##TITLE=1H ikalashn
EC-3316(II-2)
21.11.2024
##JCAMPDX= 6.0         $$ Bruker NMR JCAMP-DX V2.0
##DATA TYPE= NMR SPECTRUM
##DATA CLASS= NTUPLES
##ORIGIN= UXNMR, Bruker Analytische Messtechnik GmbH
##OWNER= root
$$ TOPSPIN		Version 1.3
$$ 2024-11-21 13:40:29.109 +0400  Irina@DPX200
$$ Compression mode = diff/dup
##.OBSERVE FREQUENCY= 200.131300845
##.OBSERVE NUCLEUS= ^1H
##.ACQUISITION MODE= SIMULTANEOUS
##.ACQUISITION SCHEME= undefined
##.AVERAGES= 16
##.DIGITISER RES= 18
##SPECTROMETER/DATA SYSTEM= spect
##.PULSE SEQUENCE= zg
##.SOLVENT NAME= CDCl3
##.SHIFT REFERENCE= INTERNAL, CDCl3, 1, 17.49637
##AUDIT TRAIL= $$ (NUMBER, WHEN, WHO, WHERE, WHAT)
$$ ##TITLE= Audit trail, TOPSPIN		Version 1.3
$$ ##JCAMPDX= 5.01
$$ ##ORIGIN= Bruker BioSpin GmbH
$$ ##OWNER= Irina
$$ $$ F:/spectra/data/iren/nmr/1H/4/pdata/1/auditp.txt
$$ ##AUDIT TRAIL=  $$ (NUMBER, WHEN, WHO, WHERE, VERSION, WHAT)
(   1,<2024-11-21 13:40:00.156 +0400>,<Irina>,<DPX200>,<TOPSPIN 1.3>,
      <created by zg
	started at 2024-11-21 13:38:51.750 +0400,
	POWCHK disabled, PULCHK disabled
       terminated by command 'halt'
       configuration hash MD5:
       BE 6D 3F 07 2A EA 11 49 91 17 2B D3 AF B3 58 0D
       data hash MD5: 16K
       71 03 CF D4 92 41 9F 66 AC 25 8D 3D 0A B6 69 8D>)
(   2,<2024-11-21 13:40:03.218 +0400>,<Irina>,<DPX200>,<TOPSPIN 1.3>,
      <Start of raw data processing
       efp BC_mod = 2 LB = 0.02 FT_mod = 6 PKNL = 1 PHC0 = 313.9969 PHC1 = 8.637775 SI = 32K 
       data hash MD5: 32K
       1C 8E 61 E1 78 C0 7B AF B9 10 E9 31 45 C4 C4 36>)
(   3,<2024-11-21 13:40:05.312 +0400>,<Irina>,<DPX200>,<TOPSPIN 1.3>,
      <apk 
       data hash MD5: 32K
       28 85 B4 61 B4 A2 C7 19 FA 5F 98 B7 56 77 66 41>)
(   4,<2024-11-21 13:40:16.500 +0400>,<Irina>,<DPX200>,<TOPSPIN 1.3>,
      <pk fgphup PHC0 = 2 PHC1 = 0 
       data hash MD5: 32K
       06 B0 22 8F EE 39 CA 91 31 69 18 08 96 46 2D B9>)
(   5,<2024-11-21 13:40:19.015 +0400>,<Irina>,<DPX200>,<TOPSPIN 1.3>,
      <abs n ABSG = 5 
       data hash MD5: 32K
       B6 63 A5 64 15 40 F4 99 CC D0 CE 46 0C BC 21 02>)
$$ ##END=
$$ 
$$ $$ hash MD5
$$ $$ 89 B7 66 6E B5 CF 30 1F 85 8D 48 F3 EC 63 10 4F
##$RELAX= 
##$RELAX= 
##$RELAX= 
##$RELAX= 
##$RELAX= 
##$RELAX= 
##$RELAX= 
##$RELAX= 
##$RELAX= 
$$ Bruker specific parameters
$$ --------------------------
##$DU= <F:/spectra>
##$EXPNO= 4
##$NAME= <1H>
##$PROCNO= 1
##$TYPE= <nmr>
##$USER= <iren>
##$AMP= (0..31)
100 100 100 100 100 100 100 100 100 100 100 100 100 100 100 100 100 100 
100 100 100 100 100 100 100 100 100 100 100 100 100 100 
##$ANAVPT= -1
##$AQSEQ= 0
##$AQ_mod= 1
##$AUNM= <au_zg>
##$AUTOPOS= <>
##$BF1= 200.13
##$BF2= 200.13
##$BF3= 200.13
##$BF4= 200.13
##$BF5= 200.13
##$BF6= 200.13
##$BF7= 200.13
##$BF8= 200.13
##$BYTORDA= 1
##$CFDGTYP= 0
##$CFRGTYP= 5
##$CHEMSTR= <none>
##$CNST= (0..63)
1 1 145 1 1 1 1 1 1 1 1 1 1 1 1 1 1 1 1 1 1 1 1 1 1 1 1 1 1 1 1 1 1 1 
1 1 1 1 1 1 1 1 1 1 1 1 1 1 1 1 1 1 1 1 1 1 1 1 1 1 1 1 1 1 
##$CPDPRG= <>
##$CPDPRG1= <>
##$CPDPRG2= <>
$$ [...]
##$SW_h= 4401.40845070422
##$TD= 16384
##$TD0= 1
##$TE= 300
##$TE2= 300
##$TE3= 300
##$TEG= 300
##$TL= (0..7)
0 120 120 120 120 120 120 120 
##$TP= (0..7)
150 150 150 150 150 150 150 150 
##$TP07= 0
##$TPNAME0= <>
##$TPNAME1= <>
##$TPNAME2= <>
##$TPNAME3= <>
##$TPNAME4= <>
##$TPNAME5= <>
##$TPNAME6= <>
##$TPNAME7= <>
##$TPOAL= (0..7)
0.5 0.5 0.5 0.5 0.5 0.5 0.5 0.5 
##$TPOFFS= (0..7)
0 0 0 0 0 0 0 0 
##$TUNHIN= 0
##$TUNHOUT= 0
##$TUNXOUT= 0
##$USERA1= <user>
##$USERA2= <user>
##$USERA3= <user>
##$USERA4= <user>
##$USERA5= <user>
##$V9= 5
##$VALIST= <valist>
##$VCLIST= <CCCCCCCCCCCCCCC>
##$VD= 0
##$VDLIST= <DDDDDDDDDDDDDDD>
##$VPLIST= <PPPPPPPPPPPPPPP>
##$VTLIST= <TTTTTTTTTTTTTTT>
##$WBST= 1024
##$WBSW= 25
##$XGAIN= (0..3)
0 0 0 0 
##$XL= 0
##$YL= 0
##$YMAX_a= 440064
##$YMIN_a= -611946
##$ZGOPTNS= <>
##$ZL1= 120
##$ZL2= 120
##$ZL3= 120
##$ZL4= 120
##$ABSF1= 17.49637
##$ABSF2= -4.496376
##$ABSG= 5
##$ABSL= 3
##$ALPHA= 0
##$AQORDER= 0
##$ASSFAC= 0
##$ASSFACI= 0
##$ASSFACX= 0
##$ASSWID= 0
##$AUNMP= <proc_1d>
##$AXLEFT= 0
##$AXRIGHT= 0
##$AXTYPE= 0
##$AXUNIT= <>
##$AZFE= 0.1
##$AZFW= 0.1
##$BCFW= 0
##$BC_mod= 2
##$BYTORDP= 0
##$COROFFS= 0
##$CY= 7568.61572265625
##$DATMOD= 1
##$DC= 0
##$DFILT= <>
##$DTYPP= 0
##$F1P= 17.9538593292236
##$F2P= -4.03888763876832
##$FCOR= 0.5
##$FTSIZE= 32768
##$FT_mod= 6
##$GAMMA= 0
##$GB= 0
##$INTBC= 0
##$INTSCL= 5.656564e-011
##$ISEN= 128
##$LB= 0.02
##$LEV0= 0
##$LPBIN= 0
##$MAXI= 945.577
##$MC2= 0
##$MEAN= 0
##$ME_mod= 0
##$MI= -402.1523
##$NCOEF= 0
##$NC_proc= -6
##$NLEV= 6
##$NOISF1= 8.587773
##$NOISF2= 6.764455
##$NSP= 0
##$NTH_PI= 0
##$NZP= 0
##$OFFSET= 17.49637
##$PC= 1
##$PHC0= 325.0177
##$PHC1= 1.140402
##$PH_mod= 1
##$PKNL= yes
##$PPARMOD= 0
##$PPDIAG= 0
##$PPIPTYP= 0
##$PPMPNUM= 100
##$PPRESOL= 1
##$PSCAL= 0
##$PSIGN= 0
##$REVERSE= no
##$SF= 200.13
##$SI= 32768
##$SIGF1= 16.12182
##$SIGF2= -4.496377
##$SINO= 3.521527
##$SIOLD= 32768
##$SREGLST= <1H.CDCl3>
##$SSB= 0
##$STSI= 32768
##$STSR= 0
##$SW_p= 4401.40845070422
##$SYMM= 0
##$S_DEV= 0
##$TDeff= 16384
##$TDoff= 0
##$TI= <>
##$TILT= no
##$TM1= 0
##$TM2= 0
##$TOPLEV= 0
##$USERP1= <user>
##$USERP2= <user>
##$USERP3= <user>
##$USERP4= <user>
##$USERP5= <user>
##$WDW= 1
##$XDIM= 32768
##$YMAX_p= 362231562
##$YMIN_p= -1016293
$$ End of Bruker specific parameters
$$ ---------------------------------
##NTUPLES= NMR SPECTRUM
##VAR_NAME=  FREQUENCY,     SPECTRUM/REAL,   SPECTRUM/IMAG
##SYMBOL=    X,             R,               I
##VAR_TYPE=  INDEPENDENT,   DEPENDENT,       DEPENDENT
##VAR_FORM=  AFFN,          ASDF,            ASDF
##VAR_DIM=   32768,         32768,           32768
##UNITS=     HZ,            ARBITRARY UNITS, ARBITRARY UNITS
##FACTOR=    0.134324425510551, 1,           1
##FIRST=     4401.40845070422, 140851,       -735814
##LAST=      0,             90756,           -837191
##MIN=       0,             -1016293,        0
##MAX=       4401.40845070422, 362231562,    0
$$ Real data points
##PAGE= N=1
##DATA TABLE= (X++(R..R)), XYDATA
$$ [...]
13484A6181345j83768k6411R3752k10j67229j46339K3760N5353r0069r3104J81495
13473A5828575L83906K08895p2300r207L06428L91363J50086o474J46296L33494
13463A7661062L06998K37120L41725M91413M72330L67670L88622N30079O53308
13454B1450327P34155P93786P59402O31498O15411Q32281J058366J021138Q16252
13445B8712616P47404Q63597R48377Q96163Q18900Q19741R04574J073148J281980
13436C7066500J395171J392853J512261J921796K389754K593244K623374K794713
13428E3689666L047591K998328K572479K107019J754319J264311N01074k81983
13420F7652804q77100j398397j892522k103418j923638j687397j670695j655014
$$ y = [16181345, 15997577, 15971166, 16064918, 16064708, 15897479, 15751140, 15774900, 15830253, 15740184, 15647080, 15828575, 16212481, 16421376, 16349076, 16339869, 16646297, 17037660, 17187746, 17181272, 17327568, 17661062, 17968060, 18205180, 18546905, 19038318, 19510648, 19878318, 20266940, 20797019, 21450327, 22184482, 22978268, 23737670, 24369168, 24984579, 25816860, 26875226, 27896364, 28712616, 29460020, 30323617, 31271994, 32168157, 32987057, 33806798, 34711372, 35784520, 37066500, 38461671, 39854524, 41366785, 43288581, 45678335, 48271579, 50894953, 53689666, 56737257, 59735585, 62308064, 64415083, 66169402, 67433713, 67934787, 67652804, 66775704, 65377307, 63484785, 61381367, 59457729, 57770332, 56099637, 54444623]
13412E4444623j363302r88190q45040p93399n05956r4391P0451K1942J25151M05384
13402E0477273N20174M29625N25815R57196J347196J411410J402130J651175K048595
13393F0770589K315270K510694K904264L510011M086989M526957M964816N513339
13385I1102929O069930O378480O179823N363497M072518K592766J066947n81817
13377A22245073k373615m059844n303762n967520o126240n920406n502637n012335
13369H1978714m485846l882590l267150k819986k581930k365191k041576j736405
13361E8798040j583104j474865j259140j008087q61772p43839m93264j78398j0393
13352E1185178K514O6105K97655O30516R80662J299541J518311J657614J915708
$$ y = [54444623, 53081321, 52093131, 51248091, 50454692, 49948736, 49854345, 49924796, 49946738, 50071889, 50477273, 50997447, 51427072, 51952887, 52910083, 54257279, 55668689, 57070819, 58721994, 60770589, 63085859, 65596553, 68500817, 72010828, 76097817, 80624774, 85589590, 91102929, 97172859, 103551339, 109731162, 115094659, 119167177, 121759943, 122826890, 122245073, 119871458, 115811614, 110507852, 104540332, 98414092, 92493686, 86991049, 81978714, 77492868, 73610278, 70343128, 67523142, 64941212, 62576021, 60534445, 58798040, 57214936, 55740071, 54480931, 53472844, 52611072, 51867233, 51373969, 51195571, 51185178, 51187692, 51253797, 51551452, 52181968, 53162630, 54462171, 55980482, 57638096, 59553804]
13343E9553804K393938K814904K816056K462058K110559J794174J162732J19421
13335G5227646r26624j638346k187955k838813l424104l602600l413717l199365
13327E3996122l087706k906864k571345k235425k032986j914077j790738j655333
13319C5801648j511100j343723j197090j139099j127035j041865q84544p99516
13311B6757676q47699q80636p36404m88690l85353n31181p19982o61493l52936
13302B1153302j03979j30722k58699j91359K7880P9426j22467k90495k26613j22061
13292A9814213k15694m18260n17584n35212n97206o33106n20436l90368m48473
13283A5537874n86320n28262l05992k09343k84714k89692j85019k36594m96383
$$ y = [59553804, 61947742, 64762646, 67578702, 70040760, 72151319, 73945493, 75108225, 75227646, 74301022, 72662676, 70474721, 67635908, 64211804, 60609204, 57195487, 53996122, 50908416, 48001552, 45430207, 43194782, 41161796, 39247719, 37456981, 35801648, 34290548, 32946825, 31749735, 30610636, 29483601, 28441736, 27557192, 26757676, 25909977, 25029341, 24292937, 23804247, 23418894, 22887713, 22167731, 21506238, 21153302, 21049323, 20918601, 20659902, 20468543, 20496423, 20575849, 20453382, 20162887, 19936274, 19814213, 19598519, 19180259, 18662675, 18127463, 17530257, 16897151, 16376715, 15986347, 15537874, 14951554, 14423292, 14117300, 13907957, 13623243, 13333551, 13148532, 12911938, 12415555]
13274A2415555o03151l28606L2284R3257q9373k10103j98106j85509j80407j10284
13264A0635557o4790j61670k53826j04842J80206K37471j4503k34141j49605Q1272
13254A0151129J48438J6522j05452r4156l3728n0249j56528k70285l16583k90782
13244H998326k39185j95751j62606j53976k01765k82138l02403k25075j44717
13235G090710j58645k14098j84510o3995K0136k0488j39492k29510k22519j26014
13225E751575j6315K0237k3547q3705j38709k20197k75192j69578O9150J78033
13215E091752L6k40637k24508P365J38180M9215p4199r4654q4911r6741n2275
13204D418623M3564L8450j01494j88475j05756O689O21m7717j8948J7417n5203
$$ y = [12415555, 11812404, 11483798, 11516082, 11609339, 11519966, 11309863, 11111757, 10926248, 10745841, 10635557, 10570767, 10409097, 10155271, 10050429, 10230635, 10468106, 10453603, 10219462, 10069857, 10151129, 10299567, 10316089, 10210637, 10116481, 10082753, 10032504, 9875976, 9605691, 9289108, 8998326, 8759141, 8563390, 8400784, 8246808, 8045043, 7762905, 7460502, 7235427, 7090710, 6932065, 6717967, 6533457, 6469462, 6489598, 6469110, 6329618, 6100108, 5877589, 5751575, 5735260, 5755497, 5731950, 5648245, 5509536, 5289339, 5014147, 4844569, 4913719, 5091752, 5091788, 4851151, 4626643, 4634008, 4772188, 4821403, 4747204, 4652550, 4567639, 4470898, 4418623, 4462187, 4500637, 4399143, 4210668, 4104912, 4111601, 4112222, 4064505, 4045557, 4062974, 4007771]
13193D007771j67966j74006q9374m4540o6490p0237j7743M4279O3612J3730q9017
13182C410019j44262n5826Q4349O1640j30775k26034p6131J05697P6773p1851
13172C033599j13827n6207l9190l3662N9022J40654P1452k3480N1262J61713L2799
13161C284135k26768k32094L5818J64291k2112j94548r6417N9229K1998o9917
13151B723615j6197L8834j02253k64981j70799O7343J21071j8242p8449O984M6817
13140B353743j0618j3024N0620P475j40612j60658J2279J33834L9249j05242r5494
13129B071552Q487M6650K0094N721k0014q5898r3728K9344J51880R8838p7009
13118B155917j56441n0287J09560J56825N6651r7108j64540o9547J01527J55980
$$ y = [4007771, 3839805, 3665799, 3576425, 3531885, 3465395, 3395158, 3377415, 3421694, 3485306, 3499036, 3410019, 3265757, 3209931, 3294280, 3355920, 3225145, 2999111, 2922980, 3028677, 3105450, 3033599, 2919772, 2863565, 2824375, 2790713, 2849735, 2990389, 3061841, 3038361, 3089623, 3251336, 3284135, 3057367, 2825273, 2861091, 3025382, 3003270, 2808722, 2712305, 2771534, 2793532, 2723615, 2707418, 2746252, 2643999, 2379018, 2208219, 2275562, 2396633, 2378391, 2299942, 2306926, 2353743, 2343125, 2330101, 2380721, 2388196, 2247584, 2086926, 2099205, 2233039, 2272288, 2167046, 2071552, 2080039, 2126689, 2146783, 2152504, 2132490, 2046592, 1952864, 1982208, 2134088, 2232926, 2155917, 1999476, 1949189, 2058749, 2215574, 2272225, 2175117, 2010577, 1941030, 2042557, 2198537]
13108B198537J5272j81030k55534j91738p3602N9731J71389J49157m5779k16847
13098A629556j28755J43587K71927J15703r7224j15005n98J8851q9200j40547
13088A608295l1575J08305R8678n7808j83829j35284M3125J77083J60449N8138
13078A845577j0218l6314q9037j41850p3441J12699K09217O4465j72693k21943
13068A486462m2513J31821J31358M8468L6919P6618O1541O231M308L7690j834
13057A977069j00473r7227P2163K40652K15903L0047j25825j55072j18151p1493
13047A867593Q844J10621J28122J3175j04484o7401P7556J25368k333j46556j39861
13036A870644l2299J4295k3520l0303K8095N0642M65q608P9582J17502k3525j90304
$$ y = [2198537, 2213809, 2032779, 1777245, 1585507, 1511905, 1571636, 1743025, 1892182, 1846403, 1629556, 1500801, 1644388, 1916315, 2032018, 1934794, 1819789, 1819191, 1838042, 1748842, 1608295, 1576720, 1685025, 1783703, 1725895, 1542066, 1406782, 1449907, 1626990, 1787439, 1845577, 1835359, 1799045, 1710008, 1568158, 1494717, 1607416, 1816633, 1881098, 1708405, 1486462, 1443949, 1575770, 1707128, 1755596, 1792515, 1869133, 1930674, 1936905, 1941213, 1978903, 1977069, 1876596, 1779369, 1851532, 2092184, 2308087, 2338134, 2212309, 2057237, 1939086, 1867593, 1876437, 1987058, 2115180, 2128355, 2023871, 1956470, 2034026, 2159394, 2157061, 2010505, 1870644, 1838345, 1852640, 1829120, 1798817, 1826912, 1877554, 1878019, 1869411, 1948993, 2066495, 2042970, 1852666]
13024A852666j24501J27587K26250K1283k06722j37852J32752K49121J07556l3088
13014B215052L9464J98760J94188O468j46147r5734R0819K08168J33524n5102
13004B789460j66727j11140o586k7040j62450k23874j06042O1978R6497K795o5004
12993B081867l8437l664l2097o3808k2550L7687N267r5603j03020M8059J92007
12982B005708J37875n1849j35611l8306N7599K5510k48J16189K26096J13030j13427
12971B342566j41675M8378J42142J549j13764R684J83530J46628m654j9427O1180
12960B656137R447j43710j38995N3861J63338N3240q5993p9170j3942j6877l4301
12949B423035O089K6345m3912j17747j12858r3852j03232l4408J47248K40261
$$ y = [1852666, 1728165, 1855752, 2082002, 2103285, 1896563, 1758711, 1891463, 2140584, 2248140, 2215052, 2254516, 2453276, 2647464, 2653932, 2507785, 2412051, 2502870, 2711038, 2844562, 2789460, 2622733, 2511593, 2505007, 2477967, 2315517, 2091643, 1985601, 2047579, 2144076, 2146871, 2081867, 2043430, 2039766, 2007669, 1943861, 1921311, 1958998, 1964265, 1868662, 1765642, 1813701, 2005708, 2143583, 2091734, 1956123, 1917817, 1975416, 2000926, 2000678, 2116867, 2342963, 2455993, 2342566, 2200891, 2249269, 2391411, 2392960, 2279196, 2288880, 2472410, 2619038, 2614384, 2594957, 2656137, 2665584, 2521874, 2382879, 2436740, 2600078, 2653318, 2567325, 2488155, 2474213, 2457336, 2423035, 2429124, 2455469, 2411557, 2293810, 2180952, 2087100, 1983868, 1949460, 2096708, 2336969]
12939B336969Q9349j19710j04334Q4885J53864K2475r3044n0249L9983N2914L0688
12928B443790L9116L7447q214k9433K7937R9199R4452K0679m1993k8774N8014
12917B712220J30278Q0091n9437r7334M4512J51973J7554j80669j00156J99874
12907B898906K81190j2172k93923k13426N2158J40482M5393k967K3829j1565q0822
12896B827083m3219N3498M8269k0619P802Q4608K7566j03884o8056J17604J68819
12885C099471K3250m7772P2693J38186R38r4626N3930K11866Q7740j47990j20348
12874C277338J32443K16204Q811j66916n8141J62832J95393K6460j17373r8447
12864C578604L416M3283r188n5370j0728O6194M6610o6131j20091n0313P906n6921
$$ y = [2336969, 2426318, 2306608, 2202274, 2287159, 2441023, 2463498, 2370454, 2320205, 2360188, 2413102, 2443790, 2482906, 2520353, 2512139, 2482706, 2510643, 2609842, 2704294, 2724973, 2682980, 2654206, 2712220, 2842498, 2922589, 2863152, 2765818, 2810330, 2962303, 2979857, 2799188, 2699032, 2898906, 3180096, 3167924, 2874001, 2660575, 2712733, 2853215, 2898608, 2895641, 2919470, 2907905, 2827083, 2783864, 2837362, 2885631, 2865012, 2872814, 2957422, 2984988, 2881104, 2813048, 2930652, 3099471, 3122721, 3074949, 3147642, 3285828, 3286766, 3192140, 3246070, 3457936, 3545676, 3397686, 3277338, 3409781, 3625985, 3634796, 3467880, 3409739, 3572571, 3767964, 3794424, 3677051, 3578604, 3582020, 3625303, 3616115, 3560745, 3550017, 3616211, 3662821, 3596690, 3476599, 3426286, 3434192, 3377271]
12852C377271j36929q3603M2803Q4968M5875L2134K9222l9603r7429p021J53787
12841C401475J66398J5297r4962p2445k7517j2894M6089J18233N8824q7351p7989
12830C433158J19547K21784Q2373o0378O161J13494L3066j12988p8444P7656J25893
12819C961322P3191Q7116J29805L0316j39796j28422O2621J49464J7577j11714
12809D131480m7922J06441J63649R9450k997p3597m6495R8042K31671J90000J9821
12798D869543o9622j9368L2057L5520J04597K37477K43825P0885n7248J8202J47430
12787E613298J46416Q6085J00181J16559K8723l8637Q3049K71568K59263N5377
12777F721882o0124L9059J71536J68263J16750J77521L14144L42288J89889N356
$$ y = [3377271, 3240342, 3156739, 3199542, 3284510, 3330385, 3362519, 3391741, 3352138, 3254709, 3247688, 3401475, 3567873, 3583170, 3488208, 3415763, 3388246, 3375352, 3421441, 3539674, 3598498, 3511147, 3433158, 3552705, 3774489, 3856862, 3796484, 3802645, 3916139, 3949205, 3836217, 3757773, 3835429, 3961322, 4034513, 4121629, 4251434, 4281750, 4141954, 4013532, 4076153, 4225617, 4243194, 4131480, 4083558, 4189999, 4353648, 4453098, 4450101, 4376504, 4330009, 4428051, 4659722, 4849722, 4869543, 4799921, 4780553, 4812610, 4848130, 4952727, 5190204, 5434029, 5504914, 5447666, 5465868, 5613298, 5759714, 5845799, 5945980, 6062539, 6091262, 6052625, 6135674, 6407242, 6666505, 6721882, 6661758, 6700817, 6872353, 7040616, 7157366, 7334887, 7649031, 7991319, 8181208, 8186564]
12767H186564r265J61121L16321K87024J57272J37121K46018K95077K06785J41226
12757A0125264K11717K89343K43919J82138K45722L44094L23318K58553L14892
12748A2538960M28267M11797L03965L07385M18606M33285L21252K76226L50166
12739A5789909L60693K49398K10919L24071L64175J92404O0139K40780N46248
12730A8338736N44059J93811n3847J41607N54574O97477M58999K33316L80347
12721B1489079P37636Q55849O45977N00700O84941R25669Q71398O95616Q31475
12712B8238340J244738J459479J312288J183624J355264J611937J701322J755397
12704C9862389J958884K181602K286703K461475K842352L110998K921186K489757
$$ y = [8186564, 8177299, 8338420, 8654741, 8941765, 9099037, 9236158, 9482176, 9777253, 9984038, 10125264, 10336981, 10626324, 10870243, 11052381, 11298103, 11642197, 11965515, 12224068, 12538960, 12967227, 13379024, 13682989, 13990374, 14408980, 14842265, 15163517, 15439743, 15789909, 16150602, 16400000, 16610919, 16934990, 17299165, 17491569, 17551708, 17792488, 18338736, 18882795, 19076606, 19022759, 19164366, 19718940, 20416417, 20875416, 21108732, 21489079, 22226715, 23082564, 23728541, 24229241, 24914182, 25839851, 26711249, 27406865, 28238340, 29483078, 30942557, 32254845, 33438469, 34793733, 36405670, 38106992, 39862389, 41821273, 44002875, 46289578, 48751053, 51593405, 54704403, 57625589, 60115346]
12696F0115346K259708K148859J691128Q53080J27215k39468n56048j074309j562128
12687F3763383j727639j660979j579590j465049j238669j025499r49709q78187
12679E3238062o44436l53264k00613j43966j1960J90738L51009N09330P80843
12670E3715743J085697J231126J238934J342017J647556K024172K344876K637577
12662F7267698K956056L289716L658454M128777M659628N070005N237783N210333
12654A01478450N035327M597383L741807K496111J054970m18556j858273l165848
12646A12961371m158219m732985n004440n145765n126510m775923m143901l588388
12638G6285240l342588l171510k722709k110052j793532j870618j888903j517090
$$ y = [60115346, 62375054, 64523913, 66215041, 67068121, 67195336, 66955868, 66399820, 65325511, 63763383, 62035744, 60374765, 58795175, 57330126, 56091457, 55065958, 54116249, 53238062, 52593626, 52240362, 52039749, 51895783, 51883823, 52074561, 52425570, 52934900, 53715743, 54801440, 56032566, 57271500, 58613517, 60261073, 62285245, 64630121, 67267698, 70223754, 73513470, 77171924, 81300701, 85960329, 91030334, 96268117, 101478450, 106513777, 111111160, 114852967, 117349078, 118404048, 117985492, 116127219, 112961371, 108803152, 104070167, 99065727, 93919962, 88793452, 84017529, 79873628, 76285240, 72942652, 69771142, 67048433, 64938381, 63144849, 61274231, 59385328, 57868238]
12630E7868238j023078q07818p88017o30027l64750k91710l66683j95909L05228
12621E3705474P24628P92639P92104J074023J509769J757851J823351J966698
12613F4146537K189690K200876J872470J389981Q99778L09282m52138j219687
12605G1336789j797815k207719k568031k851337k935097k830975k691053k586890
12597E0867872k423391k114872j747793j496392j417413j395251j294600j123094
12589C7855066j009140j029209j103135j091786r70218q49287q26884q78637r20277
12580B9176493r20887r02970q67354p84912o59389n44820m88581m87509n01492
12571B3018579m85118m20580l55774l82131n09124n85031m49013j74972l5391
$$ y = [57868238, 56845160, 56037342, 55249325, 54619298, 54254548, 53962838, 53596155, 53400246, 53705474, 54430102, 55222741, 56014845, 57088868, 58598637, 60356488, 62179839, 64146537, 66336227, 68537103, 70409573, 71799554, 72699332, 73008614, 72556476, 71336789, 69538974, 67331255, 64763224, 61911887, 58976790, 56145815, 53454762, 50867872, 48444481, 46329609, 44581816, 43085424, 41668011, 40272760, 38978160, 37855066, 36845926, 35816717, 34713582, 33621796, 32651578, 31802291, 30975407, 30096770, 29176493, 28255606, 27352636, 26485282, 25700370, 25040981, 24496161, 24007580, 23520071, 23018579, 22533461, 22112881, 21757107, 21374976, 20865852, 20280821, 19831808, 19656836, 19621445]
12562A9621445j55142l24286k75859n4320O0528m5438j86092j64674j9916R3825
12552A8550071J28100J35214J45685J64723K18325K97324L18137K44213J82265
12543B0384057K31094K84996J46033j70761m07058l88745k49808k37966l88227
12534A9203615n04954m34126k42586j07010j03616j61286j85830j61299j19134
12525A7183774p1820k8341l4650j22125k24732k28043j14296J5013P7566R0598
12515A6542944R2071P9001O4216R1052J36466J11508K8063L4040J78361K82077
12505A7639799J95904N5688Q0124K16779K36463J26047J07727K51632L48042K47744
12495A9505949Q2628K5350M1846K9158J6532O3527J06863Q1665P2752J68561K67469
$$ y = [19621445, 19466303, 19142017, 18866158, 18811838, 18872366, 18826928, 18640836, 18476162, 18456246, 18550071, 18678171, 18813385, 18959070, 19123793, 19342118, 19639442, 19957579, 20201792, 20384057, 20615151, 20900147, 21046180, 20875419, 20468361, 20079616, 19829808, 19591842, 19203615, 18698661, 18264535, 18021949, 17914939, 17811323, 17650037, 17464207, 17302908, 17183774, 17111954, 17083613, 17048963, 16926838, 16702106, 16474063, 16359767, 16374780, 16452346, 16542944, 16635015, 16714016, 16778232, 16869284, 17005750, 17117258, 17145321, 17179361, 17357722, 17639799, 17835703, 17891391, 17971515, 18188294, 18424757, 18550804, 18658531, 18910163, 19258205, 19505949, 19588577, 19613927, 19655773, 19684931, 19701463, 19764990, 19871853, 19953518, 20026270, 20194831, 20462300]
12484B0462300K17790P6231L2239J14891J67288J09512M6989Q0583J58093J82067
12474B1647983J63487J90071K87445L73006L51328K39139J70009K41057L79551
12465B4043076M40074M20485M53417N61885N94411M91389M37077N86738P93916
12456B8822468Q24448P34550P78402R87016J123027J085303J079920J276711J531751
12447C8243596J625768J612555J727771K040629K391660K648288K850536L084506
12439E6225309L346069L571301L695625L627590L257936K583986J769110R76850
12431G9053776J78319p45440j704483k376303k580527k525949k513511k512117
12423F4273765k274024j811800j444623j318367j202761r14568o33727n54729
$$ y = [20462300, 20680090, 20756321, 20788560, 20903451, 21070739, 21180251, 21227240, 21307823, 21465916, 21647983, 21811470, 22001541, 22288986, 22661992, 23013320, 23252459, 23422468, 23663525, 24043076, 24483150, 24903635, 25357052, 25918937, 26513348, 27004737, 27441814, 28028552, 28822468, 29646916, 30381466, 31159868, 32146884, 33269911, 34355214, 35435134, 36711845, 38243596, 39869364, 41481919, 43209690, 45250319, 47641979, 50290267, 53140803, 56225309, 59571378, 63142679, 66838304, 70465894, 73723830, 76307816, 78076926, 79053776, 79232095, 78486655, 76782172, 74405869, 71825342, 69299393, 66785882, 64273765, 61999741, 60187941, 58743318, 57424951, 56222190, 55307622, 54673895, 54119166]
12415E4119166m92714j76616K47833M05991L08675L64028P41714J118399J194922
12406E7831398J138167J294900J699963K114110K421830K759210L271917L911200
12398G6442695M513952N026674N588552O315625O979559P049814O211716M735249
12390A22863836L122826J493036l88778k503299m368166n543902o057778o188482
12382A02429293o086005n765472n263920m639279l967826l424316l156425l013778
12374F7112272k676074k146539j794767j768291j736703j446336j134470j063419
12366E3345673j018939p06669l35286k87599m28822l01738J11324L95835M38765
12357E1212544N78991R67895J331794J509558J715493K064382K294691K212061
$$ y = [54119166, 53626452, 53449836, 53697669, 54103660, 54412335, 54776363, 55518077, 56636476, 57831398, 58969565, 60264465, 61964428, 64078538, 66500368, 69259578, 72531495, 76442695, 80956647, 85983321, 91571873, 97887498, 104867057, 111916871, 118128587, 122863836, 125986662, 127479698, 127090920, 124587621, 120219455, 114675553, 108617775, 102429293, 96343288, 90577816, 85313896, 80674617, 76706791, 73282475, 70126050, 67112272, 64436198, 62289659, 60494892, 58726601, 56989898, 55543562, 54409092, 53345673, 52326734, 51620065, 51284779, 50997180, 50568358, 50266620, 50377944, 50773779, 51212544, 51791535, 52759430, 54091224, 55600782, 57316275, 59380657, 61675348, 63887409]
12349F3887409K000174J815593J446461O94074k18041r55234j536616k144013
12341F4989807k679288k885554k782451k631445k534640k377548k133057j930580
12333D5035244j812209j667729j455778j297610j292748j371109j377190j233783
12325C3527088j015334q89729r40269j029309r47920p30073o43031p80672q77290
12316B5673461o92977l89851k91229m10825m89059m08809k97246k50012k23210
12307B2220243k06665k56192l19103k57598j00398n0956j62554k13708l4042K17996
12297B0837023K69742J18630K1749J33494L15464L45040J97528L2134n1299j24055
12287B2095450k72018m39233n22507n43143n85605o12118n15976l53286l13554
$$ y = [63887409, 65887583, 67703176, 69149637, 69843711, 69625670, 68670436, 67133820, 64989807, 62310519, 59424965, 56642514, 54011069, 51476429, 49098881, 46965824, 45035244, 43223035, 41555306, 40099528, 38801918, 37509170, 36138061, 34760871, 33527088, 32511754, 31622025, 30681756, 29652447, 28704527, 27974454, 27331423, 26550751, 25673461, 24980484, 24590633, 24299404, 23888579, 23399520, 22990711, 22693465, 22443453, 22220243, 22013578, 21757386, 21438283, 21180685, 21080287, 21029331, 20866777, 20653069, 20619027, 20837023, 21106765, 21225395, 21247144, 21380638, 21696102, 22041142, 22238670, 22270804, 22219505, 22095450, 21823432, 21384199, 20861692, 20318549, 19732944, 19120826, 18604850, 18251564, 17938010]
12278A7938010m12183m29793k56738q7226j24754k79838l34186k50243j39645
12269A5623404o4124m3492j21983k50509k52769q8430K6374l8798q4423N9127
12259A4764377J68212j6429k74774j98874J30955K59306R5753J2271J60769K36010
12249A5337576O5931p4269K7525J48589N6951q2659m6288M2309k2664j43382j38008
12238A5171611r3944j58105k03425o6612Q0077k1194k46198k64598p5981K4428
12228A4146059m9298r8925n5610p5521j76424j47122P0590K23815J24612o0862
12218A3901314o8408R3286J95122J12846l6877n8718Q9859K40372K10101N4975
12208A4733872J6476J65670K68862J44286k8113K2179K22126K81690J67907J26564
$$ y = [17938010, 17525827, 17096034, 16839296, 16752070, 16627316, 16347478, 16013292, 15763049, 15623404, 15559280, 15515788, 15393805, 15143296, 14890527, 14802097, 14828471, 14789673, 14705250, 14764377, 14932589, 14916160, 14641386, 14442512, 14573467, 14832773, 14928526, 14940797, 15101566, 15337576, 15403507, 15329238, 15356763, 15505352, 15562303, 15479644, 15433356, 15475665, 15453001, 15309619, 15171611, 15077667, 14919562, 14716137, 14649525, 14729602, 14708408, 14462210, 14197612, 14121631, 14146059, 14096761, 13997836, 13942226, 13866705, 13690281, 13543159, 13613749, 13837564, 13962176, 13901314, 13832906, 13926192, 14121314, 14234160, 14197283, 14138565, 14228424, 14468796, 14678897, 14733872, 14750348, 14916018, 15184880, 15329166, 15301053, 15323232, 15545358, 15827048, 15994955, 16121519]
12198A6121519K43421L16036K28047J50497K43280L93002L99991K62478J40651
12189A8498922J47847K67974L93980M04152K85996J85654K31242L40675L43001
12180B1099443K41521J80531J98723K20043K43624L10245L26024J90688O4308
12171B3075150J88132M49878M92030K87455K01165L80619N19744M14121L15184
12162B6323478M52496O01983M91728L07593L79422O12529O68948N43316N20192
12153C0901685O58799P39568O81299O28060O29342N82450N00861N17041O00832
12144C6439937N77155M42841L77826M29085M73223M97545O03684P14667O25397
12135D1181360M03718L79692O25494Q07249P17418N97915P00618Q55076P89535
$$ y = [16121519, 16364940, 16680976, 16909023, 17059520, 17302800, 17695802, 18095793, 18358271, 18498922, 18646769, 18914743, 19308723, 19712875, 19998871, 20184525, 20415767, 20756442, 21099443, 21340964, 21521495, 21720218, 21940261, 22183885, 22494130, 22820154, 23010842, 23075150, 23263282, 23713160, 24205190, 24492645, 24693810, 25074429, 25594173, 26008294, 26323478, 26775974, 27377957, 27869685, 28177278, 28556700, 29169229, 29838177, 30381493, 30901685, 31560484, 32300052, 32981351, 33609411, 34238753, 34821203, 35322064, 35839105, 36439937, 37017092, 37459933, 37837759, 38266844, 38740067, 39237612, 39841296, 40555963, 41181360, 41585078, 41964770, 42590264, 43397513, 44114931, 44712846, 45413464, 46268540, 47058075]
12126D7058075O31457P17731J044426J272456J243762J166414J251929J441143
12118E5827393J578788J653224J742169J855776J959477K080852K278354K522921
12110G1498954K708549K810940K965235L307095L760360M096478M243635M409085
12102I9800331M782224N228096N461969N472778N540817N810707O085068O146944
12094A44328934O078958O085988O135699N979025N478162M730670L855349K806150
12086A85478935J480211n3242j528394k721570l666977m546544n364247n875842
12078A63202330n941681n802884n806381n943487n918326n651056n412053n381380
12070A17345082n365634n119015m719768m420325m276308m128261l856555l486889
$$ y = [47058075, 47689532, 48407263, 49451689, 50724145, 51967907, 53134321, 54386250, 55827393, 57406181, 59059405, 60801574, 62657350, 64616827, 66697679, 68976033, 71498954, 74207503, 77018443, 79983678, 83290773, 87051133, 91147611, 95391246, 99800331, 104582555, 109810651, 115272620, 120745398, 126286215, 132096922, 138181990, 144328934, 150407892, 156493880, 162629579, 168608604, 174086766, 178817436, 182672785, 185478935, 186959146, 186905904, 185377510, 182655940, 178988963, 174442419, 169078172, 163202330, 157260649, 151457765, 145651384, 139707897, 133789571, 128138515, 122726462, 117345082, 111979448, 106860433, 102140665, 97720340, 93444032, 89315771, 85459216, 81972327]
12062H1972327l115357k852345k751376k693791k470307k084126j809474j805030
12054F2390521j852008j677063j365545j197817j199924j146672r49223p52046
12046E2250223o52082n82251m99268m60350m73748m64108m17758l93743l79930
12037D7926985l05906j94553j26041p0738M6157J40952O5787j03758j39678m1062
12027D7198145n4515k52562l98383l54501l19429m58602n74023m15778j26080
12018D4244272n6180k34673l28440j37718J33692J87834L1796o4956N6405K40555
12008D4072587K33454M3723l6445J69620M38576M38196K22788J79716M66447P85423
11998D7014085Q36962P39208Q00401J064469J317499J434405J498190J627341
$$ y = [81972327, 78856970, 76004625, 73253249, 70559458, 68089151, 66005025, 64195551, 62390521, 60538513, 58861450, 57495905, 56298088, 55098164, 53951492, 53002269, 52250223, 51598141, 51015890, 50516622, 50056272, 49582524, 49118416, 48700658, 48306915, 47926985, 47621079, 47426526, 47300485, 47229747, 47275904, 47416856, 47482643, 47378885, 47239207, 47198145, 47143630, 46891068, 46492685, 46138184, 45818755, 45360153, 44786130, 44370352, 44244272, 44188092, 43953419, 43624979, 43487261, 43620953, 43808787, 43840583, 43775627, 43832032, 44072587, 44306041, 44349764, 44313319, 44482939, 44921515, 45359711, 45582499, 45762215, 46228662, 47014085, 47851047, 48590255, 49390656, 50455125, 51772624, 53207029, 54705219, 56332560]
11990E6332560J854277K125042K283033K129850J649689J092437O77796L07826
11982F8452510k36344q87327j315046j351847j175648j021721q95150o60849k95926
11973F0612652O1884K84583L99813N41320P63823R62524J040317J095119J294728
11964F7056763J590764J769991J823717K005773K409816K765510K851299K843157
11956H5116790K975481L085821K848074K299174J749465J260565O11388k36156
11948I9710602j019544j556561j909159k136502k211741k214584k270100k263037
11940H4129374j971196j520350j297690j332341j214747p83656m13152l67573
11932G5228669l44408j7040L87967N04838M85665P32392J193893J462307J465662
$$ y = [56332560, 58186837, 60311879, 62594912, 64724762, 66374451, 67466888, 68144684, 68452510, 68216166, 67328839, 66013793, 64661946, 63486298, 62464577, 61569427, 60908578, 60612652, 60674536, 60959119, 61358932, 61900252, 62664075, 63626599, 64666916, 65762035, 67056763, 68647527, 70417518, 72241235, 74247008, 76656824, 79422334, 82273633, 85116790, 88092271, 91178092, 94026166, 96325340, 98074805, 99335370, 99946758, 99710602, 98691058, 97134497, 95225338, 93088836, 90877095, 88662511, 86392411, 84129374, 82158178, 80637828, 79340138, 78007797, 76793050, 76009394, 75596242, 75228669, 74884261, 74867221, 75255188, 75760026, 76245691, 76978083, 78171976, 79634283, 81099945]
11923H1099945J561041J953442K471637K958230L479008M066060M601277N054159
11915A07244799N536348O010454O193391N854605N019008L821135K360497P51791
11907A42792028q70439k435925l864756m934336n439641n474611n319870n067586
11899A09384864m622047m050537l596560l293424k908593k380786j977822j860306
11891H4694789j801941j553010j210809r91488q63129o65648m19921k55501j50362
11882G6782980K1112K63294M78559O39792P86406R30713J099435J358650J669691
11873H4030632J858899J874142J908706K088795K202390J967764J442827R22322
11865I8296477N26408J45598k71588o34466q92260j076235j169780j130638j022475
$$ y = [81099945, 82660986, 84614428, 87086065, 90044295, 93523303, 97589363, 102190640, 107244799, 112781147, 118791601, 124984992, 130839597, 135858605, 139679740, 142040237, 142792028, 141921589, 139485664, 135620908, 130686572, 125246931, 119772320, 114452450, 109384864, 104762817, 100712280, 97115720, 93822296, 90913703, 88532917, 86555095, 84694789, 82892848, 81339838, 80129029, 79137541, 78274412, 77608764, 77188843, 76933342, 76782980, 76804092, 77067386, 77545945, 78185737, 78972143, 79902856, 81002291, 82360941, 84030632, 85889531, 87763673, 89672379, 91761174, 93963564, 95931328, 97374155, 98296477, 98822885, 98968483, 98696895, 98062429, 97170169, 96093934, 94924154, 93793516, 92771041]
11856I2771041r43049q59572p01193n54182n40618n51900l65949k7491J58577
11847H8385664N9861j09639j32456p9144j32700k87937l61199k14001J13246M38705
11837H7680400O03157O64519Q78833J372536J910387K159333K101722J958610
11829I9329497J773321J377270P74485K32160r5903l38517n86833o95810n64077
11820A01205593l50786k25113j23984M6015J73389J24559o836m2394L2527J50017
11810A00982987L40063O40278R72644J295446J710115K206755K486170K305377
11802A12939835J858188J520519J329153J032543N95113L10673L93430P45520
11794A20724974J180404J626277K038114K313851K376603K206812J783916J137262
$$ y = [92771041, 91827992, 90968420, 90267227, 89713045, 89172427, 88620527, 88254578, 88227087, 88385664, 88445525, 88335886, 88203430, 88124286, 87991586, 87703649, 87342450, 87128449, 87241695, 87680400, 88283557, 88948076, 89826909, 91199445, 93109832, 95269165, 97370887, 99329497, 101102818, 102480088, 103254573, 103486733, 103390830, 103052313, 102465480, 101769670, 101205593, 100854807, 100629694, 100505710, 100551725, 100725114, 100849673, 100842837, 100800443, 100832970, 100982987, 101323050, 101963328, 102935972, 104231418, 105941533, 108148288, 110634458, 112939835, 114798023, 116318542, 117647695, 118680238, 119275351, 119586024, 119979454, 120724974, 121905378, 123531655, 125569769, 127883620, 130260223, 132467035, 134250951, 135388213]
11786A35388213M19832k46942r58116j848863k784060l475345l880455m202277
11778A18411987m484763m524873m254059l899714l646591l408664l072791k714710
11770H8405822k419952k125391j799976j558207j427191j230440q93701o35566
11762G6315398o23871o56408m55945j07397J01323J46677K58084N10831P50937
11753G6239629R16678J137322J469981J793876K036595K295784K658802L074164
11745I1622831L471992L857225M209180M419196M403098M181017L801232L279203
11737A23244974K644406J951104J211344M04862m24749j171729j775436k231728
11729A23853048k492267k462415k130013j617393j095324p12795n76332o80645
$$ y = [135388213, 135808045, 135561103, 134602987, 132754124, 129970064, 126494719, 122614264, 118411987, 113927224, 109402351, 105148292, 101248578, 97601987, 94193323, 91120532, 88405822, 85985870, 83860479, 82060503, 80502296, 79075105, 77844665, 76950964, 76315398, 75691527, 75035119, 74579174, 74471777, 74573100, 74719777, 74977861, 75488692, 76239629, 77156307, 78293629, 79763610, 81557486, 83594081, 85889865, 88548667, 91622831, 95094823, 98952048, 103161228, 107580424, 111983522, 116164539, 119965771, 123244974, 125889380, 127840484, 129051828, 129456690, 129031941, 127860212, 126084776, 123853048, 121360781, 118898366, 116768353, 115150960, 114055636, 113342841, 112766509, 112085864]
11721A12085864q75496j029113j213190j583772k086640k453159k514584k347744
11713I7982166k068358j675828j197199q01622o19801n66546m86874l92198m10990
11704H9762750n59324o88789o44519l95065l5939K73744M17824M12528L37734
11695H8880944J61934k50431q99367j551254j988790k243125k446316k566865
11687G7096730k474330k200919j936198j764525j584607j316378j035460q57303
11679F3927010q09777q60183r56840j011053r57884q79389r41978j145815j264299
11670E5099792j136284r12608q74023j064827j258884j280721j216527j260869
11662D6095049j457365j664524j729193j632758j484230j403734j400545j358578
$$ y = [112085864, 111210368, 110181255, 108968065, 107384293, 105297653, 102844494, 100329910, 97982166, 95913808, 94237980, 93040781, 92239159, 91619358, 91052812, 90565938, 90173740, 89762750, 89203426, 88514637, 87870118, 87475053, 87439114, 87712858, 88130682, 88543210, 88880944, 89042878, 88792447, 87893080, 86341826, 84353036, 82109911, 79663595, 77096730, 74622400, 72421481, 70485283, 68720758, 67136151, 65819773, 64784313, 63927010, 63117233, 62257050, 61300210, 60289157, 59331273, 58451884, 57509906, 56364091, 55099792, 53963508, 53050900, 52176877, 51112050, 49853166, 48572445, 47355918, 46095049, 44637684, 42973160, 41243967, 39611209, 38126979, 36723245, 35322700, 33964122]
11654C3964122j179227r43243q53347r66486j069986r36254o48464n12593o34242
11645B6220280p63721o54859m18954l54287n18151o71362o28615m67186l50794
11636B1392351l20884l38345l86793m33951m04320k97631k40406l07262l77686
11627A8285073l05252j62868j55855l08846m10506l13247j42359j12230k29785
11618A6144125l05733k31571j18485j21209k21212k78879k51975k30599k43767
11609A4140695j86554l0667L9692j21449l32593k86460k0700Q6987j34420l80866
11599A2773665l17411n8323M1322q4205j81523j16455m5831j13201k19000j98875
11589A1480163o6987L3741K8533l5150p8015p2364n9315r9286j82046k10176j21916
$$ y = [33964122, 32784895, 31841652, 30988305, 30021819, 28951833, 28015579, 27367115, 26854522, 26220280, 25456559, 24801700, 24382746, 24028459, 23510308, 22838946, 22210331, 21743145, 21392351, 21071467, 20733122, 20346329, 19912378, 19508058, 19210427, 18970021, 18662759, 18285073, 17979821, 17816953, 17661098, 17352252, 16941746, 16628499, 16486140, 16373910, 16144125, 15838392, 15606821, 15488336, 15367127, 15145915, 14867036, 14615061, 14384462, 14140695, 13954141, 13923474, 13963166, 13841717, 13509124, 13222664, 13201964, 13288951, 13154531, 12773665, 12456254, 12397931, 12439253, 12355048, 12173525, 12057070, 12011239, 11898038, 11679038, 11480163, 11413176, 11446917, 11475450, 11440300, 11362285, 11289921, 11230606, 11131320, 10949274, 10739098, 10617182]
11578A0617182M914M2057k9798j28105j95298k27981k17915j65809j22449j16770
11568I460028q5767J2108O8932m1117k38478l11339k04048p0762l3994n0991m8511
11557H456061m1615o9688j22233j58113j25687L161J29994N6971k25524l96796
11547G506531j95596J41600J52885j72767l66026j74683J03126J29052j771k6519
11537G095832M8676M7720n8103j75765k56301k42830n4679J95502K09560o4390
11527F745222k72106j65376J6722k2301j31607l0697J38044N1578j87631k04522
11517E937326l629O0118p6194j07331L9951O4494j36392k52428r9272P6521M7862
11506E551026m0877j2431J9699o7562j25225j3248J12142O8086m3060n8184n4153
$$ y = [10617182, 10622096, 10664153, 10634355, 10506250, 10310952, 10082971, 9865056, 9699247, 9576798, 9460028, 9374261, 9386369, 9455301, 9414184, 9175706, 8864367, 8660319, 8589557, 8555563, 8504572, 8456061, 8414446, 8344758, 8222525, 8064412, 7938725, 7941886, 8071880, 8128851, 7903327, 7506531, 7310935, 7452535, 7605420, 7432653, 7066627, 6891944, 6995070, 7124122, 7122351, 7095832, 7144508, 7192228, 7134125, 6958360, 6702059, 6459229, 6404550, 6600052, 6809612, 6745222, 6473116, 6307740, 6324462, 6302161, 6170554, 6139857, 6277901, 6329479, 6141848, 5937326, 5933697, 5993815, 5917621, 5810290, 5850241, 5914735, 5778343, 5525915, 5426643, 5503164, 5551026, 5510149, 5497718, 5517417, 5449855, 5324630, 5311382, 5423524, 5491610, 5448550, 5390366, 5336213]
11495E336213j45483k00175o0315J31097J32467j060k5410Q3350J15689k0971
11485E345402j86241k29234j42150q366O9826L3291m9751m1492N5418Q0628k0725
11474D906606j01677p0636k4237j3484N8733J62952P7897j94255k88126l3061
11464D480712J98612O7275j54212m6154K13724J50284j65665k22528N2869J83199
11454D758116l6496k37199j54891k8170p8942j15446M3968J90191J00945n9958
11444D382118n4589K1411k5641j04689k9894J10884J04028k1776o9379m010M4713
11433D353176K4236r957k7966k6995J2502N4803J7771n6537j9798J02536Q6706
11422D510477j06660k03275n2246R9249J3776j34047o6539J28579J78553P7529
$$ y = [5336213, 5190730, 4990555, 4930240, 5061337, 5193804, 5192744, 5167334, 5250684, 5366373, 5345402, 5159161, 4929927, 4787777, 4779411, 4849237, 4882528, 4832777, 4791285, 4846703, 4927331, 4906606, 4804929, 4734293, 4710056, 4696572, 4755305, 4918257, 4996154, 4801899, 4513773, 4480712, 4679324, 4746599, 4592387, 4546233, 4759957, 4910241, 4744576, 4522048, 4574917, 4758116, 4721620, 4484421, 4329530, 4301360, 4222418, 4106972, 4150940, 4341131, 4442076, 4382118, 4327529, 4348940, 4323299, 4218610, 4188716, 4299600, 4403628, 4381852, 4312473, 4308463, 4353176, 4377412, 4367455, 4339489, 4312494, 4324996, 4379799, 4397570, 4341033, 4321235, 4423771, 4510477, 4403817, 4200542, 4148296, 4247545, 4261321, 4127274, 4060735, 4189314, 4367867, 4445396]
11412D445396Q871j7872r5611j31095J262J38528M8210j28838o3189J93433K52983
11401D652078J0113k05553j60562j0515M6264N6501J08275J31343N7175m1830
11391D643289q9349r4578m5858Q1158J76868R2378q6993j13631M1035J44119Q3395
11380D831833O138J5302K3825o393J9752Q2076K1028j31567j25787O8190J41210
11369D945607n4568k31695j26757Q7458J21609J6058k7481r057j9728P519J24337
11358D833302J51000m2919k29832j32890J22280K11080J15536O0428P1301p723
11348E151563j31360r2383P7024J24877J1432m0883M0718P5908J53j2246J04554
11337E309357J57195K2542j44235j66761p9883J1593Q5320J07978J2281j25532
$$ y = [4445396, 4454267, 4436395, 4340784, 4209689, 4210951, 4349479, 4397689, 4268851, 4205662, 4399095, 4652078, 4662191, 4456638, 4296076, 4285561, 4331825, 4388326, 4496601, 4627944, 4685119, 4643289, 4553940, 4459362, 4413504, 4494662, 4671530, 4763908, 4676915, 4563284, 4604319, 4748438, 4831833, 4837971, 4853273, 4877098, 4870705, 4890457, 4972533, 4993561, 4861994, 4736207, 4804397, 4945607, 4891039, 4659344, 4532587, 4620045, 4741654, 4757712, 4730231, 4721174, 4701446, 4708965, 4833302, 4984302, 4941383, 4711551, 4578661, 4700941, 4912021, 5027557, 5087985, 5159286, 5151563, 5020203, 4927820, 5004844, 5129721, 5141153, 5100270, 5140988, 5216896, 5217049, 5204803, 5309357, 5466552, 5489094, 5344859, 5178098, 5098215, 5109808, 5195128, 5303106, 5315387, 5189855]
11327E189855j06262Q3057K00884J07979l4565n5291k4898n2741n8204M5006J27152
11316E421972M2946q7323m3411J37100K04180O0671j25003j68510o5375P5075
11306E452322J60536J59186J01771N4015L9424J4335l8249m9625K8849J14427
11296F036991P7974p8085j99133j43523N9606K21637J78316j7643j36940o1451
11286E937749N2199J5461q1396j1932J80815K01451k8853k11270j11018J01076
11276F044282J45206N1064L1691R9761R4459J1570J9245J39064J65676j4968k13412
11265F573638j71393Q3914K56538J57144m5537m5566J69130K81783J13147q5372
11255G287426q937K10356K14048J2021m4558J21407J87418K3649o9677P5354J69546
$$ y = [5189855, 5083593, 5166650, 5367534, 5475513, 5440948, 5385657, 5360759, 5308018, 5249814, 5294820, 5421972, 5464918, 5377595, 5334184, 5471284, 5675464, 5736135, 5611132, 5442622, 5377247, 5452322, 5612858, 5772044, 5873815, 5927830, 5967254, 5981589, 5943340, 5893715, 5922564, 6036991, 6114965, 6036880, 5837747, 5694224, 5753830, 5975467, 6153783, 6136140, 5999200, 5937749, 5989948, 6005409, 5924013, 5912081, 6092896, 6294347, 6265494, 6054224, 5943206, 6044282, 6189488, 6240552, 6272243, 6372004, 6466463, 6478033, 6497278, 6636342, 6802018, 6787050, 6573638, 6402245, 6486159, 6742697, 6899841, 6854304, 6808738, 6977868, 7259651, 7372798, 7287426, 7278489, 7488845, 7702893, 7714914, 7670356, 7791763, 7979181, 8002830, 7933153, 8008507, 8178053]
11244H178053J0261j03060J00330L26133J99408o2841k5324J96759J68875n5027
11234H933567l5619K24607K61202j1934j32623J01297L04282K02552N9884J22909
11224A0030124J91135P5027q318J35272K87465K35837J76866L01662L67648J36433
11214A1929151j03755L7784L68455L85996P4373r9313Q5344L52365M08824K70979
11204A3710203Q8199k2340M9503L01253M88854L75900R1734k4410R9653K26611
11194A5385160K14769J74601K12039K78237L07039K97489K54511K13390K71305
11185A7608540M25069M81917L36347K03442L25030N77118O61776N71302N42982
11176B1733523O49239P62474Q48004R65671J058336J056644J093325J295719J519753
$$ y = [8178053, 8188314, 8085254, 8185584, 8511717, 8711125, 8648284, 8622960, 8819719, 8988594, 8933567, 8897948, 9122555, 9383757, 9371823, 9239200, 9340497, 9644779, 9847331, 9907215, 10030124, 10221259, 10296286, 10287968, 10423240, 10710705, 10946542, 11123408, 11425070, 11792718, 11929151, 11825396, 11863180, 12231635, 12617631, 12692004, 12592691, 12678035, 13030400, 13439224, 13710203, 13798402, 13776062, 13825565, 14126818, 14615672, 14991572, 15083306, 15058896, 15158549, 15385160, 15599929, 15774530, 15986569, 16264806, 16571845, 16869334, 17123845, 17337235, 17608540, 18033609, 18515526, 18851873, 19055315, 19380345, 19957463, 20619239, 21190541, 21733523, 22382762, 23145236, 23993240, 24958911, 26017247, 27073891, 28167216, 29462935, 30982688]
11167C0982688J643480J899721K465478K995847L176416L470181M489079N757603
11159E6880493O098574N334942M526956M190889L415554J419659j013759k608784
11151G8244524l365369m175454n152604n516674m996188m254068l805188l416341
11143D3562638k812090k222922j917054j763141j569471j415726j383270j324307
11135B9154657j129582r23563q20115p58865p05860p35294q09126p58441n76110
11126B1937701m51465m43282m06381l01573k66712l11501k67327j23230p8759
11117A9287471j67853j75911m7382j4875j66223k45079r1252N8040l5903k05746
11107A8195287j58710N4614J51199N4014n2950l5206M6766Q2848O0339N5305J22496
$$ y = [30982688, 32626168, 34525889, 36991367, 39987214, 43163630, 46633811, 51122890, 56880493, 62979067, 68314009, 72840965, 77031854, 80447408, 81867067, 80853308, 78244524, 74879155, 70703701, 65551097, 60034423, 55038235, 50784167, 46978979, 43562638, 40750548, 38527626, 36610572, 34847431, 33277960, 31862234, 30478964, 29154657, 28025075, 27101512, 26281397, 25522532, 24816672, 24081378, 23272252, 22513811, 21937701, 21486236, 21042954, 20636573, 20335000, 20068288, 19756787, 19489460, 19366230, 19287471, 19119618, 18943707, 18896325, 18881450, 18715227, 18470148, 18378896, 18436936, 18401033, 18195287, 18036577, 18091191, 18242390, 18296404, 18243454, 18208248, 18255014, 18337862, 18398201, 18453506, 18576002]
11096A8576002J95380J54522M8106R6533L31880M39502K24355R557J73771M94943
11086B0744551M83290K29254K70798O43642P96147N61269M49086P27822R75198
11077B5881057R04429Q95800J245259J590357J621803J687931K099552K526744
11069C8452932K756505L291551M336468M950308M330293L303144L175869L522032
11061F8119102K691896M58020j506973k119768k276884l082246m078307m239567
11053E3965273l681773l254542l120971k823029k318272j967567j764253j433524
11045C3601342j104164j113473j297455j192043q30405o65506p73926p88235o00270
11036B5235865n10178o28346o86445n40205l89246l89896m37235m16377l49056
$$ y = [18576002, 18771382, 18925904, 18974010, 19070543, 19402423, 19841925, 20066280, 20075837, 20249608, 20744551, 21227841, 21457095, 21727893, 22371535, 23167682, 23728951, 24178037, 24905859, 25881057, 26785486, 27681286, 28926545, 30516902, 32138705, 33826636, 35926188, 38452932, 41209437, 44500988, 48837456, 53787764, 58118057, 61421201, 64597070, 68119102, 70810998, 71269018, 69762045, 67642277, 65365393, 62283147, 58204840, 53965273, 50283500, 47028958, 43907987, 41084958, 38766686, 36799119, 35034866, 33601342, 32497178, 31383705, 30086250, 28894207, 28063802, 27398296, 26624370, 25836135, 25235865, 24725687, 24097341, 23410896, 22870691, 22481445, 22091549, 21654314, 21237937, 20888881]
11027B0888881k56582j59825j77457l33822l72801j05256J93904J47524r9257
11018A9725309j03396J25791J62661o6180j53924N5425K03281O9570o5393K8283
11008A9981427J19907k1410j93354j48458m8641j45928l04340k41479l2675J6884
10998A8981933j33697k47155k06031j21188q9443r2344j05489j15381p2015J9782
10988A7818972L9151o8878j50698n4917J11001J25703j6337j15152o5589L8351
10978A7661607R2410J09956J30088J21102L7542p6806r7571M5354K49022L17193
10968A8589897K00243O8486O6711J20390J26708J78317L56027M52031K50298j5423
10958B0393685P5965M28431M98243J62798l7585K35686N65090M74863J96321K19902
$$ y = [20888881, 20632299, 20472474, 20295017, 19961195, 19588394, 19483138, 19677042, 19824566, 19725309, 19621913, 19747704, 19910365, 19844185, 19690261, 19745686, 19948967, 20018537, 19953144, 19981427, 20101334, 20079924, 19886570, 19738112, 19689471, 19543543, 19239203, 18997724, 18965049, 18981933, 18848236, 18601081, 18395050, 18273862, 18184419, 18092075, 17986586, 17871205, 17799190, 17818972, 17858123, 17789245, 17638547, 17583630, 17694631, 17820334, 17803997, 17688845, 17623256, 17661607, 17754017, 17863973, 17994061, 18115163, 18152705, 18075899, 17978328, 18023682, 18272704, 18589897, 18790140, 18858626, 18925337, 19045727, 19172435, 19350752, 19706779, 20158810, 20409108, 20393685, 20469650, 20898081, 21396324, 21559122, 21521537, 21757223, 22322313, 22797176, 22993497, 23213399]
10948B3213399M54603M35994J52133M4672K61579M75445M64941L77337L42897
10939B6223000K74033J58451J66456L33778M55932M16647L44506L51076L79601
10930B9103480L94553M59479N46767N23725M05574L77997M96667O03785O06205
10921C3518232N94491O27958O47966O56448P25919P92520P20427O09512P13109
10912C9606582R83485J062818Q47521O84885Q25183J044636J055442R54508R72790
10903D8037850J065755J070795J036107J073732J090151R83406R20659J081852
10895E6360307J290370J260809J088938J108334J329265J423744J280390J188026
10887F6330183J368810J650854J760005J701471J680495J795251J967329K102965
$$ y = [23213399, 23668002, 24103996, 24256129, 24300801, 24562380, 25037825, 25502766, 25880103, 26223000, 26497033, 26655484, 26821940, 27155718, 27611650, 28028297, 28372803, 28723879, 29103480, 29498033, 29957512, 30504279, 31028004, 31433578, 31811575, 32308242, 32912027, 33518232, 34112723, 34740681, 35388647, 36045095, 36771014, 37563534, 38283961, 38893473, 39606582, 40590067, 41652885, 42500406, 43185291, 44010474, 45055110, 46110552, 47065060, 48037850, 49103605, 50174400, 51210507, 52284239, 53374390, 54357796, 55278455, 56360307, 57650677, 58911486, 60000424, 61108758, 62438023, 63861767, 65142157, 66330183, 67698993, 69349847, 71109852, 72811323, 74491818, 76287069, 78254398, 80357363]
10879H0357363K205856K345989K569387K845482L110898L356691L615258L867455
10871A04274379M077247M335200M798978N424660N956834O309981O746753P485693
10863A49409725Q333111Q967166R439658J0093316J1054409J2099348J3000817
10856B22397550J3740068J4367464J4881172J5262957J5445725J5237624J4427427
10849C25759987J2935086J0744715P826449M321040O44285k856091o197483r416147
10841C43761841j2117957j3821440j4649140j5168022j5545885j5409682j4634387
10834B42415328j3697453j3003559j2360773j1459373j0445113r626275q951493
10827A62871289q202922p461042o954254o612820o170248n606017n137308m844683
$$ y = [80357363, 82563219, 84909208, 87478595, 90324077, 93434975, 96791666, 100406924, 104274379, 108351626, 112686826, 117485804, 122910464, 128867298, 135177279, 141924032, 149409725, 157742836, 166710002, 176149660, 186242976, 197297385, 209396733, 222397550, 236137618, 250505082, 265386254, 280649211, 296094936, 311332560, 325759987, 338695073, 349439788, 357266237, 361587277, 362231562, 359375471, 353177988, 343761841, 331643884, 317822444, 303173304, 288005282, 272459397, 257049715, 242415328, 228717875, 215714316, 203353543, 191894170, 181449057, 171822782, 162871289, 154668367, 147207325, 140253071, 133640251, 127470003, 121863986, 116726678, 111881995]
10819A11881995m617191m404065m231755m025340l680818l272641k960197k750570
10811H1939418k561623k414132k331509k178590j868328j597839j575708j641867
10803F5769822j506827j257504j218410j371900j371121j144347j012749j109441
10795E5777523j154432r93772r10769j114456j306130j126036p50392o37351q47799
10786D6936386j017848r32407p56221o87813p05075p26414p69795q40014q38510
10777C9662289p08215n57975n35501o36243p20119o89089n86854n24591n46186
10768C4157516n88232n69025m92109m38587m68552n54150o00638n23195l40812
10759B9582216k09221k82574m94713n85108m37753k68487l15393m67447m42741
$$ y = [111881995, 107264804, 102860739, 98628984, 94603644, 90922826, 87650185, 84689988, 81939418, 79377795, 76963663, 74632154, 72453564, 70585236, 68987397, 67411689, 65769822, 64262995, 63005491, 61787081, 60415181, 59044060, 57899713, 56886964, 55777523, 54623091, 53629319, 52718550, 51604094, 50297964, 49171928, 48421536, 47784185, 46936386, 45918538, 44986131, 44229910, 43542097, 42837022, 42110608, 41340813, 40500799, 39662289, 38954074, 38396099, 37860598, 37224355, 36504236, 35815147, 35228293, 34703702, 34157516, 33569284, 33000259, 32508150, 32069563, 31601011, 31046861, 30446223, 29923028, 29582216, 29372995, 29090421, 28595708, 28010600, 27572847, 27304360, 26988967, 26521520, 26078779]
10750B6078779k55195j93975l39531m39759l52831k75790l68917m65081l82400
10741B3005300k54799k74190l32707k39960j14376j99433m06913m24109k33518
10732B0525295j45475k84072m02336l06883j44985j17199j68909j51843r1203
10723A8712390r9601j65190k01445k08838k33941k42102j68487m9893N460m5302
10713A7303051j45320k12304k03419j43665j11480j46572j76452j16236k6216
10704A6021387m4248j58501k05749j31195p5338j28914j80258j22374m7155q0090
10694A4847565j56369j37637n2831l8052j00271j21543o5138j1729n692j4684
10684A4143619l3163q5114j26745q3586Q584K9816m1675r4705n6272J2664K2567
$$ y = [26078779, 25823584, 25629609, 25290078, 24850319, 24497488, 24221698, 23852781, 23387700, 23005300, 22750501, 22476311, 22143604, 21903644, 21789268, 21589835, 21182922, 20758813, 20525295, 20379820, 20095748, 19693412, 19386529, 19241544, 19124345, 18955436, 18803593, 18712390, 18612789, 18447599, 18246154, 18037316, 17803375, 17561273, 17392786, 17342893, 17348353, 17303051, 17157731, 16945427, 16742008, 16598343, 16486863, 16340291, 16163839, 16047603, 16021387, 15977139, 15818638, 15612889, 15481694, 15406356, 15277442, 15097184, 14974810, 14927655, 14847565, 14691196, 14553559, 14500728, 14462676, 14362405, 14240862, 14175724, 14163995, 14158303, 14143619, 14110456, 14025342, 13898597, 13815011, 13823595, 13853411, 13811736, 13717031, 13660759, 13673423, 13695990]
10673A3695990l4938j05629j22810l6441J20549K03752J04051p6221j18475J9248
10663A3649076J36371P0236p8393r0581P5717K34761K02670J7415r4783J8786
10653A4141275K28793K56917M7318j22900j5938K16600K54894R1693K5781J87973
10643A5312406L61965L44696K16503J35963J06187Q7163J22086J99467J99152
10634A7085588J27418J72448L51930L81753J42037j8429K08402N36751M91429
10625A9479327J78341J19488L94536N28990L02561R3077K13880M22381L86724
10616B2119305K16521J82370K51914K67831K98764M39741N11733L48636J72213
10607B4809028K76333N15505N35415L70538L52623N13826N68333M69298M88407
$$ y = [13695990, 13661052, 13555423, 13432613, 13396172, 13516721, 13720473, 13824524, 13748303, 13629828, 13649076, 13785447, 13855683, 13777290, 13686709, 13762426, 13997187, 14199857, 14217272, 14122489, 14141275, 14370068, 14626985, 14674303, 14551403, 14535465, 14752065, 15006959, 15098652, 15124433, 15312406, 15674371, 16019067, 16235570, 16371533, 16477720, 16564883, 16686969, 16886436, 17085588, 17213006, 17385454, 17737384, 18119137, 18261174, 18242745, 18451147, 18987898, 19479327, 19657668, 19777156, 20171692, 20700682, 21003243, 21096320, 21310200, 21732581, 22119305, 22335826, 22518196, 22770110, 23037941, 23336705, 23776446, 24288179, 24636815, 24809028, 25085361, 25600866, 26136281, 26506819, 26859442, 27373268, 27941601, 28410899, 28899306]
10598B8899306O83675P68830O38220N72542P44708R34182R47145R36254J053970
10589C6178832J148880J096855J105000J353543J619962J623052J502390J566801
10581D7195315J759700J791467J664311J622077J642076J426128R21465M39643
10573E8462182J78415l116k18811l15703j74276L9503J28122J53673K75892M66043
10563E8991924N76820N84358N92479O68513P99547R54139J103810J238633J396289
10554F6906512J593651J735884J739458J741233J972018K382991K657972K705423
10546H3435142K854558L357457L950730M204095M127866M101945M297979M516901
10538A14846673M584537M582868M644068M807467N157552N830247O776215P779451
$$ y = [28899306, 29582981, 30351811, 30990031, 31562573, 32307281, 33241463, 34188608, 35124862, 36178832, 37327712, 38424567, 39529567, 40883110, 42503072, 44126124, 45628514, 47195315, 48955015, 50746482, 52410793, 54032870, 55674946, 57101074, 58022539, 58462182, 58640597, 58637481, 58418670, 58102967, 57928691, 57968194, 58096316, 58249989, 58525881, 58991924, 59568744, 60153102, 60745581, 61414094, 62213641, 63167780, 64271590, 65510223, 66906512, 68500163, 70236047, 71975505, 73716738, 75688756, 78071747, 80729719, 83435142, 86289700, 89647157, 93597887, 97801982, 101929848, 106031793, 110329772, 114846673, 119431210, 124014078, 128658146, 133465613, 138623165, 144453412, 151229627, 159009078]
10530A59009078Q840479J0259897J2141957J4098124J5745166J7231268J8777713
10523B56103682J9784254J8998677J5822006J1009816N734314L31963n478998
10516C22305714j1351506j6030553j8550330j9182261j8838798j7954278j6445366
10509B03952622j4490198j2678205j1332102j0209139r054652q032857p367496
10502A30787973o904475o349955n716084n217849m882074m561025m235740m019153
10494H8901618l907812l782503l620856l478270l297877k984220k641879k478632
10486F2709569k460631k331161k019485j760467j711657j711906j574357j394593
10478D7745312j361256j422411j374833j201564j093153j144171j219826j165107
$$ y = [159009078, 167849557, 178109454, 190251411, 204349535, 220094701, 237325969, 256103682, 275887936, 294886613, 310708619, 321718435, 327452749, 327784712, 322305714, 310954208, 294923655, 276373325, 257191064, 238352266, 220397988, 203952622, 189462424, 176784219, 165452117, 155242978, 146188326, 138155469, 130787973, 123883498, 117533543, 111817459, 106599610, 101717536, 97156511, 92920771, 88901618, 84993806, 81211303, 77590447, 74112177, 70814300, 67830080, 65188201, 62709569, 60248938, 57917777, 55898292, 54137825, 52426168, 50714262, 49139905, 47745312, 46384056, 44961645, 43586812, 42385248, 41292095, 40147924, 38928098, 37762991]
10470C7762991j007147q80532q35513q00083p07623n96543n56170n99729o41802
10461C1137849o17504n71956n84224o43306o63373n96020m68274l42997l01688
10452B6348507m07366n93672o58440m96814k83514k63604m07667m70952l73630
10443B2392848k87537l19790l65264l51339l70135m40066l94970j94290r6255
10434A9573202k74487m77014l78027j09818p7788l20452m50530k64867l0041k9103
10424A7161075j56262j74052j15945j65030k91018k91625j38512l1055r1422k07388
10414A5498766k32245j83959j63272j85688j95659j85317j96657k23578k03413
10405A3728978j23887o5960r7062j72577k01815j76764j59500j58005j11585j9963
$$ y = [37762991, 36755844, 35875312, 35039799, 34239716, 33532093, 32935550, 32379380, 31779651, 31137849, 30520345, 29948389, 29364165, 28720859, 28057486, 27461466, 26993192, 26650195, 26348507, 25941141, 25347469, 24689029, 24192215, 23908701, 23645097, 23237430, 22766478, 22392848, 22105311, 21785521, 21420257, 21068918, 20698783, 20258717, 19863747, 19669457, 19573202, 19298715, 18821701, 18443674, 18333856, 18256068, 17935616, 17485086, 17220219, 17190178, 17161075, 17004813, 16830761, 16714816, 16549786, 16258768, 15967143, 15828631, 15797576, 15706154, 15498766, 15266521, 15082562, 14919290, 14733602, 14537943, 14352626, 14155969, 13932391, 13728978, 13605091, 13539131, 13442069, 13269492, 13067677, 12890913, 12731413, 12573408, 12461823, 12441860]
10395A2441860J3443p2918j89781k13547j52015j02496q9929n7336l887j4852
10385A1558542j21533k21961k00978q1477L116k6804j09289j34027r2229q2053
10375A0491307j52939k11451j49177j3856N2675J9478k5101o0307j50883k45890
10365I553856j74800N1258J53212k5949k41714j92261K3485Q2208m8018j10908
10355I070369l4979l0536j67673k19921n9322J08260Q0570l6104n9477l1055n6644
10344H563488n5002P2690J81449P3240j50256k04265m1693J03400Q1441n211k3423
10333H595858J4725M4187M1048k2011j62557k89969k64788j02163J7485j2023
10323G859792j00562j29401j10694j08013j12792r0677o6825p5519q5253n5215
$$ y = [12441860, 12455303, 12382385, 12192604, 11979057, 11827042, 11724546, 11634617, 11577281, 11573394, 11558542, 11437009, 11215048, 11014070, 10932593, 10935709, 10908905, 10799616, 10665589, 10573360, 10491307, 10338368, 10126917, 9977740, 9963884, 10016559, 10036037, 10010936, 9950629, 9799746, 9553856, 9379056, 9430314, 9583526, 9557577, 9315863, 9123602, 9147087, 9229295, 9181277, 9070369, 9035390, 9004854, 8837181, 8617260, 8557938, 8666198, 8746768, 8710664, 8651187, 8620132, 8563488, 8508486, 8581176, 8762625, 8835865, 8685609, 8481344, 8439651, 8543051, 8624492, 8619281, 8595858, 8610583, 8654770, 8695818, 8673807, 8511250, 8221281, 7956493, 7854330, 7871815, 7859792, 7759230, 7629829, 7519135, 7411122, 7298330, 7207653, 7140828, 7065309, 6980056, 6924841]
10313F924841j9547l7622r2692j14419q5851n8284n8707m7929L236M7669K4698
10302F485393l5262m2360N874j436j09853j87754j10085J8938L282j13554q4750
10291E828433J24814K16594N24k71637k52196j1491Q6006o3983j93388j16221
10281E347455Q853k3484j43500j45943o030J07283P1975n2438j17088n1755N9418
10270E054746P1980l3515j11555n2486N3695N7516k4408o7379n3786n3568m3227
10259D798013M6758J33225O5239q8770r2989P5030J58849K3477j35444j09372
10249D874016K8036R3808O1372m06p0467j10301l5424J06713J22028k1932q6962
10238D960481O8537K44391K25228J15132J00207J12381K6461k3699J29485L23545
$$ y = [6924841, 6905294, 6867672, 6774980, 6660561, 6574710, 6516426, 6457719, 6409790, 6413026, 6460695, 6485393, 6450131, 6407771, 6413645, 6412209, 6302356, 6114602, 6004517, 6023455, 6026737, 5913183, 5828433, 5953247, 6169841, 6170365, 5898728, 5646532, 5635041, 5721047, 5657064, 5463676, 5347455, 5356308, 5332824, 5189324, 5043381, 5037351, 5144634, 5216609, 5164171, 5047083, 4995328, 5054746, 5126726, 5093211, 4981656, 4929170, 4982865, 5040381, 5015973, 4948594, 4894808, 4841240, 4798013, 4844771, 4977996, 5043235, 4954465, 4861476, 4936506, 5095355, 5118832, 4983388, 4874016, 4902052, 4995860, 5057232, 5056826, 4986359, 4876058, 4840634, 4947347, 5069375, 5047443, 4960481, 5029018, 5273409, 5498637, 5613769, 5713976, 5826357, 5852818, 5829119, 5958604, 6282149]
10228F282149K97054J36471J02149J42736J9991j82445j65594Q210k9099k86659
10218F324963l56548j33804k7641k41104l97244k01293M3065j1192j48937l9436
10208D810829J11663n1174k95069j26767K92755K89446k35232n63486k26755L00399
10198D306609L34533o1215l10685k03442m4064n5414j01785l7748M1008K3521
10188C891318m060N6726R5034m2751k49988k47466L995J88738O1324j76439j48394
10177C428037J23323K20264m2011l03054j77752J70861K84864P6480j20623j08235
10167C552154n2645j03903j38352k9649J00980R3874O837k1023L15r634l0063
10156C368891j0545N282j9222p086Q4741J31383K1078j37825j65419p0347J2319
$$ y = [6282149, 6579203, 6715674, 6817823, 6960559, 6980550, 6798105, 6632511, 6640721, 6611622, 6324963, 5968415, 5834611, 5806970, 5565866, 5168622, 4967329, 5010394, 4999202, 4850265, 4810829, 4922492, 4871318, 4576249, 4449482, 4742237, 5031683, 4796451, 4232965, 4006210, 4306609, 4641142, 4579927, 4269242, 4065800, 4021736, 3966322, 3864537, 3826789, 3867797, 3891318, 3887258, 3943984, 4039018, 3996267, 3746279, 3498813, 3502808, 3691546, 3752870, 3576431, 3428037, 3551360, 3771624, 3729613, 3426559, 3248807, 3419668, 3704532, 3781012, 3660389, 3552154, 3499509, 3395606, 3257254, 3227605, 3328585, 3422459, 3429296, 3408273, 3408588, 3398954, 3368891, 3358346, 3363628, 3344406, 3337320, 3422061, 3553444, 3574522, 3436697, 3271278, 3200931, 3213250]
10145C213250M6832P5454O6116j4886o2714J5125Q8838p313j51830r1248J17162
10134C294786J53157m4583j59093j2606J39356L3564j72461j67324K8101J37661
10124C230558O8134j7227o950L4390M3739M8164N6120K5295l9185p7490o8909
10113C296639l8556l272J025q3822k00606j53382J05311K88621J25647j91803
10103C145802k26600O0153K39218O1371j85913j52769N6622J14385r135p1711
10093C031423J1425P6123K0508n6968o0276l2142l5181m4986j5018M7297R7150
10082C039355Q4683j1077j22067j23738o282P3060J6607m5175K9932J24768L5206
10071C095272j59270j73741L6146J91848J16541l0310n4494j0880k5492n0535
$$ y = [3213250, 3260082, 3335536, 3401652, 3386766, 3324052, 3339177, 3428015, 3420702, 3268872, 3177624, 3294786, 3447943, 3403360, 3244267, 3231661, 3371017, 3404581, 3232120, 3064796, 3092897, 3230558, 3298692, 3281465, 3274515, 3308905, 3352644, 3400808, 3456928, 3482223, 3443038, 3365548, 3296639, 3258083, 3254811, 3255836, 3172014, 2971408, 2818026, 2923337, 3211958, 3337605, 3145802, 2919202, 2979355, 3218573, 3279944, 3094031, 2941262, 2997884, 3112269, 3103134, 3031423, 3042848, 3118971, 3139479, 3082511, 3022235, 2990093, 2954912, 2909926, 2894908, 2942205, 3039355, 3124038, 3112961, 2990894, 2867156, 2860874, 2933934, 2950541, 2905366, 2935298, 3060066, 3095272, 2936002, 2762261, 2798407, 2990255, 3106796, 3076486, 3021992, 3011112, 2985620, 2935085]
10061B935085M006O0533J0257n9511R286J68607K18952J01411m7207j08319q5179
10050C207921p732J05051J81675J40596J7822o0044l9786K1708P5990J22656J31786
10039C897643N3135p1126j13389k3629R4425J09607J2931q1565n3902R6598K21092
10028D141820J65917j6519r1142N3424K37185K47124J34038O9475L0731j09746
10018D862307k55894j75622P1350J39141p4568k44274j33111L3005l5474k03210
10008C983650j62126L1695O7705p7906j22673J0551O8261o5501j53059k3060J17297
9997C674834K7842j56282j44710M3095J29312J2328j32820j68457j46503j17264
9987C021375k7516J09454J46214K1015j13161j07193l0583k5342o2401k2521N6681
$$ y = [2935085, 2939091, 2999624, 3009881, 2950370, 2959656, 3128263, 3347215, 3448626, 3401419, 3293100, 3207921, 3200189, 3305240, 3486915, 3627511, 3645333, 3585289, 3545503, 3567211, 3643201, 3765857, 3897643, 3950778, 3879652, 3766263, 3742634, 3837059, 3946666, 3959597, 3878032, 3824130, 3920728, 4141820, 4307737, 4291218, 4200076, 4253500, 4490685, 4737809, 4871847, 4941322, 4972053, 4862307, 4606413, 4430791, 4502141, 4641282, 4566714, 4322440, 4189329, 4222334, 4186860, 3983650, 3821524, 3853219, 3920924, 3843018, 3720345, 3730896, 3799157, 3733656, 3580597, 3557537, 3674834, 3702676, 3546394, 3401684, 3444779, 3574091, 3586419, 3453599, 3285142, 3138639, 3021375, 2993859, 3103313, 3249527, 3270542, 3157381, 3050188, 3019605, 2994263, 2931862, 2909341, 2966022]
9976B966022K3791j09832j47864j3607J13123O6674n1447l7447R8093J50777K8406
9965C086689j22092j20496K6046J56139J43203J0484j11492j21087m6618R65k1901
9954B879840m3105k594N0854N3564L5789M4146L4875l4194p7553j562J03266O8751
9942C112077p9674j52874r2669k4318j072O1936J45759Q6866j07859j72035J8971
9931B795108K04750J25279p1292q6755M2733N4032o7645q9293K7617N6218p7141
9920B913611j49023k6325J07192P2697j4430K3493J12265P4194m9740o8585L3420
9909C028769O8906m7575j52581o4011J50332K35552O9353j59534j62891P4275
9899C040595K52704J52448p0384j30209l3431j4078j10065j10629L7910R9947
$$ y = [2966022, 2989813, 2879981, 2732117, 2718510, 2831633, 2898307, 2846860, 2809413, 2907506, 3058283, 3086689, 2964597, 2844101, 2870147, 3026286, 3169489, 3179973, 3068481, 2947394, 2900776, 2901741, 2879840, 2836735, 2834141, 2884995, 2938559, 2974348, 3018494, 3053369, 3019175, 2941622, 2940060, 3043326, 3112077, 3032403, 2879529, 2786860, 2762542, 2761470, 2823406, 2969165, 3056031, 2948172, 2776137, 2795108, 2999858, 3125137, 3053845, 2967090, 3009823, 3063855, 2996210, 2906917, 2934534, 2990752, 2913611, 2764588, 2738263, 2845455, 2918152, 2903722, 2927215, 3039480, 3113674, 3063934, 2995349, 3028769, 3097675, 3050100, 2897519, 2833508, 2983840, 3219392, 3288745, 3129211, 2966320, 3040595, 3293299, 3445747, 3375363, 3245154, 3211723, 3197645, 3087580, 2976951, 3014861, 3114808]
9889C114808m0391j41118P326K08765J64042m2239r0487M8270R5508m2586j23753
9878C158145N906J51580J00846k9600n175J23175Q9884j49776l04334j42900J69197
9867C166948K79369J09302o8690k5556J30645J56592L1337o1738l9696Q1j497
9856C677097J9372O8879L9443p6873j15903l384R7221M7107l8037k667P2839L3076
9844C818170n6344k7932P3072O4325m2372n9961M5014J08839O1985R879J587l2486
9832C963776p6769j4965J27229J69081P2644R826N3747O1305k8264m6090R5606
9821D387126J95793P6040j05780q8142J00035K14847J60040N0080j5709l4845
9811D939485n664O5212R1381N108r9473o9255Q2060J84239J34645J40r2144p3358
$$ y = [3114808, 3074417, 2933299, 2940625, 3149390, 3313432, 3271193, 3180706, 3228976, 3324484, 3281898, 3158145, 3164051, 3315631, 3416477, 3386877, 3381702, 3504877, 3594761, 3444985, 3140651, 2997751, 3166948, 3446317, 3555619, 3486929, 3461373, 3592018, 3748610, 3779947, 3718209, 3678513, 3678594, 3677097, 3696469, 3765348, 3804791, 3727918, 3612015, 3608631, 3705852, 3752959, 3714922, 3712255, 3785094, 3818170, 3761826, 3733894, 3806966, 3871291, 3828919, 3768958, 3813972, 3922811, 3984796, 3994675, 3996262, 3963776, 3887007, 3872042, 3999271, 4168352, 4240996, 4250822, 4304569, 4365874, 4337610, 4291520, 4387126, 4582919, 4658959, 4553179, 4465037, 4565072, 4779919, 4939959, 4990039, 4974330, 4939485, 4933821, 4999033, 5090414, 5095522, 4996049, 4926794, 5008854, 5193093, 5327738, 5327878, 5235734, 5162376]
9799E162376L9568J57463J80149R6851o166n7813n3165Q821J15880J59936L4718
9788E838618j46616j38730O3449J83218R8822L3515J34877J82692p221j87968
9778F054656o0755J95642K09818M7281O3435K42009K25366j0630q1686J14065
9768F999201J93387k7609j79946K6084K86334K11378k8411j6355K20094L04138
9758G988295J40458q75K8384Q8298P7567P7825J23097J15649M0949K8747J26243
9747H834637K06402J72192Q8686N0884O2327J00049J71284K45921K40161J33480
9737A0306023K9411M2176J58732K47769J98416M8516l6951M8482K11571K81388
9727A1535533K42250K11112K01899J14384j1391K0178K17257L04207J39789k3819
$$ y = [5162376, 5201944, 5359407, 5539556, 5636407, 5630241, 5572428, 5519263, 5528084, 5643964, 5803900, 5838618, 5692002, 5553272, 5616721, 5799939, 5898761, 5932276, 6067153, 6249845, 6242624, 6054656, 5993901, 6189543, 6399361, 6446642, 6510077, 6752086, 6977452, 6966822, 6885136, 6999201, 7192588, 7164979, 6985033, 7011117, 7297451, 7508829, 7480418, 7464063, 7684157, 7988295, 8128753, 8127878, 8156262, 8244560, 8322127, 8399952, 8523049, 8638698, 8679647, 8708394, 8834637, 9041039, 9213231, 9301917, 9352801, 9415128, 9515177, 9686461, 9932382, 10172543, 10306023, 10335434, 10377610, 10536342, 10784111, 10982527, 11031043, 10994092, 11042574, 11254145, 11535533, 11777783, 11988895, 12190794, 12305178, 12293787, 12313965, 12531222, 12835429, 12975218, 12951399]
9717A2951399O7618K60712K69855J52003J53753K43295J91800K9790R361J42141
9707A4471727J85260R8347R8855K09552J79839k8888j06362P7455K10333N1954
9697A5448072j51054p3305J56474J77472m5091k20721j78054k3524P3821L6466
9687A5200556j14297k43070j92891k0635J8643j45497k54253j40081k8065j48050
9677A3932360l03059j85673P2988R0364j47077k86887j94181j02240j55665k12795
9667A2508135j81653j75999k26027j83074m4715l9390k25516l29105j82799k7220
9657A0892637j24896l28553l26206j30628j6009p5666j41611j10660q7110j65807
9647I385491k65355k48057j07358J4725k8690k20960l61527k81882p6908J088
$$ y = [12951399, 13019017, 13279729, 13549584, 13701587, 13855340, 14098635, 14290435, 14320225, 14329586, 14471727, 14656987, 14755334, 14854189, 15063741, 15243580, 15214692, 15108330, 15185785, 15396118, 15448072, 15297018, 15223713, 15380187, 15557659, 15512568, 15291847, 15113793, 15090269, 15164090, 15200556, 15086259, 14843189, 14650298, 14629663, 14648306, 14502809, 14248556, 14108475, 14080410, 13932360, 13629301, 13443628, 13516616, 13606980, 13459903, 13173016, 12978835, 12876595, 12720930, 12508135, 12326482, 12150483, 11924456, 11741382, 11696667, 11657277, 11431761, 11102656, 10919857, 10892637, 10767741, 10439188, 10112982, 9982354, 9966345, 9890679, 9749068, 9638408, 9551298, 9385491, 9120136, 8872079, 8764721, 8779446, 8750756, 8529796, 8168269, 7886387, 7809479, 7810567]
9637G810567j06716j91602j13306r438m2670j30133j12943m4495q2479j88658
9627F788127j77689l2015N6983k0638j48099j69858q2777P756J7957o4702j82673
9616E992372k36252j71319m6414L1614K0383n0178j35945j85664j41962r699J12350
9605E179286J26647K8375j22738k46898k42094o3524J46706J60171l2296j82750
9595D750885j44505o3486q2066r6344j1357J6753j23484k02960j3942J85281L6415
9584D251190k65913k24766J18036K00103j27859l22254l7031L01929J97654j41849
9574C949240k16819m8632k7961j87259j92114L2171J82244R6342l9222n5863j4466
9563C477661R606L9272L6017q6058k35842k10615l5177M0100o3144j37158m9205
$$ y = [7810567, 7703851, 7512249, 7398943, 7389505, 7346835, 7216702, 7103759, 7059264, 6976785, 6788127, 6610438, 6578423, 6635406, 6614768, 6466669, 6296811, 6214034, 6221790, 6239747, 6175045, 5992372, 5756120, 5584801, 5538387, 5570001, 5590384, 5540206, 5404261, 5218597, 5076635, 5066936, 5179286, 5305933, 5334308, 5211570, 4964672, 4722578, 4659054, 4805760, 4965931, 4933635, 4750885, 4606380, 4542894, 4460828, 4364484, 4353127, 4369880, 4246396, 4043436, 4029494, 4214775, 4251190, 3985277, 3760511, 3878547, 4078650, 3950791, 3628537, 3591506, 3893435, 4091089, 3949240, 3732421, 3683789, 3655828, 3468569, 3276455, 3308626, 3490870, 3587212, 3547990, 3492127, 3477661, 3487267, 3526539, 3562556, 3476498, 3240656, 3030041, 2994864, 3034964, 2971820, 2834662, 2785457]
9552B785457O4185O9540L3886K3036l7982j51724j44702L9777J71775O9501r6348
9541B826401p4473N8186M0010j27769j79917j8046J37321R0665n4109q2957R890
9530B625202M2496o6416j68020q7524J16113J96562M2121j56196j53767J1291
9520B401862Q9003n576q6659j3265R0012M4538j05943j80415j18683p907P4789
9509B181756J06875O2300n5896j54671j38421l9409K9641K6115k140j4269j2254
9498A989627o695j3102m6847p0694j0155J18453J76734Q3814n4138r1894m5064
9487B030039l0344p3460r8710o3997K408N9843O3650k2534j38507j39099M133
9476A593422J14668M7642r3502j21261l2153N5355J11951J49475Q2106j24533
$$ y = [2785457, 2849642, 2919182, 2953068, 2976104, 2938122, 2786398, 2641696, 2681473, 2853248, 2922749, 2826401, 2751928, 2810114, 2850124, 2722355, 2542438, 2524392, 2661713, 2752378, 2698269, 2615312, 2625202, 2667698, 2601282, 2433262, 2345738, 2461851, 2658413, 2700534, 2544338, 2390571, 2401862, 2490865, 2485289, 2398630, 2385365, 2475377, 2519915, 2413972, 2233557, 2114874, 2106967, 2181756, 2288631, 2350931, 2295035, 2140364, 2001943, 1962534, 1992175, 2018290, 2016150, 2001881, 1989627, 1982932, 1969830, 1922983, 1852289, 1842134, 1960587, 2137321, 2221135, 2166997, 2075103, 2030039, 1999695, 1926235, 1827525, 1763528, 1765936, 1825779, 1889429, 1866895, 1728388, 1589289, 1593422, 1708090, 1755732, 1662230, 1540969, 1508816, 1564171, 1676122, 1825597, 1907703, 1783170]
9466A783170k65668j33663J26570J90509L2433q6755p8650j08871j96139j27206
9456A135730J20786K53550J21486m0657l1113L601q9190j43340K129J42985L3966
9445A509933j52828q7992J51105J88664m4759k12663r6482J18323J53845j1868
9435A515278j84973j82041R438J87353J15834j34779j89196J00145L38876J26901
9425A702836k89130l39498J713J92613j6652k41016j31245J11298J53361N0318
9415A194598K8332O5126J8795o5026p7925p6799j15591o0549J47473K64055Q9086
9404A411575j53958j31818P3916J29470K394n3056J5550R572r3492q2288O8565
9393A196430J14792k4745j16175k1788P6405K6554l3526L6477J09739L2015r9366
$$ y = [1783170, 1517502, 1383839, 1510409, 1700918, 1733351, 1646596, 1567946, 1459075, 1262936, 1135730, 1256516, 1510066, 1631552, 1590895, 1559782, 1563383, 1474193, 1330853, 1332982, 1475967, 1509933, 1357105, 1269113, 1420218, 1608882, 1564123, 1351460, 1254978, 1373301, 1527146, 1515278, 1330305, 1148264, 1157702, 1345055, 1460889, 1326110, 1136914, 1237059, 1575935, 1702836, 1413706, 1074208, 1075921, 1268534, 1251882, 1010866, 879621, 990919, 1144280, 1194598, 1222930, 1288056, 1306851, 1241825, 1163900, 1087101, 971510, 910961, 1058434, 1322489, 1411575, 1257617, 1125799, 1199715, 1329185, 1331579, 1278523, 1294073, 1303645, 1210153, 1127865, 1196430, 1311222, 1286477, 1170302, 1148514, 1224919, 1251473, 1217947, 1254424, 1364163, 1396178, 1296812]
9382A296812j21073p2318o1436m7962K1766L9134o7818j24899L2534K31680J81503
9371A307923p4541k24401j50330k3528M1426J11828J84833J19222q4670k01453
9361A006309j04082M7850P2191J5555n6P423j4862K58R7513J32916l4862k68236
9349I57917k86646n5193J60828J48575r343r0927j0723J22491J54927M8539q3287
9338A057158j00506q421M6071j7618r7603p5019L457K5112N94K043o157q4179
9326G44932j25877J4453K22283K16085j8459j64906m8106J08379O5268n5875k5856
9315I32321P6710J7083j57366j71305K1148J55898P1442q1544j19764o9376k4793
9304F50454K1048Q0312Q0165n91m8360R796P7222N2468j856J7368P2203O0522
$$ y = [1296812, 1175739, 1103421, 1041985, 994023, 1015789, 1054923, 987105, 862206, 894740, 1126420, 1307923, 1233382, 1008981, 858651, 835123, 876549, 988377, 1173210, 1292432, 1207762, 1006309, 902227, 950077, 1022268, 1037823, 1037767, 1045190, 1030328, 1030586, 1128099, 1261015, 1226153, 957917, 671271, 616078, 776906, 925481, 916138, 825211, 814488, 936979, 1091906, 1140445, 1057158, 956652, 948231, 994302, 976684, 879081, 804062, 807519, 832631, 833225, 835268, 829111, 744932, 619055, 633508, 855791, 1071876, 1053417, 888511, 840405, 948784, 1014052, 958177, 932321, 1009031, 1026114, 868748, 697443, 718591, 874489, 945931, 864387, 744623, 675247, 650454, 671502, 751814, 831979, 831388, 783028, 792824, 870046, 922514, 920658, 938026, 1010229, 1070751]
9292A070751j4243p5993r9442q7581j4639Q9471R5490m3073j54864o2398J39827
9281H43306J97685M8708j18183j41117n2949L6432O7636K1141p9359j30047m4507
9270F48746R3865J12541M019m9298N0246J63288J16369n8057j78793j40739m798
9259G57389R2480O9766k8196p8425l1317K0038p635l0644O7320J89605J14921
9248A135302j50282l17160j90742P8507K18653J54441j318j21461j17664K9459
9238G17735J75405J06167j41546k37867j2862K42420J74920r7863j74752R181
9228G60938J22200k872j28415m6431Q4952M2943q1071o1167P0305Q3269o7126
9217G77525j71078q8340N9541Q4677j4355q1086j8794R5909J16537J3512p4091
$$ y = [1070751, 1056508, 980515, 881073, 793492, 778853, 868324, 963814, 920741, 765877, 703479, 843306, 1040991, 1089699, 971516, 830399, 777450, 813882, 881518, 902659, 823300, 693253, 648746, 742611, 855152, 859171, 809873, 860119, 1023407, 1139776, 1081719, 902926, 762187, 757389, 849869, 919635, 891439, 813014, 781697, 801735, 794100, 763456, 830776, 1020381, 1135302, 985020, 667860, 477118, 555625, 774278, 928719, 927401, 805940, 688276, 717735, 893140, 999307, 857761, 619894, 607032, 849452, 1024372, 926509, 751757, 760938, 883138, 880266, 751851, 705420, 790372, 833315, 752244, 691077, 761382, 844651, 777525, 606447, 518107, 577648, 662325, 647970, 566884, 548090, 643999, 760536, 774048, 699957]
9206F99957o909J52117J85414L462k08758k10109o977J69725J64366M9746l5867
9195I56167p6870j25657j50791o9916Q1389J44024M8883o4640l5536Q1347R3293
9184H81693l6748j29010o1182M7832L3997n2384l9789P6294J17483j761j43615
9173F92810j42767j1417J15335J46422Q1228l5109j29141j21783o014J16283J25496
9162H31343J1612j09966j12456M051Q8996K705j78299k06272J1203K33567J84860
9151G61344n1288j47466j5196R1017N321r5643k3187R0972L2765j05901p1750
9140D70988J10199J55176k3221j69687q3948Q9725J13261P294l2342L8932P1728
9129G48105j3415r3021k9505J14928J50012J3576j36271j18213M3428J54672R3039
$$ y = [699957, 693048, 845165, 1030579, 1034041, 825283, 615174, 608197, 777922, 942288, 992034, 956167, 879297, 753640, 602849, 532933, 614322, 758346, 807229, 742589, 707053, 788400, 881693, 844945, 715935, 654753, 702585, 736582, 684198, 644409, 720703, 838186, 836425, 692810, 550043, 538626, 653961, 800383, 881611, 846502, 717361, 595578, 589564, 705847, 831343, 842955, 732989, 620533, 624584, 713580, 716285, 537986, 331714, 342917, 576484, 761344, 710056, 562590, 547394, 638411, 643732, 548089, 524902, 615874, 648639, 542738, 470988, 581187, 736363, 713142, 543455, 459507, 549232, 662493, 669787, 637445, 676377, 748105, 734690, 641669, 612164, 727092, 877104, 890680, 754409, 636196, 679624, 834296, 927335]
9118I27335o4886j58854j11373L1448J43231R1456j26396k99913j96321J13917
9108C49644K83534J35651r3754j13207P639J3302q9173o6056J12440K03574Q8030
9097H31624o1643q8382n8815n9343l6371K8684K2067p2185p2481R3774K07627
9086G34556R4540p0314m8879N9182J1936j26417r3541Q6614J13485p7975j91032
9075D92155n5038J01954M3449r7984o6885R6635J46426K4415q3871n2966K9237
9064E77527K9840n2447j17934r0768J4442J14334J43681J23904J06484O3561o5511
9053H47113k09817j95046j562J53862J02573m6735r8581n4751l1256j5095O6454
9042E17159J16927j5436k14649j81949J01750K85301J42488j03899j37128l76
$$ y = [927335, 862449, 703595, 592222, 623670, 766901, 858357, 731961, 432048, 235727, 349644, 633178, 768829, 675075, 561868, 569507, 582809, 493636, 427580, 540020, 743594, 831624, 769981, 681599, 622784, 563441, 527070, 555754, 577821, 505636, 433155, 526929, 734556, 829096, 758782, 709903, 769085, 781021, 654604, 561063, 647677, 761162, 683187, 492155, 437117, 539071, 582520, 484536, 417651, 514286, 660712, 685127, 601256, 548290, 577527, 607367, 554920, 436986, 346218, 360660, 474994, 618675, 742579, 849063, 912624, 847113, 637296, 442250, 440688, 594550, 697123, 650388, 551807, 497056, 465800, 450705, 517159, 634086, 618650, 404001, 222052, 323802, 609103, 751591, 647692, 510564, 510188]
9032E10188M9592k0850k3925Q3741J31270M0633n6093o6941p8411j45214j45595
9021B78395P456J67024J40588j9442r2917r442Q5588P2684R05m0526m8191m3094
9009D99028n433M9381L2603p7993j43371l7589J34585J48233j9298j41956o8706
8998C69484O8239P4740j3814k3964O0441Q9438R468o1216m4872r680q480J1699
8986E21483N8235K6736r9869j56025m5668P1107K8012o1200O45J33935J02704
8975E80095p1064j25485R626J10858M3441n3923n7983m6409o9505j6449J29806
8964D33008J70379J6773j10455l0639Q7001J9162j22359r2654O9815J38554P4145
8953F52730K326n4930j23040q6967J09419K19051K4378k21573j29045J60077J58102
$$ y = [510188, 559780, 538930, 515005, 598746, 730016, 770649, 714556, 647615, 569204, 423990, 278395, 285851, 452875, 593463, 574021, 481104, 471662, 557250, 629934, 630839, 590313, 542122, 499028, 493595, 542976, 575579, 497586, 354215, 316626, 451211, 599444, 580146, 438190, 369484, 437723, 512463, 498649, 474685, 535126, 624564, 634032, 572816, 527944, 518264, 509784, 521483, 579718, 606454, 506585, 350560, 304892, 375999, 404011, 342811, 343456, 477391, 580095, 509031, 383546, 393172, 504030, 547471, 493548, 435565, 389156, 319651, 303202, 433008, 603387, 620160, 509705, 479066, 566067, 585229, 462870, 370216, 440031, 578585, 652730, 655056, 600126, 477086, 390119, 499538, 718589, 742967, 521394, 392349, 552426, 710528]
8942G10528j49553k57419J0769K14117N7751j38321m4565J27004O9398o7745j4134
8931E17830J02751L6894q4470j6752J12516M1568j20717j01277K6186J9248l6731
8920D97046P2505J72465l9006l38408k23993K19434L71681N7004j99150o0329
8910E29249J27897J6555j65735q8177J06059J12319j7242n9852k5550k3456J266
8899E13333P9943M9553j24468j57257R2118K82287R8203k02003j88858M8121J00436
8888E91408o2183j11021L5668J31115Q1495M1645M1317m4635j50247p2538J10930
8877E92954J07639p1548j00176Q9042J70673n990j57949o3233Q9829P5629p109
8866G19761o26N221r2704j46392j6597J31571Q2804o6612q2273L0580R5627P9550
$$ y = [710528, 560975, 303556, 314325, 528442, 586193, 447872, 403307, 530311, 599709, 531964, 517830, 620581, 657475, 573005, 556253, 668769, 710337, 589620, 488343, 514529, 533777, 497046, 569551, 742016, 703010, 364602, 140609, 360043, 731724, 788728, 589578, 529249, 657146, 673701, 507966, 419789, 525848, 638167, 620925, 561073, 535523, 512067, 513333, 593276, 642829, 518361, 361104, 453222, 735509, 833712, 631709, 442851, 490972, 591408, 529225, 418204, 453872, 584987, 666482, 708127, 749444, 704809, 554562, 482024, 592954, 700593, 629045, 528869, 617911, 788584, 782594, 624645, 561412, 651241, 726870, 719761, 719135, 724356, 631652, 485260, 468663, 600234, 683038, 616426, 534153, 564733, 660360, 739910]
8854G39910P0429M9796n1035j44666q9059N2713Q3299k4615r8913l3002R1637
8843F46494J43921P1854q3698j95286j25170R4276K35619J52798j4956n4758J7553
8832H88647M1701o031k5156q929l0835o2286k0243M0399J552q1154m9006O7915
8820G56574P9896l2577q4188k0852p400r0964p0598J35516K64650Q8173j94681
8809H23549k26801k1258R2638l858p2375N3686J91477J11843r2325j47607N83
8798G09552J38313J03769k5799r5864p4412k3313K0431M8815M0409m63j2648L5445
8786H64235P6926M5763j0292j7270j6296p9660j31783l7466J34192J48544l2450
8775I44443j45317q559J86289J55477n3566j51356l8120R7961J02766M4272K5960
$$ y = [739910, 810339, 860135, 809100, 664434, 575375, 628088, 711387, 686772, 587859, 554857, 646494, 790415, 862269, 778571, 583285, 458115, 552391, 788010, 940808, 925852, 871094, 888647, 930348, 924317, 899161, 890232, 859397, 797111, 776868, 817267, 818819, 737665, 688659, 756574, 836470, 803893, 719705, 698853, 691453, 600489, 529891, 665407, 930057, 1018230, 823549, 596748, 575490, 668128, 664270, 591895, 645581, 837058, 948901, 856576, 708969, 709552, 847865, 951634, 925835, 829971, 755559, 732246, 752677, 801492, 841901, 841438, 828790, 864235, 941161, 986924, 976632, 959362, 943066, 863406, 731623, 694157, 828349, 976893, 944443, 799126, 790567, 976856, 1132333, 1078767, 927411, 889291, 987252, 1090018, 1134290, 1160250]
8764A160250Q768p3049j51005j09445K4189R6505L9853k4721M4204J83073J77778
8753A376400k2529j78302p8911J19225R8371j23092j96199O866J79698P9703q4957
8742A176273k8639J31614J12297l4668n2364L3614j1609j46682r4715J30367J93538
8731A409026N404j22377j6198R2624K5075l0032R3428J99709Q4128q1014m0356
8720A619417J11960J24825J4072l2827r804l1651o0060L272P4598L4082j4191
8709A833693P1508J60572N7168j08869o5282J26635J75615P2546O6641J52271
8699B542498N6447j99901k23238R9864L33262J39790j95009k20376J1455J15385
8689B460177k747r2057k4092N4527K8075k7685k8800m665P878K8074O0490Q4661
$$ y = [1160250, 1169018, 1095969, 944964, 835519, 859708, 956213, 996066, 971345, 1015549, 1198622, 1376400, 1353871, 1175569, 1096658, 1215883, 1314254, 1191162, 994963, 1001829, 1181527, 1261230, 1176273, 1147634, 1279248, 1391545, 1356877, 1304513, 1338127, 1326518, 1179836, 1085121, 1215488, 1409026, 1414430, 1292053, 1275855, 1368479, 1393554, 1363522, 1456950, 1656659, 1740787, 1659773, 1619417, 1731377, 1856202, 1870274, 1837447, 1827643, 1795992, 1735932, 1739204, 1813802, 1847884, 1833693, 1905201, 2065773, 2122941, 2014072, 1948790, 2075425, 2251040, 2323586, 2390227, 2542498, 2598945, 2399044, 2175806, 2275670, 2608932, 2748722, 2553713, 2333337, 2344792, 2460177, 2457430, 2365373, 2341281, 2395808, 2423883, 2396198, 2367398, 2362733, 2370611, 2398685, 2459175, 2543836]
8677B543836J12028J42599J05624k3903j05539k470J69799J70326M842o2092P8804
8666C133854J98947R7897o5405k3724J65775K14632P2836M076J39925K49784J16129
8655D304726r8401j02198O9275J42784O4783L5453R3059L1232j74722k28730n7
8644D137204J89883N4378j78134j37537O9944O2632j48596j98064k7758J8632
8634C842584j67626k56778q7463K6446j29339k49262l9394K17270R2757k60748
8624B988447l29295l6723J80895P0721j35239j76528j15495r9324r3523k0699
8614B233237O1704P3279M1194J3215k5349p4013p9190k5779L8942Q5899J01115
8603B444254L4555j05119j60987k2998J44733J07156n9532p5698P5226J34162
$$ y = [2543836, 2655864, 2798463, 2904087, 2880184, 2774645, 2772175, 2941974, 3112300, 3117142, 3055050, 3133854, 3332801, 3430698, 3365293, 3341569, 3507344, 3721976, 3794812, 3798888, 3938813, 4188597, 4304726, 4206325, 4104127, 4173402, 4316186, 4380969, 4416422, 4509481, 4540713, 4365991, 4137261, 4137204, 4327087, 4381465, 4203331, 4065794, 4135738, 4198370, 4049774, 3851710, 3823952, 3842584, 3674958, 3418180, 3330717, 3357163, 3227824, 2978562, 2939168, 3156438, 3249195, 2988447, 2659152, 2622429, 2803324, 2874045, 2738806, 2562278, 2446783, 2347459, 2253936, 2233237, 2294941, 2368220, 2409414, 2422629, 2397280, 2323267, 2244077, 2218298, 2257240, 2343139, 2444254, 2478809, 2373690, 2212703, 2189705, 2334438, 2441594, 2382062, 2306364, 2381590, 2515752]
8593B515752N1746Q6823K94492L34496L3494k43394j25367J67908J72456r9891
8583C188515k42882j34433n9089j63857k43976j57633n9697p6684q4231J2536
8573A978569O5816l8924j35301l8638J30572J31116k4859j25683r8669n7903o1942
8562A724154m9787j1402j9958p2081o8644R366N4846O830o1197o9728l3281J0801
8550A419919O0236Q6493K9096q4763j16923O981J77181K28048J25428l2062j34274
8539A765360j28766l7065M7540M7452J7543P2825J67102J03285j44571l00966
8529A609739j51845J14002J54906l6838j64896r6487o600l1488o7325r977N1160
8518A364351J2483o5696r2127q8000p8366j0214R7833J00963l6012j26551m6819
$$ y = [2515752, 2567498, 2654321, 2948813, 3283309, 3316803, 3073409, 2948042, 3115950, 3288406, 3188515, 2945633, 2811200, 2752111, 2588254, 2344278, 2186645, 2126948, 2050264, 1966033, 1978569, 2044385, 2005461, 1870160, 1831522, 1962094, 2093210, 2068351, 1942668, 1843999, 1786096, 1724154, 1674367, 1662965, 1643007, 1570926, 1502282, 1511648, 1566494, 1573324, 1512127, 1442399, 1409118, 1419919, 1480155, 1566648, 1595744, 1510981, 1394058, 1401039, 1578220, 1806268, 1931696, 1899634, 1765360, 1636594, 1599529, 1647069, 1694521, 1712064, 1784889, 1951991, 2055276, 1910705, 1609739, 1457894, 1571896, 1726802, 1689964, 1525068, 1428581, 1421981, 1390493, 1323168, 1313191, 1364351, 1376834, 1311138, 1219011, 1131011, 1052645, 1042431, 1140264, 1241227, 1205215, 1078664, 1031845]
8507A031845M8939j0652j14131o3421P6507R0901k3238q3245m4329k5109m4165
8496H39902J281R8375J11804K5442l9927n6086j02037j45735o1703J07489J58661
8485I37466M2762o5709n8515j4689P115M3168N2187n2828j54802l5263K00587
8474I01479J73484j56474l30944q3887K06694J00479k14873k49270K0564J92561
8464E59813J16179L4016P1092N0915j02014j81086o2844P0627M4296l3111J0592
8453E78475J13691J01464k1844q8592k0891P7588P8714j4587r3226q0857j1518
8442F18417L7585M8300M2368L233p5921r7350K6087J66065J03585j06168j57624
8431F08577K3265J26144l9465k08230r9022J07286Q7634p1257o0567Q8530Q7052
$$ y = [1031845, 1080784, 1070132, 956001, 892580, 969087, 1059988, 1036750, 953505, 909176, 884067, 839902, 841183, 939558, 1051362, 1076804, 1036877, 980791, 878754, 733019, 671316, 778805, 937466, 980228, 914519, 856004, 841315, 848430, 891598, 943785, 890957, 736155, 700892, 901479, 1074963, 918489, 587545, 503658, 710352, 810831, 595958, 346688, 367252, 559813, 675992, 710008, 781100, 832015, 730001, 548915, 486071, 556698, 600994, 567883, 578475, 692166, 793630, 771786, 683194, 662303, 739891, 818605, 804018, 710792, 629935, 618417, 656002, 704302, 746670, 749903, 673982, 576632, 602719, 768784, 872369, 766201, 608577, 631842, 757986, 718521, 510291, 411269, 518555, 606189, 534932, 474365, 562895, 649947]
8420F49947p0818j10851J7698Q5734K6261P833N8200L1048m4174l312O6392n6176
8408F57782k28851r8791K17974K16888j30225k58127L3800K14458m0201k50809
8398C33898J4092L36521J55490k48054k27923J37984K34862l1830j67151j611
8388E36278Q4716r0239k14345p8818R3455R4059L5361M2141L7062j9377k5196
8377D95097J8051j4688q1675q437J41460J05188j09101j84117j4613J26620O1007
8366E34792l8599m086O8232O1777K2333k6887j38284k17005q5879J48779J73849
8355D99022r122o2639Q9512J23962p2804j75011k1264Q0741n3363j15317J04636
8344C88353K68683P7182j69252r7318Q0660m155j77262p2361J40316N3809j87886
$$ y = [649947, 579129, 468278, 485976, 571710, 597971, 605804, 664004, 695052, 650878, 647566, 713958, 657782, 428931, 330140, 548114, 765002, 634777, 376650, 410450, 624908, 584707, 333898, 347990, 684511, 840001, 591947, 364024, 502008, 736870, 705040, 537889, 536278, 620994, 530755, 316410, 237592, 331047, 425106, 460467, 502608, 539670, 520293, 495097, 513148, 498460, 416785, 408348, 549808, 654996, 545895, 361778, 347165, 473785, 534792, 496193, 492107, 560339, 622116, 644449, 617562, 479278, 262273, 176394, 325173, 499022, 489900, 427261, 516773, 640735, 567931, 392920, 371656, 452397, 399034, 283717, 388353, 657036, 734218, 564966, 467648, 548308, 544153, 366891, 294530, 434846, 488655, 300769]
8333C00769j13870K08851K60112l4136k00378n1923N9654n9719j41193j9722P6195
8322B84640J0950j1432R4429R2670q7497j52201J8169J12825m1682j36392N6871
8311B41350K33752P5952j79504j46308O5177R1476n0977p1952L5390L4205o9512
8300B59049m7518R5134J17823j2835p6008p481J6719n3118m9194O5067R2955l6907
8288C63686j14910m56J35396R3627l8757n6393L3378N2783n1566j42776j10511
8277A63501j1228L9916K4014M795N366j4858m6870m7J28947J55513n0911k84311
8265A13827k12000J19496K87120R8999j25850q1409N5037q231j31901l495K51202
8254C62795K19194j01835k68415r3209J10717J02671N3228J15554J11533p2437
$$ y = [300769, 186899, 395750, 655862, 621726, 421348, 369425, 429079, 369360, 228167, 208445, 284640, 295590, 284158, 378587, 471257, 383760, 231559, 249728, 362553, 320871, 184479, 241350, 475102, 551054, 371550, 225242, 290419, 381895, 330918, 258966, 294356, 328561, 259049, 211531, 306665, 424488, 411653, 335645, 328164, 344883, 291765, 242571, 307638, 400593, 363686, 248776, 248320, 383716, 477343, 438586, 382193, 415571, 468354, 416788, 274012, 163501, 152273, 192189, 216203, 220998, 226364, 211506, 164636, 164589, 293536, 449049, 398138, 113827, -98173, 21323, 308443, 407442, 281592, 200183, 255220, 246989, 115088, 111593, 362795, 581989, 480154, 211739, 118530, 229247, 331918, 385146, 500700, 612233, 539796]
8244E39796j75281M052J93950O9619j80057j47884J12940J82323l3297j76175
8234C89986l4566J64505J67572M0060m5436o8293n3777L3010J32053O8625j47025
8223F46714k36688n9849J32886Q7373l7625M8432K42796J90937j11868k71135
8213F31973j00899J04442O0522q2851n1599Q3257O1492r9427j34300K1675J34146
8202F28431N3794p5280p8584K841M4443L3941J1010l4911p8888j5882J53680K25231
8190H69826N1397j97401k27654k0656J59132J32317o245p8142l2910O5459J24824
8179H39947O7105r2127j92672r6372Q4816R5927r1066k08900q1604J17752J40930
8168E83736K5883j5102M9359O1994k1454o3259m017K4970o2630j35582m3239J31209
$$ y = [539796, 364515, 368567, 562517, 632136, 452079, 304195, 417135, 599458, 566161, 389986, 355420, 519925, 687497, 727557, 682121, 613828, 560051, 593061, 725114, 793739, 646714, 410026, 350177, 483063, 570436, 532811, 581243, 824039, 1014976, 903108, 631973, 531074, 635516, 696038, 613187, 561588, 644845, 706337, 606910, 472610, 494285, 628431, 682225, 606945, 528361, 531202, 575645, 609586, 620596, 585685, 506797, 490915, 644595, 869826, 921223, 723822, 496168, 475512, 634644, 766961, 760716, 682574, 649664, 715123, 839947, 907052, 814925, 622253, 525881, 610697, 706624, 615558, 406658, 325054, 442806, 583736, 609619, 594517, 643876, 705870, 684416, 621157, 617140, 642110, 579480, 443898, 400659, 531868]
8156E31868J75682N4060n5220l0644L1771o761j06165j10186K3245J68726K01291
8145H77667J18444j0876j19146j42306n6892M3681K1621r8183j19165M0238J91001
8134G46084J43985P38k2596M8518K1480r3740r1233M1564O3049r9543j82368j5668
8122E60270J63867Q3479j12211r1720J24348J99644J3595j72556j27575M5484
8112F86625J19470N6673j0990R798R0493J39537Q8979l2251j07197o8865L863
8101I76135J2301L076P5827J73106J36298l3792j52545j17612l1990j3012l5307
8090I92485k9472K02K6496N1446N3462k975o6598m0028M4255M5501m1898n2931
8078I79945O0007J08563k7352j70426j08376O9735J20332K0795l9037J4104N4258
$$ y = [531868, 707550, 761610, 706390, 675746, 707517, 700756, 594591, 484405, 507650, 676376, 877667, 996111, 985235, 866089, 723783, 666891, 710572, 732193, 634010, 514845, 555083, 746084, 890069, 890807, 868211, 916729, 938209, 844469, 753236, 794800, 857849, 758306, 575938, 560270, 724137, 807616, 695405, 603685, 728033, 927677, 941272, 768716, 641141, 686625, 806095, 862768, 851778, 861576, 952069, 1091606, 1180585, 1148334, 1041137, 972272, 976135, 988436, 991512, 1067339, 1240445, 1376743, 1342951, 1190406, 1072794, 1040804, 1027792, 992485, 963013, 963215, 989711, 1041157, 1094619, 1091644, 1025046, 985018, 1029273, 1074774, 1032876, 979945, 1039952, 1148515, 1121163, 950737, 842361, 912096, 1032428, 1053223, 1014186, 1028290, 1082548]
8067A082548N359l8643Q120Q6265R5863K9167m8718p4354k2165O5075Q8384R761
8055A286662o8581l4855N6644O0725k9599p1950j266P8002O7867J3949O8J1652
8043A369318j0973n1226l5276M8104J05747L5620j36649k37507j25299R4854J47287
8032A204000m6754k11440q3104J83186K14262k8698j94092p4764J06051P8038
8022A146685p7409j19610l2083L1784M2118P4967R4627J1145r5687o3448N8564
8011A071653N3254j08317k01859r7201O1156J08100P7215N1684l563j12457j60990
8000G38675o8448N0557O2602K6566M9604O1466m7858j69731j14956M9201Q0834
7989G18512l3983o4252M3607N5173j22538k26658o2565J40844Q2971j21449j41975
$$ y = [1082548, 1087907, 1049264, 1057384, 1143649, 1239512, 1268679, 1219961, 1145607, 1123442, 1188517, 1276901, 1286662, 1218081, 1183226, 1239870, 1300595, 1270996, 1199046, 1197780, 1275782, 1343649, 1357598, 1357666, 1369318, 1358345, 1307119, 1271843, 1319947, 1425694, 1461314, 1324665, 1087158, 961859, 1056713, 1204000, 1157246, 945806, 862702, 1045888, 1260150, 1231452, 1037360, 962596, 1068647, 1146685, 1069276, 949666, 917583, 949367, 991485, 1066452, 1161079, 1172224, 1076537, 1013089, 1071653, 1124907, 1016590, 814731, 717530, 778686, 886786, 964001, 1015685, 1012122, 899665, 738675, 670227, 720784, 783386, 809952, 859556, 921022, 873164, 703433, 588477, 637678, 718512, 684529, 620277, 663884, 719057, 596519, 369861, 307296, 448140, 531111, 409662, 267687]
7978B67687K8924J06496J5325k3738P5123J16528J93r5094m5694L522o2023r5840
7966B91409K3325J27967M4636p6460j3191J20072N1762j68388k25930m3914J13352
7955B44640O9233l9879m2252K8127O2883M0759k2371j03337j07049L4161J74780
7944C39695J02085j04481j37101N5959J65345K0958j36291p9420L1305k5508j16080
7933A16466m447J89967J67791m7449j60357q8041k6624n7897m7473M0903O5219
7922A48058k132j0969O1331L9915j10416j68075j4627J50395J24475O093n424
7911B18624O9966P2292k9642j25938j31129l5320J13244J86640P0597j34817j75838
7900I8679q210J04006m490j24363j8623J68301J37604q1083j98882j31293n6516
$$ y = [267687, 296611, 403107, 418432, 394694, 469817, 586345, 586538, 491444, 445750, 449272, 387249, 291409, 314734, 442701, 487337, 410877, 397686, 517758, 569520, 401132, 175202, 131288, 244640, 313873, 273994, 231742, 259869, 322752, 363511, 341140, 237803, 130754, 164915, 339695, 441780, 337299, 200198, 256157, 421502, 442460, 306169, 226749, 258054, 232546, 116466, 112019, 301986, 469777, 422328, 261971, 173930, 147306, 89409, 41936, 82839, 148058, 145926, 134957, 196288, 236203, 125787, -42288, -56915, 93480, 217955, 224048, 218624, 288590, 360882, 331240, 205302, 74173, 38853, 152097, 338737, 409334, 274517, 98679, 90469, 194475, 189985, 65622, 46999, 215300, 352904, 271821, 72939, -58354, -114870]
7889a14870m3836K9697J57067J34734p2613j97748o4170J29054J12882m8140q3576
7878f1519O3928J75790Q7665j00517j77880p7983O5605Q4502k3436p9656M6642
7867C141K29566K20374j066j62423o6080J25085J15404j05079k56037j62876K5486
$$ y = [-114870, -158706, -129009, 28058, 162792, 90179, -107569, -171739, -42685, 70197, 22057, -61519, 2409, 178199, 265864, 165347, -12533, -90516, -24911, 59591, 36155, -43501, 3141, 232707, 453081, 452015, 289592, 223512, 348597, 464001, 358922, 102885, -59991, -34505]
$$ [...]
##END NTUPLES=NMR SPECTRUM
##END=
