##TITLE=1H ikalashn
LY-Propylene Carbonate
21.6.2024
##JCAMPDX= 6.0         $$ Bruker NMR JCAMP-DX V2.0
##DATA TYPE= NMR FID
##DATA CLASS= NTUPLES
##ORIGIN= UXNMR, Bruker Analytische Messtechnik GmbH
##OWNER= root
$$ TOPSPIN		Version 1.3
$$ 2024-06-21 10:48:51.765 +0400  Irina@DPX200
$$ Compression mode = diff/dup
##.OBSERVE FREQUENCY= 200.131392401
##.OBSERVE NUCLEUS= ^1H
##.DELAY= (6, 6)
##.ACQUISITION MODE= SIMULTANEOUS
##.ACQUISITION SCHEME= undefined
##.AVERAGES= 8
##.DIGITISER RES= 18
##SPECTROMETER/DATA SYSTEM= spect
##.PULSE SEQUENCE= zg
##.SOLVENT NAME= CDCl3
##.SHIFT REFERENCE= INTERNAL, CDCl3, 1, 17.95386
##AUDIT TRAIL= $$ (NUMBER, WHEN, WHO, WHERE, WHAT)
$$ ##TITLE= Audit trail, TOPSPIN		Version 1.3
$$ ##JCAMPDX= 5.01
$$ ##ORIGIN= Bruker BioSpin GmbH
$$ ##OWNER= Irina
$$ $$ F:/spectra/data/iren/nmr/1H/4/audita.txt
$$ ##AUDIT TRAIL=  $$ (NUMBER, WHEN, WHO, WHERE, VERSION, WHAT)
(   1,<2024-06-21 10:48:41.562 +0400>,<Irina>,<DPX200>,<TOPSPIN 1.3>,
      <created by zg
	started at 2024-06-21 10:48:04.953 +0400,
	POWCHK disabled, PULCHK disabled
       terminated by command 'halt'
       configuration hash MD5:
       BE 6D 3F 07 2A EA 11 49 91 17 2B D3 AF B3 58 0D
       data hash MD5: 16K
       FE 01 42 98 3C 55 FF 15 DA 9A ED 00 56 64 16 3D>)
$$ ##END=
$$ 
$$ $$ hash MD5
$$ $$ C0 1C A2 94 64 89 7A 52 22 65 82 8D E8 15 E6 FD
##$RELAX= 
##$RELAX= 
##$RELAX= 
##$RELAX= 
##$RELAX= 
##$RELAX= 
##$RELAX= 
##$RELAX= 
##$RELAX= 
$$ Bruker specific parameters
$$ --------------------------
##$DU= <F:/spectra>
##$EXPNO= 4
##$NAME= <1H>
##$PROCNO= 1
##$TYPE= <nmr>
##$USER= <iren>
##$AMP= (0..31)
100 100 100 100 100 100 100 100 100 100 100 100 100 100 100 100 100 100 
100 100 100 100 100 100 100 100 100 100 100 100 100 100 
##$ANAVPT= -1
##$AQSEQ= 0
##$AQ_mod= 1
##$AUNM= <au_zg>
##$AUTOPOS= <>
##$BF1= 200.13
##$BF2= 200.13
##$BF3= 200.13
##$BF4= 200.13
##$BF5= 200.13
##$BF6= 200.13
##$BF7= 200.13
##$BF8= 200.13
##$BYTORDA= 1
##$CFDGTYP= 0
##$CFRGTYP= 5
##$CHEMSTR= <none>
##$CNST= (0..63)
1 1 145 1 1 1 1 1 1 1 1 1 1 1 1 1 1 1 1 1 1 1 1 1 1 1 1 1 1 1 1 1 1 1 
1 1 1 1 1 1 1 1 1 1 1 1 1 1 1 1 1 1 1 1 1 1 1 1 1 1 1 1 1 1 
##$CPDPRG= <>
##$CPDPRG1= <>
##$CPDPRG2= <>
##$CPDPRG3= <>
##$CPDPRG4= <mlev>
##$CPDPRG5= <mlev>
##$CPDPRG6= <mlev>
##$CPDPRG7= <mlev>
##$CPDPRG8= <mlev>
##$CPDPRGB= <>
##$CPDPRGT= <>
##$D= (0..63)
0 2 0 0 0 0 0 0 0 0.06 0 0.03 0 0 0 0 0.0002 0 0 0 0 0 0 0 0 0 0 0 0 0 
0 0 0 0 0 0 0 0 0 0 0 0 0 0 0 0 0 0 0 0 0 0 0 0 0 0 0 0 0 0 0 0 0 0 
##$DATE= 1718952518
##$DBL= (0..7)
120 120 120 120 120 120 120 120 
##$DBP= (0..7)
150 150 150 150 150 150 150 150 
##$DBP07= 0
##$DBPNAM0= <>
##$DBPNAM1= <>
##$DBPNAM2= <>
##$DBPNAM3= <>
##$DBPNAM4= <>
##$DBPNAM5= <>
##$DBPNAM6= <>
##$DBPNAM7= <>
##$DBPOAL= (0..7)
0.5 0.5 0.5 0.5 0.5 0.5 0.5 0.5 
##$DBPOFFS= (0..7)
0 0 0 0 0 0 0 0 
##$DE= 6
##$DECBNUC= <off>
##$DECIM= 32
##$DECNUC= <off>
##$DECSTAT= 4
##$DIGMOD= 1
##$DIGTYP= 9
##$DL= (0..7)
0 120 120 120 120 120 120 120 
##$DP= (0..7)
$$ [...]
##$SW= 21.9925939549014
##$SWIBOX= (0..15)
0 0 2 0 0 0 0 0 0 0 0 0 0 0 0 0 
##$SW_h= 4401.40845070422
##$TD= 16384
##$TD0= 1
##$TE= 300
##$TE2= 300
##$TE3= 300
##$TEG= 300
##$TL= (0..7)
0 120 120 120 120 120 120 120 
##$TP= (0..7)
150 150 150 150 150 150 150 150 
##$TP07= 0
##$TPNAME0= <>
##$TPNAME1= <>
##$TPNAME2= <>
##$TPNAME3= <>
##$TPNAME4= <>
##$TPNAME5= <>
##$TPNAME6= <>
##$TPNAME7= <>
##$TPOAL= (0..7)
0.5 0.5 0.5 0.5 0.5 0.5 0.5 0.5 
##$TPOFFS= (0..7)
0 0 0 0 0 0 0 0 
##$TUNHIN= 0
##$TUNHOUT= 0
##$TUNXOUT= 0
##$USERA1= <user>
##$USERA2= <user>
##$USERA3= <user>
##$USERA4= <user>
##$USERA5= <user>
##$V9= 5
##$VALIST= <valist>
##$VCLIST= <CCCCCCCCCCCCCCC>
##$VD= 0
##$VDLIST= <DDDDDDDDDDDDDDD>
##$VPLIST= <PPPPPPPPPPPPPPP>
##$VTLIST= <TTTTTTTTTTTTTTT>
##$WBST= 1024
##$WBSW= 25
##$XGAIN= (0..3)
0 0 0 0 
##$XL= 0
##$YL= 0
##$YMAX_a= 537319
##$YMIN_a= -575019
##$ZGOPTNS= <>
##$ZL1= 120
##$ZL2= 120
##$ZL3= 120
##$ZL4= 120
##$ABSF1= 10
##$ABSF2= 0
##$ABSG= 5
##$ABSL= 3
##$ALPHA= 0
##$AQORDER= 0
##$ASSFAC= 0
##$ASSFACI= 0
##$ASSFACX= 0
##$ASSWID= 0
##$AUNMP= <proc_1d>
##$AXLEFT= 0
##$AXRIGHT= 0
##$AXTYPE= 0
##$AXUNIT= <>
##$AZFE= 0.1
##$AZFW= 0.1
##$BCFW= 1
##$BC_mod= 2
##$BYTORDP= 1
##$COROFFS= 0
##$CY= 7568.61572265625
##$DATMOD= 1
##$DC= 2
##$DFILT= <>
##$DTYPP= 0
##$F1P= 17.9538593292236
##$F2P= -4.03888763876832
##$FCOR= 0.5
##$FTSIZE= 32768
##$FT_mod= 4
##$GAMMA= 1
##$GB= 1
##$INTBC= 1
##$INTSCL= 1
##$ISEN= 128
##$LB= 0.03
##$LEV0= 0
##$LPBIN= 0
##$MAXI= 945.577
##$MC2= 0
##$MEAN= 0
##$ME_mod= 0
##$MI= -402.1523
##$NCOEF= 0
##$NC_proc= 0
##$NLEV= 6
##$NOISF1= 8.587773
##$NOISF2= 6.764455
##$NSP= 1
##$NTH_PI= 0
##$NZP= 0
##$OFFSET= 17.95386
##$PC= 1
##$PHC0= 89.89745
##$PHC1= 3.180964
##$PH_mod= 0
##$PKNL= yes
##$PPARMOD= 0
##$PPDIAG= 0
##$PPIPTYP= 0
##$PPMPNUM= 100
##$PPRESOL= 1
##$PSCAL= 0
##$PSIGN= 0
##$REVERSE= no
##$SF= 200.13
##$SI= 32768
##$SIGF1= 18.5376
##$SIGF2= -6.396296
##$SINO= 400
##$SIOLD= 32768
##$SREGLST= <1H.CDCl3>
##$SSB= 3
##$STSI= 0
##$STSR= 0
##$SW_p= 4401.40845070423
##$SYMM= 0
##$S_DEV= 0
##$TDeff= 0
##$TDoff= 0
##$TI= <>
##$TILT= no
##$TM1= 0
##$TM2= 0
##$TOPLEV= 0
##$USERP1= <user>
##$USERP2= <user>
##$USERP3= <user>
##$USERP4= <user>
##$USERP5= <user>
##$WDW= 1
##$XDIM= 8192
##$YMAX_p= 0
##$YMIN_p= 0
$$ End of Bruker specific parameters
$$ ---------------------------------
##NTUPLES= NMR FID
##VAR_NAME=  TIME,          FID/REAL,        FID/IMAG
##SYMBOL=    X,             R,               I
##VAR_TYPE=  INDEPENDENT,   DEPENDENT,       DEPENDENT
##VAR_FORM=  AFFN,          ASDF,            ASDF
##VAR_DIM=   8192,          8192,            8192
##UNITS=     SECONDS,       ARBITRARY UNITS, ARBITRARY UNITS
##FACTOR=    0.0002272,     1,               1
##FIRST=     0,             0,               0
##LAST=      1.8609952,     -72,             101
##MIN=       0,             -575019,         -575019
##MAX=       1.8609952,     537319,          537319
$$ Real data points
##PAGE= N=1
##DATA TABLE= (X++(R..R)), XYDATA
0@%%%%%%%%%%%%%%%%%%%%%%%%MnNj2J6j6J6k0K7l0L2l7M4n2N7o5P6q4R4j07J20
45F3j32J46j63J83k04K23k44K69k94L19l48L81m11M38m68M94n10N07m65L48o0
66G2o51K593r544P2604M72245j98239m47037J72465J84523m48309l75741M31217
78a43802M93295k20642l13161K87556K52684l82120l26726L34628K84557l53743
88h7474k81287L73554L18311k96208k23995L48525J85752m60909l19190L74639
98f8282L29317k63776j85164L53079J73752m42454k86914L68580L01575k67913
108A1800j92857K92978J16296m05262j88258M11816K75967k74058j68543K66448
118A46327L7641m35020j42962M38330K43381k87427j16498L22160M9485m38098
$$ plain form
0 0 0 0 0 0 0 0 0 0 0 0 0 0 0 0 0 0 0 0 0 0 0 0 0 0 4 -1 4 -8 8 -8 8 -12 15 -15 17 -20 24 -28 29 -36 40 -44 50 -57 63
45 63 -69 77 -86 97 -107 116 -128 141 -153 166 -182 199 -212 226 -242 252 -258 249 -216 132 72
66 72 -579 2014 -7530 65074 537319 339080 -107957 64508 249031 -199278 -575019 -143802
78 -143802 349493 128851 -184310 103246 355930 -26190 -352916 -18288 266269 -87474
88 -87474 -368761 4793 323104 26896 -197099 151426 337178 -123731 -442921 -68282
98 -68282 261035 -2741 -187905 165174 338926 -103528 -390442 -21862 279713 11800
108 11800 -181057 111921 228217 -177045 -365303 46513 322480 48422 -120121 146327
118 146327 183968 -251052 -394014 44316 287697 270 -116228 205932 255417 -182681
128a82681j51675L84283J55673l35121r6266L76988J28386l37893j01194L17533
138A58033L1255m07020j12932L61323J47378k32181J4339L26802l8246m47583
148a98832j23424L14036Q8199k23534P6060L65469k5289m16983r4049K94300L4806
159I0759k67057M2324L39256m702l40400k7697L00759J4001k83003K487K69922
170A36649l0438k81729M2309L05888j2930k80040J2445K41212o2558k60220Q5691
181a03721L01634n3846k95556K7113K48707n8770k36214J07942K88975q2037l07379
192a63152J8809K31915n2609j97642J28172K67096r3342k79706L1471J96271q2403
203D880j82904J38725K40021j02686k30842Q2047J90070j16228k00139J21648
$$ plain form
128 -182681 -334356 49927 205600 -129521 -225787 151201 279587 -58306 -159500 158033
138 158033 189288 -217732 -330664 30659 178037 -54144 -39805 286997 248751 -198832
148 -198832 -322256 -8220 79979 -143555 -67495 297974 272685 -144298 -238347 55953 90759
159 90759 -176298 -133974 205282 200580 -139820 -167517 133242 147243 -135760 -133273 136649
170 136649 106211 -175518 -133209 172679 159749 -120291 -107846 133366 70808 -189412 -103721
181 -103721 197913 144067 -151489 -124376 124331 65561 -170653 -62711 226264 144227 -163152
192 -163152 -144343 87572 34963 -162679 -34507 232589 139247 -140459 -108988 87283 4880
203 4880 -178024 -39299 200722 98036 -132806 -50759 139311 23083 -177056 -55408
213e5408K07459j13313j94875J26831K08749j12363k04964R0516J64443j22872
223e797j70436J41464K07191r5163j76265Q3173J25659j35086j47615J45110J79020
234A51255j03434j45857J04468J13069j44526j32623J49786J52743j25404j36758
244a17281J22366J18216j39232j22469J44253J32026j33361j27329J24302J13711
254A15202j26376j04496J32360J02029j34183j01931J29378R6072j23925q1644
264i7514J29563P1897j43128p9205J41595Q4044j28004o8801J31707N8138j47278
275d6986p0970J41396P7498j23079o1369J24678N1982j34438o0400J26554O0497
286H5363j13796m6462J15276L8557j19831l8793J17306L5978j14129l0071J14564
$$ plain form
213 -55408 152051 38738 -156137 -29306 179443 67080 -137884 -47368 117075 -5797
223 -5797 -176233 -34769 172422 77259 -99006 -15833 109826 -25260 -172875 -27765 151255
234 151255 47821 -98036 6432 119501 -25025 -157648 -7862 144881 19477 -117281
244 -117281 5085 123301 -15931 -138400 5853 137879 4518 -122811 1491 115202
254 115202 -11174 -115670 16690 118719 -15464 -117395 11983 108055 -15870 -97514
264 -97514 32049 103946 -39182 -118387 23208 107252 -20752 -89553 42154 100292 -46986
275 -46986 -117956 23440 100938 -22141 -83510 41168 93150 -41288 -101688 24866 85363
286 85363 -28433 -74895 40381 78938 -40893 -79686 37620 73598 -40531 -70602 43962
297D3962K5695j15770k2677J17750K2531j17706k3706J13987K1518j11227j8006
308f3649J11612J8443j09131j9244J02805J5406r8691j0466R7608Q094r5220n879
320d8312R1084J156q9165L764Q9282o553q9538P574Q8212r108q6814J1035Q6615
333D9232j1573q6380J0110Q3404r506p9690J0591P7507j0581p4591R646O9144
345C7313j1374o4904J4675O3558j5603o0826J6238N6750j9561n5300K2681N5958
357C9605k2366n4803K2157N3037k2874n2427K2340N1597k0862m9471K0040M7494
369C3467j8423m4670J6739M0681j6807l7461J6873L4853j6477l0887J7564K8261
381B3713j9401k7508J8668K5070j9210k2267K1932K3886k1380k5455J7073K1438
$$ plain form
297 43962 69657 -46113 -68790 48960 71491 -46215 -69921 44066 65584 -45643 -63649
308 -63649 47963 66406 -42725 -61969 40836 56242 -42449 -52915 44693 52787 -42433 -48312
320 -48312 42772 43928 -45237 -41473 47809 41256 -48282 -40708 47504 38396 -48418 -37383 49232
333 49232 37659 -48721 -38611 44793 35287 -44403 -33812 43695 33114 -41477 -31831 37313
345 37313 25939 -38965 -24290 39268 23665 -37161 -20923 35827 16266 -39034 -16353 39605
357 39605 17239 -37564 -15407 37630 14756 -37671 -15331 36266 15404 -34067 -14027 33467
369 33467 15044 -29626 -12887 27794 10987 -26474 -9601 25252 8775 -22112 -4548 23713
381 23713 4312 -23196 -4528 20542 1332 -20935 997 24883 3503 -21952 -4879 16559
393A6559j7160j9366J9225K2826j4535k2041Q539J4793j0546j3068J2275J5760
405A3261o127j1855L241M543p464m678Q526O357n020l276N478K045o049l233L566
420f85O43m653j003O368P522K111n008q521n018P47J000J112R714J4983o41j9900
436a229j4113N121N275m485O365K2337O576k2565j8230O459N808r196L218K3330
450A4671O753k1358j0488J4412K153j9700r91K3727K295k3927J575L1660L466
463B4248l3755j0947K2634q92k8141R637M8959J0552m1641k0689J7504n620l0529
476c8680J5884N8555J3190m3350j9508J7246j3118l6097J9989O1500P134m5917
488c172p492K9626j6413m6502J6454N9381k515n0681N328M8850j0043n2485Q237
$$ plain form
393 16559 -601 -19967 -742 22084 7549 -14492 -5953 8840 -1706 -14774 -2499 13261
405 13261 7134 -4721 -1480 3063 -4401 -9079 -553 5804 784 -2492 2986 5031 -1018 -4251 -685
420 -685 -42 -4695 -5698 670 8192 10303 5295 -3226 -8244 -7497 -6497 -5385 4329 19312 18671 -1229
436 -1229 -15342 -10221 -4946 -9431 -3066 19271 25847 3282 -14948 -8489 -2681 -11877 -8659 14671
450 14671 21424 66 -10422 3990 6143 -13557 -14548 9179 11474 -12453 -10878 20782 24248
463 24248 -9507 -20454 2180 1288 -26853 -17216 31743 42295 654 -20035 -2531 -8151 -38680
476 -38680 -22796 35759 48949 5599 -13909 3337 -9781 -45878 -25889 35611 42745 -3172
488 -3172 -10664 18962 2549 -43953 -27499 31882 29367 -21314 -15986 32864 22821 -29664 -21427
501b1427M8294j5943n4848J7516O6090J19m9473L756L2721l5171n9186L0818P9633
514D2899M715m5730P895K5539n2281o6694L9071Q7177K209m6442J6710L2216n6196
527h912p2422L7772Q2363q608n0297K7171M6718m6914o6988L5910O5397l2415
539H775n9355L8103O2909l2644n1794M2905M8223o3938p5108M6438P6669k2509
551A8674l7631N5367M0980q6515q8427M9137Q1093k0717l0289O4621L9962r3109
563f854q7812N2380P4860k9692k9590O8640L8440r0364p2756O2392O3683m9219
575e892l6861P0834M0203q1962n2551P5410N1204p4985n2000P0885M7673o6270
587a4312l0216Q7564L8911j00224o9700O4919N0132n1404m874J03159L1764j17045
$$ plain form
501 -21427 26867 10924 -43924 -26408 39682 39801 -9672 -5916 26805 -8366 -67552 -36734 42899
514 42899 47614 1884 9779 35318 -16963 -83657 -44586 42591 44800 -1642 15068 47284 -8912
527 -8912 -81334 -43562 38801 30193 -20104 7067 53785 6871 -60117 -24207 41190 8775
539 8775 -50580 -12477 50432 17788 -34006 8899 57122 -6816 -81924 -35486 41183 18674
551 18674 -18957 36410 77390 -9125 -97552 -48415 32678 11961 -18328 46293 86255 -6854
563 -6854 -94666 -42286 32574 2882 -26708 41932 80372 -9992 -82748 -20356 43327 -5892
575 -5892 -42753 28081 68284 -13678 -66229 9181 60385 -14600 -66600 4285 51958 -14312
587 -14312 -44528 43036 81947 -18277 -87977 -23058 27074 -24330 -29204 73955 105719 -11326
599a1326p9676N7643L9401n3218J0331J18992L3082j18479p0578O2657K4761p4643
611f1053J845J18982L3235j06579m2142Q5141K0161r6505k0308R8459J9217r6849
623d6396r059J13411K5564j03587l1941P6346m535r7679J3413J31070K6466j04403
635a1330k8644P0608j7362r8768K4697J33832J5560j10950k4000P4725j6532r2140
647h0304L3425J30179K427j16366j9249P6861j8672q9396L7132J23666o885j09608
659c6790J64Q6200k5959r9633K7460J06306k2304r9707L3354J12861k1826j06956
671d6830J3383P9070n0785j03230N6631J38280o523r5386J7021O2591p7186j15856
683a28820N7164J35796o894p8844M0115P0630p9979j15125N1809J10462l4605
$$ plain form
599 -11326 -91002 -33359 6042 -47176 -36845 82147 115229 -3250 -73828 -11171 13590 -61053
611 -61053 -59208 59774 93009 -13570 -55712 29429 49590 -46915 -67223 31236 50453 -46396
623 -46396 -55455 57956 83520 -20067 -52008 24338 19803 -77876 -64463 66607 93073 -11330
635 -11330 -39974 30634 13272 -85496 -60799 73033 88593 -22357 -46357 28368 11836 -80304
647 -80304 -46879 83300 85727 -30639 -49888 26973 8301 -81095 -43963 79703 72818 -36790
659 -36790 -36626 49574 23615 -76018 -48558 57748 35444 -64263 -30909 81952 60126 -46830
671 -46830 -33447 45623 -5162 -108392 -51761 86519 79996 -15390 1631 64222 -12964 -128820
683 -128820 -71656 64140 57246 -21598 18517 89147 9168 -105957 -54148 56314 21709
694B1709q2058N7064Q7748o3115r3784O0300R0840o5421r8639N4785R0209n1353
706H285p1831P4448Q5366p6947j01956N3281Q3095n4467o6003P6221P6527q0587
718E432q9355O7944Q5064n8435o6430P0275N9136r3110q2481Q3124R1560n6003
730A6721n8615P4940N0079j05271q4396Q2740Q2574o2324m9310Q9152N6656r8915
742e969p3971Q0216N8230q6333n3877R4824O2370q2217m5849R3165M2667j09115
754b5859o5391Q5579N1732p7886k3421J11131M4157j10122o2766P8536L3942q8324
766d8692k1522J11748M3342r8993m3410Q6143K6859r5195k6347R8177K7736r6870
778c7024k5886R8556K8598r1642k1865R0623J1877j02889j9601J01075K4576q9644
$$ plain form
694 21709 -60349 -3285 84463 21348 -72436 -12136 78704 13283 -85356 -30571 59638 8285
706 8285 -63546 10902 96268 19321 -82635 -29354 53741 -726 -66729 9492 86019 5432
718 5432 -83923 -15979 69085 10650 -55780 14495 73631 -19479 -101960 -18836 72724 16721
730 16721 -41894 33046 83125 -22146 -106542 -23802 58772 -3552 -52862 36290 92946 -5969
742 -5969 -79940 276 58506 -27827 -81704 13120 75490 -6727 -52576 40589 83256 -25859
754 -25859 -91250 -5671 46061 -31825 -55246 55885 100042 -10080 -72846 5690 39632 -48692
766 -48692 -70214 41534 84876 -14117 -57527 28616 55475 -39720 -66067 32110 59846 -37024
778 -37024 -62910 35646 64244 -27398 -49263 41360 53237 -49652 -69253 31822 56398 -33246
790c3246j1993R4689P903j02036j4078R7003J1287r5476p493R6342O834r3122
802d3386M27R7947o78j01503o363R0197l044q8763J5243J02577n862r8964J579
815d0593Q5743j6476r2525J9544R9964j0365r0847J5510Q7663k2793r3145J9089
827c9231Q9531k0465q5875K5757Q8900k3376q5452K4372Q0874l1334q4940K9704
839c1535Q4390k7000p7557L3208P8950l6063q1854L2280P7049l4882p5060L8902
851a9172P7621l6961p5004L7713P1766m1497p3023M0963P1404m1173o8031M4675
863a0719O8744m4719o7248M4637O3151m9071o3875N0113O4794m7590n9433N0787
875d29N7315n5382o0539N2918N8805n1116n2982N5493N2827n7665n4682N4951
$$ plain form
790 -33246 -45239 49450 57353 -44683 -58761 38242 49529 -45947 -53440 42902 49736 -43386
802 -43386 -42959 54988 54310 -47193 -53556 36641 33597 -55166 -39923 62654 56792 -42172 -40593
815 -40593 45150 28674 -63851 -44307 55657 45292 -45555 -30045 57618 34825 -58320 -39231
827 -39231 50300 29835 -56040 -30283 58617 35241 -50211 -25839 55035 23701 -61239 -31535
839 -31535 52855 25855 -51702 -18494 60456 24393 -57461 -25181 51868 16986 -58074 -19172
851 -19172 58449 21488 -53516 -15803 55963 14466 -58557 -17594 53810 12637 -55394 -10719
863 -10719 58025 13306 -53942 -9305 53846 4775 -59100 -8987 55807 8217 -51216 -429
875 -429 56886 1504 -59035 -6117 52688 1572 -51410 4083 56910 -755 -55437 -486
887d86N1654n4460m7633N7213M6680n8386m6505N7709M4861n7205m2361N7533
899H614L9897n9151l8962O0450L9188n9385l7918N7746L4439n9333l2582O1538
911A4541L3869o0229l3676N7501K9386n8327k6439O1355K7617o0617k7949N7450
923A4482K3931n7636k0454O0570K0831o0565k1210N8319J8396n7804j5201N9379
935B3038J4442o0168j4660N9038J3695n7098j1014N7038Q477n8637q461N8337
947B4027R100n5047o428N4031K640n6415l067N6460M331n2817j296N2027k037
960B5509n4410J014N3573m34n0733L231N0887m526n1668L600M9549n075m8583
973b8066O803M9391n870m7372O538M4834r796m6191R692M6250p886m2383J0778
$$ plain form
887 -486 51168 -3292 -50925 6288 52968 -5418 -51923 5786 50647 -6558 -48919 8614
899 8614 48511 -10640 -49602 10848 50036 -9349 -47267 10479 44918 -14415 -46997 14541
911 14541 48410 -11819 -45495 12006 41392 -16935 -43374 17981 45598 -15019 -42968 14482
923 14482 38413 -19223 -39677 20893 41724 -18841 -40051 18268 36664 -21140 -36341 23038
935 23038 37480 -22688 -37348 21690 35385 -21713 -32727 24311 32788 -25849 -34310 24027
947 24027 33127 -21920 -28348 25683 28323 -28092 -31159 25301 29632 -23185 -24481 27546 25509
960 25509 -28901 -27887 25686 25252 -25481 -22250 28637 24111 -27557 -23957 25592 20517 -28066
973 -28066 -21263 28128 22258 -25114 -18576 26258 16462 -29729 -20037 26213 18327 -24056 -13278
986a3278M1630j3657m4151J1236M2018j1135l7962J5612M0234j5503m1582J1680
998a4858L6342j4531l4634J9021L9148j4975l7101J2287L0112j8697l2180K0872
1010i194L7067j4010l1191J4308K5215k2248l0430K0913L3139j4455k5767J7801
1022A148K3592k3000k8587J8840K6911j6798k2022K1133K4470k0010k4978J6082
1034c219J9081k0700k0191K2653K5403j4860j8782J5058J1512k5147j9821K2263
1046f750K4513j0632j2040J5922P243k7518j9700J9851K1233q937p274J7243O468
1059A9622k5210j7526J6175J5042j0384n642J7533Q170j8746j1937J3302P460
1071G859j5046p123J6153J0156j0453l937J2953J079k0520j1110J2610J1023k819
$$ plain form
986 -13278 28352 14695 -29456 -18220 23798 12663 -25299 -9687 30547 15044 -26538 -14858
998 -14858 21484 6953 -27681 -8660 30488 15513 -21588 -9301 20811 2114 -30066 -9194
1010 -9194 27873 13863 -17328 -3020 22195 -53 -30483 -9570 23569 9114 -16653 1148
1022 1148 24740 1740 -26847 -8007 18904 2106 -19916 1217 25687 5677 -19301 -3219
1034 -3219 15862 -4838 -25029 -2376 23027 8167 -10615 4443 15955 -9192 -29013 -6750
1046 -6750 17763 7131 -4909 11013 18256 -9262 -28962 -9111 12122 3185 -4089 13154 19622
1059 19622 -5588 -23114 -6939 8103 -2281 -7923 9610 17780 -966 -12903 399 7859
1071 7859 -7187 -14310 1843 11999 1546 -2391 10562 11641 -8879 -19989 -7379 3644 825
1084H25L807J4273j885k3391j4850P562R470J713Q686J5026j971k1246j4525L236
1098a3270N596J718Q645J3265l80j4395r084K088J343k380L550Q398J253n354
1112I93n54M545r50p336m697O38J673L247Q083Q415l25r882j2367p822K07Q787
1128g345J3720J0991K078q650j5447j3573k303J0065J3940J0232M229m034j3272
1141F31j4089k737Q102Q158M391M619J978p296r454L38O083j409n966K384P447
1156C180K98k404O133N361j0782j6824j246J0856N351L613J2340O820j6641k3971
1170a7916l620J1243N569N394J6952R628j8121k5332k460J0393J075K058J7960
1183A2823J1791j6442k1113K972J0808n852n744J4444J1889j2903j3084J1816
$$ plain form
1084 825 4632 18905 17020 -6371 -21221 -13659 -4189 -2476 6210 21236 19265 -1981 -16506 -13270
1098 -13270 -7674 -5956 2689 15954 15574 1179 -7905 -5817 -4474 -6854 -3304 5094 6347 993
1112 993 439 4984 4034 -3302 -7999 -7361 -5688 -2441 5642 14057 13732 3850 -8517 -16339 -16132 -7345
1128 -7345 6375 17366 19444 10794 -4653 -18226 -20529 -10464 3476 13708 17937 13903 631
1141 631 -13458 -16195 -8093 65 4456 9075 11053 3757 -5697 -5359 724 -685 -6651 -4267 3180
1156 3180 3478 1074 7207 12568 1786 -15038 -16284 -5428 -77 3536 15876 22696 6055 -17916
1170 -17916 -21536 -10293 -4724 670 17622 27250 9129 -16203 -18663 -8270 -7195 -5137 12823
1183 12823 24614 8172 -12941 -9969 839 -5013 -10757 3687 15576 2673 -10411 1405
1195A405J2442j2903j4997Q645J0121j0382m906K1320J5261j8316k1935M065P044
1208c136j0900J43K8907J8213k1145k4546L512M699j4260L15L1916J8801k2013
1221A0506k1868Q394N293j8775l728K9579J5396k2696j5390J7729Q442k2257q357
1234a7732K4400Q787k5401q715K7910J2666k3726j0884K0082J762k9115l978L5370
1247A1426J5268k4718j1231J8485k676l1359o52L8816J4303k6414j0019J9481
1259A0710m176l1948J233L9182J0836k8390o988K2997m267l2780J731L7077N672
1272B0889l0499k548K9141k101l2979J229L3058k214l4458K144L6490J683l0943
1285a1108K559K9387j0952l9537N038M0620K766k8696P288K9985j5925m2652O549
$$ plain form
1195 1405 13847 944 -14053 -5408 4713 -5669 -10575 10745 26006 7690 -14245 -10180 -3136
1208 -3136 -14036 -13893 15014 33227 12082 -12464 -8952 -4253 -18513 -18198 13718 32519 10506
1221 10506 -11362 -2968 2325 -16450 -20178 9401 24797 2101 -13289 4440 12882 -9375 -17732
1234 -17732 6668 15455 -9946 -18661 9249 21915 -1811 -12695 7387 9149 -19966 -23944 11426
1247 11426 26694 1976 -9255 9230 6554 -24805 -25457 13359 27662 1248 -8771 10710
1259 10710 6534 -25414 -24181 15001 25837 -2553 -9541 13456 9189 -23591 -21860 15217 20889
1272 20889 -9610 -12158 16983 14882 -18097 -16868 16190 13976 -20482 -18338 18152 19835 -11108
1285 -11108 -8549 20838 9886 -29651 -24613 16007 18773 -9923 -2635 27350 11425 -31227 -24678
1298b4678L9776j840k9514J2384L3432j6217m0892R894L7541r312l3514J3852
1310i088L4750j5619l6103J5995L7193j4961l6592J3859L3003j7425l2989K0562
1322g415L6953j7980l5971J6741L2465j9968l2883K1876L4309k1961l4624K1604
1334f854L4362k0500l1464K3222L0807k7486l5415K4273L4832k1358k8262K7696
1346C853L0057l0953l5381K5488L1048k6364k7033L2768L1209l1439l1522K9138
1358H69K6915l3429k8064L4624K9339l2672k5928L5445K6000l6848k7483L4663
1370C431K3884l6873k3143L9471K5720l6647k2675L7104K0032m1158k2646L9204
1382E704K1685l7673j7560M1643J9134m1592k0177L8885J6404m1361j6205M2834
$$ plain form
1298 -24678 15098 13258 -16256 -3872 29560 13343 -27549 -17655 19886 10574 -22940 -9088
1310 -9088 25662 10043 -26060 -10065 27128 12167 -24425 -10566 22437 5012 -27977 -7415
1322 -7415 29538 11558 -24413 -7672 24793 4825 -28058 -6182 28127 6166 -28458 -6854
1334 -6854 27508 7008 -24456 -1234 29573 2087 -33328 -9055 25777 4419 -23843 3853
1346 3853 33910 2957 -32424 -6936 24112 -2252 -29285 3483 34692 3253 -28269 869
1358 869 27784 -5645 -33709 915 30254 -2418 -28346 7099 33099 -3749 -31232 3431
1370 3431 27315 -9558 -32701 6770 32490 -4157 -26832 10272 30304 -10854 -33500 5704
1382 5704 27389 -10284 -27844 13799 32933 -8659 -28836 10049 26453 -14908 -31113 11721
1394A1721J7572m0383j4725M2226J4224m3864j6382M0702J2674m1939j0041M6517
1406A8302J4340m3458j3441M0091O777m5587p908M8021J2026m3043p965M2868
1418B1023L733m7475n742M7307O215m5171l663M5700K172m6195p70M6883K6m8191
1432b4148j022M6095m41m4315M686M7118m878m8636K433M5674m207m3799Q067
1445a7373M5701r006m7437P528M6447o939m3492R751M2925j3387m6356J2022M7227
1458B7611q830m2296J1950M0819j7046m5382J5229M6101j1974m1389J5160M0119
1470C0072j9095m3122J8529M3643j7154m1569J8006L9776k0321l9429K2760M1177
1482C3273k2846m2042K0536L8574k1969l5698K7029L8617k7377m0904K3412L6581
$$ plain form
1394 11721 29293 -11090 -25815 16411 30635 -13229 -29611 11091 23765 -18174 -28215 18302
1406 18302 32642 -10816 -24257 15834 22611 -22976 -30884 17137 29163 -13880 -21845 21023
1418 21023 24756 -22719 -28461 18846 25061 -20110 -23773 21927 24099 -22096 -22866 24017 24043 -24148
1432 -24148 -25170 20925 20484 -23831 -19145 27973 23095 -25541 -23108 22566 18359 -25440 -17373
1445 -17373 28328 19322 -28115 -20587 25860 18921 -24571 -14820 28105 14718 -31638 -19616 27611
1458 27611 18781 -23515 -11565 29254 12208 -33174 -17945 28156 16182 -25207 -10047 30072
1470 30072 10977 -32145 -13616 30027 12873 -28696 -10690 29086 8765 -30664 -7904 33273
1482 33273 10427 -31615 -11079 27495 5526 -30172 -3143 35474 8097 -32807 -9395 27186
1494B7186k4656l2917L0025L5708l0398l7946K7131L4410k7601l1288L1378L2219
1506C3251l2644l3580L1225L2675l0374l0022L1535K8199l4308k9322L5147L1098
1518C2880l2151k8626L1586K4328l5895k5659L7546K8941l3525k5992L2729K1509
1530B7671l7310k2960L8439K5200l5263k2606L5192J9791l7753k0153L8203K0224
1542B8675l7738j9176L7806J8532l7329j6785L7870J4852m0115j5911L9524J6361
1554B6566l6726j2526L8009J0133m1595j2838M0114J3113l6488q295L8695O438
1566B4600m2130r541L9504R042l6638m327L9508M005m1205o586L8071M344l7333
1579a8686j203M0117K976l9154l209L6454n85l8508P49M0053J782l6372Q89L5606
$$ plain form
1494 27186 2530 -30387 -362 35346 4948 -32998 -5867 28543 942 -30346 1032 33251
1506 33251 607 -32973 -1748 30927 553 -29469 2066 30265 -4043 -33365 1782 32880
1518 32880 729 -27897 3689 28017 -7878 -33537 4009 32950 -575 -26567 6162 27671
1530 27671 -9639 -32599 5840 31040 -4223 -26829 8363 28154 -9599 -29752 8451 28675
1542 28675 -9063 -28239 9567 28099 -9230 -26015 11855 26707 -13408 -29319 10205 26566
1554 26566 -10160 -22686 15323 25456 -16139 -28977 11137 24250 -12238 -20533 18162 24600
1566 24600 -17530 -27071 12433 21475 -15163 -19490 20018 24023 -17182 -23768 14303 18647 -18686
1579 -18686 -19889 20228 23204 -15950 -19159 17295 16710 -21798 -21049 19004 20786 -15586 -14697 20909
1593B0909m320l9369J900L8017p91l4055N455L6314o328l8795K697L4487m898
1606A1223l2763R555L7114o820l6409M377L0828r863l2574J1999L7025o854l2366
1619a5528P532K7914j4469l3281J2962L5445p281k8062J1656K6575j7409l3097
1631b7043J2701L1698r585k5001J5763K7222j7417l1081J2617K6381j4298k4240
1643b2283J8629K8448j5179k6387J3933K1542j9875k5517J8944K8080j2755k0478
1655a2898J7281J8616k3919k6765J7449K5493j2185j5488K0459J7634k4980k5763
1667b5066J6340K1121j3801j2992K2266J6988k3372k2193J6523J6658j6868j2701
1679a7097K2097J6182k0574j6511J7945J2973k0620j3997K0245J4674j7008r895
$$ plain form
1593 20909 16589 -22780 -20880 17137 16346 -17709 -12254 24060 17732 -21063 -18366 16121 11223
1606 11223 -21540 -11985 25129 18309 -18100 -13723 17105 7242 -25332 -13333 23692 16838 -15528
1619 -15528 -7996 19918 5449 -27832 -14870 20575 13294 -14768 -3112 23463 6054 -27043
1631 -27043 -14342 17356 7771 -17230 -1467 25755 8338 -22743 -10126 16255 1957 -22283
1643 -22283 -3654 24794 9615 -16772 -2839 18703 -1172 -26689 -7745 20335 7580 -12898
1655 -12898 4383 22999 -920 -27685 -10236 15257 3072 -12416 8043 25677 697 -25066
1667 -25066 -8726 12395 -1406 -14398 7868 24856 1484 -20709 -4186 12472 -4396 -17097
1679 -17097 5000 21182 608 -15903 2042 15015 -5605 -19602 643 15317 -1691 -11586
1691a1586K0565J0124k3855j6062J7211J2401j4261l900K3421Q790k5043j6715
1703a8910J4154Q726j3962l68K5238Q685k3398j4390J2745M672j5733k43K4205
1716A1421Q055j9997r272J4245K728j7939k755J9679N456j6631k811J7836K868
1729A2883j8688n724J3779J435j4460K594K0964L987j7755o997R257k492j3563
1742a4780N266K1845M714j5528n969O890m850j3249N549K0207L934j3076l242
1755b289P005n038j2681M145J5962J396j1186L53R283l207j1438K074J0509k468
1769B420j0198L584J2024m92r142O70N407o324j0116N405J3526K041o294L76K026
1784D913q582r827N225J2961K871l988J000J078q433q562M268R956J573k952J947
$$ plain form
1691 -11586 8979 19103 -4752 -20814 -3603 8798 -5463 -9363 14058 22848 -2195 -18910
1703 -18910 -4756 3970 -9992 -10360 14878 23563 165 -14225 -1480 3192 -12541 -12784 11421
1716 11421 19476 -521 -9793 4452 7180 -10759 -13514 6165 11621 -5010 -7821 10015 12883
1729 12883 -5805 -11529 2250 3685 -10775 -8181 12783 16770 -985 -7982 1275 -1217 -14780
1742 -14780 -9514 12331 17045 1517 -4452 2438 -2412 -15661 -10112 10095 14029 953 -2289
1755 -2289 4716 -322 -13003 -8858 7104 8500 -2686 -2333 6950 3743 -7695 -5621 4888 2420
1769 2420 -7778 -4194 7830 7338 -1804 -1134 4273 -2051 -12167 -6762 6764 8805 2511 2887 4913
1784 4913 -3669 -13496 -8271 4690 7561 3573 4573 5651 -2782 -11344 -7076 2880 4453 1501 3448
1799C448J885n968o258L089N928q94l226K342L255k391l157K214K428l472m135
1814d912J702M041J040j5J944l4n081m769O47L861L031K222J678j380m817m271
1830e113m07K609L648K909Q81j637k878k676j236J088L148K344n23j359j96m40
1846A62j839k24K511J162k333j266K568J615k294j092K507J12m257j275M684K816
1862C557k856j446L059l59n713j290O008K968l825j402M257k95o764j306O956
1877A549K604n317j167N738m4p536j110P646J983o672q15P102M3q509p66Q592
1893C321J086p858k31Q459l47r500k20R517L54r120O51R707j177j0733O57J0726
1909E292n36j0123J543J0704k281j1749J831J1708j735j1141K674J1512l236j2228
$$ plain form
1799 3448 5333 -635 -6893 -3804 2124 1230 -1996 346 3601 1210 -1947 267 2695 -777 -4912
1814 -4912 -3210 831 1871 1856 3800 3766 -1315 -6084 -5437 -1576 1455 3677 5355 3975 -842 -5113
1830 -5113 -5520 -2911 737 3646 4527 2890 12 -2664 -3900 -2812 336 2680 2157 798 602 162
1846 162 -1677 -1901 610 1772 -561 -1827 741 2356 62 -1030 1477 1589 -2668 -3943 741 3557
1862 3557 701 -745 2314 1955 -3758 -5048 960 3928 103 -1299 2958 2663 -4101 -5407 1549
1877 1549 4153 -1164 -2331 3407 3363 -4173 -5283 2363 4346 -2326 -3141 3961 4004 -4505 -5271 3321
1893 3321 4407 -3451 -3682 4777 4430 -5070 -5290 4227 4581 -4539 -3888 5819 4642 -6091 -5434 5292
1909 5292 4756 -5367 -3824 6880 4599 -7150 -5319 6389 4654 -6487 -3813 7699 4463 -7765
1923g765L276J2390l554j2416L576J2178l999j1734N282J2862n495j4039L867
1936e571J2324m481j1046P627J3655p208j5376M092J2173n540j0537R382J4191
1949A3685q341j5691N233J2395o922j1322J0289J3967r523j5130P878J3415q571
1962A362j2333J0310J2994j1385j4090J1080J4630j0154j3121J0637J1556j3344
1974a858j2653J4346J5119j2215j3791J1173J0378j4642j0869J7269J4696j4458
1986B495j4153J1968R187j5778r002J9571J3704j6416j3674J3307Q428j6816p981
1999a5160K0314J1892j8028j1967J5722Q723j7410p798J9472Q962j9995j0020
2011a5293J9146J0010j7365p630J8426N513k2264q400K2075J0944j7551o642J8204
$$ plain form
1923 -7765 -4489 7901 4347 -8069 -4493 7685 3686 -8048 -2766 10096 4601 -9438 -5571
1936 -5571 6753 2272 -8774 -1147 12508 5300 -10076 -5984 6189 649 -9888 -506 13685
1949 13685 5344 -10347 -5114 7281 359 -10963 -674 13293 3770 -11360 -3482 9933 1362
1962 1362 -10971 -661 12333 948 -13142 -2062 12568 2414 -10707 -70 11486 -1858
1974 -1858 -14511 -165 14954 2739 -11052 121 10499 -4143 -15012 2257 16953 2495
1986 2495 -11658 310 9497 -6281 -15283 4288 17992 1576 -12098 1209 9637 -7179 -15160
1999 -15160 5154 17046 -982 -12949 2773 11496 -5914 -13712 5760 14722 -5273 -15293
2011 -15293 3853 13863 -3502 -11132 7294 12807 -9457 -17857 4218 15162 -2389 -9031 9173
2024I173K955k3983o733K3964R847j8804n656J9419J637k4347m338K4982P152
2037A5268k1350m674K0449J142k3464j245K5579L650k4167l724K1533O27k2340
2050a2716J869K5674k8k6100k331K2534n9k1447M083K5141l352k7155j01K3728
2064I740r11k1145N306K4132n924k7129K508K4899k093k1635N818K2896p795k6172
2078a7505N690K5831l805k2772O000K1849r134k4729Q984K6390o140k3950O516
2091f775K1310j0509k3143J1966K6227r022k4537Q116K0811j1965k1798J4499
2103d820K5159j1983k4225J0352K0710j3505k0626J6025K3127j4799k2989J3541
2115d033K0879j5026j9830J6716K0342j7506k1080J6931K1302j5802j9009J6627
$$ plain form
2024 9173 12128 -11855 -18588 5376 15223 -3581 -9237 10182 11819 -12528 -16866 8116 15268
2037 15268 -6082 -10756 9693 10835 -12629 -13874 11705 15355 -8812 -12536 8997 9624 -12716
2050 -12716 -10847 14827 14799 -11301 -13632 8902 8843 -12604 -8521 16620 13268 -13887 -13988 9740
2064 9740 8829 -12316 -7010 17122 11198 -15931 -13423 11476 9383 -12252 -6434 16462 8667 -17505
2078 -17505 -11815 14016 10211 -12561 -6561 15288 6154 -18575 -9591 16799 10659 -13291 -6775
2091 -6775 14535 4026 -19117 -7151 19076 10054 -14483 -6367 14444 2479 -19319 -4820
2103 -4820 20339 8356 -15869 -5517 15193 1688 -18938 -2913 20214 5415 -17574 -4033
2115 -4033 16846 1820 -18010 -1294 19048 1542 -19538 -2607 18695 2893 -16116 511
2127E11J7139k0147j9423J9921K1382j6221j7578J7450J4763k2262j8633K1274
2139a824K0242j7198j5449J9365J4075k3354j7673K1401J7436j9383j4095K1923
2151E466J4332k2885j5505K1565J3786k2583j3386K3627J4348k1900j2390K2553
2163G028J0652k5377j2808K4109J3161k1588r081K4145Q398k7000j1646K4147
2175D140J0495k2070o161K5624O957k7480r692K3910P272k3325m013K6834N989
2188A8480k6471p250K3414L870k5115k852K7466N445k4954m168K3749P79k6816
2201a4423k479K6831M043k3506n27K4882r42k7782k058K5166J261k3131K719K6410
2215A6464j571k7115q34K3459k415k3931M801K7260j660k5079J618K1897o192
$$ plain form
2127 511 17650 -2497 -21920 -1999 19383 3162 -14416 3034 17797 -4465 -23098 -1824
2139 -1824 18418 1220 -14229 5136 19211 -4143 -21816 -415 17021 -2362 -16457 5466
2151 5466 19798 -3087 -18592 2973 16759 -5824 -19210 4417 18765 -3135 -15525 7028
2163 7028 17680 -7697 -20505 3604 16765 -4823 -13904 10241 18639 -8361 -20007 4140
2175 4140 14635 -7435 -13596 12028 18985 -8495 -18187 5723 12995 -10330 -14343 12491 18480
2188 18480 -7991 -15241 8173 12043 -13072 -15924 11542 16987 -7967 -12135 11614 12393 -14423
2201 -14423 -16902 9929 13972 -9534 -10061 14821 13879 -13903 -15961 9205 10466 -12665 -9946 16464
2215 16464 14893 -12222 -13056 10403 7988 -15943 -11142 16118 14458 -10621 -9003 12894 6702
2228F702k5034N836K6977k093k2388M807K1220r210k6009O309K5328l589k0146
2241a1290Q539K1561j0813k5605O407K2418o676j9075J1484K2484j0402k3439
2253a4407P566J9423j0802k0023J2513K2742r361j9664J0458J7875j4352k1651
2265a9683J1902K1040r429j6177J3975J7771j5996k1765J1341J8343j1156j4295
2277a4129J6321J7690j6372j9924J2161J6014j3221j3575J7062J6331j6307j7357
2289a5306J3716J4320j4911j3058J7172J4695j6157j4478J5164J2547j6537j2885
2301a5718J6740J3173j5448j0934J7085J0843j8498j3154J5368J0934j4824p213
2313a1646J9416J0321j9103j2880J3835P596j5709n239K0946J0245j7960j0481
$$ plain form
2228 6702 -18332 -12496 14481 12388 -10000 -5193 16027 6817 -19192 -12883 12445 8856 -11290
2241 -11290 -2751 18810 7997 -17608 -11201 11217 4541 -14534 -3050 19434 9032 -14407
2253 -14407 -6841 12582 1780 -18243 -5730 17012 7651 -12013 -1555 16320 1968 -19683
2265 -19683 -7781 13259 3830 -12347 1628 19399 3403 -18362 -7021 11322 166 -14129
2277 -14129 2192 19882 3510 -16414 -4253 11761 -1460 -15035 2027 18358 2051 -15306
2289 -15306 -1590 12730 -2181 -15239 1933 16628 471 -14007 1157 13704 -2833 -15718
2301 -15718 1022 14195 -1253 -12187 4898 15741 -2757 -15911 -543 10391 -4433 -11646
2313 -11646 7770 18091 -1012 -13892 -57 7539 -8170 -13409 7537 17782 -178 -10659
2325a0659J4012M840j7763n212K0077Q853j6655o709J6172M139j8585n638J7678
2338D550N298j6694l534J8386M554j7612m683J5734J991j7505j894J8808M251
2351A1650j6372k874J5125O9j7327q42J8105K768j5842j538J4548q41j6318P52
2365h937J7391J105j5481n33J3823j881j5353J862J6362j75j4437R35J3663k824
2379E520j4818K117J4663j743j3505K926J3880k892j4039K621J2834l806j3308
2392i550M155J3863k891j2346L771J1542n335j3033M411J2778l558j0812N015
2405a990J1050n901j1926M775J1228m788j0141N803J0342n867j0435N424R946
2418G520n477r421N810R219o137r317N898R089n454q080N993P925o716q589N795
$$ plain form
2325 -10659 3353 8193 -9570 -14782 5295 14148 -2507 -9216 6956 11095 -7490 -13128 4550
2338 4550 9848 -6846 -10380 8006 12560 -5052 -9735 5999 7990 -9515 -11409 7399 11650
2351 11650 -4722 -7596 7529 7598 -9729 -10571 7534 10302 -5540 -7078 7470 6629 -9689 -8937
2365 -8937 8454 9559 -5922 -6455 7368 5487 -9866 -8004 8358 8183 -6254 -5319 8344 5520
2379 5520 -9298 -7181 7482 5739 -7766 -4840 9040 6148 -7891 -5270 7564 3758 -9550
2392 -9550 -5395 8468 5577 -6769 -2998 8544 3209 -9824 -5413 7365 3807 -7005 -1990
2405 -1990 9060 3159 -8767 -3992 7236 2448 -7693 -1890 8452 2585 -7850 -2426 7520
2418 7520 2043 -7378 -1568 7651 1514 -7803 -1905 7184 1730 -6350 -357 7568 852 -7737 -1942
2433a942Q061n338o616O544P007o896p899N510O749n443n553O784O256o711o689
2448f176N664N608n823n053O375N208o132n038O172M777o122m908N561M015n640
2463a512l203O707M181o346m666M519K733n071j703P262L701o117m545L456J700
2478A096m408m11P102L046n751m038K861J174l856K9O117K203m978k997L115J100
2494A404l521k92M372J016m239j309L775J506k958j009K219m38l638J60M635K346
2510D029k226j581J44j903l015J113N065K849j302j911j279k519k168J494M511
2525A301K567p75j788j612j909j078J423K834J542p93j488j027l44M09R65O84
2541I11k92r76j167p4J726K141L72j613j875j374r37O98L465L483k09l367k688
$$ plain form
2433 -1942 6119 781 -5835 709 7716 820 -7079 -1569 5180 -263 -5816 968 7224 513 -6176
2448 -6176 -512 5096 -727 -5780 595 5803 -329 -5367 805 5582 -540 -5448 113 4128 -1512
2463 -1512 -4715 1992 6173 -173 -4839 -320 2413 -2658 -4361 2901 6602 485 -4060 -604 1096
2478 1096 -3312 -3723 3379 6425 674 -3364 -503 671 -3185 -3156 2961 5164 186 -2811 304 1404
2494 1404 -2117 -2409 1963 2979 -1260 -2569 1206 2712 -246 -1255 964 526 -3112 -2952 1683 4029
2510 4029 1803 222 366 -1537 -4552 -3439 1626 4475 3173 1262 -17 -2536 -4704 -3210 1301
2525 1301 3868 3093 1305 -307 -2216 -3294 -1871 963 2505 1712 224 -803 -1147 -738 227 911
2541 911 619 -357 -1524 -1598 128 2269 2641 1028 -847 -2221 -3158 -2460 1005 4488 4279 912 -1776
2558a776j204q38Q01M395M131q89m298k392k87q76L31M288L847j971m640r00J709
2575e69n45p61L229K720l313m464J429L965l47j921J972J307m516m022L764N910
2591C838o81k954J261L68n559l445N756O788j599l732J242K16n846k806O970O485
2607F302l090m564J928J146n411k222P370N287n148n252L149K626m626j437P242
2622C300L582p310n661M628M164l954j184P142K076r101n537O325N188m162j319
2637a823O964J113j0151m659Q003N302n235j880O995N72j0101l152R669M696p086
2652g73k822P058L45r558j030J1054L533r247l327P034K35q954Q43J2147K052
2667H590j0841l314P577l9q765K093J2415O84j1788k524Q661j94r016K290J1818
$$ plain form
2558 -1776 -2980 -3818 -3017 1378 5509 4620 322 -2070 -2357 -3233 -2902 1386 5233 3262 -1378 -2278 -569
2575 -569 -1114 -1875 1354 4074 761 -3703 -2274 1691 1344 -577 1395 2702 -1814 -5836 -2072 3838
2591 3838 3157 203 1464 1832 -3727 -7172 -1416 5372 3773 41 1283 1499 -4347 -7153 -183 6302
2607 6302 3212 -1352 576 1722 -3689 -5911 1459 6746 1598 -3654 -505 2121 -2505 -3942 3300
2622 3300 6882 -428 -6089 -1461 2703 -1251 -2435 4707 6783 -2318 -7855 -1530 3658 -504 -1823
2637 -1823 5141 6254 -3897 -8556 -553 4749 -486 -2366 4629 5201 -4900 -8052 1617 6313 -773
2652 -773 -3595 3463 3808 -5750 -6780 4274 7807 -1440 -4767 2267 2502 -6452 -5609 6538 8590
2667 8590 -2251 -5565 2012 1973 -6792 -4699 7716 8400 -3388 -5912 2749 2555 -6461 -4171 7647
2682G647p64j2118p60J0327k31r611J898J0710k325j2193J177J2175l2j0324J405
2697c019R736l850j2321L041J3555l62j0793J538R361n120j2393M562J4080j441
2711F574j1281K480R713n997j2259N539J3782l304j1537M185J0353o368j1882
2724a0002O260J2449n438j1660N972J1413o412j1134O722J0891p912j1814P516
2737c149J2413o123j0169P547R360j0192j2149Q649J2583o351q920Q866Q968j1587
2751b54j2371R105J1520p493q232J0550R391j1767j1686R447J0065r794q528J1814
2765A767J0065j1226j0143J0570Q483j2068r243J2234R969j0895q088J2068P567
2778A1060j3825r512J2338Q914j1335o315J3745P099j4790r064J2444P252j2230
$$ plain form
2682 7647 6883 -5235 -5995 4332 4101 -5510 -3612 7098 4773 -7420 -6243 5932 5900 -4424 -3019
2697 -3019 6717 2867 -9454 -6413 7142 6780 -4013 -2475 6886 1766 -10627 -6065 8015 6574
2711 6574 -4707 -2227 7486 1489 -10770 -5231 8551 5247 -6290 -2105 8248 1880 -10002
2724 -10002 -3742 8707 3269 -8391 -2419 8994 2582 -8552 -1830 9061 1149 -10665 -3149
2737 -3149 9264 3141 -7028 519 9879 -313 -12462 -3813 8770 2419 -6501 2365 11333 -254
2751 -254 -12625 -3520 8000 507 -7725 2825 12216 449 -11237 -1790 8275 -1519 -10047 1767
2765 1767 11832 606 -9537 1033 9516 -2552 -11795 439 10408 -487 -8575 3493 11060
2778 11060 -2765 -12277 61 8975 -2360 -8675 5070 12169 -2621 -11685 759 8011 -4219
2791d219n163J5043O734j4888p762J2625N491j3842m402J5757O429j4459n997
2804h653J3299L649j5403m192J6033N567j3939l798J4408K467j6490m212J5637
2817D373M220j4183k007J5931K109j6765l716J5048K191j4960n73J6952J885j6453
2831e948k376J4822K31j6046J67J7329J415j5766m18J5026j631j7031O15J7065
2845G454N64j4858J595J5530k933j7668J034J6303j163j4236L708J6094l547j7218
2859i341J729J5059l253j4631N011J6617l760j5868L468J4383n502j5494N419
2872f163J5911m482j4218N950J4564o818j5788N534J4583o060j3644P868J4951
2885A2188p351j5173O621J3690p784j3588Q673J4275q313j4035Q101J3322q633
$$ plain form
2791 -4219 -9382 5661 12395 -2493 -10255 2370 7861 -5981 -10383 5374 11803 -2656 -8653
2804 -8653 4646 8295 -7108 -11300 4733 10300 -3639 -7437 6971 9438 -7052 -11264 4373
2817 4373 8593 -5590 -7597 8334 10443 -6322 -10038 5010 7201 -7759 -8332 8620 10505 -5948
2831 -5948 -8324 6498 6729 -9317 -9150 8179 9594 -6172 -6590 8436 6805 -10226 -9611 7454
2845 7454 8018 -6840 -5245 10285 7352 -10316 -9282 7021 5858 -8378 -4670 11424 7877 -9341
2859 -9341 -7612 7447 4194 -10437 -5426 11191 7431 -8437 -4969 9414 3912 -11582 -6163
2872 -6163 9748 5266 -8952 -3002 11562 4744 -11044 -5510 9073 3013 -10631 -2763 12188
2885 12188 4837 -10336 -3715 9975 2191 -11397 -2724 11551 3238 -10797 -2696 10626 1993
2898A993j2851R387J3176r719j3583Q999J2734r227j1716J0589J2546j0478j2851
2911a1001R601J1331j0664j1188J1383J2112j0352j0905J0672J0211j2084j1344
2923a2228J1263J0763j0808r159J2571R939j2332j0417J1052Q476j2343q470J3364
2936A671R700j1875q424J2135P313j3665q355J3018P935j2524o641J3677P256
2949A1221j3639p130J2972O035j3893o253J3835O179j3241m877J4258N341j4332
2962c524n823J2850L942j4066l599J5274N441j3289m040J2856J974j5287l577
2975a0868J4532M307j2645j735J4030J647j4911l058J3262J728j3426j014J4474
2988F323K172j3254r94J3012k64j4781j087J3771J256j2032J146J3519j278j4602
$$ plain form
2898 1993 -10858 -1471 11705 1986 -11597 -2598 10136 909 -10807 -218 12328 1850 -11001
2911 -11001 -1400 9931 -733 -11921 -538 11574 1222 -9683 989 11200 -884 -12228
2923 -12228 -965 9798 -1010 -10169 2402 12341 9 -10408 644 9120 -3223 -11693 1671
2936 1671 11371 -504 -8928 3207 10520 -3145 -11500 1518 9453 -3071 -9712 3965 11221
2949 11221 -2418 -9548 3424 9459 -4434 -10687 3148 9327 -3914 -8791 5467 10808 -3524
2962 -3524 -9347 3503 7445 -6621 -10220 5054 10495 -2794 -6834 6022 7996 -7291 -10868
2975 -10868 3664 7971 -4674 -6409 7621 9268 -5643 -8701 4561 6289 -7137 -8151 6323
2988 6323 8495 -4759 -5753 7259 6995 -7786 -8873 4898 6154 -5878 -4732 8787 7509 -7093
3002g093n51J3008k20j2038K112J3332k186j4073J050J3085j083j1650K706J1986
3016H385l798j3641K488J3067j552j0903L597J1515m899j3276L203J2235l028
3029C393j0750M591J1432m622j1408M483J0871n182j1720M244J0799l864q806
3042f539O588J0626o599j2622L072R339m234p072Q264J0822o714j2119L141P992
3056C945n263o941Q428J0031o552j0315M554P771o006p212P367Q287p191q417
3070g514O647Q223o181p345O266O154p879o727Q425Q428o477p220N478M408q045
3085c359n082R692P981o843p076M764L236p884l514J0374P259p321o672M686K535
3100B776p588k566R971N779p429n571N392K790o948k359Q414L676p855m250O818
$$ plain form
3002 -7093 -7644 5364 5144 -6894 -4782 8550 6364 -7709 -6659 6426 5343 -6307 -3601 8385
3016 8385 4587 -9054 -6566 6501 4949 -5954 -2357 9158 4259 -9017 -5814 6421 3393
3029 3393 -7357 -2766 8666 4044 -7364 -2881 7990 2808 -8912 -4668 6131 2267 -6539
3042 -6539 49 10675 4076 -8546 -5474 3865 -369 -7441 823 11645 4931 -7188 -4047 3945
3056 3945 -1318 -8259 169 10200 3648 -6667 -2113 5658 -348 -7560 -193 8094 903 -7514
3070 -7514 -867 7356 1175 -6170 96 6250 -1629 -8356 69 8497 2020 -5200 278 4686 -3359
3085 -3359 -8441 1251 9232 2389 -4687 77 3313 -4571 -8085 2289 9548 2227 -4445 241 2776
3100 2776 -4812 -7378 2593 8372 943 -4628 764 3554 -3394 -5753 2661 6337 -1518 -5768 1050
3115A050L795n971k330O622J201q515l174Q172M817m911k039N122o36q992k196
3130g985Q727M879m283j648M483j659q592j202Q582M011m617j516M198j513p133
3145e268J5P925K177n478j565M196p11n224J318O812K24o608j705M380M22l398
3161b488K150N615j547p154j542M497J214k004K446M399k717p074r99M755J526
3176A077j567K149L181l140o156P5M873J291j853J234K082l029m512J404M897
3191B006O90k632K1J172k506k537K661M585j97l284r40N17j604r55L271L925r55
3208C238l639j256L33p43J39L146K719j614l413r42P71J48O26K185J229k136k810
3225b019k01J574Q94O65R55l07k390j945O90K084J572M95l21j502k128r67J067
$$ plain form
3115 1050 4845 -1126 -3456 3166 4367 -4148 -7322 850 5667 756 -1283 3839 3203 -5789 -7985
3130 -7985 742 5621 1338 -310 4173 2514 -6078 -7280 1302 5313 696 -820 3378 1865 -5268
3145 -5268 -5253 2672 4849 -629 -2194 2002 1291 -3933 -2615 4197 4421 -2187 -3892 488 910 -2488
3161 -2488 -338 5277 3730 -3424 -4966 -469 745 -1259 1187 5586 2869 -4205 -5204 -449 1077
3176 1077 -490 1659 4840 1700 -4456 -4381 492 1783 -70 1164 3246 217 -4295 -2891 2006
3191 2006 2696 64 85 1257 -1249 -3786 -1125 3460 3263 -21 -961 -444 -2048 -3003 268 4193 3238
3208 3238 -401 -1657 -1324 -2067 -1928 1218 3937 2323 -1090 -2032 -1261 -1113 -487 1698 2927 791 -2019
3225 -2019 -2220 -646 248 913 1868 1561 -829 -2774 -2084 0 1572 2067 1746 244 -1884 -2851 -1784
3242a784K265J778L36j290j979j404j13J168J717J480o3j684j723j87P64O53P00
3259F34R46n18j919r96J374J566j41l20J94q76k139j11K829K034q34j240j26j166
3277h09k301M46L810K202j608j611J94j025k461M91M053J725k250j271J083n05
3293A63k717L88L687Q46l010q23K515K86k715K8L172k94l903k60L914J092k757
3310c88k6K806j273m770M5M855J444k823L04K991j944n431L00N240J154l187P71
3327F8L620k128n518N85N236J3l848J240M510j774n329J102M853j290m774J731
3343a703N170j337m839J726M696k605n711J999N619j307m322K718M778l589o220
3358d927K065N526j787m081L676N041l830o465K364N244k670m316M218N622l924
$$ plain form
3242 -1784 481 2259 2595 1305 -674 -2078 -2191 -1023 694 2174 2111 427 -1296 -1483 -719 -66 634
3259 634 1580 1062 -857 -1853 -479 1087 946 626 820 -56 -2195 -2306 523 2557 1723 483 357 -809
3277 -809 -3110 -2664 1146 3348 1740 129 323 -702 -3163 -2672 1381 3106 856 -415 668 163
3293 163 -2554 -2166 1521 2367 -643 -1466 1049 1335 -1380 -1352 1820 1526 -2377 -2637 1277 2369 -388
3310 -388 -414 2392 1119 -3651 -3606 1249 2693 -130 174 3165 1221 -4210 -3910 1330 2484 -703 68
3327 68 3688 1560 -3958 -3373 1863 1876 -1972 -732 3778 2004 -3325 -2223 2630 1340 -3434 -1703
3343 -1703 3467 2130 -2709 -983 3713 1108 -4603 -2604 3015 1708 -2614 104 4882 1293 -4927
3358 -4927 -2862 2664 877 -3204 472 5513 1683 -4782 -2418 2826 156 -4160 58 5680 1756
3373A756o079K993N006l932m955M637N873l955n470M046M888m983n440M703N643
3388D731m278m917N173N108n781n756N018N224m979m484O029N175o127n544N466
3403E8M510n855m282O861M916o395m918N972M055o810m062P113M706o643m116
3418d890O673L578p559l929P366M197p014l428P450L339q061l675P688L423p539
3433b381k891Q138K955q272l299Q143K726q211k400Q643K666q616k628Q492K194
3448E259q817j928R012K230r027j913Q896J477r212j537R395J574r102j179R249
3463D377P89r600q83R485Q11r328l53R545J93r731j44R476j48r500M24R678n49
3480D542r669P33R600r24r603J199R619j376r889J414R639j472r405K201R751
$$ plain form
3373 1756 -4323 -1330 3676 -256 -5211 -574 5299 1344 -4126 -80 4808 -175 -5615 -912 4731
3388 4731 453 -4464 709 5817 36 -5720 -702 4522 -457 -4941 1088 6263 136 -5408 58
3403 58 4568 -1287 -5569 1292 6208 -187 -5105 867 4922 -1888 -5950 1163 5869 -774 -4890
3418 -4890 1783 5361 -2198 -6127 1239 5436 -1578 -5006 2444 5783 -2278 -5953 1735 5158 -2381
3433 -2381 -5272 2866 5821 -2451 -5750 2393 5119 -3092 -5492 3151 5817 -2799 -5427 3065 5259
3448 5259 -3558 -5486 3526 5756 -3271 -5184 3712 5189 -4023 -5560 3835 5409 -3693 -4872 4377
3463 4377 5166 -4434 -5317 4168 4979 -4349 -4702 4843 5036 -4695 -4839 4637 4489 -5011 -4587 5091 4542
3480 4542 -5127 -4394 5206 4282 -5321 -4122 5497 4121 -5768 -4354 5285 3813 -5592 -3391 6360
3495F360k180j0166J762R341k423r091L334J0247k757r983K386Q773l704r457
3509g558M127J0302l087r222L551Q974m794r865M019R633m023q649N207R407m871
3524C151r614M240Q278n535q646O113R806m886q652N086P610o723q773O501R277
3539G233n390p996N921P432p097q206P081Q502o217p805O299O992p447p423P890
3554b31Q168o966p329O907O379q321o879Q067P379p505o380Q302O486q440o661
3569g024P695N377q965n673R690P195p586n360P831L515j0910n995R804P042o942
3584c06l492R126L016j1626o156R079N346p640k533J0111L451j0615m693R140
3598B208L461r515l184R831L515r283k440J0184K578j0772l800R106K548q814
$$ plain form
3495 6360 4180 -5986 -4224 5117 2694 -6397 -3063 7184 4427 -5556 -3170 5603 1899 -7558
3509 -7558 -3431 6871 3784 -5438 -1887 7087 2293 -7572 -3553 6080 2057 -6592 -1385 8022 3151
3524 3151 -6463 -2223 6055 520 -8126 -2013 7793 2907 -5745 -659 6951 228 -8545 -2044 7233
3539 7233 1843 -6153 -232 7200 103 -8103 -1022 7480 1263 -6542 -243 6749 -698 -8121 -231
3554 -231 7937 971 -6358 549 6928 -1393 -8272 -205 7174 -331 -6711 1591 8077 -363 -7024
3569 -7024 671 6048 -2917 -8590 1100 8295 709 -4651 3180 6695 -4215 -10210 -406 6636 -306
3584 -306 -3798 5328 8344 -3282 -9438 -359 4987 -2653 -5186 4925 8376 -2239 -6932 2208
3598 2208 5669 -3846 -7030 2801 6316 -2967 -5407 4777 7355 -3417 -7217 1889 4437 -4377
3612d377q22J0961J904j1073l400R100J926q751j3J0629P56j1528k458R631J771
3627D256q300R42J0235p50j1955j736R630J102q038J835J0323j292j1304o85R395
3642C658m88r015J754R954j278r602J688R885j732j0374N36Q377j812q091M171
3657b369J1056j886j0780j22O816l217p644N319J1349j909r915N37O653l964p850
3672g926N006J0233k861r240K291P559l677p637M540Q410m504q879L648Q389l177
3687B175o900M424O795n810q461M910Q722l376o654M330N617o491p445O312Q608
3702F756l857o677M002M542o866o169P338Q328m439o469M039L916o944n395P654
3717b41P332n168o060M581M195o451m484P131N614o390n794N478M870n368l600
$$ plain form
3612 -4377 -5199 5762 7666 -3407 -6807 2293 4219 -4532 -4545 6084 6840 -4688 -7146 2485 4256
3627 4256 -4044 -3102 7133 6383 -5572 -7308 2322 3424 -4614 -2779 7544 6252 -5052 -5737 3658
3642 3658 3170 -5845 -4091 5863 4585 -5017 -3329 6556 4824 -5550 -5014 3363 1551 -6540 -2369
3657 -2369 8687 6801 -3979 -4101 2715 -502 -8146 -2827 8522 6613 -3302 -2765 3888 -76 -7926
3672 -7926 -2920 7313 4452 -4788 -2497 5062 1385 -6252 -1712 6698 2194 -6685 -3037 5352 2175
3687 2175 -4725 -301 6494 684 -7777 -2867 5855 2479 -4175 155 5772 -719 -8164 -1852 6756
3702 6756 2899 -3778 224 4766 -2100 -8269 -931 7397 2958 -3511 528 4444 -2500 -7895 -241
3717 -241 7091 1923 -4137 444 4639 -1812 -6296 835 6449 59 -5735 -257 4613 -755 -4355
3732d355O791L856p739n694O094N331m658k564O507K602q434n199O463N098m541
3747d42k197O249J853q321m074P034M435n105k372N834J345p581k497P573L470
3762E204n873k623N285R44o686r29P823K501o590k745N035O95n821K37P677J380
3778E514p069k442N013P70n158Q47O978L63p209j829N313Q71m688R29N996n06
3794C693o932r64N772R93m494N81N137j372o464J07O219P98m562L57M336j891
3810A314n900J135O223N83m697L18L711j951n219J805N967j63m647L00L483j871
3826C91m276K219N245j169m569O44L571j609l448K424M226k003m604J113L691
3841A846j112k748K392L217k760m485J546L740q01k157K256K571l223l982J719
$$ plain form
3732 -4355 2436 6292 -1447 -7141 -1047 4284 -374 -2938 3569 6171 -2263 -7462 -999 4099 -442
3747 -442 -2639 3610 5463 -2858 -6932 102 4537 -568 -2940 2894 4239 -3342 -5839 1734 5204
3762 5204 -669 -3292 1993 2937 -3749 -4678 3145 5646 -944 -3689 1346 2041 -3780 -3543 4134 5514
3778 5514 -1555 -3997 1016 1786 -3372 -2525 4453 4816 -2393 -4222 1091 1962 -2726 -1797 4199 3693
3794 3693 -3239 -4203 1569 2562 -1932 -1351 3786 2414 -4050 -3943 2276 3074 -1488 -1131 3205 1314
3810 1314 -4586 -3451 2772 3355 -1342 -1024 2687 736 -4483 -2678 3289 3126 -1521 -1221 2262 391
3826 391 -3885 -1666 3579 2410 -2159 -1515 2056 447 -3001 -577 3649 1646 -2958 -1845 1846
3841 1846 734 -2014 378 3595 835 -3650 -2104 1636 835 -1322 934 3505 282 -3700 -1981
3856a981L527q50j947K268K096k973l421J878L074j230j992J955J978k385k575
3871b578K167K534j763k281J632J915j925j605K454J947k209k329J247J596j416
3886f14q05K500J592k268k364J111J281j165m36K362J380k149j977J002R57j259
3902h52k10K028R37j752j269J055P05j241m74J519O53j227o61J151O00j165o21
3919h24Q31L84r33j27J300N13j001q17N28J02o74J75J140N14p02n58K4j88m32
3938g45J44R12N00l96l31q3k47k98J19L58L60M4j42k35l3rj15n5J81L10m7j76
3960A6K7J55j14n07J07N54k7m43K52N32k97p59J31O43j05o60L77Q54k90j024J58
3981d20R75k79r53L84J113l51j239L45J225n30j174O13J364n47j521M83J397o32
$$ plain form
3856 -1981 1546 696 -1251 1017 3113 140 -3281 -1403 1671 441 -1551 404 2382 -3 -2578
3871 -2578 -411 2123 360 -1921 -289 1626 -299 -1904 550 2497 288 -2041 -794 802 -614
3886 -614 -1419 1081 2673 405 -1959 -848 433 -732 -1168 1194 2574 425 -1552 -550 407 -852
3902 -852 -1062 966 1903 151 -1118 -63 642 -599 -1073 446 1099 -128 -789 362 962 -203 -824
3919 -824 7 391 -542 -669 631 1144 143 -674 -146 -44 -718 -543 597 1111 409 -149 -125 -313 -745
3938 -745 -601 311 811 415 84 1 -246 -544 -425 -67 293 337 195 -40 -73 -82 -197 -252 -71 239 192 16
3960 16 43 198 84 -423 -316 238 211 -232 20 552 255 -504 -373 270 165 -495 -118 736 446 -578 -420
3981 -420 555 276 -677 -293 820 469 -770 -425 800 270 -904 -291 1073 526 -995 -512 885 253
3999B53j412Q07J691q58j654P29J479r65j601J153J918r82j810R96J581j320j879
4016a874J445K071j097j671J145J594j603k073J609K001j284j670J714J849k059
4031I7k233J640K078j704j660K248K000k118k294J813J667k140j678K652K247
4046B615k210k141K071J496k757j850K883K295k273j740K566J545l372k160K854
4061a78K165k516j343L329J630l623k340K847J592k889r98M015J761l747k172
4076b467K907J172l517r58M295J939l671j758L245Q47m143j138M434J714l704
4091h03j004L918N27m590j237M100J191l777l51M694O78m752j389L757L56m082
4107b764L25N370R18m763j161L539m72m655N55N787R81m573l89L787j111n303
$$ plain form
3999 253 -1159 -352 1339 481 -1173 -444 1035 70 -1531 -378 1540 558 -1252 -256 1325 5 -1874
4016 -1874 -429 1642 545 -1126 19 1613 10 -2063 -454 1547 263 -1407 307 2156 97
4031 97 -2136 -496 1582 -122 -1782 466 2466 348 -1946 -133 1534 -606 -2284 368 2615
4046 2615 405 -1736 335 1831 -926 -2776 107 2402 129 -1611 955 2500 -872 -3032 -178
4061 -178 1987 -529 -1872 1457 3087 -536 -2876 -29 1563 -1326 -2324 1691 3452 -295 -2467
4076 -2467 440 1612 -1905 -2863 1432 3371 -300 -2058 1187 2034 -2109 -3247 1187 2901 -803
4091 -803 -1807 2111 2638 -1952 -3189 911 2102 -1675 -2026 2668 3346 -1406 -2795 962 1318 -2764
4107 -2764 -2439 2931 3849 -914 -2075 1464 992 -3663 -3108 2679 3660 -913 -1302 2485 1374 -3929
4123c929M20N653N96m337M87M531j189n538K63N115m98m610J326N294p19n200
4139b335N44M415j682n178J655N877m65m651J071M168k592n628J711O121n72m424
4155a965J830M137l135n861K134N847r59m230K241M223l398n645K395N430j780
4170A264m146K815M524l355n196K639M805k965m574L284N078k796m329L248L941
4185D237m390n386L455N230k284l242M212L736n351n893L117M728k539k579N229
4200B280L828n517n464L391L919l604k730N327L801n094m276M322L658m617l491
4215d267M804L340m926l128N476L645n150l806M341K638m956k219O222L384n657
4230b59l880M425K355m900j535O585K769o261l751M496K159m782q36O853K256
$$ plain form
4123 -3929 -3509 2144 2740 -1597 -1110 3421 2232 -3306 -3043 2072 1574 -3036 -1710 3584 2865 -2335
4139 -2335 -1791 2624 942 -4236 -2581 3296 2831 -1820 -749 3419 827 -4801 -3090 3031 2459 -1965
4155 -1965 -135 4002 867 -4994 -2860 2987 2028 -2202 39 4262 864 -4781 -2386 3044 1264
4170 1264 -2882 -67 4457 1102 -4094 -1455 3350 385 -4189 -905 4173 1377 -2952 296 4237
4185 4237 -153 -5539 -2084 3146 862 -2380 1832 5568 217 -5676 -2559 2169 -370 -2949 2280
4200 2280 6108 591 -4873 -1482 2437 -1167 -3897 1430 5231 137 -4139 183 3841 -776 -4267
4215 -4267 537 3877 -1049 -4177 1299 4944 -206 -4012 329 2967 -1989 -4208 2014 5398 -259
4230 -259 -4139 286 2641 -2259 -3794 2791 5560 -701 -4452 44 2203 -2579 -3415 3438 5694
4245E694o628l318M735J733n203n73O783J745o391k346N536J294n779r90O085
4260B377R65o135p70O506J445o031j401N084k58o224L55P459J554n843j097M599
4276B585j068o594P47P551J272n822n71M936j211o302R22P060J38o133j33N566
4292B943q97n626J333O446j044o760L03N974p08n223J832O017j941o887R70O181
4308B913q50n104K128N343k710o498J867O336j106n046K152M804l401o034K659
4323b547O393j567m982K289M411l668n469L234N968k151n048K488M373l528m784
4338d588L744N461l144n254K701M355l201m147M194M845l833n397K957M283l130
4353a54l537M434M375m457n121L284M327l323l277M336L864m731m550L953M102
$$ plain form
4245 5694 -934 -4252 483 2216 -2987 -3560 3223 4968 -1423 -3769 1767 3061 -2718 -3708 2377
4260 2377 3342 -2793 -3563 2943 4388 -1643 -3044 2040 1782 -4442 -4087 3372 4926 -917 -2014 2585
4276 2585 1517 -5077 -4330 3221 4493 -1329 -1900 3036 1825 -4477 -3555 3505 3643 -2490 -2623 2943
4292 2943 2046 -3580 -2247 4199 3155 -3605 -3302 2672 1964 -3259 -1427 4590 2649 -4238 -3268 2913
4308 2913 2063 -3041 -913 4430 1720 -4778 -2911 3425 2319 -2727 -575 4229 828 -5206 -2547
4323 -2547 3846 2279 -2703 -414 3997 329 -5140 -1906 4062 1911 -3137 -649 3724 196 -4588
4338 -4588 -844 4617 1473 -3781 -1080 3275 74 -4073 121 4966 1133 -4264 -1307 2976 -154
4353 -154 -3691 743 5118 661 -4460 -1176 3151 -172 -3449 887 4751 20 -4530 -577 3525
4368C525l605l302M214L241m776l831M632L925l957l281M003K634m948k942N105
4383F37L731m266l143L963K040n015k314N415L246m516k752M125J663m794j918
4398c898N286K402m693k353M510J800m682j420M906J609n184j871M696J822m221
4413a291j105M732R90n395j673M891J538m160p20M705N28n247j206M936J190m375
4429a662n07M547K90n069o21M892Q23m489l46M426o3m818p4M929J54m345m1M348
4447B374m06m532L32M625l86m411L93M297m63m126P79M177q37m455N91M090n98
4464A444l690J150M061j221m288O28L852r70l505J595L864j290m001J072L493
4479B194j270l470J434L731j352l572J377L345j533l381J567L248j503l275J722
$$ plain form
4368 3525 -80 -3382 832 4073 -703 -4534 98 4023 66 -3215 788 3422 -1526 -4468 637
4383 637 4368 102 -3041 922 2962 -2053 -4367 1048 4294 -222 -2974 1151 2814 -1980 -3898
4398 -3898 1388 3790 -903 -3256 1254 3054 -1628 -3048 1858 3467 -1717 -3588 1108 2930 -1291
4413 -1291 -2396 2336 3326 -2069 -3742 1149 2687 -1473 -2193 2512 3040 -2207 -3413 1523 2713 -1662
4429 -1662 -2169 2378 2668 -2401 -3022 1870 2693 -1796 -2142 2284 2221 -2597 -2671 2258 2412 -1933 -1974 2374
4447 2374 1968 -2564 -2232 2393 2007 -2404 -2011 2286 1823 -2303 -1524 2653 1816 -2639 -2048 2042 1444
4464 1444 -2246 -1096 2965 1744 -2544 -1916 1936 966 -2539 -944 2920 1630 -2371 -1299 2194
4479 2194 924 -2546 -1112 2619 1267 -2305 -928 2417 884 -2497 -930 2318 815 -2460 -738
4494g38L290j682l149J658L013j819l068J892K911j801k773J872K739j989k613
4509b257J919K563k048k496J949K578j989k307J968K263k021k278J965K138k058
4524a11j996K215K107k067k022J952J697k230j730K342J900j914j746J828J425
4539A650k249j426K166J841j980j435J852J127k095j413K202J466j898j085J934
4554F57R01k146j138K030J118j874p96J965Q75k019r37J750O78j839o38K029R20
4571A536j828p04J641K86j993m85J960Q69j418l32J418m7k044n11J777P43j085
4588b17N4J294q7j905n36J463K92r12K35J478k9j607m03R71M5j072J92J568K78
4607A102j187j42P37l33j224J8J340L40n57K38O05m77j365k03Q82L07j29M95P74
$$ plain form
4494 -738 2552 870 -2279 -621 2392 573 -2495 -603 2308 507 -2266 -394 2345 356 -2257
4509 -2257 -338 2225 177 -2319 -370 2208 219 -2088 -120 2143 122 -2156 -191 1947 -111
4524 -111 -2107 108 2215 148 -1874 78 1775 -455 -2185 157 2057 143 -1603 225 1650
4539 1650 -599 -2025 141 1982 2 -1433 419 1546 -549 -1962 240 1706 -192 -1277 657
4554 657 1558 -588 -1726 304 1422 -452 -1248 717 1592 -427 -1364 386 1064 -775 -1413 616 1536
4571 1536 -292 -996 645 931 -1062 -1547 413 1282 -136 -468 950 903 -1141 -1652 125 868 -217
4588 -217 -163 1131 1044 -861 -1397 66 358 -554 -319 1159 1130 -477 -880 91 136 -936 -744 824 1102
4607 1102 -85 -227 510 177 -1047 -1029 311 651 94 332 937 460 -905 -1108 -226 81 -48 447 1221
4626A221m74j178n05M37O3l0O39R15j38o94o19Lk77k47N40R12L86l96k40k65n68
4647e15m15Q3P19N39K46O4k19n24o00k86J00N90N37L83N6j56n26o52m24J96O18
4668a86M15K84M12r0o93r05m0K16J01L79Q44O47n95j056l33pm20J24J300J019
4688A416l85p66k07j99j010k11J151J191j81n28M27k55j256p15R40R82l05j33
4706d4R76L44j365j035O26N21r13K6J645Q66j018r40L79j58j357k09J975J302
4724A621p34o89N76m04j964m79J930J419o61l26J095m63k229p51J855R59j009
4741b54O6J596Ok175o16J555L42j639j7K166N00j742k94J476l01k439j00K366
4759D96P58j381K36J649q48k818m03K434O78j141O51J921r62l026l85K288M25
$$ plain form
4626 1221 747 -431 -936 -499 -436 -466 173 1088 950 256 -363 -360 -637 -884 -344 568 954 558 318 53 -515
4647 -515 -930 -847 -128 411 657 721 502 -22 -622 -908 -808 -218 319 702 758 602 76 -576 -1000 -804 -186
4668 -186 229 513 925 835 142 -763 -803 -587 -486 -107 737 1384 789 -267 -600 -607 -1027 -903 397 1416
4688 1416 1031 265 58 -141 -1151 -1362 -211 980 799 271 698 443 -813 -1528 -588 394 89 -44
4706 -44 932 1276 -89 -1124 -498 23 -890 -864 781 1647 629 -311 68 -90 -1447 -1656 319 1621
4724 1621 887 198 774 370 -1594 -2073 -143 1276 615 289 1384 921 -1308 -2059 -204 755 -254
4741 -254 -188 1408 1414 -761 -1377 178 520 -1119 -1136 1030 1530 -212 -506 970 669 -1770 -1870 496
4759 496 1254 -127 109 1758 910 -1908 -2311 123 801 -340 311 2232 1270 -1756 -2141 147 572
4776E72j343P36K207p09l017j15K304l1j915P30K368n64k531M72K298p50k447
4793a735N16K364m08k070J257K481j258l068K69K262n91j581J788K766j421l410
4809a839K72K101q93j534K114K860j545l276P03K040j224j899K035K739j857k731
4825a934J308K417j590k165J828K178j994k378K067K608j757k337J527J912k224
4840e34k086K589K842j979k543J541J666k439j699K923K758k185k679J649J633
4855A457k526j613L245K542k628k499K114J557k714j489L272K073k907k145K624
4870C63J728k675j496K978J431l281j671L068K021k730j364K895Q08l652j439
4885c016L497J919k658j145K914N65l798j223L644J689l083r10L122M72l684q44
$$ plain form
4776 572 -771 -35 2172 1463 -1554 -1669 635 604 -1311 -581 1787 1223 -1308 -836 1462 712 -1735
4793 -1735 -1219 1145 737 -1333 -76 2405 1147 -1921 -1652 610 19 -1562 226 2992 1571 -1839
4809 -1839 -1567 534 -359 -1893 221 3081 1536 -1740 -1037 1003 -221 -2120 -85 2654 797 -1934
4825 -1934 -626 1791 201 -1964 -136 2042 48 -2330 -263 2345 588 -1749 -222 1690 -534
4840 -534 -2620 -31 2811 832 -1711 -170 1496 -943 -2642 281 3039 854 -1825 -176 1457
4855 1457 -1069 -2682 563 3105 477 -2022 92 1649 -1065 -2554 718 2791 -116 -2261 363
4870 363 2091 -584 -2080 898 2329 -952 -2623 445 2466 -264 -1628 1267 2075 -1577 -3016
4885 -3016 481 2400 -258 -1403 1511 2076 -1722 -2945 699 2388 -695 -1605 1517 1989 -1695 -2539
4901b539L816J168l422r84L203M63l503l50L922P70l776r44L286M24l355pL937
4918B109M18m070p14L425L76l360K21L927j19m163k17L679J15l439M09L746m71
4935A872m155L10L801j23l490N30L561q53m005P30M005m64l475O44L410j266l634
4952b602J077L966q74l545R47L255j327l605J502L725j147l622J130L324j401
4967H03l408J699L665j544l694J369L383j657l292K040L502j851l574J689L317
4982B447j869l232K090L288k079l355K134L308k144l159K196K990k442l098K487
4997d38L248k289k795K341K651k842k921K698K876k342k539K742K469k953k675
5012b769K655K534k731k314K914K467k900k282K844K223l096k294K964K187k974
$$ plain form
4901 -2539 1277 2445 -977 -1961 1242 1705 -1798 -2148 1774 2544 -1232 -2176 1110 1534 -1821 -1828 2109
4918 2109 2527 -1543 -2257 1168 1544 -1816 -1595 2332 2213 -1950 -2167 1512 1627 -1812 -1403 2343 1872
4935 1872 -2283 -1973 1828 1705 -1785 -1255 2306 1453 -2552 -1822 2183 1719 -1756 -1112 2298 1032 -2602
4952 -2602 -1525 2441 1567 -1978 -1031 2224 897 -2708 -1206 2519 1372 -2250 -1120 2204 803
4967 803 -2605 -906 2759 1215 -2479 -1110 2273 616 -2676 -636 2866 1015 -2559 -870 2447
4982 2447 578 -2654 -564 2724 645 -2710 -576 2732 588 -2571 -375 2615 173 -2925 -438
4997 -438 2810 521 -2274 67 2718 -124 -3045 -347 2529 187 -2352 390 2859 -94 -2769
5012 -2769 -114 2420 -311 -2625 289 2756 -144 -2426 418 2641 -455 -2749 215 2402 -572
5027e72j959L186K043l044k110L051J747l246j825L281J943l038j648L242J484
5042B535l395j810L286J641l263j339L420J492l356j394L295J133l516j279L511
5057I61J198l243q79L574Q73l602j150L173Q28l406l62L719Q10l547q31L233L02
5074A651l372l24L584N44l393m40L221K28l265j81L344R6l401j11L269R2l076
5091a534J41L311k15l496Q4L198q9l144L17L201l65l172L81L420m55l374L15K938
5109A462o41k959J107L395n44l251K49K608j106k888J325L461n37k895O46K441
5125A873j463k944J229L115p80k584J265K504j434k847J129K552j265k457J577
5140e30K705j295k461J286K034j787k396J661K731j069k213J469J772k073k390
$$ plain form
5027 -572 -2531 655 2698 -346 -2456 595 2342 -904 -2729 552 2495 -543 -2191 1051 2535
5042 2535 -860 -2670 616 2257 -1006 -2345 1075 2567 -789 -2183 1112 2245 -1271 -2550 961
5057 961 2159 -1084 -1963 1611 2484 -1118 -2268 905 1733 -1673 -2035 1684 2494 -1053 -1884 1349 1651
5074 1651 -1721 -2045 1539 2083 -1310 -1750 1471 1699 -1566 -1747 1597 1693 -1708 -1819 1450 1542 -1534
5091 -1534 -1393 1918 1703 -1793 -1709 1489 1400 -1744 -1427 1774 1409 -1763 -1382 2038 1583 -1791 -1476 1462
5109 1462 821 -2138 -1031 2364 1820 -1431 -1182 1426 320 -2568 -1243 2218 1681 -1214 -568 1873
5125 1873 410 -2534 -1305 1810 1030 -1554 -289 2215 781 -2066 -937 1615 350 -2107 -530
5140 -530 2175 880 -1581 -295 1739 -48 -2444 -783 1948 879 -1334 135 1907 -166 -2556
5155b556J742K571j104j879J605J569k161k226J760K343j359j596J760J627k197
5170a01k171J743J942j525j530K106J665j972j819J689J360j943j485K170J799
5185A928j670j350J684R61k323j542K039J725j417q03J934P63k582j495J720J311
5201H83j350l61K236P27k368j433J444Q20j552l34K286R67j944j097J494L37j927
5218a172m80K147R37j509n40J538J44k186o23J801Q58j396PJ864R1k159q45J519
5236dL19j321L30K100K10k010o12J170o2j483L19K223L05j557k55R89m45j633
5254a417J70J851M59j159J27J137n96j793j24J456L16q88N54J375n04j732k29
5271i97J024j50q37P59J493k50j369j13O67m75j016N79J522L3r21J93N73q05j203
$$ plain form
5155 -2556 -814 1757 653 -1226 379 1948 -213 -2439 -679 1664 305 -1291 469 2096 -101
5170 -101 -2272 -529 1413 -112 -1642 464 2129 157 -1662 27 1387 -556 -2041 129 1928
5185 1928 258 -1092 592 1553 -770 -2312 -273 1452 35 -768 1166 1929 -653 -2148 -428 883
5201 883 -467 -828 1408 2135 -233 -1666 -222 598 -954 -1288 998 1965 21 -1076 418 755 -1172
5218 -1172 -1652 495 1432 -77 -617 921 1065 -1121 -1744 57 915 -481 -474 1390 1481 -678 -1523 -4
5236 -4 315 -1006 -676 1424 1634 -376 -988 182 120 -1363 -1044 1179 1484 -73 -328 661 216 -1417
5254 -1417 -1247 604 1063 -96 31 1168 572 -1221 -1345 111 427 -461 93 1468 964 -768 -997
5271 -997 27 -123 -960 -201 1292 1042 -327 -440 227 -248 -1264 -685 837 870 -51 142 715 -90 -1293
5290a293L52J231J00l87N15O25q20j317K5Q27J8k19Q36Q04o05j249p2M33k80j39
5310f15P61R95m44p84k7J77m15m37N85P03m0m36L28K53o50o69J13N56PM2N22L64
5332H89o01p52o6J00m2K10P68L85k94o45l24j09k53K32O64N51j06l95l51k25j81
5353e45J23L19L36J28j41p4j24j36j11j9L5J90O2J42R5Q3j94l79k66Q1K34J80
5375A9L64L36j95o48m35jJ99K23L96N08j40o83m81J46J61o5L15O52j48n17l03
5396b97K07J21l74J61N02M0o22L5N37k0m70j25M17j06m54K70Q37mp62k56L28j04
5418a39n57N09R99l1r16k49M29k35n95N95J005q9r50j01O36l42o60M14J099l17
5438E05j022K00P06k27p55M22Q64m71j068M85J003k77q62M06Q48p11j007N44J150
$$ plain form
5290 -1293 -941 290 390 3 518 1143 323 -994 -969 -142 -124 -343 493 1297 692 -557 -629 -196 -476 -615
5310 -615 146 1141 697 -87 -114 63 -352 -789 -204 499 459 23 351 604 -46 -715 -602 -46 -39 3 525 889
5332 889 288 -464 -530 -430 -472 -262 506 891 597 -48 -372 -481 -734 -502 162 713 607 212 -139 -364 -545
5353 -545 -422 -103 233 361 220 146 22 -114 -225 -244 -209 -19 43 185 280 363 169 -210 -476 -395 -161 19
5375 19 383 719 524 -124 -559 -560 -361 -138 258 766 626 -57 -538 -392 -231 -296 19 671 523 6 -297
5396 -297 -90 31 -343 -182 320 360 -262 -227 310 290 -180 -305 112 6 -448 -178 659 655 -107 -363 -35 -139
5418 -139 -696 -187 812 781 -135 -384 45 -190 -785 -190 815 726 -224 -325 311 -31 -691 -277 822 505
5438 505 -517 -317 389 162 -593 -171 693 222 -846 -361 642 365 -497 -91 757 46 -961 -417 733
5457G33k42r08L02Q51p98j014O56J235l37j000M91Q14q74j011R08J190o37j132
5475g73O66Q24p94r51J013J092r05j095P86R28q85r20J188R51j077j123R41J045
5493I11r86q21J178Q75j348j015J161R50j056q09J308Q23j430r80J346R53j270
5510b10p55J342P60j500q25J429R31j437p69J430O93j607o97J667Q02j643o71
5527a060J484O64j651o03J758O43j662o66J666M54j680n30J801O22j819m82J689
5544F28L85j852l08J806M11j801l63J852L37j944k30J911K17j890k43J934J39
5561I89j867p8J958J7j899q8J899l4j966P6K122k7j992L6J862k22j978K39K031
5580A078j29k031K60K021k86k097M05K006m53k098M24K101l08k038N59K014p10
$$ plain form
5457 733 491 -417 -115 736 -62 -1076 -420 815 478 -522 -31 783 -91 -1102 -194 996 359 -773
5475 -773 -107 717 -77 -1028 -15 1077 172 -923 -137 791 -94 -1014 174 1125 48 -1075 -134 911
5493 911 -75 -896 282 1157 -191 -1206 -45 905 -151 -960 348 1171 -259 -1239 107 1060 -210
5510 -210 -965 377 1137 -363 -1188 241 1172 -265 -1034 396 1089 -518 -1215 452 1254 -389 -1060
5527 -1060 424 1088 -563 -1166 592 1235 -427 -1093 573 1027 -653 -1183 618 1240 -579 -1061 628
5544 628 1013 -839 -1147 659 1070 -731 -1094 758 1095 -849 -1079 832 1049 -841 -1084 850 989
5561 989 -878 -956 1002 1019 -880 -968 931 897 -1069 -993 1129 1102 -890 -854 1008 786 -1192 -953 1078
5580 1078 949 -1082 -822 1199 913 -1184 -779 1227 774 -1324 -900 1201 893 -1145 -586 1428 718
5597G18k272N44K163m74j846P48K051r16k204O53K028p14j860J002J923r95k088
5614a539R72K001r28j883R88J818j164j843J155K001j024j882J100J678j382j732
5630a664J356J891j260j827J311J660j335j650J509J724j577j882J363J636j244
5645A1j308J721J616j931j884J230J589j339j182K017J609j833j937J438J333
5660A150j750j156J999J659j887j436J834J163j870j483J844J266j901j012K212
5675F32J379k035j362J575R08k090q37K492J337k054j152J727O02k143o97K421
5691G03J029j967j057J858N58k144m61K370Q31k196r10J929M92k050l80K306O89
5708A600k222n57K063L91k213m45K133K87k094j09K485L68k257n00J768r4k367
$$ plain form
5597 718 -1554 -1010 1153 679 -1167 -419 1632 716 -1488 -835 1193 479 -1381 -379 1544 549 -1539
5614 -1539 -567 1434 506 -1377 -389 1429 265 -1578 -423 1578 554 -1328 -228 1450 68 -1664
5630 -1664 -308 1583 323 -1504 -193 1467 132 -1518 -9 1715 138 -1744 -381 1255 11
5645 11 -1297 424 2040 109 -1775 -545 1044 -295 -1477 540 2149 316 -1621 -183 1150
5660 1150 -600 -1756 243 1902 15 -1421 413 1576 -294 -1777 67 1333 -568 -1580 632
5675 632 2011 -24 -1386 189 1097 -993 -1830 662 1999 -55 -1207 520 1122 -1021 -1718 703
5691 703 1732 -235 -1292 566 1124 -1020 -1481 889 1720 -476 -1386 543 1035 -1015 -1395 911 1600
5708 1600 -622 -1179 884 1275 -938 -1383 750 1037 -1057 -1166 1319 1687 -570 -1070 698 604 -1763
5725a763K48K780N49k130k48J727n71k544J42K653N15j864K19J894o79k600Q4
5742a588K372J4j949O07K154m65k224J62J962m69k241O99K203k01j945N21J813
5759A425r33k238O87K090k70j646P66J796j126k319O37K153m34j495R82J680j274
5776D81k226P04J957n72j419J226J705j263k209Q17J752r60j439J323J908j111
5792F74j844J042J363j395j669J274J935r80j299J298J254j673j885J175J602
5807H72r88r70J704J349j742j743J006J240j246q21J883J389j573j478J110Q70
5823H62j563r29J830J418j358j173J350P00j703j039J637J181j325p40J596O83
5839A427j777j078J435P97j300m91J707Q51j689j051J330N36j545l19J878Q02
$$ plain form
5725 -1763 -1515 1265 1814 -316 -564 1163 592 -1952 -1810 843 1358 -506 -287 1607 928 -1672 -1588
5742 -1588 784 798 -1151 -544 1610 1145 -1079 -917 1045 576 -1665 -966 1237 1036 -909 -388 1425
5759 1425 492 -1746 -1059 1031 761 -885 -119 1677 551 -1768 -1131 1022 588 -907 75 1755 481
5776 481 -1745 -1041 916 344 -1075 151 1856 593 -1616 -799 953 -7 -1446 -123 1785 674
5792 674 -1170 -128 1235 -160 -1829 -555 1380 400 -899 399 1653 -20 -1905 -730 872
5807 872 -116 -1086 618 1967 225 -1518 -512 728 -518 -1339 544 1933 360 -1118 -8 862
5823 862 -701 -1630 200 1618 260 -913 437 1137 -566 -1605 32 1213 -112 -852 744 1427
5839 1427 -350 -1428 7 804 -496 -987 720 1571 -118 -1169 161 697 -848 -1167 711 1513
5855A513j640p03J169L56j720l57J825P53j331m75J384P7j861l34J671N47j301
5872d27r7J536Q6j800l87J369K01j244O5J671K04j617m16J299n1j360J69J628
5890H29J99j411j02J189k35j544J18J591O2j196K91J218l09j632J04J243l6j066
5908f87M16J432l74j452k2J017k19r69N36J393k64j392J35R10m05j096O12J303
5926H74l78r90L33Q24m59j156N39J054l27r54N15R99n14j087L33R77n24q75P37
5945g9R97n56q80L04O88n82p58P43R94m22q62L62N18o31o50P06Q14m08o58L78
5965A8M82o34n71M98Q35n36n89N81M99n70n59N30N67o30m71N78N17m93m52N71
5985A71K42n83m31N84N31l75m06M48K33o67l32N35M63l86j63L52J29o03l03N91
$$ plain form
5855 1513 -127 -830 339 695 -1025 -1382 443 1196 -135 -610 774 851 -1010 -1344 327 874 -427
5872 -427 -524 1012 1098 -702 -1089 280 481 -763 -698 973 1177 -440 -856 443 392 -968 -799 829
5890 829 1028 -383 -485 704 469 -1075 -957 634 696 -500 -209 1009 700 -932 -828 415 379 -687
5908 -687 -271 1161 787 -665 -687 330 111 -858 -322 1071 807 -585 -450 460 55 -1041 -429 874
5926 874 496 -494 -161 663 204 -952 -413 641 314 -640 -125 874 360 -727 -394 583 59 -816 -79
5945 -79 918 362 -518 -214 474 -108 -866 -123 871 449 -413 -51 467 -164 -814 -108 706 298 -360 18
5965 18 500 -134 -705 -207 628 92 -497 84 583 13 -546 -16 551 -79 -550 28 545 52 -400 171
5985 171 413 -170 -601 -17 514 139 -267 181 414 -253 -585 -50 413 27 -136 216 345 -258 -561 30
6005C0L23l85j80M06J76n74j50M49K28l81k07M33K2l53r6M37O1l56j31K63J61
6026A76l58P7K79Q3l22j67K87J17k53j8K85j4k55j21K25P4j41l8K71Lk26p9J19
6049DP3j15K1Q7J1j19o3J17J22j57L4j2L6r3j6L1J27m6q2P9rk7k7j4M6Q2l1r0
6077c1j5N9l6o7J21Q7r7m1o1J93l1j90R9J99j91o8j1K58j64n5J03J23q8k98J32
6102g0J89j18k06K48K71k01k78J05K41j49k12K78J96j94m10L21K59k74j89K24
6122C1K29l36k86L70L32k95k39K28K16m44k75M71M91l57m04L68J81m91l57O45
6142G8M51m42l44L29K26n43k65N88M77m63m84M95K74n39l20O83K96o30m47O58
6162G8L54n82j81O62K14q45l30O89M06n44j70P44j01q08l55R40L52n95q6N73M9
$$ plain form
6005 30 353 -32 -212 194 370 -204 -354 95 323 -58 -265 168 190 -163 -259 178 239 -117 -248 15 176
6026 176 -182 -105 174 257 -65 -232 55 172 -81 -99 186 172 -83 -204 21 95 -46 -84 187 190 -36 -115 4
6049 4 77 -38 -17 70 81 -38 -101 16 138 -19 15 3 39 -54 -70 -39 88 42 -40 39 30 3 -24 -38 8 90 59 -31
6077 -31 -46 13 -23 -90 31 118 21 -20 -81 112 81 -109 -10 189 -2 -70 -81 177 13 -42 61 184 96 -202 -70
6102 -70 119 1 -205 43 314 113 -165 -60 181 32 -180 98 294 100 -310 11 270 -4 -193 31
6122 31 260 -76 -362 8 340 45 -194 34 250 -194 -469 2 493 136 -268 100 281 -210 -567 78
6142 78 529 87 -257 72 298 -245 -510 78 555 92 -392 103 377 -162 -482 201 497 -133 -580 78
6162 78 432 -150 -331 331 545 -300 -630 59 465 -79 -249 495 394 -414 -769 171 523 -72 -158 415 464
6183D64j021k61R41M41o97j14P78l9j010k37R44L31p71j15Q78k4r51p8J029N3
6203E41j027j34R00J27q01J42J074j76j231k83J066J09p95L61J154k29j447j22
6221g71R71k3p25M22J200l45j339r7J072j53q67M32J126m21j250K61J050k00j044
6240g01M41J035m25j111M12J224m05j239K77J006l79r41P76J218o00j380K72Q21
6258C01m91p00J036J282o38j432K45O98o32q14J115J426p56j163L69Q05r23r24
6276a196J003J198p11j083Q87R52r07j095P46Q86q77q78J185J092q67r32O63O48
6294G14j234q28J337J293r12r46Q24M21j302o76J359J111q62q67Q37M94j433o61
6312a331J509R81j081p24J042M55j421o67J413P55j130n71J244O30j318p26J118
$$ plain form
6183 464 -557 -818 123 564 -133 -247 531 492 -518 -755 189 520 -251 -366 512 488 -463 -541 488 541
6203 541 -486 -620 280 407 -394 -252 822 646 -585 -868 198 307 -488 -127 1027 798 -649 -771
6221 -771 200 177 -548 -126 1074 729 -610 -707 365 212 -655 -223 903 482 -768 -507 543 343 -701
6240 -701 -260 775 350 -761 -349 875 470 -769 -492 514 135 -806 -30 1188 588 -792 -520 301
6258 301 -190 -890 146 1428 790 -642 -397 301 -331 -1145 -30 1396 640 -523 -154 651 -272 -1196
6276 -1196 -193 1005 294 -789 98 1050 143 -952 -206 680 -197 -1075 110 1202 335 -597 66 714
6294 714 -520 -1348 -11 1282 370 -576 248 669 -633 -1309 50 1161 299 -568 269 763 -670 -1331
6312 -1331 178 1159 78 -646 396 851 -570 -1237 176 931 -199 -770 474 1104 -214 -940 178
6329A78M95j344m88J580P92j150n49J070O0j648m61J642Q94j094j27J166r5j839
6347i18n73J555O11r72m5J418M8j747m91J399K50j307Q1J534J92j511k00J406
6365G30j19j462j08J503J93j313J91J352j67j704q8J552p4j092K63J460l13j757
6383i53m1J484Nj190M55J493m54j685p9J454k11j226O65J514l83j579J25J235
6401F29m87j222M81J661l27j415N06J217p23j563N70J387m49j051P37J466q92
6418E25j525L48J222o21j032J013J508p89j474M68J075r07j052J046J383p11j227
6435g50P28R60r96j163R74J242p84j053R51R39j018j188R22J092r25q93J112J032
6453A182j129j083J013Q32j055p81J151J060j076r42R21P44j224o97J185J025
$$ plain form
6329 178 673 -671 -1159 421 1213 63 -486 584 644 -1004 -1465 177 1071 -23 -150 1016 921 -918
6347 -918 -1491 64 675 -297 -342 1076 1124 -623 -1114 285 535 -772 -691 843 1035 -476 -676 730
6365 730 611 -851 -959 544 737 -576 -385 967 800 -904 -992 560 486 -606 -343 1117 804 -953
6383 -953 -994 490 495 -695 -240 1253 799 -886 -965 489 278 -948 -283 1231 848 -731 -606 629
6401 629 142 -1080 -599 1062 735 -680 -174 1043 320 -1243 -673 714 265 -786 -49 1417 525
6418 525 -1000 -652 570 -51 -1083 -70 1438 649 -825 -357 718 -189 -1241 -195 1188 477 -750
6435 -750 -22 938 -58 -1221 -247 995 211 -842 109 1048 30 -1158 -236 856 -69 -962 150 1182
6453 1182 53 -1030 -17 815 -240 -1021 130 1190 114 -828 93 837 -387 -1084 101 1126
6469A126j021q98J062O28j234p94J250Q57j129n70J122O18j303p63J200O59j059
6486b49n79J312N02j271n81J088M61j204l22J375M41j276m68J150L32j334l18
6503i41J324M28j153k87J194J90j283l75J259K88j066j99J200K49j291k86J164
6520D15J22j155n3J351J64j313j71J187k6j152J3J298mj138m5J131m3j302J23
6539e98J280r2j209K16J120k12j175J49J197k30j118K19J144k46j084K77J055
6556F93k22j167K43J087k49j065L40J065l90j020L22J080l52j083L67J011l58
6573C02r81M03R81l73r46L86R47n40r17N20Q61l83q50M02Q53n27q45M62R00m28
6593B27q66M76P63m60q15N96P55n84p46N98P31n95p37O04P44o45o44O01O61o86
$$ plain form
6469 1126 105 -793 269 897 -337 -1131 119 976 -153 -723 399 1017 -286 -1049 151 810 -249
6486 -249 -828 484 986 -285 -866 222 683 -521 -843 532 973 -303 -771 379 711 -623 -941
6503 -941 383 811 -342 -629 565 755 -528 -903 356 644 -422 -621 579 828 -463 -749 415
6520 415 537 -618 -671 680 844 -469 -640 547 521 -631 -618 680 676 -462 -507 624 581 -721 -598
6539 -598 682 590 -619 -403 717 505 -670 -521 676 446 -672 -453 691 445 -639 -362 693
6556 693 471 -696 -453 634 385 -680 -340 725 335 -685 -363 717 365 -718 -351 660 302
6573 302 -679 -276 705 332 -614 -228 719 179 -738 -218 643 260 -590 -188 665 138 -707 -245 655 227
6593 227 -639 -163 600 140 -675 -79 676 92 -654 -56 675 80 -657 -53 691 46 -598 3 664 -22
6613b2n78N39O73n97n45N68N45o15n54N92O25o30n29O32L75m43n97O71M57n92
6633b5n19N75M43n87m72P99L51o45m34N38M19n31l56N92L57o48l58N88K68n51
6653a96k83O76K71o27k50N25K63n44k07N48J86n82k15N92K62m93k05N33L6n54
6673b64j37N93K37n87m9M28J5n31p7N74K38n00j50L65L0m19o9N79J12n44j05L58
6695I7O1l32l8N34p3m45j38L81J12k69P1L45j19n22j2L28J44k19J07L01j49m97
6717c32N6K89J26j98K2K95j48l81N3L01N6j56o0J95r5k07J24K92q9k25o4K04j27
6740f9r3K60K06o5l01j62J36j32J08K68K41j78l25j28J9J4J02K24K09p0l15j55
6762b06j9P2J45O5R4p9q9L2r2RJ05q5Q4l6o1O2J07J31r8j44k08JJ32J02J66J72
$$ plain form
6613 -22 -600 -61 612 15 -530 38 583 -32 -586 6 631 1 -528 104 479 36 -561 110 567 -25
6633 -25 -544 31 474 -113 -585 214 565 -80 -514 24 443 -88 -444 148 505 -143 -501 87 355 -196
6653 -196 -479 197 468 -159 -409 116 379 -165 -372 176 362 -220 -435 157 419 -74 -279 254 290 -264
6673 -264 -401 192 429 -158 -207 221 236 -295 -372 202 440 -60 -210 155 185 -234 -303 276 388 -156 -261 97
6695 97 158 -174 -212 322 249 -196 -334 47 159 -110 -39 306 187 -335 -347 -19 125 -94 13 314 165 -332
6717 -332 -276 13 139 -59 -37 258 110 -271 -218 83 139 -17 -77 118 23 -184 -60 232 143 -82 -146 58 -69
6740 -69 -162 98 304 239 -62 -224 -88 -220 -112 156 397 219 -106 -234 -215 -201 -99 125 334 264 -51 -206
6762 -206 -225 -153 -8 57 151 72 -17 15 -77 -68 37 -48 36 0 -61 1 108 239 141 -3 -211 -210 -78 24 190 362
6788C62j10l69k62lJ84K47J74J08q0k77l52L9J70J39J38K70o5l80j89Q6J44j02
6810a28O7J39M8j91j14K83M5k15j88J40M3r8J43L91N1l98l69P2J30j11L14L92
6832D46J62m84m47R9Pj94L41N60R3m97k82J49n9k16J36N48J5l88j59L01K7m18
6854b60M6M15ol61M0N46m3m77p1K57k04k88J86P28P8n63j96K47k93m06L28P90
6876D93J41n71j89K76l25m36K08P84J17m92J9K52k82n56K30O40j38m72K33N17
6896D49j48o32J79M45l22n79L76P06n0n57K11L29n48o35M91P32p1n10L88J99p04
6917b51n42M56P09o3l74K88K82n21p18M79N96j72m65M84M18n56o23L97N46m88
6937a18l64N75M95l80n31L79L40n73n88O79N82l87l34M62M66r31o27N59P02m94
$$ plain form
6788 362 252 -117 -379 -382 -198 49 223 331 251 -26 -378 -339 -169 -30 108 378 313 -67 -256 -170 -26 -128
6810 -128 -61 78 126 -65 -179 104 149 -66 -254 -114 -71 -169 -26 365 416 18 -351 -279 -149 -260 54 446
6832 446 608 124 -323 -224 -217 -411 -70 490 583 86 -196 -47 -106 -322 -186 362 377 -11 -170 131 158 -260
6854 -260 -214 201 195 -166 -126 420 377 -100 -171 86 -118 -406 -220 508 586 23 -173 74 -219 -625 -297 493
6876 493 634 63 -126 150 -175 -611 -403 381 498 6 25 277 -5 -561 -331 309 171 -301 -68 449
6896 449 301 -331 -152 293 -29 -608 -232 474 424 -133 78 407 -141 -776 -285 447 376 -134 254 453 -251
6917 -251 -793 -337 372 309 -65 223 505 -16 -734 -255 341 169 -296 188 606 50 -573 -176 370 -118
6937 -118 -482 93 588 208 -323 56 396 -177 -765 -86 496 109 -225 237 703 -228 -855 -296 406 -88
6957h8j84P54K83q78n54M83M48m78k40Q39L42p38n49N72L81p08l15Q41L80p09
6977a18l49P40K47q56l74Q48L62o61k25Q10J64r09k60O87L03o60j77R47J06q75
6997b50l03P26J57o96m6R57J35r09k38O62J15p74l6J020P1q11k00Q70o4r47oR70
7019D03J06q86K7Q90m2j048J2Q81l1q69J97R88j17r95Q8P97j37r26K44J029j16
7040D95r35J78Q16k49r21K17R12j69q41K21R00l08q91K58Q71k15q83L13Q62l17
7060C14r26L28Q73m25p89L75R08l81q34L26Q04l85p75L96Q12m14p95M36O56l86
7080A18p87N32P79n07p45N89O73o25p11O07O86n38o50N36P20o24p21O19P09o27
7100C3o81O74O29o50o74O12P00o85n87O44O32o89n63O27O52p67n80P34O13p23
$$ plain form
6957 -88 -272 482 765 -113 -667 -184 264 -214 -454 385 727 -11 -560 12 393 -315 -630 211 591 -118
6977 -118 -467 273 520 -336 -710 138 500 -161 -386 424 588 -321 -581 106 409 -251 -428 519 625 -250
6997 -250 -553 173 330 -366 -412 545 680 -229 -467 195 310 -464 -500 520 591 -220 -420 450 386 -561 -567 403
7019 403 509 -377 -350 540 498 -550 -538 343 312 -557 -360 628 511 -484 -396 401 264 -662 -418 611 495
7040 495 -440 -262 554 305 -616 -399 513 344 -497 -276 624 316 -575 -317 554 339 -544 -231 631 314
7060 314 -612 -284 589 164 -625 -250 658 277 -557 -231 573 188 -587 -191 621 207 -588 -152 504 118
7080 118 -669 -137 642 135 -610 -21 652 27 -684 -77 609 71 -579 -43 677 53 -668 -49 660 33
7100 33 -648 26 655 5 -669 -57 643 -42 -629 15 647 -42 -605 22 674 -93 -673 61 674 -49
7120d9n62O73N96q14n15P92M85p19m44P15M62p41m94P88M29p96m01P71M34q41
7140b31l07P34M49q21l77P54L36p93l06Q35K73p97l30Q59M09j007k37Q39L36r20
7160c02k22Q90K06q30k47Q50J50r03j78J009J06p96j99Q87Q7r65o7Q71J21q18
7180c50l5Q17N7q75j11R20M3q93M3Q04N3q32n3Q70m4q27QQ87j13q31J50Q07m7
7203D48r25Q3Q10j03p82K08P86j54p98J41O82k17o52K50P43j96p55J28P59j90
7223B66p14K39P40k84p46K28Q04k63p52L59N76l06o66K81P29k25p10L31N93m49
7243C1n94L83P10l05o45L48N61m53n82M11O80l73o15L46N48m19n33N03N11l78
7263A35n86L99N41m87m17M45M89m63o09M08N84m45l81M64M16n68m39M33M58k83
$$ plain form
7120 -49 -611 62 658 -156 -671 121 606 -113 -557 158 620 -121 -615 173 602 -194 -595 176 610 -231
7140 -231 -538 196 645 -176 -553 201 537 -256 -562 273 546 -251 -581 278 687 -320 -557 282 618 -302
7160 -302 -524 366 572 -258 -505 345 495 -408 -586 423 529 -267 -466 421 508 -457 -524 347 468 -350
7180 -350 -385 432 489 -386 -497 423 466 -427 -384 420 473 -359 -412 458 414 -413 -405 482 369 -462 -312 495 448
7203 448 -477 -394 416 313 -469 -261 525 371 -427 -286 396 179 -473 -223 520 324 -431 -303 456 266
7223 266 -448 -209 531 247 -499 -271 533 270 -482 -123 453 147 -519 -238 491 266 -444 -113 480 31
7243 31 -563 -180 530 225 -420 -72 489 36 -546 -135 545 172 -443 -97 451 32 -501 2 513 135
7263 135 -451 -52 489 2 -415 30 519 56 -553 -145 439 -6 -387 77 493 -75 -514 -81 377 94
7283I4l76M28K85n36m98M85M21l27k18M18K20n96k99M62L67m44k39N29K19n68
7303a73k61M86L11m62l55N31K97n09j10N76J87o17l18M29J19k85j33O78J35n91
7323f5l67L57K22m22L3P37M2n92k93L00J94l96k1O09M6m88k26M53J07l93j05M53
7345A85M5m97L1M80N9m62o2L07j0l47M0N75J26n34j40J91ol66J98N73J16m75j39
7368a12K02j01l63K20M99R1m18p0J72j59l04J51M31k2l25nL22n6m15J76K75j66
7390B3k63R7M45n3l03j8K11k57k97J71M52L5j58O0K8l72k37J39M55J18j59J0O9
7413A96l50j99J30L05M7r2J3J45j88k91J34K03L2j87J24J44r9j01J09k3r8j58
7435b04R1J93j4J1Q3k3k23k69J23J94P1J39Q2o9k32k57OJ71J95K7J48r7r9k28
$$ plain form
7283 94 -282 146 431 -105 -603 -118 303 -24 -242 176 396 -200 -499 -37 330 -114 -353 176 395 -173
7303 -173 -434 52 363 -99 -454 77 374 -135 -245 331 518 -99 -417 12 131 -154 -287 391 526 -65
7323 -65 -432 -75 147 -275 -242 495 537 -55 -348 -48 146 -250 -271 338 384 -104 -330 123 230 -163 -268 185
7345 185 230 -267 -236 244 303 -159 -221 86 76 -271 -231 344 470 -64 -204 -13 -19 -385 -187 386 502 27 -112
7368 -112 90 -11 -374 -154 345 436 18 -52 120 -39 -343 -192 239 217 -108 -113 209 153 -262 -86 189 23
7390 23 -240 -143 302 249 -54 -72 139 -118 -415 -244 208 243 85 145 173 -199 -436 -297 158 276 117 127 196
7413 196 -154 -353 -223 82 129 37 50 195 7 -284 -150 53 85 -102 22 166 67 -34 75 52 -46 -204
7435 -204 -113 80 66 77 160 137 -86 -355 -232 -38 33 172 254 185 -47 -304 -298 -127 68 95 243 146 47 -181
7459a81j6R4J13J3P3J8nj01m4L4q9N6l8N7Q2L7j4Q6j52j54m3p1K84J27J13j08
7485A71j50j34j45mJ79J49P9K0m2j13k51L3J22J37L4P3j0j28j42n3J44m1K4K2
7509b6J26k2o2l1Q9o9k12J14Q3J58r0M0K2l8l05K5J46J56j3l4J72q4l30o9K41
7534a3Oj7R9K20j56k91L8J33Mj22Q4K77q9l78J33J96j05k59J71J81Rj87J27J18
7558A79p7l02M9L16p3j98R9K62j56l46O0K68o4k18K34L03j53l54Q4K22j65k30
7580b60K26L34k18l21K26K18j74k67K21K91k81k39L22J91k53k39K02K52j90k88
7600b47K87K35l06k39K44K74l15k20L36K22l00l15L10K83l56j96K79M15l41l43
7620b93L26K48l42k36L85K26l57k70L98J79m07j26L80J78m23j72M55K41m83k38
$$ plain form
7459 -181 -197 -103 10 23 96 114 109 8 -36 -2 -91 -35 -73 -16 66 103 89 175 23 -131 -174 -245 39 166 279 171
7485 171 21 -113 -258 -262 -83 66 145 165 123 10 -241 -208 -86 51 85 158 148 20 -122 -175 -31 -72 -48 -26
7509 -26 100 78 16 -15 74 5 -207 -93 -10 148 58 98 120 82 -223 -198 -52 104 91 57 229 145 -185 -254 -13
7534 -13 -7 -24 75 295 139 -152 -114 19 23 -99 -15 262 173 -205 -72 124 19 -240 -69 112 121 -66 61 179
7558 179 102 -200 -151 165 92 -106 -7 255 99 -247 -187 81 17 -201 33 336 183 -171 -87 135 -30 -260
7580 -260 -34 300 82 -239 -13 205 31 -236 -15 276 -5 -244 78 269 16 -223 -21 231 41 -247
7600 -247 40 275 -31 -270 -26 248 -67 -287 49 271 -29 -344 -34 249 -107 -303 -24 391 50 -293
7620 -293 33 281 -61 -297 88 314 -43 -313 85 264 -143 -269 111 289 -134 -306 149 390 -93 -331
7640c31M14K07l63j84M42J40n61n1M59K27n73j56N11O6n34k4M37J73m55j61M49
7661A32J49n17n5M28J11m92n6N81R8n55j48N57P9o01k4N96J8n77kN54k1n60m0
7684c45O03J3m82k9N81n9n92QN51K7n47O0N94q2n76k3N97q7n42J21O37j38o23
7707c33J31N50j48o12J67O94j88o10J13O09j83o23K13N87j53o20L33M72k62o03
7727d66K51O06k81n12K67N34k47n67L32N16l87m71L05O11l03n64L23M43l45n12
7747d67L19P10l92n63L39N03l49o04L68O08m72m15M69M13m21n50M62N07m23m98
7767d56M46N43n36n23N74M48n00m11M06M83n74l40N22L88m62m76M46M00m97l00
7787d19N30M07o14m31N93M08n42l04M60L77n98l61N19L74n42l35O27K83o21l45
$$ plain form
7640 -331 83 290 -73 -257 185 325 -236 -287 172 399 -174 -330 181 247 -287 -311 126 299 -156 -317 132
7661 132 281 -236 -291 137 248 -244 -300 281 379 -176 -324 233 312 -289 -313 283 301 -276 -278 276 255 -305 -345
7684 -345 258 271 -211 -240 341 282 -310 -302 249 276 -271 -211 383 301 -275 -298 299 212 -330 -209 428 290 -333
7707 -333 -202 348 200 -412 -245 449 261 -349 -236 373 190 -433 -220 367 214 -406 -73 399 137 -466
7727 -466 -215 391 110 -402 -135 399 152 -415 -83 433 46 -425 -120 491 188 -376 -53 390 45 -467
7747 -467 -148 562 170 -393 -54 449 100 -504 -136 472 0 -415 54 467 46 -504 -42 465 42 -456
7767 -456 -10 533 -3 -526 48 496 -4 -415 -9 474 -100 -440 82 470 8 -468 -22 378 -119 -419
7787 -419 111 518 -96 -527 66 474 -68 -372 88 465 -133 -494 25 399 -143 -478 149 432 -189 -534
7807e34P18L46o62l12N51K59n59k81O51L20o06k91N80J90o92j35P21J56o53j09
7827c42N39J74p00r8O69J53n96j76O11J23o06p7O58M9o70j37P23M9n85l2O36q7
7849B78o79r5Q16pn25j6O59j29p61pO66J54o39P1O75q8q18J18N87J7n69P4P01
7872D83k38o19O1O67o4o89J88N43j56n91K46O57k06p29J16O46k18m86L36M80k02
7893B25p03J74N70j70m98M06O20l88o51M7N94j67m81L89N53l01o30K33M96k92
7913B6m74L90N11l45n39L77M48l23n74L78M31l46l84N05N67m67n86K77L68m21
7933a81k80N27N31l67n23K30L76m60l88O35M37m38m23K86L43m77k18N55L25m69
7953B1l50M31J87l67k98L89M05n06l42N87K55m97k28M62N3l96k69O13L37l98l50
$$ plain form
7807 -534 184 530 -132 -444 107 366 -193 -474 177 497 -109 -400 180 370 -322 -457 264 420 -233 -342
7827 -342 197 371 -329 -427 242 395 -201 -377 234 357 -249 -326 332 381 -289 -426 297 346 -239 -271 365 278
7849 278 -401 -496 320 313 -212 -228 431 302 -459 -466 200 354 -285 -214 461 373 -445 -327 260 277 -292 -218 483
7872 483 245 -374 -313 354 290 -399 -211 332 176 -415 -169 488 282 -447 -331 315 97 -389 -53 427 225
7893 225 -478 -304 266 96 -402 4 624 236 -415 -368 226 59 -422 -33 520 219 -411 -178 318 26
7913 26 -448 -58 453 108 -431 -54 394 71 -503 -125 306 -40 -424 81 648 181 -405 -128 240 -181
7933 -181 -461 66 597 230 -293 -63 313 -147 -535 100 537 99 -324 -38 305 -172 -390 165 490 21
7953 21 -329 102 289 -78 -376 13 418 -88 -430 157 412 -85 -313 149 202 -194 -463 150 487 89 -261
7974b61M21N6n91j39O51L60m17k49L60j2n99j01N72L44l94r9L44M5n76j16N20
7995A19J78m33q6M31O4m30j06M42km21j41N11J77l36o6M47k18m78m3M62J24k93
8017i8N1L97j10n71n4M74R2l23P4M13r2n50q0N22J9l32L4M46q7m68P0K88L1l74
8041b28R4L66p3l17J36K83j36l99J21K23M1k14R8L63k58l81QL67k8j93J76L15
8063C64j78l98l1L10q4j77K23K85j45k85k7K37o0k53J63K68j22k21Q4K37j11l61
8085b82K67J56j22j88J84J68j49k31R7J97j27j72K22K57j86k78J50J68k10r9K89
8106A11J56j54k68R7J53j24j28J92Q5n5j21M0J22j34j59K13J17j31j68J56J40
8127A40j70m3J53k6q6o1Q9J22m9j24J06jj19k7P8K14k32q2J04M9n9m1O6N8k0o9
$$ plain form
7974 -261 160 216 -375 -514 137 497 80 -169 191 179 -420 -521 51 395 1 -98 246 291 -285 -401 119
7995 119 297 -136 -222 209 273 -157 -263 179 177 -244 -385 126 303 -33 -99 348 130 -348 -391 71 195 -98
8017 -98 -47 350 240 -331 -385 89 181 -142 -68 345 253 -297 -377 145 164 -168 -134 312 225 -243 -173 115 146 -228
8041 -228 -134 232 159 -158 -22 261 125 -274 -153 70 111 -103 -5 358 100 -281 -273 94 66 -127 49 364
8063 364 186 -212 -243 67 -17 -194 29 314 169 -116 -143 94 34 -219 -56 212 90 -131 -47 190 79 -282
8085 -282 -15 141 19 -169 15 183 34 -197 -100 97 -30 -202 20 277 91 -187 -37 131 -79 -178 111
8106 111 267 113 -155 -58 95 -29 -157 35 120 65 -56 -16 106 -28 -187 26 143 12 -156 0 140
8127 140 -30 -73 80 54 -32 -93 -4 118 69 -55 51 50 -69 -96 -18 196 -36 -118 -14 35 -24 -65 1 59 39 -30
8153c0K4O2r3p1J09P4j06K9M0%q2m2J22kk8l4J00k6o5n5J13P3n9o2R4j18L8rn6
8182f0J06m7k0l2l8R1j02N6k6
$$ plain form
8153 -30 -6 56 -37 -108 1 75 -31 -2 38 38 -44 -86 36 34 6 -28 72 46 -19 -74 39 112 53 -9 85 -33 5 -4 -60
8182 -60 46 -1 -21 -53 -91 0 -102 -46 -72
8191g2
$$ Imaginary data points
##PAGE= N=2
##DATA TABLE= (X++(I..I)), XYDATA
0@%%%%%%%%%Qj6J7j8K5m0M9n8P4r0J07j25J50j82K15k50K92l41L98m63N30o05
31c23O90p83Q89j006J134j275J430j603J792j992K210k456K725l016L332l679
47a931M062m477M929n430N983o594P274q032Q886r854J0959j2240J3744j5533
61h254J7707k0423K3925k8626L5308m5645O3897j05542L68816M4807o85100J86083
73a53047K22341k75091k70603N21238M60858k90143m32883K35141K36617l45816
83i1388l06097L72424L08786l22504k73506L84869L04642l29804k89355L01529
93E9596J74828m15752k48898M45625L52889k96658k60022K90337J50929m14620
103a61746k31419M23368L13631l07758k55452K62762J39063l48265j35347M33359
$$ plain form
0 0 0 0 0 0 0 0 0 0 0 8 -8 9 -9 16 -24 25 -33 41 -49 58 -67 83 -99 116 -134 158 -183 215 -248 282 -323
31 -323 367 -416 473 -533 601 -674 756 -847 945 -1047 1163 -1293 1432 -1584 1748 -1931
47 -1931 2131 -2346 2583 -2847 3136 -3458 3816 -4216 4670 -5184 5775 -6465 7279 -8254
61 -8254 9453 -10970 12955 -15671 19637 -26008 37889 -67653 301163 345970 -339130 -153047
73 -153047 69294 -205797 -476400 44838 505696 215553 -217330 17811 254428 -91388
83 -91388 -397485 -25061 283725 -38779 -312285 72584 377226 47422 -241933 59596
93 59596 234424 -181328 -430226 15399 368288 71630 -188392 101945 252874 -161746
103 -161746 -393165 30203 343834 36076 -219376 43386 182449 -165816 -301163 132196
113A32196K47662l47084k47261K38106Q1394l48047o4264M72796K20074l57650
123B7922j97901K73966N4519l93840r5786M29648J75317l43070j17475L56452
133A69752J05731l70159j31869L10217N4764l61085n5479M12351J58071k83129
143I165p5881K48905o3773m13284m3848M04970J43169k36591N208K80280q1739
154A76581m22106m9923L60755Q4208k58467J7596L04098l2636l51759j9332L18979
165A27994K2942k89940n961K75776j4875k70946M2258K97099k9786k99945M541
176a40843K56156l5255k43003Q2074K83599p4031l06315L5148K73329l5484k33211
187a37836Q7813K58100j06817l10633M5433K76397k0589j99348R7472K26867j26078
$$ plain form
113 132196 379858 32774 -214487 23619 105013 -243034 -307298 165498 385572 27922
123 27922 -169979 103987 158506 -235334 -331120 98528 273845 -69225 -186700 169752
133 169752 275483 -94676 -226545 83672 138436 -222649 -278128 134223 292294 9165
143 9165 -66716 182189 118416 -294868 -338716 66254 209423 -27168 -21960 258320 176581
154 176581 -245525 -295448 65307 149515 -108952 -91356 212742 180106 -171653 -190985 127994
165 127994 150936 -139004 -144965 130811 115936 -155010 -112752 184347 154561 -145384 -140843
176 -140843 115313 80058 -162945 -80871 202728 128697 -177618 -142470 130859 95375 -137836
187 -137836 -50023 208077 101260 -209373 -163940 112457 91868 -107480 -10008 216859 90781
198I0781k90454N2529K40248m4215j73833J21399K12687j28235k46744Q2906K06251
209A23320r7758j90050J24803K08376j14659j99851J19664J98991j25177k13637
219a65978R6542J84566j01178j58087J40830J92413j22220k01751P8412J45026
229H8575j07018j27943J50538J69735j24554j68845R5324J23425j24872j17958
239a43593J53646J47104j37668j48037J19911J25091j30480j17804J44432J28331
249A40933j39774j31558J27592J20760j24177j08016J29472J02624j34007j02190
259a18341J32578J00157j26008q9450J24727P4843j36767p3902J45180Q3829j34521
270a7675p8250J26614O0539j40334o2752J47763P7258j31274p1025J20787N3725
$$ plain form
198 90781 -199673 -147144 93104 48889 -124944 -3545 209142 80907 -165837 -82931 123320
209 123320 25562 -164488 -39685 168691 54032 -145819 -26155 172836 47659 -165978
219 -165978 -69436 115130 13952 -144135 -3305 189108 66888 -134863 -56451 88575
229 88575 -18443 -146386 4152 173887 49333 -119512 -24188 99237 -25635 -143593
239 -143593 10053 157157 19489 -128548 -8637 116454 -14026 -131830 12602 140933
249 140933 1159 -130399 -2807 117953 -6224 -114240 15232 117856 -16151 -118341
259 -118341 14237 114394 -11614 -101064 23663 98506 -38261 -112163 33017 116846 -17675
270 -17675 -95925 30689 91228 -49106 -111858 35905 113163 -18111 -89136 31651 85376
281H5376j30701n5356J32747O2814j19046n3990J12896M0865j18244l8494J19323
292C8190L8074j15392l2973J14180K7551j14951k3959J16772K2168j18184k3228
303g1752J16117K3199j12119j9342J11276J7761j10899j9233J06163J7926j00130
314d1033j2756R8092R087r6729p217R3126L825q9794J530Q9070n490q9565P156
327d0698Q8988q215q7422J0081Q6517j1604q6675J0793Q5277r613q1516J0052
339c4035P8420j0961p6330R776P2061j0104o6682J3091O4068j5498o2544J5555
351b3183N8701j7627n5538K1452N5560k2742n5658K2046N3811k2458n2628K2772
363a5492N2251k1480n0524K0351M8526j9245m6271J7385M2806j6491l8880J7060
$$ plain form
281 85376 -45325 -100681 32066 94880 -24166 -78156 34740 75605 -42639 -81133 38190
292 38190 76264 -39128 -72101 42079 69630 -45321 -69280 47492 69660 -48524 -71752
303 -71752 44365 67564 -44555 -63897 47379 65140 -45759 -64992 41171 59097 -41033
314 -41033 -53789 44303 53390 -43339 -50556 42570 46395 -43399 -41869 47201 41711 -47854 -40698
327 -40698 48290 40075 -47347 -37266 49251 37647 -49028 -38235 47042 37429 -44087 -34035
339 -34035 44385 33424 -42906 -33130 38931 28827 -37855 -24764 39304 23806 -38738 -23183
351 -23183 35518 17891 -37647 -16195 39365 16623 -39035 -16989 36822 14364 -38264 -15492
363 -15492 36759 15279 -35245 -14894 33632 14387 -31884 -14499 28307 11816 -27064 -10004
375a0004L6252j6555l2824J6661K9241j8641k7814J9300K6692j8441k3364K0523
387A026K2564k2456k5155J9136K3866j6342j9589J8726K0865j7910k3656J0847
399h078J8478q696j2810J2262J4641r808j4943L507P630n054l714Q841O144o809
413A591n163M606K064o331k854M849K227l368K69O415M288l311q122o968m31N807
429d432N492K676N630N952q044k0525q725J3303J2685j131K997J3333k523k6071
443i383j5191J4218J4055m535J437J7112N54k4576j0957J6719O523j5846k78K2867
457A2719K417k3351l96K6925q22l4862q822K8344P302k1729Q429L9358k059n0365
471a6912k0481K7708R972j8387J6772M7322l337n6900k2928K6601M524k1197K2964
$$ plain form
375 -10004 26248 9693 -23131 -6470 22771 4130 -23684 -4384 22308 3867 -19497 1026
387 1026 23590 1134 -24021 -4885 18981 2639 -16950 1776 22641 4731 -18925 -8078
399 -8078 10400 1704 -11106 1156 15797 5989 -8954 -5447 2183 -2871 -6585 2256 8400 1591
413 1591 -3572 1034 3098 -3233 -6087 -1238 989 -2379 -2110 4305 8593 5282 -2840 -9808 -10239 -4432
429 -4432 1060 3736 9366 15318 7274 -13251 -21976 -8673 4012 2881 5878 19211 16688 -9383
443 -9383 -24574 -10356 3699 -836 601 17713 18267 -6309 -17266 -547 5976 -9870 -10148 12719
457 12719 15136 -8215 -8611 18314 17492 -17370 -26192 2152 9454 -12275 -3846 35512 33453 -16912
471 -16912 -37393 -9685 287 -18100 -1328 45994 42657 -14243 -37171 -10570 -6046 -27243 -4279
484d279N2818o909n7994j2938L3850m835l5368K0586N6224q388n6033J934M7871
497B6539r114n1416Q766N0709j0701m9237J9661O2321r325o1377l546L7041j9675
510i354m1275M0362P5546j1695o7584p106K7668l2561m1496N4954Q5850j4977
522E8332p0421j469L0399m0894n0139N4164Q5421j8635o6948J2866M2543m1085
534e866n7763M3275O9245l1367o0693L6269O1558l5812n9545L4082M5913n5695
546a6399n9958O0890Q3064k9683n7711L2419K9813p8175o5457P4612R5380k6263
558D2532n3909L6745K4562q8023o6412P7847R1104l2363m9285M5004K5824q6787
570c3161n8154P9470P4366n0225m8076N8193L4734p9790m7894P9065N2820p4375
$$ plain form
484 -4279 48539 41630 -16364 -29302 4548 -287 -35655 -15069 41155 32767 -23266 -21332 26539
497 26539 17425 -33991 -25225 25484 14783 -34454 -14793 47528 38203 -23174 -26720 10321 -9354
510 -9354 -50629 -10267 65279 53584 -14000 -21106 6562 -25999 -67495 -12541 73309 58332
522 58332 -12089 -13558 16841 -24053 -74192 -20028 65393 46758 -20190 -7324 35219 -5866
534 -5866 -63629 -20354 48891 17524 -43169 -6900 54658 18846 -40699 -6617 39296 -16399
546 -16399 -76357 -15467 67597 37914 -19797 12622 42435 -35740 -101197 -26585 68795 42532
558 42532 -11377 25368 49930 -38093 -104505 -26658 64446 32083 -17202 27802 53626 -33161
570 -33161 -91315 -11845 62521 12296 -35780 22413 57147 -22643 -70537 8528 61348 -13027
582a3027n0785P4520N2086o6609l8748P3854K8869r9411n6139Q6579O8605m9135
594A0659k3402P3234P747j22158o2597Q9755P0513m1568n383Q5720J871j32205
606d7814o2239Q8390N4068n7616j763J00725J3081j19724m4820R1598L0561q8833
618d4386j7255J00390K2535r5164j2477J04906J4143j14102l4507Q7336J6127
629B7546p9825J7328J19383N146j25053l6678Q1728O559p7741K9835J21618n925
641H3921j29233k7781Q8888O287p6195L2493J14124j8955j31304j8506R3932M032
653B1703p5361L5412J09807k4309j22878l219R3835j3185q9912L0866J06585k2342
665D7002j01585K7875J04583l1364j15651J2313R0942k8978q2953O3793J27490
$$ plain form
582 -13027 -63812 10708 62794 -3815 -42563 31291 60160 -39251 -95390 -8811 59794 10659
594 10659 -12743 60491 68238 -53920 -116517 -26762 43751 2183 -3200 82520 84391 -47814
606 -47814 -110053 -21663 32405 -25211 -26974 73751 86832 -32892 -77712 13886 44447 -44386
618 -44386 -61641 38749 61284 -33880 -46357 58549 72692 -41410 -75917 11419 27546
629 27546 -52279 -34951 84432 89578 -35475 -72153 9575 16134 -61607 -31772 89846 83921
641 83921 -45312 -73093 15795 22082 -54113 -21620 92504 73549 -57755 -76261 17671 21703
653 21703 -53658 -18246 91561 67252 -55626 -58845 34990 21805 -68107 -37241 69344 47002
665 47002 -54583 -26708 77875 46511 -69140 -56827 34115 5137 -77816 -14023 113467
676A13467l2106j25210j080O8135n0318q2884P9748J38673k5438j10008J3687
687a3334O3022o8100r3714P1406J21109l6318r3419M4639Q1369o3534r3187O0200
699a9861R1408o3438r4394O2255R8118m9141p8930O1811P4338q1058r7311O5072
711c1131R5881m9044p1120O5646O8809q1515q4512P5122Q9477o1449p6645O1216
723G35N9057q3194o8387R3732R2826o7037p7566N8772M6721r4866o6346R9925
735e628R1275o6488o4297P2617M7016j00102o9084Q9318O8449p9362n2017R3821
747B5518O0000q8647n6510Q3313L9087j05085n4644J00930O5102p4974l3611R3553
759E4032K8151j18342n9441R2780N1645p7206k1424J03401L1689j09086m7935
$$ plain form
676 113467 81361 -43849 -44929 23206 -27112 -109996 -30248 108425 82987 -27021 -13334
687 -13334 49688 -18412 -112126 -40720 80389 44071 -49348 -4709 76660 13126 -80061 -19861
699 -19861 71547 8109 -86285 -24030 74088 24947 -53983 7828 82166 1108 -96203 -31131
711 -31131 64750 15706 -55414 10232 79041 -2474 -86986 -11864 77613 16164 -60481 735
723 735 59792 -23402 -91789 1943 94769 27732 -49834 8938 55659 -39207 -105553 -5628
735 -5628 85647 19159 -45138 27479 74495 -25607 -94691 -5373 63076 -16286 -68303 25518
747 25518 85518 -3129 -59639 23674 62761 -42324 -96968 3962 69064 -5910 -39521 54032
759 54032 82183 -36159 -95600 -2820 48825 -28381 -49805 53596 85285 -23801 -71736
770g1736Q9394L4208q9601k4729R8468K8068r6944k6268R8241K7294r6100k7226
782e6931Q8956J5302r6674j3816J04886K4436r4344j9106Q9815P562r9966j1316
794f1196J00302J3915r5146q618R6622P689r4609l666R4182k445j01636l587R6870
807C8677M212q6490J1327R5783j2594j04055Q64R0949q351q6672K1057R8503j4504
820D8706r6324J0919Q7151k0533r0793K1656R2637j8428q6561K3714Q7536k5282
$$ plain form
770 -71736 17658 51866 -37735 -62464 36004 64072 -32872 -59140 39101 66395 -29705 -56931
782 -56931 32025 47327 -49347 -63163 41723 66159 -28185 -47291 42524 50086 -49880 -61196
794 -61196 39106 53021 -42125 -50743 45879 53568 -41041 -44707 49475 47030 -54606 -58193 38677
807 38677 42889 -43601 -32274 63509 50915 -53140 -52276 38673 30322 -56350 -35293 63210 48706
820 48706 -47618 -36699 50452 29919 -60874 -39218 53419 34991 -51570 -27856 59680 34398
$$ [...]
8191A01
##END NTUPLES=NMR FID
##END=
