##TITLE=1H ikalashn
LY-OP.2
18.4.2024
##JCAMPDX= 6.0         $$ Bruker NMR JCAMP-DX V2.0
##DATA TYPE= NMR FID
##DATA CLASS= NTUPLES
##ORIGIN= UXNMR, Bruker Analytische Messtechnik GmbH
##OWNER= root
$$ TOPSPIN		Version 1.3
$$ 2024-04-18 13:59:29.953 +0400  Irina@DPX200
$$ Compression mode = diff/dup
##.OBSERVE FREQUENCY= 200.131300845
##.OBSERVE NUCLEUS= ^1H
##.DELAY= (6, 6)
##.ACQUISITION MODE= SIMULTANEOUS
##.ACQUISITION SCHEME= undefined
##.AVERAGES= 8
##.DIGITISER RES= 18
##SPECTROMETER/DATA SYSTEM= spect
##.PULSE SEQUENCE= zg
##.SOLVENT NAME= CDCl3
##.SHIFT REFERENCE= INTERNAL, CDCl3, 1, 16.50952
##AUDIT TRAIL= $$ (NUMBER, WHEN, WHO, WHERE, WHAT)
$$ ##TITLE= Audit trail, TOPSPIN		Version 1.3
$$ ##JCAMPDX= 5.01
$$ ##ORIGIN= Bruker BioSpin GmbH
$$ ##OWNER= Irina
$$ $$ F:/spectra/data/iren/nmr/1H/4/audita.txt
$$ ##AUDIT TRAIL=  $$ (NUMBER, WHEN, WHO, WHERE, VERSION, WHAT)
(   1,<2024-04-18 13:58:56.421 +0400>,<Irina>,<DPX200>,<TOPSPIN 1.3>,
      <created by zg
	started at 2024-04-18 13:58:18.468 +0400,
	POWCHK disabled, PULCHK disabled
       configuration hash MD5:
       BE 6D 3F 07 2A EA 11 49 91 17 2B D3 AF B3 58 0D
       data hash MD5: 16K
       76 D2 FC 5A BE 7C 71 E1 75 A0 C7 CB 90 9E CC FA>)
$$ ##END=
$$ 
$$ $$ hash MD5
$$ $$ 92 04 BD 70 17 7A 75 D8 1C A4 DC A7 31 1A 19 1E
##$RELAX= 
##$RELAX= 
##$RELAX= 
##$RELAX= 
##$RELAX= 
##$RELAX= 
##$RELAX= 
##$RELAX= 
$$ Bruker specific parameters
$$ --------------------------
##$DU= <F:/spectra>
##$EXPNO= 4
##$NAME= <1H>
##$PROCNO= 1
##$TYPE= <nmr>
##$USER= <iren>
##$AMP= (0..31)
100 100 100 100 100 100 100 100 100 100 100 100 100 100 100 100 100 100 
100 100 100 100 100 100 100 100 100 100 100 100 100 100 
##$ANAVPT= -1
##$AQSEQ= 0
##$AQ_mod= 1
##$AUNM= <au_zg>
##$AUTOPOS= <>
##$BF1= 200.13
##$BF2= 200.13
##$BF3= 200.13
##$BF4= 200.13
##$BF5= 200.13
##$BF6= 200.13
##$BF7= 200.13
##$BF8= 200.13
##$BYTORDA= 1
##$CFDGTYP= 0
##$CFRGTYP= 5
##$CHEMSTR= <none>
##$CNST= (0..63)
1 1 145 1 1 1 1 1 1 1 1 1 1 1 1 1 1 1 1 1 1 1 1 1 1 1 1 1 1 1 1 1 1 1 
1 1 1 1 1 1 1 1 1 1 1 1 1 1 1 1 1 1 1 1 1 1 1 1 1 1 1 1 1 1 
##$CPDPRG= <>
##$CPDPRG1= <>
##$CPDPRG2= <>
##$CPDPRG3= <>
##$CPDPRG4= <mlev>
##$CPDPRG5= <mlev>
##$CPDPRG6= <mlev>
##$CPDPRG7= <mlev>
##$CPDPRG8= <mlev>
##$CPDPRGB= <>
##$CPDPRGT= <>
##$D= (0..63)
0 2 0 0 0 0 0 0 0 0.06 0 0.03 0 0 0 0 0.0002 0 0 0 0 0 0 0 0 0 0 0 0 0 
0 0 0 0 0 0 0 0 0 0 0 0 0 0 0 0 0 0 0 0 0 0 0 0 0 0 0 0 0 0 0 0 0 0 
##$DATE= 1713434333
##$DBL= (0..7)
120 120 120 120 120 120 120 120 
##$DBP= (0..7)
150 150 150 150 150 150 150 150 
##$DBP07= 0
##$DBPNAM0= <>
##$DBPNAM1= <>
##$DBPNAM2= <>
##$DBPNAM3= <>
##$DBPNAM4= <>
##$DBPNAM5= <>
##$DBPNAM6= <>
##$DBPNAM7= <>
##$DBPOAL= (0..7)
0.5 0.5 0.5 0.5 0.5 0.5 0.5 0.5 
##$DBPOFFS= (0..7)
0 0 0 0 0 0 0 0 
##$DE= 6
##$DECBNUC= <off>
##$DECIM= 32
##$DECNUC= <off>
##$DECSTAT= 4
##$DIGMOD= 1
##$DIGTYP= 9
##$DL= (0..7)
0 120 120 120 120 120 120 120 
##$DP= (0..7)
150 150 150 150 150 150 150 150 
##$DP07= 0
##$DPNAME0= <>
##$DPNAME1= <>
$$ [...]
##$SW= 20.0189087838548
##$SWIBOX= (0..15)
0 0 2 0 0 0 0 0 0 0 0 0 0 0 0 0 
##$SW_h= 4006.41025641026
##$TD= 16384
##$TD0= 1
##$TE= 300
##$TE2= 300
##$TE3= 300
##$TEG= 300
##$TL= (0..7)
0 120 120 120 120 120 120 120 
##$TP= (0..7)
150 150 150 150 150 150 150 150 
##$TP07= 0
##$TPNAME0= <>
##$TPNAME1= <>
##$TPNAME2= <>
##$TPNAME3= <>
##$TPNAME4= <>
##$TPNAME5= <>
##$TPNAME6= <>
##$TPNAME7= <>
##$TPOAL= (0..7)
0.5 0.5 0.5 0.5 0.5 0.5 0.5 0.5 
##$TPOFFS= (0..7)
0 0 0 0 0 0 0 0 
##$TUNHIN= 0
##$TUNHOUT= 0
##$TUNXOUT= 0
##$USERA1= <user>
##$USERA2= <user>
##$USERA3= <user>
##$USERA4= <user>
##$USERA5= <user>
##$V9= 5
##$VALIST= <valist>
##$VCLIST= <CCCCCCCCCCCCCCC>
##$VD= 0
##$VDLIST= <DDDDDDDDDDDDDDD>
##$VPLIST= <PPPPPPPPPPPPPPP>
##$VTLIST= <TTTTTTTTTTTTTTT>
##$WBST= 1024
##$WBSW= 25
##$XGAIN= (0..3)
0 0 0 0 
##$XL= 0
##$YL= 0
##$YMAX_a= 842737
##$YMIN_a= -475964
##$ZGOPTNS= <>
##$ZL1= 120
##$ZL2= 120
##$ZL3= 120
##$ZL4= 120
##$ABSF1= 10
##$ABSF2= 0
##$ABSG= 5
##$ABSL= 3
##$ALPHA= 0
##$AQORDER= 0
##$ASSFAC= 0
##$ASSFACI= 0
##$ASSFACX= 0
##$ASSWID= 0
##$AUNMP= <proc_1d>
##$AXLEFT= 0
##$AXRIGHT= 0
##$AXTYPE= 0
##$AXUNIT= <>
##$AZFE= 0.1
##$AZFW= 0.1
##$BCFW= 1
##$BC_mod= 2
##$BYTORDP= 1
##$COROFFS= 0
##$CY= 7568.61572265625
##$DATMOD= 1
##$DC= 2
##$DFILT= <>
##$DTYPP= 0
##$F1P= 17.4489326093798
##$F2P= -7.48496080290002
##$FCOR= 0.5
##$FTSIZE= 32768
##$FT_mod= 4
##$GAMMA= 1
##$GB= 1
##$INTBC= 1
##$INTSCL= 1
##$ISEN= 128
##$LB= 0.2
##$LEV0= 0
##$LPBIN= 0
##$MAXI= 945.577
##$MC2= 0
##$MEAN= 0
##$ME_mod= 0
##$MI= -402.1523
##$NCOEF= 0
##$NC_proc= 0
##$NLEV= 6
##$NOISF1= 8.587773
##$NOISF2= 6.764455
##$NSP= 1
##$NTH_PI= 0
##$NZP= 0
##$OFFSET= 16.50952
##$PC= 1
##$PHC0= 371.9463
##$PHC1= -36.11411
##$PH_mod= 0
##$PKNL= yes
##$PPARMOD= 0
##$PPDIAG= 0
##$PPIPTYP= 0
##$PPMPNUM= 100
##$PPRESOL= 1
##$PSCAL= 0
##$PSIGN= 0
##$REVERSE= no
##$SF= 200.13
##$SI= 32768
##$SIGF1= 18.5376
##$SIGF2= -6.396296
##$SINO= 400
##$SIOLD= 32768
##$SREGLST= <1H.CDCl3>
##$SSB= 3
##$STSI= 0
##$STSR= 0
##$SW_p= 4006.41025641026
##$SYMM= 0
##$S_DEV= 0
##$TDeff= 0
##$TDoff= 0
##$TI= <>
##$TILT= no
##$TM1= 0
##$TM2= 0
##$TOPLEV= 0
##$USERP1= <user>
##$USERP2= <user>
##$USERP3= <user>
##$USERP4= <user>
##$USERP5= <user>
##$WDW= 1
##$XDIM= 8192
##$YMAX_p= 0
##$YMIN_p= 0
$$ End of Bruker specific parameters
$$ ---------------------------------
##NTUPLES= NMR FID
##VAR_NAME=  TIME,          FID/REAL,        FID/IMAG
##SYMBOL=    X,             R,               I
##VAR_TYPE=  INDEPENDENT,   DEPENDENT,       DEPENDENT
##VAR_FORM=  AFFN,          ASDF,            ASDF
##VAR_DIM=   8192,          8192,            8192
##UNITS=     SECONDS,       ARBITRARY UNITS, ARBITRARY UNITS
##FACTOR=    0.0002496,     1,               1
##FIRST=     0,             0,               0
##LAST=      2.0444736,     52,              -39
##MIN=       0,             -475964,         -475964
##MAX=       2.0444736,     842737,          842737
$$ Real data points
##PAGE= N=1
##DATA TABLE= (X++(R..R)), XYDATA
0@%%%%%%pPpJ4j4J5k2L0l7M6n5O7q7J08j31J53j78K13k49K92l40L96m57N23o00
$$ 0 0 0 0 0 0 0 -7 0 -7 7 -7 8 -14 16 -21 25 -30 37 -50 58 -73 80 -98 115 -134 158 -182 214 -243 280 -320
31c20O86p80Q83r98J124j264J417j586J774j977K200k441K704k992L309l654M028
$$ -320 366 -414 469 -529 595 -669 748 -838 936 -1041 1159 -1282 1422 -1570 1739 -1915 2113
48B113m442M894n391N939o547P222p973Q820r781J0883j2157J3650j5432J7602
$$ 2113 -2329 2565 -2826 3113 -3434 3788 -4185 4635 -5146 5737 -6420 7230 -8202 9400
62I400k0312K3811k8531L5277m5805O4716j09490M18559M95112k02879p8860k41512
$$ 9400 -10912 12899 -15632 19645 -26160 38556 -70934 347625 842737 639858 560998 319486
74C19486j55338j82351p0141m2552O8256R5435J63890J47697J52939Q1269L3904
$$ 319486 164148 -18203 -88344 -130896 -62640 32795 196685 344382 497321 578590 612494
85F12494l9361r8736j68454j85463j98677j61961j21595m8155J3860Q4078J24379
$$ 612494 573133 474397 305943 120480 -78197 -240158 -361753 -409908 -396048 -311970 -187591
96a87591J52995J43981J19175O5214P502n8617j09352j47643j56999j45163j06103
$$ -187591 -34596 109385 228560 293774 301276 242659 133307 -14336 -171335 -316498 -422601
107d22601n3363J1077P0944J21662J50922J58039J38827R9564M4769j4675p0624
$$ -422601 -475964 -464887 -393943 -272281 -121359 36680 175507 275071 319840 305165 234541
118B34541j12519j34673j32820j08427o4872j0151M7089R6906J31458J44814J34959
$$ 234541 122022 -12651 -145471 -253898 -318770 -328921 -281832 -184926 -53468 91346 226305
129B26305J03730N6466O05n4635j00122j28820j36327j21661q7550l9938J3146
$$ 226305 330035 386501 387106 332471 232349 103529 -32798 -154459 -242009 -281947 -268801
140b68801O2942J01236J21672J21312J00540O2823J4614l6061q0832j12648j26299
$$ -268801 -205859 -104623 17049 138361 238901 301724 316338 280277 199445 86797 -39502
151c9502j19749r4313n4460o752M1117Q1264J07199J15087J04048P5905L5637
$$ -39502 -159251 -253564 -308024 -314776 -273659 -192395 -85196 29891 133939 209844 245481
162B45481r936n3355q7536j06891j08487r2231o0967j9966K4118O3806R2762J06447
$$ 245481 235545 182190 94654 -12237 -120724 -212955 -273922 -293888 -269770 -205964 -113202 -6755
174f755J02618Q1946M8102O653l5638p1870r6124j04653r6421p2827l7874K328
$$ -6755 95863 177809 225911 232564 196926 125056 28932 -75721 -172142 -244969 -282843 -280515
186b80515M1209P2361R0698R3159P9662N2411J6068k3351n9344q5918r8919r6442
$$ -280515 -239306 -166945 -76247 16912 96574 148985 165053 141702 82358 -3560 -102479 -198921
198a98921p8840m9228j2697K4899N7408P9509Q7863Q1361O1367L1399l438l7226
$$ -198921 -277761 -326989 -339686 -314787 -257379 -177870 -90007 -8646 52721 84120 80682 43456
210D3456o4280q0384q2813p1178m7631j6101J8310N0059P3958Q6282Q5319P1434
$$ 43456 -20824 -101208 -184021 -255199 -302830 -318931 -300621 -250562 -176604 -90322 -5003 66431
222F6431M7112J6403j5348m3125o2367o9917o4842m8027k2518P706L7284O1529
$$ 66431 113543 129946 114598 71473 9106 -60811 -125653 -173680 -196198 -188492 -151208 -89679
234h9679P6502P9737P0805N1161K4188n708l3782n5474o7229o7431n6247l5689
$$ -89679 -13177 66560 137365 188526 212714 207006 173224 117750 50521 -16910 -73157 -108846
246a08846r146J8652M3234O0406O7436O3146M8249K5416j749k8743n1077o5138
$$ -108846 -117992 -99340 -56106 4300 71736 134882 183131 208547 206798 178055 126978 61840
258F1840o8928o1873m5254k1921M045K8514M7521N7718N7887M8025K9914O648
$$ 61840 -7088 -68961 -114215 -136136 -132091 -103577 -56056 1662 59549 107574 137488 144136
270A44136j7820l9400n4651o1063n7680m5174k5775k655K0436L9681N2039N5605
$$ 144136 126316 86916 32265 -28798 -86478 -131652 -157427 -160082 -139646 -99965 -47926 7679
282G679N0089L6460J7075m704k5289m1305n0161n0437m2378k7157p543J3355L2076
$$ 7679 57768 94228 111303 106599 81310 40005 -10156 -60593 -102971 -130128 -137671 -124316 -92240
295i2240M5560N1740M9681L9851K3934M668j4786l1334m2149m5572m1265k9964
$$ -92240 -46680 5060 54741 94592 118526 123194 108408 77074 34925 -10647 -51912 -81876
307h1876j3530N105K2936L7029M5081M5897L9369K6661J0047p883k4145l5936
$$ -81876 -95406 -90301 -67365 -30336 14745 60642 100011 126672 136719 128836 104691 68755
319F8755m1565m0241l2219j8902k640J3773K7825L7013M0102L6567K7182J3490
$$ 68755 27190 -13051 -45270 -64172 -66812 -53039 -25214 11799 51901 88468 115650 129140
331A29140k141j7135k9074l6050l7132l2097k2088q759N597J8721K8260L2901
$$ 129140 126999 109864 80790 44740 7608 -24489 -46577 -55336 -49739 -31018 -2758 30143
343C0143L2012K5754J5180K286j0888k2162k9893l2665l0330k3298j2926q03J0954
$$ 30143 62155 87909 103089 105375 94487 72325 42432 9767 -20563 -43861 -56787 -57590 -46636
356d6636K0440K6114K7311K3808J6214N992n154j5433k3252k7110k6741k2256
$$ -46636 -26196 -82 27229 51037 67251 73243 68089 52656 29404 2294 -24447 -46703
368d6703j4330m397N899J4784K1011K3512K2011J6908R108p4r112j6391k0875
$$ -46703 -61033 -65430 -59531 -44747 -23736 -224 21787 38695 47803 47729 38617 22226 1351
381A351k1831j9303j3665n900K536J0300J6296J9381J9254J6068J0527L377l943
$$ 1351 -20480 -39783 -53448 -59348 -56812 -46512 -30216 -10835 8419 24487 35014 38391 34448
394C4448j0377j4727j6511j5544j1919o542j94O041J1081J4175J4874J3334R687
$$ 34448 24071 9344 -7167 -22711 -34630 -41172 -41366 -35325 -24244 -10069 4805 18139 27826
407B7826M658p84n799r701j1742j1734r828o464k112K330O305Q956J0068R565
$$ 27826 32484 31700 25901 16200 4458 -7276 -17104 -23568 -25680 -23350 -17045 -8089 1979 11544
421A1544P563M420Q11k748n610p460p897p025n246k599K36K833M744N783N798
$$ 11544 19107 23527 24338 21590 15980 8520 623 -6402 -11648 -14247 -14011 -11178 -6434 -651 5147
436E147M822L290J317o99k349l462l843l585k812j651l77O83J477J941J989J617
$$ 5147 9969 13259 14576 13877 11528 8066 4223 638 -2174 -3825 -4202 -3519 -2042 -101 1888 3505
452C505J136O72K14o5n1K1J39K94K71K3l91r64j499j938k136j871j278k90R44
$$ 3505 4641 5313 5527 5462 5411 5432 5571 5865 6136 6159 5768 4804 3305 1367 -769 -2640 -3918 -4208 -3264
471c264K099L096L535L506K722J298m87k480m247n521n984n493m131j972O04L222
$$ -3264 -1165 1931 5466 8972 11694 12992 12505 10025 5778 257 -5727 -11220 -15351 -17323 -16719 -13497
487a3497N359O639O848N794L640O38k645n841q197r364r093p311m220l58L714
$$ -13497 -8138 -1499 5349 11143 14783 15421 12776 6935 -1262 -10626 -19719 -27030 -31250 -31608 -27894
502b7894P268R773J0626R725P153L231j390n997r678j1912j2253j0491o867j919
$$ -27894 -20626 -10853 -227 9498 16651 19882 18492 12495 2817 -9095 -21348 -31839 -38706 -40625
516d0625L431Q519J2338J4202J3820J1282O763J059m836j0018j3554j4828j3617
$$ -40625 -37194 -28675 -16337 -2135 11685 22967 29730 30789 25953 15935 2381 -12447 -26064
529b6064r992m530J878Q259J3447J6629J7172J5032J0423M044l005r604j4699
$$ -26064 -36056 -40586 -38708 -30449 -17002 -373 16799 31831 42254 46298 43293 33689 18990
542A8990j7335j7090j3974q419j284O278J2894J7565J9451J8200J3855P169q05
$$ 18990 1655 -15435 -29409 -37828 -39112 -32834 -19940 -2375 17076 35276 49131 56300 55495
555E5495q808j5573j9795k0825j8547j3156n479L147J1321J7716K1182K1092J7443
$$ 55495 46687 31114 11319 -9506 -28053 -41209 -46688 -43541 -32220 -14504 6678 27770 45213
568D5213J0763K062p226j5496k1443k3939k2722j7769r918l59R182J7275K2485
$$ 45213 55976 58038 50812 35316 13873 -10066 -32788 -50557 -60475 -60834 -51652 -34377 -11892
581a1892K3870K1302J5109O187l890j3501k0981k5168k5304k1275j3726l881O641
$$ -11892 11978 33280 48389 54576 50686 37185 16204 -8964 -34268 -55543 -69269 -73150 -66509
594f6509J6167K3093K6212K5096J9868J1291Q40r755j8823k4760k6615k4050j7414
$$ -66509 -50342 -27249 -1037 24059 43927 55218 56058 46303 27480 2720 -23895 -47945 -65359
607f5359p753L332J4042K2638K7654K8255K4356J6439N925n591j6147k4067k7849
$$ -65359 -73112 -69780 -55738 -33100 -5446 22809 47165 63604 69529 63938 47791 23724 -4125
620d125k7022k1644j2461j019J0752K0985K7925L0399K7973K0959J0536j684j3637
$$ -4125 -31147 -52791 -65252 -66271 -55519 -34534 -6609 23790 51763 72722 83258 81574 67937
633F7937k3376k9210l0255k6316j7914o482O072J7707K6550L0897L0232K4553
$$ 67937 44561 15351 -14904 -41220 -59134 -65616 -59544 -41837 -15287 15610 45842 70395
645G0395J4719K350j0465k1690k9459l2470l0256k3134j2289M73J3121K3516K9882
$$ 70395 85114 87464 76999 55309 25850 -6620 -36876 -60010 -72299 -71826 -58705 -35189 -5307
658e307L1233K7401J8838P033o105j8364k7887l2885l2683k7321j7556n023Q227
$$ -5307 25926 53327 72165 79198 73093 54729 26842 -6043 -38726 -66047 -83603 -88626 -80399
671h0399K0062K8459L2070L0338K3458J2594m45j3625k4685l1759l3709l0165
$$ -80399 -60337 -31878 192 30530 53988 66582 66137 52512 27827 -3932 -37641 -67806
683f7806k1726r653M037J7111K7405L3206L3541K8361J8580N613q231k0778k9802
$$ -67806 -89532 -99185 -95148 -78037 -50632 -17426 16115 44476 63056 68669 60438 39660 9858
696I858l3885l2376k5374j4089l57J3557K5391L3104L5481L2080K3552J1136k971
$$ 9858 -24027 -56403 -81777 -95866 -96223 -82666 -57275 -24171 11310 43390 66942 78078 75107
709G5107j6528k7235l3405l3973k8849j8924n802Q338K1207L0588L4972L3670
$$ 75107 58579 31344 -2061 -36034 -64883 -83807 -89609 -81271 -60064 -29476 5496 39166
721C9166K6913J5732K044j1992k4020l2076l4836l1928k3799j1724K228J5793
$$ 39166 66079 81811 83855 71863 47843 15767 -19069 -50997 -74796 -86520 -84292 -68499
733f8499K6752L3259L4269K9714K0106P250o876j9912k9740l4698l3951k7703
$$ -68499 -41747 -8488 25781 55495 75601 82851 75975 56063 26323 -8375 -42326 -70029
745g0029j6876l195J0941K3265L1882L5139L2626K4781J2775j336j5209k6677
$$ -70029 -86905 -90100 -79159 -55894 -24012 11127 43753 68534 81309 79973 64764 38087
757C8087l3553l4984l0660k1108q079O323J9751K9994L5327L4847K8725J7911
$$ 38087 4534 -30450 -61110 -82218 -90297 -83974 -64223 -34229 1098 35945 64670 82581
769H2581M201j0157k2722l1501l4946l2671k4916j3014J056J4995K6472L3656
$$ 82581 86782 76625 53903 22402 -12544 -45215 -70131 -83145 -82089 -67094 -40622 -6966
781f966L5264L1252K2124R416m690j7968k8204l3683l3592k7938j7647m448R534
$$ -6966 28298 59550 81674 91090 86400 68432 40228 6545 -27047 -54985 -72632 -77080 -67546
794f7546K1966L0825L4647L2874K5753J4455Q90j2771k4255l1716l3806l0346
$$ -67546 -45580 -14755 19892 52766 78519 92974 93864 81093 56838 25122 -8684 -39030
806c9030k1840r671M125J7387K7709L3537L3942K8719J8865N939q009k0526k9667
$$ -39030 -60870 -70541 -66416 -49029 -21320 12217 46159 74878 93743 99682 91673 71147 41480
819D1480l3879l2407k5681j4627j183J2472K4073L1626L4033L0741K2477J0453
$$ 41480 7601 -24806 -50487 -65114 -66297 -53825 -29752 1874 35907 66648 89125 99578
831I9578l269j6443k6850l2849l3463k8517j9014o388P181J9542K8530L2830L1670
$$ 99578 96309 79866 53016 20167 -13296 -41813 -60827 -67215 -60034 -40492 -11962 20868 52538
844E2538K5327J4786J846j1336k2686l0271l2843l0131k2518j1330J688J4374
$$ 52538 77865 92651 94497 83161 60475 30204 -2639 -32770 -55288 -66618 -64930 -50556
856e0556K4541L0533L1592K7343J8607O814o127j8076k7083l1643l1049k5452
$$ -50556 -26015 4518 36110 63453 82060 88874 82747 64671 37588 5945 -25104 -50556
868e0556j5747l497R150K0291K7930L0891K8696K1715J1098j451j3811k3937l0168
$$ -50556 -66303 -69800 -60650 -40359 -12429 18462 47158 68873 79971 78520 64709 40772 10604
881A0604l1485k7828j9537q165M384J6124K5110K9785K9481K4232J4941L122r224
$$ 10604 -20881 -48709 -68246 -76411 -72027 -55903 -30793 -1008 28473 52705 67646 70768 61544
894F1544k0087k7646l0669k8777k2199j2021j8J1880K1731K7861K9369K6030J8424
$$ 61544 41457 13811 -16858 -45635 -67834 -79855 -79873 -67993 -46262 -18401 10968 36998 55422
907E5422P802m037j5170k3746k8378k8362k3782j5254m394P164J7451K4730K7999
$$ 55422 63224 59187 44017 20271 -8107 -36469 -60251 -75505 -79899 -72735 -55284 -30554 -2555
920b555K6618K0872J1748P54j0300j9696k5760k7578k4938j8290q613K330J2853
$$ -2555 24063 44935 56683 57437 47137 27441 1681 -25897 -50835 -69125 -77738 -75408 -62555
933f2555K1169K5935K6417K2491J4904M868o010j5784k3007k6357k5520k0378
$$ -62555 -41386 -15451 10966 33457 48361 53229 47219 31435 8428 -17929 -43449 -63827
945f3827j1952j653Q947J7951K3979K5999K3751J7663Q691j651j1610j9579k4249
$$ -63827 -75779 -77432 -68485 -50534 -26555 -556 23195 40858 49549 47898 36288 16709 -7540
958g540k4850k1387j4342n009N175J4425K1294K4626K3905J9422J1724K235p488
$$ -7540 -32390 -53777 -68119 -73128 -67953 -53528 -32234 -7608 16297 35719 47443 49678 42190
971D2190j5872k1549k3600k1817j6425q395R56J0086J7411K1898K2721J9815J3686
$$ 42190 26318 4769 -18831 -40648 -57073 -65468 -64512 -54426 -37015 -15117 7604 27419 41105
984D1105N375l740j2206j8600k1893k1615j7801j1118k664O165J3889J9300K1478
$$ 41105 46480 42740 30534 11934 -9959 -31574 -49375 -60493 -63157 -56992 -43103 -23803 -2325
997b325K0120J5503Q393l4q374j5251j9441k0449j8035j2544n001L397J1290J7323
$$ -2325 17795 33298 41691 41657 33283 18032 -1409 -21858 -39893 -52437 -57438 -54041 -42751 -25428
1011b5428K0535K0427J7125J1132L401m614j1777j6738j8808j7674j3476p024
$$ -25428 -4893 15534 32659 43791 47192 42578 30801 14063 -4745 -22419 -35895 -42919
1023d2919O85Q277J4579J8497J9461J7385J2554N796j739q789j4278j7278j7331
$$ -42919 -42234 -33957 -19378 -881 18580 35965 48519 54315 52576 43787 29509 12231 -5100
1036e100j4570r373k705M367J0639J5102J7050J6209J2691P147M45o266j1900
$$ -5100 -19670 -29043 -31748 -27381 -16742 -1640 15410 31619 44310 51457 51902 45636 33736
1049C3736j5625j6723j5153j1242n588R12P079J1950J4731J5059J2854Q430K709
$$ 33736 18111 1388 -13765 -25007 -30595 -29683 -22604 -10654 4077 19136 31990 40420 43129
1062D3129l520r151j3241j5177j4622j1770p025j170M709R791J3162J4299J3107
$$ 43129 39609 30458 17217 2040 -12582 -24352 -31377 -32547 -27838 -18047 -4885 9414 22521
1075B2521R733M852q90o311j0635j3156j3485j1554p816k708K671P606J1270J2991
$$ 22521 32254 37106 36216 29905 19270 6114 -7371 -18925 -26741 -29449 -26778 -19172 -7902 5089
1089E089J2609J0215O161J231l900q176j1109j2131j1113q387m247M60N087Q747
$$ 5089 17698 27913 34074 35305 31405 23229 12120 -11 -11124 -19511 -23758 -23298 -18211 -9464
1103i464J0920J1299R816O798K646j788n936r004j0557j0325q532n350j328K803
$$ -9464 1456 12755 22571 29369 32015 30227 24291 15287 4730 -5595 -14127 -19477 -20805 -18002
1117a8002O378Q846R812R157P009L746j13l881o988q880r275q245n851k583J077
$$ -18002 -11624 -2778 7034 16191 23200 26946 26833 22952 15964 7084 -2191 -10436 -16287 -18870 -17793
1132a7793M406O987Q347Q278O878M310J097k248n207p234q069p558n917l323k87
$$ -17793 -13387 -6400 1947 10225 17103 21413 22510 20262 15055 7821 -248 -7806 -13723 -17046 -17333
1147a7333K750N234O698P130O303M477J950q83l449n460o523o493n482l581j193
$$ -17333 -14583 -9349 -2651 4479 10782 15259 17209 16326 12877 7417 894 -5599 -11081 -14662 -15855
1162a5855J317L532N092N742N476M279K469K82j878l682m785n108m615l393j645
$$ -15855 -14538 -11006 -5914 -172 5304 9583 12052 12334 10456 6774 1989 -3119 -7734 -11127 -12772
1177a2772L35K129L560M377M415L801K525R87p18k249l278l762l633k879j721
$$ -12772 -12437 -10308 -6748 -2371 2044 5845 8370 9357 8639 6390 3112 -650 -4283 -7162 -8883
1192h883l06J098K250K994L235K947K177J116j07j207k062k483k581k198j439
$$ -8883 -9189 -8091 -5841 -2847 388 3335 5512 6628 6521 5314 3252 769 -1812 -4010 -5449
1207e449n56L79J168J747K018J929J497R24K34m54r38j251j388j195q17m40N4
$$ -5449 -6005 -5626 -4458 -2711 -693 1236 2733 3657 3891 3437 2499 1248 -140 -1335 -2152 -2592 -2538
1224b538M76P26Q39Q32P36M64K50O2r2j28j55p1J6M7P9Pn1k16k70l40l07j36O6
$$ -2538 -2062 -1336 -497 335 1071 1535 1785 1847 1755 1627 1472 1401 1417 1464 1543 1550 1499 1283 1013 673 366 230 296
1247B96L60O14Q30R68R04O43K83j97p31j136j408j560j398r75m07L31J001J503
$$ 296 656 1270 2100 3068 3972 4615 4898 4701 3970 2834 1426 -134 -1532 -2507 -2914 -2583 -1582 -79
1265g9J811J759J348O83j72j142j943k536k808k622k017j123k2J092K041K565
$$ -79 1732 3491 4839 5522 5350 4208 2265 -271 -3079 -5701 -7718 -8841 -8863 -7771 -5730 -3165
1281c165K709K303J485K95j052k241l216l712l633k996j885m25J101K488L435
$$ -3165 -456 1847 3332 3627 2575 334 -2882 -6594 -10227 -13223 -15108 -15533 -14432 -11944 -8509
1296h509L795L570K664J308l28j946l356m150m378l809k581q97R64K787M194M943
$$ -8509 -4714 -1144 1520 2828 2500 554 -2802 -6952 -11330 -15139 -17720 -18617 -17653 -14866 -10672 -5729
1312e729M908M119K631O87j339l134m428n015m652l480j642N44K759M607N802
$$ -5729 -821 3298 5929 6616 5277 2143 -2285 -7300 -11952 -15432 -17074 -16530 -13771 -9164 -3362
1327c362O078N369L849J716p15l022m828n755n733m729k850m27K109M466O039
$$ -3362 2716 8085 11934 13650 12935 9913 5085 -670 -6403 -11132 -13982 -14409 -12300 -7834 -1795
1342a795O737O286M890K615l9k807n024o509o911o172m438j950Q99L603N690O884
$$ -1795 4942 11228 16118 18733 18694 15887 10863 4354 -2557 -8729 -13167 -15117 -14218 -10615 -4925 1959
1358A959O860N770L596P85k226m951o944p875p520o080l588n55K515N127O930
$$ 1959 8819 14589 18185 18970 16744 11793 4849 -3026 -10546 -16626 -20214 -20769 -18254 -13127 -6197
1373f197P485O776M897K107j146m256o757q207q334p193m811j673J814M958P344
$$ -6197 1288 8064 12961 15068 13922 9666 2909 -5298 -13632 -20825 -25636 -27309 -25495 -20537 -13193
1388a3193Q503Q290O633M025N87k823n867p847q502p762n566k407J281M845P771
$$ -13193 -4690 3600 10233 14258 14845 12022 6155 -1692 -10194 -17956 -23522 -25929 -24648 -19803 -12032
1403a2032R432R763Q512O008K564j198m669p279q568q369o631l712q8L775P020
$$ -12032 -2600 7163 15675 21683 24247 23049 18380 11101 2533 -5836 -12467 -16179 -16267 -12492 -5472
1418e472R314J0145R400P193L826p9l941p149r134r617q456n937k435J552N266
$$ -5472 3842 13987 23387 30580 34406 34327 30386 23237 14103 4486 -3970 -9907 -12342 -10790 -5524
1433e524Q088R554R478P803M752Q35l286o949r569j0710j0117p998m613n16L573
$$ -5524 2564 12118 21596 29399 34151 34986 31700 24751 15182 4472 -5645 -13643 -18256 -18772 -15199
1448a5199P062R241R812Q720O071K280j984o029r191j0895j0911r203o002j910
$$ -15199 -8137 1104 10916 19636 25707 27987 26003 19974 10783 -112 -11023 -20226 -26228 -28138
1462b8138K501O423R284J0521J0019P819M311J4m333p943j0317j0959r897p159
$$ -28138 -25637 -19214 -9930 591 10610 18429 22740 22754 18421 10478 161 -10798 -20695 -27854
1476b7854l225J213N468Q826J0736J0874R265O157K036k424o461r412j0797j0389
$$ -27854 -31079 -29866 -24398 -15572 -4836 6038 15303 21460 23496 21072 14611 5199 -5598 -15987
1490a5987q281m764m32M039P881J0446J1341J0434P829M007m60m781q351j0374
$$ -15987 -24268 -29032 -29464 -25425 -17544 -7098 4243 14677 22506 26513 26053 21272 12921 2547
1504B547j0733r220o175k012K583O766R921J1506J1270R144N678J211l356p367
$$ 2547 -8186 -17406 -23581 -25593 -23010 -16244 -6323 5183 16453 25597 31275 32486 29130 21763
1518B1763j0108j1153j0243p730l805P32N194Q827J0986J1327R851O653K393k290
$$ 21763 11655 502 -9741 -17471 -21276 -20544 -15350 -6523 4463 15790 25641 32294 34687 32397
1532C2397o679r966j1635j1506r499o034j658K943O935R692J0742R987P430L586
$$ 32397 25718 15752 4117 -7389 -16888 -22922 -24580 -21637 -14702 -5010 5732 15719 23149 26735
1546B6735r88n464r166j1486j1979j0638p736l610J049N376Q750J0558J0623Q830
$$ 26735 25747 20283 11117 -369 -12348 -22986 -30722 -34332 -33283 -27907 -19157 -8599 2024 10854
1560A0854N552J317l214p208j0068j1293j0677q305m541LM503Q409J0870J1631
$$ 10854 16406 17723 14509 7301 -2767 -14060 -24737 -33042 -37583 -37580 -33077 -24668 -13798 -2167
1574b167J0544P701L774p82n084q481j0367j0441q690n374j150L508P615J0584
$$ -2167 8377 16078 19852 19070 13986 5505 -4862 -15303 -23993 -29367 -30517 -27009 -19394 -8810
1588h810J1934J1384R121N424R78l537p399r868j0632r587o886k937J464N759
$$ -8810 3124 14508 23629 29053 30031 26494 19095 9227 -1405 -10992 -17878 -20815 -19351 -13592
1602a3592R116J0999J1136R474O290K128k399o454r512j0908j0593q545n137r35
$$ -13592 -4476 6523 17659 27133 33423 35551 33152 26698 17186 6278 -4315 -12860 -17997 -18932
1616a8932L377P112R585J0411R520P035L249j072n294q720j0767j1149r745o880
$$ -18932 -15555 -8443 1142 11553 21073 28108 31357 30285 24991 16271 5504 -5645 -15390 -22270
1630b2270k929J364N378Q377R903R728P836M602N08l785p477j0006j0946j0183
$$ -22270 -25199 -23835 -18457 -10080 -177 9551 17387 21989 22497 18712 11235 1229 -9717 -19900
1644a9900p803m162J10M287P711R821J0261R001O266K460j698n572q516j0019
$$ -19900 -27703 -31865 -31755 -27468 -19757 -9936 325 9326 15592 18052 16354 10782 2266 -7753
1658g753r822q026m841q43L335O958R537J0567R955P711M422L81l534o796q858
$$ -7753 -17575 -25601 -30442 -31285 -27950 -20992 -11455 -888 9067 16778 21200 21581 18047 11251 2393
1673B393r376q259n767k230J762N492Q350R909R965Q383N553J852k095n630q161
$$ 2393 -6983 -15242 -21009 -23239 -21477 -15985 -7635 2274 12239 20622 26175 28027 25932 20302 12141
1688A2141r355q918p100m063l58L373O524Q620R189Q271N976K664j125m781p631
$$ 12141 2786 -6132 -13232 -17295 -17653 -14280 -7756 864 10053 18324 24300 26964 25839 21058 13427
1703A3427r270r419q088n488k007J687N037P511Q670Q332O572L696J61l426o454
$$ 13427 4157 -5262 -13350 -18838 -20845 -19158 -14121 -6610 2060 10392 16964 20660 20821 17395 10941
1718A0941q464r081q263o132k992N02L946O670Q222Q435P240M882J714j771m856
$$ 10941 2477 -6604 -14867 -20999 -23991 -23489 -19543 -12873 -4651 3784 11024 15906 17620 15849 10993
1733A0993p179q295q053o490l882o86K641N495P425Q148P529N667K977k68l390
$$ 10993 3814 -4481 -12534 -19024 -22906 -23592 -20951 -15456 -8031 117 7646 13313 16290 16022 12632
1748A2632n933p456p800o863m738j918J248M185O416P586P531O243L933J047j983
$$ 12632 6699 -757 -8557 -15420 -20158 -22076 -20828 -16643 -10227 -2641 4890 11133 15066 16113 14130
1763A4130m629o546p234o814n170k686L06L213N623P162P487O685M837K216o84
$$ 14130 9501 2955 -4279 -11093 -16263 -18949 -18643 -15430 -9807 -2645 4842 11527 16364 18580 17896
1778A7896l393n491o596o556n404l370o95K098M496O257O944O563N112K869K04
$$ 17896 14503 9012 2416 -4140 -9544 -12914 -13609 -11511 -7015 -758 6186 12749 17861 20730 20934
1793B0934k449m721o097o537n860m278k005N06K953M817N824N921M934L138Q22
$$ 20934 18485 13764 7667 1130 -4730 -9008 -11013 -10507 -7554 -2737 3087 9008 13942 17080 17902
1808A7902j639l928n549o260o047m924l011o83J664L663N007N455M972L650J659
$$ 17902 16263 12335 6786 526 -5521 -10445 -13456 -14139 -12475 -8812 -3805 1650 6622 10272 11931
1823A1931n86k743m467n441n550m794l213j157J089L131M612N351N199M231K553
$$ 11931 11345 8602 4135 -1306 -6856 -11650 -14863 -16020 -14931 -11800 -7188 -1837 3362 7593 10146
1838A0146N62j526l267m448m825m409l233j489N20K434L981M847N020M309K995
$$ 10146 10708 9182 5915 1467 -3358 -7767 -11000 -12489 -11969 -9535 -5554 -707 4313 8622 11617
1853A1617J242o84k415l744m384m284l442k131l99J380K871L937M299L993K983
$$ 11617 12859 12175 9760 6016 1632 -2652 -6094 -8225 -8624 -7244 -4373 -436 3863 7856 10839
1868A0839J572j22j768l119l927m102l654k565j168M14J925L022L642L619K969
$$ 10839 12411 12289 10521 7402 3475 -627 -4281 -6846 -8014 -7600 -5675 -2653 989 4608 7577
1883G577J848M28j052k357l266l666l411k676j503r5J281K414L161L299K971K092
$$ 7577 9425 9853 8801 6444 3178 -488 -3899 -6575 -8078 -8173 -6892 -4478 -1317 1982 4953 7045
1899G045R28m21j637k567l098l056k560j641m71P67J787K593K898K711K146J160
$$ 7045 7973 7552 5915 3348 250 -2806 -5366 -7007 -7478 -6711 -4924 -2331 567 3278 5424 6584
1915F584Q5j027j951k479k670k401j711q12K03J166J954K365K361K006J301M25
$$ 6584 6669 5642 3691 1212 -1458 -3859 -5570 -6382 -6179 -5013 -3059 -694 1667 3673 4974 5399
1931E399m91j331j925k173k122j652j005j70O62J373J783J952J814J333O57j03
$$ 5399 4908 3577 1652 -521 -2643 -4295 -5300 -5470 -4808 -3435 -1652 300 2114 3447 4104 4001
1947D001p62j408j652j746j480j020l45K78Q95J344J554J509J195P61J63l86q99
$$ 4001 3239 1831 179 -1567 -3047 -4067 -4412 -4134 -3239 -1895 -341 1168 2363 3124 3287 2901 2002
1964B002j254j311j201q77m62N6N70Q95J152J179J003O87K92j32m94p65q71q73
$$ 2002 748 -563 -1764 -2641 -3103 -3047 -2477 -1582 -430 749 1752 2439 2731 2599 2105 1340 469 -404
1982d04o75m12n5K52N33P05P70O93N26L20K7k09l99m56n24m31l14j19L4J80K90
$$ -404 -1079 -1491 -1546 -1294 -761 -56 714 1407 1933 2253 2280 2071 1672 1216 692 261 -53 -172 -138 42 332
2003C32L34L04K22J14L1p9j66j67k09j72j64j16p1q4o4j01j29j41j52r5p4pM1
$$ 332 666 970 1192 1306 1337 1258 1092 925 716 544 380 264 193 109 45 -56 -185 -326 -478 -573 -647 -654 -613
2026f13J13J24J24M7m2j57l11l75m67m68m30k50j01R6K79M40M94M80L50J64q3
$$ -613 -500 -376 -252 -205 -247 -404 -715 -1090 -1557 -2025 -2455 -2705 -2806 -2710 -2431 -1991 -1497 -1017 -667 -503 -586
2047e86l12n56p11o76o62m18j66J84M66P78Q68Q81P56N02J48k15n78q27r46q77
$$ -586 -898 -1454 -2165 -2841 -3503 -3921 -4087 -3903 -3437 -2659 -1791 -910 -154 348 496 281 -297 -1124 -2070 -2947
2067b947o74l03J05N56R57J155J250J146Q29L89j05n93r81j223j228j014o25j07
$$ -2947 -3621 -3924 -3819 -3263 -2306 -1151 99 1245 2074 2463 2358 1765 784 -439 -1667 -2681 -3306 -3413
2085c413M40R19J315J498J420J091N81j5n95j130j462j584j446j016m76K12Q00
$$ -3413 -2973 -2054 -739 759 2179 3270 3851 3836 3241 2111 649 -935 -2381 -3397 -3873 -3661 -2861
2102b861J329J643J643J370Q35K07n06j167j622j880j772j424q25q1O25J290J713
$$ -2861 -1532 111 1754 3124 3959 4166 3660 2493 871 -1009 -2781 -4205 -5030 -5111 -4486 -3196 -1483
2119a483J887J732J237N58k12j010j589j988k043j768j184m27M23J220J780K097
$$ -1483 404 2136 3373 3931 3719 2709 1120 -868 -2911 -4679 -5863 -6290 -5867 -4647 -2867 -770
2135g70K096J651J028J55o85j476j980k194k002j487p50K23J100J849K339K396
$$ -770 1326 2977 4005 4160 3475 1999 19 -2175 -4177 -5664 -6414 -6191 -5091 -3242 -903 1493
2151A493K146J466N93l35j234j913k263k220j785j012n3R04J808K425K670K471
$$ 1493 3639 5105 5698 5363 4129 2216 -47 -2267 -4052 -5064 -5117 -4213 -2405 20 2690 5161
2167E161J898J047K0r79j827k354k445k141j465n48M92J520K262K646K638K157
$$ 5161 7059 8106 8126 7147 5320 2966 521 -1620 -3085 -3633 -3141 -1621 641 3287 5925 8082
2183H082J361L35p67j744k460k744k625k065j196r0R45J875K484K665K353J628
$$ 8082 9443 9778 9011 7267 4807 2063 -562 -2627 -3823 -3913 -2968 -1093 1391 4056 6409 8037
2199H037O68m57j579k424k903k948k521j681o00N46J620K432K789K672K101J159
$$ 8037 8705 8248 6669 4245 1342 -1606 -4127 -5808 -6408 -5862 -4242 -1810 979 3651 5752 6911
2215F911N8j134k128k777k958k688j942r05L23J492K433K965L043K606J709O29
$$ 6911 6969 5835 3707 930 -2028 -4716 -6658 -7563 -7240 -5748 -3315 -350 2693 5299 7008 7637
2231G637o18j735k552k937k851k243j301j16J082K172K894L079K871K107J055
$$ 7637 7019 5284 2732 -205 -3056 -5299 -6600 -6716 -5634 -3462 -568 2511 5382 7489 8544
2246H544j77j400k410k962l070k721j867p83N31J644K567K991K943K411J453K29
$$ 8544 8367 6967 4557 1595 -1475 -4196 -6063 -6846 -6315 -4671 -2104 887 3830 6241 7694 7923
2262G923j015k153k874l211k988k305j252K5J277K326K966L114K769J890P62n06
$$ 7923 6908 4755 1881 -1330 -4318 -6623 -7875 -7850 -6573 -4247 -1281 1833 4602 6492 7254 6748
2278F748j746k643l116l085k570j602l46R35K075K869L189L020K271J215n5j316
$$ 6748 5002 2359 -757 -3842 -6412 -8014 -8360 -7425 -5350 -2481 708 3728 5999 7214 7159 5843
2294E843k346l042l182k825k015q79M38J589K557L077L045K565J580M18q99j998
$$ 5843 3497 455 -2727 -5552 -7567 -8446 -8008 -6419 -3862 -785 2260 4825 6405 6823 5924 3926
2310C926k835l209l065k451j418j74J066K143K901L080K822K063R39k71j518k433
$$ 3926 1091 -2118 -5183 -7634 -9052 -9226 -8160 -6017 -3116 -36 2786 4849 5788 5517 3999 1566
2326A566l034l106k650j759n91P12J867K723L172L054K514J497K93r73k022k777
$$ 1566 -1468 -4574 -7224 -8983 -9574 -8862 -6995 -4272 -1100 1954 4468 5965 6258 5285 3263 486
2342D86l035k765k020r66K95J520K472L082L164K724J838P11n61j722k571l047
$$ 486 -2549 -5314 -7334 -8300 -8005 -6485 -4013 -931 2233 4957 6795 7506 6945 5223 2652 -395
2358c95k899k365j424k43R77K054K795L033K819K098J083j35j349k302k907l006
$$ -395 -3294 -5659 -7083 -7326 -6349 -4295 -1500 1533 4352 6450 7533 7398 6049 3747 840 -2166
2374b166k653j852p72M83J552K479K942K904K390J478L82q37j873k658k937k765
$$ -2166 -4819 -6671 -7443 -6960 -5408 -2929 13 2917 5307 6785 7167 6330 4457 1799 -1138 -3903
2390c903k165j147K5J199K180K783K958K629J853Q39l81j492k336k792k833k360
$$ -3903 -6068 -7215 -7190 -5991 -3811 -1028 1930 4559 6412 7251 6870 5378 3042 250 -2583 -4943
2406d943j490l95P95J823K561K895K723K093J172J8j065k041k650k818k493j816
$$ -4943 -6433 -6828 -6033 -4210 -1649 1246 3969 6062 7234 7252 6187 4146 1496 -1322 -3815 -5631
2422e631p90L27J392K256K706K715K333J477M87o46j645k357k712k588k054j194
$$ -5631 -6421 -6094 -4702 -2446 260 2975 5308 6785 7272 6626 4981 2624 -88 -2676 -4730 -5924
2438e924j47R16J860K466K667K474J792Q83j53j232k024k540k606k252j544n75
$$ -5924 -6071 -5155 -3295 -829 1838 4312 6104 6987 6834 5602 3578 1038 -1568 -3820 -5364 -5939
2454e939M87J432K183K549K474K049J187K09q38j706k306k541k367j764r20J11
$$ -5939 -5452 -4020 -1837 712 3186 5235 6422 6631 5793 4087 1781 -760 -3127 -4891 -5811 -5700
2470e700J067J913K377K470K128J458N36m53j360k042k414k338j896j160k20P17
$$ -5700 -4633 -2720 -343 2127 4255 5713 6249 5796 4436 2394 -20 -2358 -4254 -5414 -5634 -4917
2486d917J586K199K362K219J659Q51n5r48j719k170k283k011j405n91L18J163
$$ -4917 -3331 -1132 1230 3449 5108 5959 5904 4956 3237 1067 -1216 -3227 -4632 -5223 -4905 -3742
2502c742J854K209K173J815J139K65n89j376j950k185k120j608r28j21P66J451
$$ -3742 -1888 321 2494 4309 5448 5713 5124 3748 1798 -387 -2507 -4115 -5043 -5164 -4398 -2947
2518b947J974K082J843J345N84k73j034j670k031k069j728j153l84M51J169J732
$$ -2947 -973 1109 2952 4297 4881 4608 3574 1904 -127 -2196 -3924 -5077 -5461 -5010 -3841 -2109
2534b109J968J904J496Q74P5o99j327j774j893j715j250n88J86R06J508J846J854
$$ -2109 -141 1763 3259 4133 4208 3509 2182 408 -1485 -3200 -4450 -5038 -4852 -3946 -2438 -592 1262
2551A262J605J097L79l53r97j502j735j689j360p71j28N63J207J596J738J594
$$ 1262 2867 3964 4343 3990 2993 1491 -244 -1933 -3293 -4064 -4192 -3629 -2422 -826 912 2506
2567B506J238O22r3p03j277j554j637j470r89m30K59Q63J322J549J544J277P55
$$ 2506 3744 4366 4273 3570 2293 739 -898 -2368 -3357 -3787 -3528 -2665 -1343 206 1750 3027 3782
2584C782J56m67j008j358j528j486j119n80RN81J111J379J463J286Q95L45k76
$$ 3782 3938 3471 2463 1105 -423 -1909 -3028 -3608 -3599 -3018 -1907 -528 935 2221 3116 3461 3185
2601C185p48j176j385j356j151o92j64L47Q86J224J322J277R71N00k0n12r67j202
$$ 3185 2437 1261 -124 -1480 -2631 -3323 -3487 -3140 -2254 -1030 292 1569 2540 3040 3020 2508 1541 339
2619C39j266j128q07l37J78O20R94J195J205R93O46J79k80p11j008j140j087q30
$$ 339 -927 -2055 -2862 -3199 -3021 -2401 -1407 -212 993 1986 2632 2811 2531 1820 812 -328 -1415 -2245
2637b245m99rL77P61J035J110R68P37L49r9m97q25r74j013q60n55j81K13N59Q45
$$ -2245 -2744 -2753 -2376 -1615 -580 530 1498 2235 2584 2485 1988 1163 189 -824 -1684 -2239 -2420 -2207 -1648 -803
2657h03R97R33P21M07Q0l38o41q31r18q29n98k70O4L98O90Q18Q38O77M87J54j56
$$ -803 194 1127 1848 2255 2335 1997 1356 525 -393 -1222 -1820 -2090 -2026 -1628 -938 -120 718 1395 1882 2036 1880
2678A880m75o66p99p31n98l60n5K71M72O70P28O62N04K40j9l02m84o59o53n80
$$ 1880 1405 739 -60 -791 -1389 -1749 -1804 -1533 -1061 -391 337 999 1503 1743 1724 1422 938 279 -374 -954
2698i54l62j63J34L22N02O15N86N00K97O3j56l53n14n70n12l87k26MK07L71M68
$$ -954 -1316 -1479 -1345 -1023 -521 94 680 1180 1477 1540 1384 1031 517 -53 -565 -952 -1178 -1174 -967 -596 -128
2719a28M94M15L08J03q8k46l76m57m49l76k16o8R7K46L55L76L47K87J22l8j21
$$ -128 366 781 1089 1192 1104 858 482 25 -424 -800 -1016 -1084 -987 -741 -386 -10 337 624 746 708 587
2740E87k87l23l53l04k15r7N6J42K26K85K92K37J59K0n6j58j91k43k33j68o8j0
$$ 587 300 -23 -376 -680 -895 -992 -936 -794 -568 -283 9 246 405 425 369 211 20 -223 -456 -624 -692 -702
2762g02Q7J42K09K12J60J70M9mo1q6j29j31j04m3k0O9Q2R4J36J14P9O5K1k1l9
$$ -702 -615 -473 -264 -52 108 278 327 323 262 176 47 -84 -188 -231 -251 -182 -100 -6 130 244 323 388 409 388 349
2787C49m3k5k3l3j7L7J6J7K3LJqqj5PjJ9L4J3J0l3l2m8r7r0j15q5o5k4J5L1O4
$$ 349 306 281 258 225 208 245 261 278 301 304 305 297 289 274 281 280 299 333 346 356 323 291 243 146 56 -59 -144 -209 -233 -218 -187 -123
2819a23Q5Q4M4J3n2r5j59j94j71j35j20n8L6O3J73J53J52J44O6Nq9j44j93k22
$$ -123 -38 46 90 103 51 -44 -203 -397 -568 -703 -823 -881 -845 -782 -609 -456 -304 -160 -94 -89 -178 -322 -515 -737
2843g37k02j38m4K3J38K02K80K88K39J71Q3o3j06k26k39k34j92q8K8J71K51L24
$$ -737 -939 -1077 -1121 -1098 -960 -758 -478 -190 49 220 303 240 134 -92 -331 -565 -757 -845 -817 -646 -395 -71
2865g1L59L30K36J42Lj05k32l08l19k63j75l7J02K43L39L63L91K93J77K8j17k69
$$ -71 288 618 854 996 999 894 662 354 35 -228 -403 -440 -338 -95 244 607 998 1291 1468 1496 1379 1110
2887A110l58m01l89k87j90K3J75K89L75M00L55K22P6j25k46m10m73m62m01k51
$$ 1110 752 351 -38 -325 -515 -492 -317 -28 347 747 1102 1324 1400 1275 1029 619 146 -316 -717 -968
2907i68q3J05K61L77M71L94L10J39m8k32l93n01n09m44l50j34O2K38M34M80M63
$$ -968 -1051 -946 -685 -308 163 557 867 1006 958 726 333 -168 -677 -1121 -1471 -1605 -1543 -1305 -871 -391 72
2928G2M02K48N8j58l57m90n09m89l82k06L2K36M10N32N70N12L97J68k4k59l90
$$ 72 474 722 780 622 265 -225 -734 -1223 -1605 -1811 -1779 -1543 -1133 -601 -31 481 878 1046 1022 763 373
2949C73n22m90m15k51j0J91M18N82O44O22N16L01R7j67l36m89n30m66l51j44J17
$$ 373 -149 -639 -1054 -1305 -1315 -1124 -706 -124 520 1142 1658 1959 2056 1889 1553 1064 534 68 -283 -427 -310
2970c10L32N14O37O04N23L50R5j76l81n75o26o52n43l17j09J58L40M93N29M58
$$ -310 22 536 1173 1777 2300 2650 2745 2569 2188 1613 987 335 -208 -525 -634 -476 -136 357 886 1344
2990A344L34P5j65m09n92p33p53o52m62k16L5K80M47N74N57M45K51L6k41m30o03
$$ 1344 1678 1753 1588 1179 587 -146 -899 -1551 -2013 -2229 -2194 -1914 -1467 -893 -336 109 360 396 155 -275 -878
3011h78o16n85m08k08N8L45N77O94P48O77M80K87l0k39m44n32n58m45k14jK71
$$ -878 -1494 -2079 -2487 -2695 -2637 -2292 -1715 -1021 -273 404 884 1171 1141 902 458 -74 -632 -1077 -1291 -1292 -1021
3032a021N04O62P38O80N09L03mk38n16o30p16o16m54k35O2K77M75N57N74M58K53
$$ -1021 -517 145 883 1563 2072 2375 2371 2133 1617 987 271 -345 -799 -1034 -972 -695 -220 337 911 1369 1622
3053A622j7k80n07o89p49p02n55l17n1K30M45N95O60O12M38K10n3k74m70n84n84
$$ 1622 1605 1325 818 129 -620 -1322 -1877 -2194 -2245 -2015 -1570 -975 -315 297 735 945 892 618 148 -436 -1020
3074a020m55l16j7K53M98O81P71P42N96M01R5j13l94n40o07n40m28k04M6K88N10
$$ -1020 -1475 -1791 -1808 -1555 -1057 -376 395 1137 1733 2134 2229 2116 1722 1182 575 35 -393 -597 -551 -263 247
3095B47N87N95M73L04K4k62m88o87q04p74o83m63k17N5L01M11M98M32L11J00j45
$$ 247 834 1429 1902 2206 2230 1968 1480 793 -11 -785 -1468 -1931 -2148 -2093 -1792 -1381 -883 -451 -140 -40 -185
3116a85l95n73o68o79n42m05r5J40M03O14O94P07O44M53K35j1j91l66m33l50k06
$$ -185 -580 -1153 -1821 -2500 -3042 -3447 -3542 -3402 -2999 -2385 -1691 -984 -340 113 348 337 146 -220 -653 -1003 -1209
3137a209j3K25M66O71Q14Q16P48N63L02P1j92l89m92n58m19l21q6J16L26M46N04
$$ -1209 -1222 -997 -531 140 954 1770 2518 3081 3383 3454 3262 2873 2381 1823 1404 1083 997 1113 1439 1885 2389
3158B389M30K97P0j83m13o23p93q17p68n95m06j55N4K42L53L58L17R7o3l24m70
$$ 2389 2819 3116 3186 3003 2590 1967 1174 357 -411 -1006 -1412 -1567 -1513 -1271 -918 -560 -243 -146 -209 -533 -1003
3179a003o10o15o28m47k26L4K48M34N95O34O36N17L32J14r2k32l41l35k26q9J11
$$ -1003 -1613 -2228 -2856 -3303 -3529 -3495 -3247 -2813 -2218 -1584 -948 -431 -99 15 -77 -309 -650 -985 -1211 -1300 -1189
3200a189L18N09O77P00O90N66L71J72o3k89m22m86m64l69j76m1J87L23M17M02
$$ -1189 -871 -362 315 1015 1705 2271 2642 2814 2751 2462 2040 1554 1090 721 545 504 691 1014 1431 1833
3220A833L42J14J5l18l77o19o84n99o88l22k74N3J56L01L61L57K37R8j02k44m06
$$ 1833 2175 2289 2304 1986 1609 990 306 -293 -981 -1303 -1577 -1524 -1368 -1067 -706 -349 -112 -14 -116 -360 -766
3241g66m66m57l63k56l6J21L91M68N83N56N15M05J82J4j50k68l08k75j75n3J15
$$ -766 -1232 -1689 -2052 -2308 -2344 -2223 -1832 -1364 -781 -225 290 695 877 891 741 473 165 -110 -285 -338 -223
3262b23K76M38M69N15M25L52J36p4k01l83m43m87m17l05j79J9J35K40K69K42J86
$$ -223 53 491 960 1475 1900 2252 2388 2314 2113 1730 1287 800 383 78 -101 -82 53 293 562 804 990
3283I90Mj26k74m31n33n27m75l96j89m7P9K65L16L30L10J90O8p1j89k96k84k90
$$ 990 994 868 594 163 -370 -897 -1372 -1768 -1957 -2004 -1925 -1660 -1344 -1014 -704 -514 -446 -517 -706 -1002 -1286 -1576
3305a576j84n4P8K41L67M43M99M34L49K59Q8m1j55k17k21k06p8j6J56K53L46L26
$$ -1576 -1760 -1814 -1736 -1495 -1128 -685 -186 248 597 856 944 903 748 531 310 104 26 10 166 419 765 1091
3327A091L66K32J95kj11k38l46l32m09k68k30K6r3L03J2M14q2L85l38K17o03q
$$ 1091 1457 1689 1884 1882 1771 1533 1187 855 446 178 -52 -26 -119 184 196 610 528 913 575 792 189 181
3349A81o44j42m06j83J4j74L94l1M84P4K26J99j53P8k82k57Nn70L58m83M14N7
$$ 181 -463 -605 -1011 -1194 -1180 -1354 -960 -991 -507 -433 -207 -8 -161 -83 -365 -622 -617 -1187 -829 -1312 -898 -841
3371h41K51M03K58J24M34j37N2P3m96J39l79j56Q8p6O8L18J64O7N10j17P4J85
$$ -841 -590 -187 71 195 629 492 544 617 121 260 -119 -275 -187 -263 -195 123 287 354 864 747 821 1006
3393A006l90p1j52l07k44o8j7k06K83K27j26L51K03j53J00n6j97k43j78p7k81
$$ 1006 616 545 393 86 -158 -226 -243 -449 -166 61 -65 286 489 336 436 380 183 -60 -238 -315 -596
3414e96j24K54l2j6L04K26M1O8J14O2j92k21L8j01k92m2J70L2N5J36K35J97M1
$$ -596 -720 -466 -498 -514 -210 16 57 125 239 301 109 -112 -74 -175 -467 -509 -339 -307 -252 -116 119 316 357
3437C57k5R6M7k16k04l8k7j41q1J9J21J91Q0J6J31J54K6j69j19n1o6j33j62q1
$$ 357 332 428 475 259 55 17 -10 -151 -232 -213 -92 99 179 195 326 480 506 337 218 167 101 -32 -194 -275
3461b75K4J01R9L9K9J24J00O9p1j38r0o1k6r0j24n4N7R7Q4J01J7L5L1M0K3o8j25
$$ -275 -251 -150 -51 -12 17 141 241 310 239 101 11 -50 -76 -166 -290 -344 -287 -190 -106 -5 12 47 78 118 141 73 -52
3488e2j11q0MM1rmN1N5J00Q0M1K4k7p1p8m2l1j7j9k4KRR0P3Q9J2J2k8j9j8m2m0
$$ -52 -163 -243 -239 -198 -207 -211 -160 -105 -5 75 116 140 113 42 -36 -78 -109 -126 -145 -169 -167 -158 -68 5 94 106 118 90 71 53 11 -29
3520b9mk2oK0npQ0O6N1M5l7Lp0jk7k9mrJ1L1M3K5pqOJ0K8Jj4k5m2l4j6J3K0j3
$$ -29 -33 -55 -61 -41 -46 -53 27 93 144 189 152 155 85 84 57 28 24 15 26 57 100 125 118 110 116 126 154 155 141 116 74 40 24 37 57 44
3556D4J2mnNJ3Rl2ql4l8mmK4nj0j9K0l3J8j0kK1k7j2l3J3LK4MLQl9Jk8J8jPL9
$$ 44 56 52 47 52 65 74 42 34 0 -38 -42 -46 -22 -27 -37 -56 -36 -69 -51 -61 -63 -42 -69 -81 -114 -101 -98 -74 -70 -67 -59 -98 -97 -125 -107 -108 -101 -62
3594f2lnLMRL2lLJ3l4Ql2j0LnK7M4N9M2j3L2j6pj5j0j3Kj2j1J4ROJ0M7qN2%rK4
$$ -62 -65 -70 -67 -63 -54 -22 -25 -22 -9 -43 -35 -67 -77 -74 -79 -52 -8 51 93 80 112 96 89 74 64 51 53 41 30 44 53 59 69 116 108 160 160 151 175
3633A75j5m7l6j7k6j7K4L0L5K6K7L2k6j1k0n8n8k3l7k7qJ1K6LL8PJ7J6k9k5k6
$$ 175 160 113 77 60 34 17 41 71 106 132 159 191 165 154 134 76 18 -5 -42 -69 -77 -66 -40 -37 1 8 25 41 12 -13 -39
3664c9k5l9k9k1l0M2MK8OL8L0K3Plj8j3k2l6k0j8kK0L0M9RN2QJ7J1lqk9k5j8k3
$$ -39 -64 -103 -132 -153 -183 -141 -137 -109 -103 -65 -35 -12 -5 -8 -26 -39 -61 -97 -117 -135 -137 -117 -87 -38 -29 23 31 48 59 56 48 19 -6 -24 -47
3699d7OJ2K9J3J7N8K7K5j3J5l9j4kn9k8kjM4KN8L7J9K6J7Ml7k8l9l4m6k5LOL9
$$ -47 -41 -29 0 13 30 88 115 140 127 142 103 89 87 28 0 -2 -3 41 43 101 138 157 183 200 204 167 139 100 66 20 -5 -2 4 43
3733D3J4L4N1L1J0pj5k8k3n7l9m2n0%NJ9K5L0L3L0%l1j6j4k3o2j8rk0j4K3L1O
$$ 43 57 91 142 173 183 176 161 133 110 53 14 -28 -78 -78 -73 -54 -29 1 34 64 64 33 17 3 -20 -82 -100 -109 -129 -143 -120 -89 -83
3766h3J6M1Lj7Nj7m6k3l2rk4J8J8L8L5N2L8OK9J3Kj8nj5l8KKJ0J4L3L4K2L5J3
$$ -83 -67 -26 -23 -40 -35 -52 -98 -121 -153 -162 -186 -168 -150 -112 -77 -25 13 19 48 61 63 45 40 25 -13 -11 -9 1 15 48 82 104 139 152
3800A52nLj3ok1l7k2pjLK4K0j0L5mJ0k5j3l7n0l3k4j2m3K4j0J5J4K6J0%Pj1J1
$$ 152 147 150 137 131 110 73 51 44 43 46 70 90 80 115 111 121 96 83 46 -4 -37 -61 -73 -116 -92 -102 -87 -73 -47 -37 -37 -30 -41 -30
3834c0k7j6k8qk3J4J0L0L4K7K6L9L1K4%j7Km3Lm3k2oj5J6J0L2J0QM3lJ1k6Qj3
$$ -30 -57 -73 -101 -109 -132 -118 -108 -78 -44 -17 9 48 79 103 103 86 88 45 48 5 -17 -23 -38 -22 -12 20 30 38 81 78 89 63 71 58
3868E8j7l1Lj4m2j0K5J0KkjJ0k3j5K4n1l5J2l2oJ0PL6LL1K5K7kL0pqj6lKj6j4
$$ 58 41 10 13 -1 -43 -53 -28 -18 -16 -18 -19 -9 -32 -47 -23 -74 -109 -97 -129 -135 -125 -118 -82 -79 -48 -23 4 2 32 25 17 1 -2 0 -16 -30
3904c0J9J4K0M0K9M3K1J1j5Mk3%m0k1m6J7k2ONM2nK0L4k7ll6pm6j0n4k4j7L4j5
$$ -30 -11 3 23 63 92 135 156 167 152 156 133 133 93 72 26 43 21 27 32 74 69 89 123 96 93 57 50 4 -6 -60 -84 -101 -67 -82
3938h2K1K1J1J4J3QLl6l0j5k6k5k5J9j5K7M3O4L0J3J4jNl2J2n5j0j3l1K1J9J2
$$ -82 -61 -40 -29 -15 -2 6 9 -27 -57 -72 -98 -123 -148 -129 -144 -117 -74 -10 20 33 47 46 51 19 31 -24 -34 -47 -78 -57 -38 -26
3970b6K6P0L1K3Mpk1l8j9o5l3kj3kJ9N8K0N0K6KJ7k1j7n6l3l7l0mrK4L5M1N8L3
$$ -26 0 70 101 124 128 121 100 62 43 -22 -55 -57 -70 -72 -53 5 25 75 101 103 120 99 82 26 -7 -44 -74 -78 -87 -63 -28 13 71 104
4004A04M9k5j4pl6l6l7p0jk9kM2K4N1K5L4K1j9pl9m7o0n3l4k5J3J1N9L1M3N6K1
$$ 104 153 128 114 107 71 35 -2 -72 -73 -102 -104 -62 -38 13 38 72 93 74 67 28 -19 -79 -132 -166 -191 -178 -167 -108 -77 -34 22 43
4036D3K2J2m8l9k6n4j9j3pL0K2O5M7N5L9K0J3j5n7kl7l6k7l3L2K3L6N6O4N9NJ
$$ 43 65 77 29 -10 -36 -90 -109 -122 -129 -99 -77 -12 35 90 129 149 162 147 90 88 51 15 -12 -45 -13 10 46 102 166 225 230 231
4068B31j9j7m9p8m4q3k4JJ0K4L6L6MM4j4ro1n4n0o0m7n6kj0M0K4P1P6M0K4M3j
$$ 231 212 195 146 68 24 -59 -83 -82 -72 -48 -12 24 28 72 58 49 -12 -66 -116 -176 -223 -279 -281 -291 -251 -227 -156 -80 -40 -16 27 26
4100B6j2m1o1l0l8K7nK2O6P1P2O3O3K2j3j3j0p5m6l0m7j3nM6L1L7J9M4J6mpm3
$$ 26 14 -27 -88 -118 -156 -129 -134 -112 -46 25 97 160 223 245 232 219 209 134 88 58 11 -2 -7 39 70 107 126 170 186 182 175 132
4132A32o3n2p4l0l8J1%M4NM0K5L6K3l2k5l0n6o1j2rj6%L8L5M7L2P3RJ0m1l3j8
$$ 132 69 17 -57 -87 -125 -114 -114 -70 -65 -25 0 36 59 27 2 -28 -84 -145 -157 -166 -182 -182 -144 -109 -62 -30 43 52 62 21 -12 -30
4164c0m7k5pk4L4L4M4P7J8P0M6j6pl8l8n0k6l8j1j0M5K6N4L7OM5Ok5m9l3o7k7
$$ -30 -77 -102 -109 -133 -99 -65 -21 56 74 144 190 174 167 129 91 41 15 -23 -34 -44 1 27 81 118 124 169 175 150 101 68 1 -26
4196b6o4m1lK5RN4J8M9M4Kj3l1j5o7j7p5j8j3K3L5K9L5N5N4M0%mj5l1m0k4m3o
$$ -26 -90 -131 -134 -109 -100 -46 -28 21 65 67 54 23 8 -59 -76 -151 -169 -182 -159 -124 -95 -60 -5 49 89 89 85 70 39 -1 -25 -68 -74
4229g4k3L0K2N3N6K5M9J9pj1l0k2k9p9k0opMQO7K1N1K0lk0j0l2k7m8k6k7j7J8
$$ -74 -97 -67 -45 8 64 89 138 157 150 139 109 87 58 -21 -41 -47 -54 -50 -42 25 46 97 117 114 94 84 52 25 -23 -49 -76 -93 -75
4262g5PK4M5K5J6J3j6p%l6k8k9k7kJ3K0J3J6M1L0oL5k2k2rpl1k2Lj9J1J5NM0K
$$ -75 -68 -44 1 26 42 55 39 32 32 -4 -32 -61 -88 -90 -77 -57 -44 -28 13 43 37 72 50 28 19 12 -19 -41 -38 -57 -46 -31 -26 14 16
4297A6J0K7omk3ql3J2pk0RLRK3J9k6L9j9nJ6l7KJ0j1MnpJ2kL1k2L0j3Lj7J7k1
$$ 16 26 53 47 43 20 12 -21 -9 -16 -36 -27 -24 -15 8 27 1 40 21 16 32 -5 -3 7 -4 0 -5 -12 0 -2 29 7 37 24 27 10 27 6
4334Fj5L0k2lJ1nR%NJ1j0j3J1Rj6%Oj2j8OJ0k0J5J1rJ6ql1MK6l%nPj0J2j8LKj4
$$ 6 -9 21 -1 -4 7 2 11 11 16 27 17 4 15 24 8 8 14 2 -16 -10 0 -20 -5 6 -3 13 5 -26 -22 4 1 1 -4 3 -7 5 -13 -10 -8 -22
4374b2j2J7KJJPK0J7j6rJ9l7jNnPk7ORL4LNJ1K4k5Pk5J9k6Rk0k8J1JJ0QL6pK4
$$ -22 -34 -17 -15 -14 -13 -6 14 31 15 6 25 -12 -13 -8 -13 -6 -33 -27 -18 16 19 24 35 59 34 41 16 35 9 18 -2 -30 -19 -18 -8 0 36 29 53
4413E3Olj8j3l2k3mj8j6M5J2RJ5L3J2knkKn4k0Ok3oj5K6K8L3J6M3LJj5Mm2m0j3
$$ 53 59 56 38 25 -7 -30 -34 -52 -68 -23 -11 -2 13 46 58 56 51 49 51 -3 -23 -17 -40 -46 -61 -35 -7 26 42 85 88 89 74 78 36 -4 -17
4450a7o1jqL6K7K1K4L6J9J9j8nk6l2n9l8k0j3J1%M4N3L2K6RPmj1o9n1j1m8k8K9
$$ -17 -78 -79 -87 -51 -24 -3 21 57 76 95 77 72 46 14 -45 -83 -103 -116 -105 -105 -61 -8 24 50 59 66 62 51 -18 -69 -80 -128 -156 -127
4484a27pM9M6M5P6L5J4pj6l2l5n6j9l2j8K6L1N6L1P9L6L9%k4m5o1n2m3m2l1pL7
$$ -127 -134 -85 -39 6 82 117 131 124 108 76 41 -15 -34 -66 -84 -58 -27 29 60 139 175 214 214 190 145 84 32 -11 -53 -84 -91 -54
4516e4J0N4P4M1L9j5j6l6n8o8o4m4n8k0J7L2N1P4N2L2M2Qj6o7m3o9n8l4k5N3J8
$$ -54 -44 10 84 125 164 149 133 97 39 -29 -93 -137 -195 -215 -198 -166 -115 -41 11 43 85 93 77 10 -33 -102 -160 -194 -219 -166 -148
4547a48L3P5R9O4M4L3J0n7l0n4o8l2m6pK0M2P2Q5M5M3L5Lm1n4q5p8p8m9m6mM6
$$ -148 -115 -40 59 123 167 200 210 153 123 69 1 -31 -77 -84 -64 -22 50 135 180 223 258 261 220 166 81 3 -75 -124 -170 -174 -128
4578a28M1N1P0N4K2Rk0n2q2r2o2q7j9j4M1K7Q1P9J08L4M8Mj3n4p8o1m0l7k1M8
$$ -128 -87 -36 34 88 110 119 99 47 -35 -127 -189 -276 -295 -309 -268 -241 -160 -81 27 61 109 113 100 46 -32 -93 -133 -170 -191 -143
4608a43K4J05Q7Q1Q7L9M7m1m4l7r8p1m3n2KL3M4Q8N5P3O1Nj7m8r0q9j07q9n4l4
$$ -143 -119 -14 73 154 241 280 327 286 242 205 107 36 -7 -59 -57 -24 20 108 163 236 297 302 285 237 147 58 -49 -138 -192 -226
4638b26J8K8O5O6Q8L4KJ4qr7o0q2q9m5k2k3M9Q1O0J01Q8O5M0Ml0q0n6q3n0k8k0
$$ -226 -208 -180 -115 -49 39 73 75 89 81 -16 -76 -158 -247 -292 -314 -337 -288 -207 -147 -46 42 107 147 151 121 41 -15 -98 -148 -176 -196
4669a96M4M9Q1J08P6Q3M5J2l4o2p5r3o2n5m3OL1O6Q4Q8M0N4lPp6q7n0q3r6k8l2
$$ -196 -152 -103 -22 86 162 245 290 302 268 206 131 38 -24 -79 -122 -116 -85 -19 65 153 193 247 244 251 175 88 38 -45 -141 -169 -201
4700b01M0M3N6R4N8N9M6ro2n5q5p6o2n3l4J3L2O0J18N9O2N3Ok1m8q8o3q2o1k0
$$ -201 -161 -118 -62 32 90 149 195 186 124 69 -16 -92 -154 -207 -241 -228 -196 -136 -18 41 103 156 162 141 93 5 -58 -140 -201 -221
4730b21J1K3N2O9Q0Q5N9L9j9l9n3o8p2m5o4nJ4M9P1O9Q8N9M4K9l0n6n1p8p7m9
$$ -221 -210 -187 -135 -66 14 99 158 197 178 139 86 18 -54 -99 -163 -168 -154 -105 -34 35 123 182 226 255 225 169 118 40 -37 -86
4760h6j9nK8M6Q1O9O8M8nrk7q4q4q4p3k9qmM5N3L4Q4M1L8Jn3m4q7o5m8n8k8J5
$$ -86 -105 -110 -82 -36 45 114 182 230 225 216 189 105 21 -63 -136 -165 -173 -177 -132 -79 -45 39 80 118 119 66 22 -65 -130 -178 -236 -264 -249
4793b49L1M6Q3P9P1M1Rj9l4l7n9m7l5l5K7L5O0P6O1Q9N2OJ6j8m4o8o3o0j9k6J4
$$ -249 -218 -172 -89 -10 61 102 111 92 58 21 -38 -85 -120 -155 -128 -93 -33 43 104 193 245 251 267 249 205 137 74 14 -5 -31 -17
4824a7K2N7N0O4M4Pj0j5o3q0p2n1p7m6kJ1L6N3N8K3K9RPm2r1m3m5n4k3NMN9O4
$$ -17 5 62 112 176 220 227 217 202 139 59 -13 -64 -141 -187 -189 -178 -142 -89 -31 -8 21 30 37 -5 -96 -139 -184 -238 -261 -256 -252 -193 -129
4857a29N2O3O4L3JNj2n0o5k1l4j1L1M3L8P8O1O2L3K2k1m7k7m1n8m0m1j7K7L9M3
$$ -129 -77 -14 50 83 84 89 77 27 -38 -59 -93 -104 -73 -30 8 86 147 209 242 264 243 196 169 128 70 30 -11 -28 -1 38 81
4888H1K5L7QK0Jl2p0n0o1m2n8k8pK6K7N1N5PK7lrm0n8k9l6l2k3L4J6K9N9P3L6
$$ 81 106 143 151 171 172 140 70 20 -41 -83 -141 -169 -176 -150 -123 -72 -17 -10 17 14 5 -35 -93 -122 -158 -190 -213 -179 -163 -134 -75 -2 34
4921C4J8M5j4jl9m0k5k9npJ8L0L6N5O6K6K2kj3n7j7o2l1m1%KL0K5L5L2%L2Jqo2
$$ 34 52 97 83 82 43 3 -22 -51 -56 -63 -45 -15 21 76 142 168 190 188 175 118 101 39 8 -33 -33 -31 -1 24 59 91 91 123 124 116 54
4956E4l4n6k6k9l8jQL7K9L9RJ4K5nj9k6k7k5l0l5J6lK1M0L3M0L8PNQm2km0jpk1
$$ 54 20 -36 -62 -91 -129 -130 -122 -85 -56 -17 -8 6 31 26 7 -19 -46 -71 -101 -136 -120 -123 -102 -62 -29 11 49 56 61 69 27 25 -15 -16 -23 -44
4992d4NJ3M5JK6K6M4oqj1l5%k7k6k3lk4M2qL7K3QlJ6j5m1pl9j5k4kK5%QJ6M1O
$$ -44 -39 -26 19 20 46 72 116 110 102 91 56 56 29 3 -20 -23 -47 -5 -13 24 47 55 52 68 53 12 5 -34 -49 -73 -75 -50 -50 -42 -26 15 21
5029B1J4j9J0k2j9Nl0j6JQr%M7J3K5qJ4j8K8j7j6k7kLm9L4J4J4JK5j0K3Qk7mq
$$ 21 35 16 26 4 -15 -10 -40 -56 -55 -47 -56 -56 -9 4 29 21 35 17 45 28 12 -15 -17 -14 -63 -29 -15 -1 0 25 15 38 46 19 15 7
5065Gj9j5j2J9k2QL3j2K1J8jn%J5l8J1m1J2%J7k3NJ7NRMK3m1RJ5j3%l6KJMJ5j5
$$ 7 -12 -27 -39 -20 -42 -34 -1 -13 8 26 25 20 20 35 -3 8 -33 -21 -21 -4 -27 -22 -5 0 9 13 36 -5 4 19 6 6 -30 -28 -27 -23 -8 -23
5103b3K7jqJJ4RprlQk4J3%k6K2%J5j6NJ4npk0M0j1M%j9ONMnK1qK0k1kKMkj1J8
$$ -23 4 3 -5 -4 10 19 12 3 0 8 -16 -3 -3 -29 -7 -7 8 -8 -3 11 6 -1 -21 19 8 12 12 -7 -1 4 8 3 24 16 36 15 13 15 19 17 6 24
5145B4J4l6RJ9j7mMqJ4onRNJ7j6%KkKPj8j2NnkJ3JJ0qPK9%k2K0j6k5RrklJ7Rj4
$$ 24 38 2 11 30 13 9 13 5 19 13 8 17 22 39 23 23 25 23 25 32 14 2 7 2 0 13 14 24 16 23 52 52 30 50 34 9 18 9 7 4 21 30 16
5188A6K0jpJ2j0Nj6LnOj7J1jMK0j8PLRJkLk0mOk0J0j7KK2KJ6loKqKJ%qoj9lj1
$$ 16 36 35 28 40 30 35 19 22 17 23 6 17 16 20 40 22 29 32 41 42 40 43 23 19 25 5 15 -2 0 22 24 40 37 31 33 25 27 28 28 20 14 -5 -8 -19
5232a9L1rK4LJOkmj0J0l9KlJ0k9NK1lJ7J6nnK1n5K1j6%lj8Rj2J4J9J4%j0K6Kj1
$$ -19 12 3 27 30 31 37 35 31 21 31 -8 -6 -9 1 -28 -23 -2 -5 12 28 23 18 39 -16 5 -11 -11 -14 -32 -23 -35 -21 -2 12 12 2 28 30 19
5271A9j8Nl7KqPk4J1K5oL5lJ9j8j0k4j1j0nlrj4K5nlK8J7MLkPk0j5ok9K3Qj7K9
$$ 19 1 6 -31 -29 -37 -30 -54 -43 -18 -24 11 8 27 9 -1 -25 -36 -46 -51 -54 -63 -77 -52 -57 -60 -32 -15 -11 -8 -10 -3 -23 -38 -44 -73 -50 -42 -59 -30
5310c0K%J9K6KJQj5k9j%j3j1K6OJ7j6K4J3lLJ1l3J3l5j9kk4jK8lJ9pJ9jJ0l0J4
$$ -30 -28 -28 -9 17 19 20 28 13 -16 -17 -17 -30 -41 -15 -9 8 -8 16 29 26 29 40 7 20 -15 -34 -36 -60 -61 -33 -36 -17 -24 -5 -6 4 -26 -12
5348a2Lk5j7k4J6NqJ0NM6jMK1k6MNnj1mOk1J0J0J3K8K0j8K3J8k1Rj3oj5j6MJ8
$$ -12 -9 -34 -51 -75 -59 -54 -62 -52 -47 -1 -2 2 23 -3 1 6 1 -10 -14 -8 -29 -19 -9 4 32 52 34 57 75 54 63 50 44 29 13 17 35
5385C5k1PJ0K0%j2L1j5k7J2l2mj0k3J5j7J3L6j2oJ4RKnj6j0J2m2Rk0J9J8L0k8
$$ 35 14 21 31 51 51 39 70 55 28 40 8 4 -6 -29 -14 -31 -18 18 6 0 14 23 25 20 4 -6 6 -36 -27 -47 -28 -10 20 -8
5419hL8K5j6J0j6LMrj0J0Ok9L6k8J7J6K9OPj5oj3k3lLLj5llOK8q%LK5l9j5mpj2
$$ -8 30 55 39 49 33 36 40 31 21 31 37 8 44 16 33 49 78 84 91 76 70 57 34 31 34 37 22 19 16 22 50 42 42 45 70 31 16 12 5 -7
5459gKpnmJ2JJ8j1L5j3Rk9mJ0k0%j2J0oPK0mK8qmJ6j0Qj9l0pJ4o%JK4%%J3j8J2
$$ -7 -5 -12 -17 -21 -9 -8 10 -1 34 21 30 1 -3 7 -13 -13 -25 -15 -21 -14 6 2 30 22 18 34 24 32 13 -17 -24 -10 -16 -16 -15 9 9 9 22 4 16
5500A6J8j2k2k5J6J2k3N%L1j7K2%J0%nj2j5Moj5PjlJ5qJ0Oj6J2Jk6J4Jpl3J5p
$$ 16 34 22 0 -25 -9 3 -20 -15 -15 16 -1 21 21 31 31 26 14 -1 3 -3 -18 -11 -12 -15 0 -8 2 8 -8 4 5 -21 -7 -6 -13 -46 -31 -38
5538c8J9K%j1K6k7J3rJ8Oj4qmJ5j2OJ3k7M2l2OQJ5kOj6jj0Kj1L0mLRj4j4L3qn
$$ -38 -19 -17 -17 -28 -2 -29 -16 -25 -7 -1 -15 -23 -27 -12 -24 -18 -5 -32 10 -22 -16 -8 7 5 11 -5 -6 -16 -14 -25 5 1 4 13 -1 -15 18 10 5
5577Ej3Jj1qJ6mRNPj9J4j1J2NOj3Mk7J4K0k0J4Ronj6K0j9MM%J5k6K7j4J2Oj9Q
$$ 5 -8 -7 -18 -26 -10 -14 -5 0 7 -12 2 -9 3 8 14 1 5 -22 -8 12 -8 6 15 9 4 -12 8 -11 -7 -3 -3 12 -14 13 -1 11 17 -2 6
5616Fj5J6QJ1j0j5oj4RPoRj3QkLJ6Pj5NKj7kOlJ2j7J0K8k0kK2k3OLj7J5j5NLq
$$ 6 -9 7 15 26 16 1 -5 -19 -10 -3 -9 0 -13 -5 -7 -4 12 19 4 9 11 -6 -8 -2 -5 7 -10 0 28 8 6 28 5 11 14 -3 12 -3 2 5 -3
5657cMRj4K9j5mRjqJ2j1j4j4RMJ2mOj3J1%J3k4M2k1j8kMk2KKJ2J4NjJ0qRk0J9
$$ -3 1 10 -4 25 10 6 15 14 6 18 7 -7 -21 -12 -8 4 0 6 -7 4 4 17 -7 35 14 -4 -6 -2 -24 -22 -20 -8 6 11 10 20 12 21 1 20
5697B0k9RnJJ9qj6J5J7j0KJ6l2K4pOjj9Kk5J1K1J1j0rK8l2J9k2j0K2Nj8j3j2j
$$ 20 -9 0 -5 -4 15 7 -9 6 23 13 15 31 -1 23 16 22 21 2 4 -21 -10 11 22 12 3 31 -1 18 -4 -14 8 13 -5 -18 -30 -31
5733c1M6k7J4NMJ0j6J0prj0j0LqJ8j8L0qJ9Kj8K0j2RKk9J3Lj3LoRMOJ4Qqj4J7
$$ -31 15 -12 2 7 11 21 5 15 8 -1 -11 -21 -18 -26 -8 -26 4 -4 15 17 -1 19 7 16 18 -11 2 5 -8 -5 -11 -2 2 8 22 30 22 8 25
5772B5j7Jrjl0J1j0J9J5J5j2R%qLpm3K3J4%nKQnJ5J2j6J1J1k6%J9k2kLK%j4jq
$$ 25 8 9 0 -1 -31 -20 -30 -11 4 19 7 16 16 8 11 4 -39 -16 -2 -2 -7 -5 3 -2 13 25 9 20 31 5 5 24 2 0 3 5 5 -9 -10 -18
5812a8J0J9k5J3L0j9k4KJ4Jl2J1J0j7K0jQJ6j2rj1L5%Rm0NnJ6m%J0j3J3J1k4J8
$$ -18 -8 11 -14 -1 29 10 -14 -12 2 3 -29 -18 -8 -25 -5 -6 2 18 6 -3 -14 21 21 30 -10 -5 -10 6 2 2 12 -1 12 23 -1 17
5848A7Qk2J0j7Pj2J1LNk4K0onJ1RPk4nQJ0j9j5K9j5nJK1Qj2RkRj7J1mj4K6rj4
$$ 17 25 3 13 -4 3 -9 2 5 10 -14 6 0 -5 6 15 22 -2 -7 1 11 -8 -23 6 -9 -14 -13 8 16 4 13 11 20 3 14 10 -4 22 13 -1
5887aJ4RQKjk3Pj3L5k6j6MNJ3k4J5Pj2J3LPPk0j1K2rjj9K6Rk3J6nMQj1K0k2ML
$$ -1 13 22 30 32 31 8 15 2 37 11 -5 -1 4 17 -7 8 15 3 16 19 26 33 13 2 24 15 14 -5 21 30 7 23 18 22 30 19 39 17 21 24
5927B4k6K9qnK4j5J8l6K5nk5L5j2j2PnK2kJ4k0mKLqj6mRMlj7M4l0K2mrKj3%oK1
$$ 24 -2 27 19 14 38 23 41 5 30 25 0 35 23 11 18 13 35 33 47 27 23 25 28 20 4 0 9 13 10 -7 37 7 29 25 16 18 5 5 -1 20
5967B0j4kj4J2Oj1QqJ8J8j7k4PPlqJNOk6jJ2J3lJ2Jnqjj9J6%k4M%J7Kj2KRJ1o
$$ 20 6 4 -10 2 8 -3 5 -3 15 33 16 -8 -1 6 3 -5 -4 1 7 -19 -20 -8 5 2 14 15 10 2 1 -18 -2 -2 -26 -22 -22 -5 -3 -15 -13 -4 7 1
6009AK8j5l5K6l4J0rj2J7j0J3J2NK1j2j0KkrLj3j3kqJ2J6nL6l7J5J2kj9j2Pj5
$$ 1 29 14 -21 5 -29 -19 -28 -40 -23 -33 -20 -8 -3 18 6 -4 -2 -4 -13 -10 -23 -36 -38 -46 -34 -18 -23 13 -24 -9 3 1 -18 -30 -23 -38
6045c8j5kJ3j1K0K6q%J8lJ3k7qLj0j6mQJ0oQKJ5K7k7J2JloLj3k2k2J5PJ4j0K4
$$ -38 -53 -55 -42 -53 -33 -7 -15 -15 3 0 13 -14 -22 -19 -29 -45 -49 -41 -31 -37 -29 -27 -12 15 -12 0 1 -2 -8 -5 -18 -40 -62 -47 -40 -26 -36 -12
6083a2K8J4Mml2Ok2k3K3n2N4j5J2KK7J1J7K9l4J7Kk8j9k3jK%L2rJ8K0MK9l2J4
$$ -12 16 30 34 30 -2 4 -18 -41 -18 -70 -16 -31 -19 -17 10 21 38 67 33 50 52 24 5 -18 -19 -17 -17 15 6 24 44 48 77 45 59
6118E9k5Roqpk8oqL5M%L1J1j4K2j5j4j2k7j4l4J8j1RK3J5J6L0Pk5ROpl6k1QK1
$$ 59 34 43 37 29 22 -6 -12 -20 15 19 19 50 61 47 69 54 40 28 1 -13 -47 -29 -40 -31 -8 7 23 53 60 35 44 50 43 7 -14 -6 15
6155A5k1J3nL2K3K7L9ok2Nk9Jl7j3Nj2k5M5J8j3K9M5pnok8j8l2j5l1j7MK4j4J6
$$ 15 -6 7 2 34 57 84 123 117 95 100 71 72 35 22 27 15 -10 35 53 40 69 114 107 102 96 68 50 18 3 -28 -45 -41 -17 -31 -15
6190a5M0J1nJ9j7Jk5k6j6k0lmJ2K4OL9J6PLL3j2k1j6j8nl6j2J5N2j2L5K2L3j1
$$ -15 25 36 31 50 33 34 9 -17 -33 -53 -56 -60 -48 -24 -18 21 37 44 47 80 68 47 31 13 8 -28 -40 -25 27 15 50 72 105 94
6224I4jJ0k8k9k6l0j8ml2J9J1L3QOK7Oj8j9k5m0nj7k3j6NOJ0M2PJ9L4jlqk2k4
$$ 94 93 103 75 46 20 -10 -28 -32 -64 -45 -34 -1 7 13 40 46 28 9 -16 -56 -61 -78 -101 -117 -112 -106 -96 -54 -47 -28 6 5 2 -6 -28 -52
6260e2j6k8%KQK3M6J5L6NL2J0k5l3k3mk6rRMK7qM8k1M8K8k5j6k5j6l2k6j2k1l
$$ -52 -68 -96 -96 -94 -86 -63 -17 -2 34 39 71 81 56 23 0 -4 -30 -39 -30 -26 1 -7 41 20 68 96 71 55 30 14 -18 -44 -56 -77 -80
6295h0J0K8J3K4K5J5pOk6pn2n0J8l1j3K3L1K2M1J1K5J3J0ml0l2jm7joK4KN5J0
$$ -80 -70 -42 -29 -5 20 35 28 34 8 1 -51 -101 -83 -114 -127 -104 -73 -51 -10 1 26 39 49 45 15 -17 -18 -65 -66 -72 -48 -46 9 19
6329A9L1J5L6NQl2k8j5k9rm3K9J2j4N5mL1J3K9j4l1l0l8j4k6l4MJ5RJ7J2M1L0
$$ 19 50 65 101 106 114 82 54 39 10 1 -42 -13 -1 -15 40 36 67 80 109 95 64 34 -4 -18 -44 -78 -74 -59 -50 -33 -21 20 50
6362E0rMj8Km6jo0K3l2QRJ9L1M4K0J5J3j4Ll3rk0j1j8j1lK5L1L9K9J1J7mj3j4
$$ 50 41 45 27 29 -17 -18 -78 -55 -87 -79 -70 -51 -20 24 44 59 72 58 61 28 19 -1 -12 -30 -41 -44 -19 12 51 80 91 108 104 91 77
6397G7j6m5j9rk4%pL5L3M9kj1L9j6j7m2l0k9j4k4j1JL1N0jK6lJ5J7l1Jl5l6j7
$$ 77 61 16 -3 -12 -36 -36 -43 -8 25 74 72 61 100 84 67 25 -5 -34 -48 -72 -83 -82 -51 -1 -2 24 21 36 53 22 23 -12 -48 -65
6431f5pj6K7J6M9OK9%K9J1k6pj8J2m1j8j6KQPK8L3K9K1j9K3l7K0n6l9j6k4lK0
$$ -65 -72 -88 -61 -45 4 10 39 39 68 79 53 46 28 40 -1 -19 -35 -33 -25 -18 10 43 72 93 74 97 60 80 24 -15 -31 -55 -58 -38
6465c8MJ4K2K6J8ORk2nl6l6j0pj4j6K1K7%M3K8L9jpj0l4k7%l6mj2L0RRM3ML2K0
$$ -38 -34 -20 2 28 46 52 61 39 34 -2 -38 -48 -55 -69 -85 -64 -37 -37 6 34 73 72 65 55 21 -6 -6 -42 -46 -58 -28 -19 -10 33 37 69 89
6502H9j6J3j9n6j7Lj6okPJ6K9PK4K4pj4oqk0l7k5j9%OnN8J5K8j0K8k3Nj9l0k9
$$ 89 73 86 67 11 -6 -3 -19 -25 -27 -20 -4 25 32 56 80 73 59 53 45 25 -12 -37 -56 -56 -50 -55 3 18 46 36 64 41 46 27 -3 -32
6538c2lQk8OK9J1NL7LJ3Jj4Ql3j7ok5k0J3MK0nK4OK4K3j9Kpl3l3j1J5k2LjJ6M0
$$ -32 -35 -27 -55 -49 -20 -9 -4 33 36 49 50 36 44 11 -6 -12 -37 -57 -44 -40 -20 -25 -1 5 29 52 33 35 28 -5 -38 -49 -34 -56 -53 -54 -38 2
6576BJ9K2j7Pj0mj6rj3k7kj6L0LJ4J1K6J1J9k2oj4k0%j9l0QK0LK7j2K4mK2j3r
$$ 2 21 43 26 33 23 19 3 -6 -19 -46 -48 -64 -34 -31 -17 -6 20 31 50 28 22 8 -12 -12 -31 -61 -53 -33 -30 -3 -15 9 5 27 14 5
6612Ej2kj4Rl6PmQl2N3PJ1JJ6j7j1onJ0l7oK2lNmK0J4J1Qj4j0J7k4pQm3K6j4K7
$$ 5 -7 -9 -23 -14 -50 -43 -47 -39 -71 -18 -11 0 1 17 0 -11 -17 -22 -12 -49 -55 -33 -36 -31 -35 -15 -1 10 18 4 -6 11 -13 -20 -12 -55 -29 -43 -16
6651a6J0j0jK8j7K4qpj3j8lMONk0QJ5J0qL9k7K0j7lJ1j2j4J3j2%J8nJ3%kK0kj7
$$ -16 -6 -16 -17 11 -6 18 10 3 -10 -28 -31 -27 -21 -16 -36 -28 -13 -3 -11 28 1 21 4 1 12 0 -14 -1 -13 -13 5 0 13 13 11 31 29 12
6689A2K5l3JJMK3kj3j4K5r%Njkk1QkRj0K1j4J4j7J3m1L6rrNoJ3jJ8j5RpJ5j9K
$$ 12 37 4 5 6 10 33 31 18 4 29 20 20 25 24 22 1 9 7 16 6 27 13 27 10 23 -18 18 9 0 5 -1 12 11 29 14 23 16 31 12 14
6729A4j0j3J5Nk3NPj2M0j6lK0j1K3l3K0l4J9k1pplJ9%K1KqJ1J1j9mKkj7j5kk8
$$ 14 4 -9 6 11 -12 -7 0 -12 28 12 9 29 18 41 8 28 -6 13 -8 -15 -22 -25 -6 -6 15 17 9 20 31 12 8 10 8 -9 -24 -26 -54
6766e4L2OMK3J5J1j0Pj0n%l1j4OOj7K7MJ8J5J7kJ7l0JKm1j8nMj3K4j0J6L6mJ2
$$ -54 -22 -16 -12 11 26 37 27 34 24 19 19 -12 -26 -20 -14 -31 -4 0 18 33 50 48 65 35 36 38 -3 -21 -26 -22 -35 -11 -21 -5 31 27 39
6803C9K2m0Jk4j0k6jj8K7j9N5j2K4K0kK8j9Lk9j4k9k1j9NPJ6M9lJ8J4JJ6k6rj9
$$ 39 61 21 22 -2 -12 -38 -39 -57 -30 -49 6 -6 18 38 36 64 45 48 19 5 -24 -45 -64 -59 -52 -36 13 10 28 42 43 59 33 24 5
6838El8j1j5%MrN9j5N5ML6lpk2j0k7j9k2j8JJL8RM4J2K4J3pMk9m6Rn0j8OmNN0
$$ 5 -33 -44 -59 -59 -55 -64 -5 -20 35 39 75 72 65 43 33 6 -13 -35 -53 -52 -51 -13 -4 40 52 76 89 82 86 57 11 20 -30 -48 -42 -46 -41 9
6876IK8K3L7LKk7rj6n6j2l1l3K1OJ6M3L7L9J1J3lk0k3l2n7j5k5j8J0M0K6O4L5
$$ 9 37 60 97 100 102 75 66 50 -6 -18 -49 -82 -61 -55 -39 4 41 80 91 104 101 81 58 26 -31 -46 -71 -89 -79 -39 -13 51 86
6909H6KK4j0pj9n2m3Ln4k5J5j1M8L3M5K7O4j0k9k5l0k9o1k2k0jLM7J9P2K3K2M
$$ 86 88 112 102 95 76 24 -19 -16 -70 -95 -80 -91 -43 -10 35 62 126 116 87 62 32 3 -58 -80 -100 -101 -98 -51 -32 40 63 85 89
6942H9n%n9j7l2p8j8J%J4L4N4N4J7N7rnn4k0n3k1n9j7KJ8L7L0M0O0L5Rlk7l6m0
$$ 89 84 84 25 8 -24 -102 -120 -119 -119 -105 -71 -17 37 54 111 102 97 43 23 -30 -51 -110 -127 -125 -107 -70 -40 0 60 95 104 101 74 38 -2
6977bo4l7k1l0K6K4M1N5M9J3M6pk4m9l5l2p5l1j6K0J8M7M0M3N3J7L4k5ko9m0n1
$$ -2 -66 -103 -124 -154 -128 -104 -63 -8 41 54 100 93 69 20 -15 -47 -122 -153 -169 -149 -131 -84 -44 -1 52 69 103 78 76 7 -33 -84
7009h4n0k9j0K7K9M4Q5M1L6K1Rm6qo0o5m7k9k7J2J0O1O7O4M4M5mk6mn6o6q4j7
$$ -84 -134 -163 -173 -146 -117 -73 12 53 89 110 119 73 65 5 -60 -107 -136 -163 -151 -141 -80 -13 51 95 140 136 110 106 50 -16 -100 -117
7041a17l5J8J5L1O4M9O9K6L4Mm9m2m1q1k8m9j3PN0L6P5O2O6J7J1l8l4l9p8m6j07
$$ -117 -152 -134 -119 -88 -24 25 94 120 154 158 109 67 26 -55 -83 -132 -145 -138 -88 -52 23 85 151 168 179 141 107 68 -10 -56 -163
7072a63K1lL1O3N8Q3M1K9J9j5k5l9p8r2k0m3Qj3M9Q7L2Q1O6QRm6j0q5m4q8j9k9
$$ -163 -142 -145 -114 -51 7 90 131 160 179 164 139 100 22 -70 -90 -133 -125 -138 -89 -2 30 111 177 185 194 148 138 53 9 -79 -98 -127
7104a27QK8O0M3R6M1K8Mj3m8o8k9o4m7o6M2k0M7N4J11L7M1J6oj9o9l2o9o7m2l4
$$ -127 -119 -91 -31 12 108 149 177 181 168 120 52 23 -41 -88 -154 -112 -132 -85 -31 80 117 158 174 168 149 80 48 -21 -88 -130 -164
7135a64J6M3M6P6R0O1LJ8m5k5N9q2p3j00p5o5j9L9O8O8R1Q3N8M8ll0o7q0o8j00
$$ -164 -148 -105 -59 17 107 168 171 189 144 119 178 96 23 -77 -152 -217 -236 -197 -129 -61 30 113 171 219 216 186 119 39 -29 -129
7165a29n3l0PN6R2O7Q4N3M2L1j7n0p8q1r0n6n3OM5L5Q6J03L3O9J9J3n7l1r3q9
$$ -129 -182 -212 -205 -149 -57 10 94 147 189 220 203 153 75 -6 -96 -152 -205 -199 -154 -119 -33 70 103 172 191 204 147 116 23 -66
7195f6p6m0l4K7N4P0N2R4O9M6J0n0l2p8o5q1n3l5jM3N3R3Q1M3O9M0k7l8o3q1o4
$$ -66 -142 -182 -216 -189 -135 -65 -13 81 150 196 206 156 124 46 -19 -100 -153 -188 -189 -146 -93 0 81 124 193 233 206 168 105 24 -40
7226d0q7l1rK7L8P1R3O2Q5J0Km1l3q9q4p3n0k5K0K6P5P3M0P6L5K3k3m0o1p5o7
$$ -40 -127 -158 -167 -140 -102 -31 62 124 209 219 221 180 147 58 -26 -99 -149 -174 -154 -128 -53 20 60 136 171 194 171 131 70 -5 -72
7257g2p8n7KM3M3O6P5O0O5NKk9n3q5n7o3m2l3LN6O9M6Q3O7K3J8k0o6l8q2p0n2
$$ -72 -150 -207 -205 -162 -119 -53 22 82 147 152 154 125 72 -13 -70 -133 -175 -208 -205 -149 -80 -34 49 116 139 157 137 71 33 -49 -119 -171
7289a71k0J7MP2O6L7P7K9K0On5p5m8n5o6k6qj1M7O1P7L9K8M3lj4o7n2o3p7l4K
$$ -171 -191 -174 -170 -98 -32 5 82 111 131 137 82 7 -41 -96 -162 -188 -196 -207 -160 -99 -22 17 45 88 85 71 4 -48 -111 -188 -222 -220
7321b20pM0K6P3N9N0L7%j2n0m4m7n0l6n2LK3O0M6O3M4L7L1nk8n1n0n5m7j3k0K2
$$ -220 -227 -187 -161 -88 -29 21 58 58 46 -4 -48 -95 -145 -181 -233 -230 -207 -147 -101 -38 6 43 74 69 41 -10 -60 -115 -162 -175 -195 -173
7353a73K3M1L9O7M2J7nj9k4n7k1o1k5NnJ4N2J9M4M5K6K9ok9j4k4o8k9k8k4M1N2
$$ -173 -150 -109 -70 -3 39 56 51 32 8 -49 -70 -131 -156 -151 -156 -142 -90 -71 -27 18 44 73 67 38 24 0 -68 -97 -125 -149 -108 -56
7385e6PN1M5K8J4J2j9l6k1k6n2rr%M8K8J2O3M1j5K3mk8l1pm5Nk4L6qJ0M2L3jL3
$$ -56 -49 2 47 75 89 101 82 46 25 -1 -53 -62 -71 -71 -23 5 17 80 121 106 129 125 97 66 59 14 19 -5 31 23 33 75 108 107 140
7420A40K8npm1k6k1oJ2k8K5MK9L1MK3j1J2kPk9Jl3k2j9K9nJ7J7K4j0MjOj5k2m
$$ 140 168 163 156 115 89 68 62 74 46 71 75 104 135 139 162 151 163 161 168 139 140 107 85 66 95 90 107 124 148 138 142 141 147 132 110 106
7456A06l5K8j9J2j4OJ0RmJ4Rpomj2j3j9K9j4k%J7pRJ8k3orK1prJJ1oLjj0k8Mk
$$ 106 71 99 80 92 78 84 94 103 99 113 122 115 109 105 93 80 61 90 76 74 74 91 84 93 111 88 82 73 94 87 78 79 90 84 87 86 76 48 52 50
7496E0JoJJ7j2jOQMJ0rj1j8j4Jk6k4J6j4OJ7PPM5j7k9J0ol2ql3k8J1k9PJ6J9L1
$$ 50 51 45 46 63 51 50 56 64 68 78 69 58 40 26 27 1 -23 -7 -21 -15 2 9 16 61 44 15 25 19 -13 -21 -54 -82 -71 -100 -93 -77 -58 -27
7534b7K2MOmk8m2l1k8j9k6j4J4L0J3L5K7J1K8j2j7l0l6k0n9j7mJ2LN3K9M7L0J5
$$ -27 -5 -1 5 1 -27 -69 -100 -128 -147 -173 -187 -173 -143 -130 -95 -68 -57 -29 -41 -58 -88 -124 -144 -203 -220 -224 -212 -209 -156 -127 -80 -50 -35
7567c5JNk6n8k9l1l5k7J9JO9L2P0L1K1K4ok6l2m1p0l9k6j0J8L2P3M7N2O4j0K5
$$ -35 -34 -29 -55 -113 -142 -173 -208 -235 -216 -215 -146 -114 -44 -13 8 32 26 0 -32 -73 -143 -182 -208 -218 -200 -168 -95 -48 4 68 58 83
7599H3k3m4m1o4o9k4j7K0K3N8O5O7L8L7Mj8j0o8p3n8m6k7K0J3M9M9P4O5L8L3j0
$$ 83 60 16 -25 -89 -158 -182 -199 -179 -156 -98 -33 34 72 109 113 95 85 17 -56 -114 -160 -187 -167 -154 -105 -56 18 83 121 154 144
7630A44l1n3o3j04l5m8j9JO5N2O6P1P2L5lrm6q6r0m2m9k7mN3Q2P2P5P8O3K1j2
$$ 144 113 60 -3 -107 -142 -190 -209 -208 -143 -91 -25 46 118 153 150 141 95 9 -81 -123 -172 -199 -203 -150 -68 4 79 157 220 241 229
7661B29m1q9p3p8n2n0jK0Q3R0Q8Q0P9K8Ll1o6q5j27o9n6j7MN7P4R4P3J13K3J3
$$ 229 188 99 26 -52 -104 -154 -155 -135 -52 38 126 206 285 313 316 285 219 134 7 -62 -118 -135 -131 -74 0 94 167 280 303 316
7691C16j8m4j19q7q8q9l0l0L3Q8J14Q0N8R7O%m7j04j00j08j05l4k2J8Q5O6J39
$$ 316 298 254 135 48 -40 -129 -159 -189 -156 -68 46 126 184 281 287 287 240 136 36 -72 -177 -211 -233 -215 -130 -64 75
7718G5Q0R7K8J1m0p5j19j12q0j18k6M3L3J03J10R4J23M2M4n5p1q8j31j04q3n3
$$ 75 155 252 280 291 251 176 57 -55 -135 -253 -279 -236 -203 -100 10 104 227 269 313 258 187 99 -32 -136 -219 -272
7744b72k5L9Q9J29R5J00Q1M5Mp0o8j29j01j31o7j8J9P5J01J12J23P9Q6pk5p1j14
$$ -272 -297 -258 -169 -40 55 155 236 281 285 215 147 18 -83 -214 -281 -299 -280 -205 -104 8 131 210 296 289 264 193 79
7771G9j14j11r7m4J4N3R4J28Q5J25Q1M7j7m0j38j28j11j35m9j8L4O6J35J18J09
$$ 79 -35 -146 -243 -287 -273 -220 -126 2 87 212 293 340 323 283 145 17 -94 -229 -278 -296 -262 -196 -61 57 166
7796A66R1P2Nn9r1j28j37j14q8l5J3N6R7J46R4J25Q0Moq9j03j27j75p0o7k1N2
$$ 166 257 329 334 275 184 56 -81 -195 -283 -318 -305 -249 -152 -6 88 213 293 297 291 202 99 -28 -203 -273 -340 -361 -309
7823c09R0J35J21J29R2M8om3j28j20j15j45o9l6L3M9J53J32J27J07O0Onr4j49
$$ -309 -219 -84 37 166 258 306 300 257 129 9 -106 -251 -320 -356 -323 -274 -121 11 138 245 305 311 306 212 63
7848F3j25j15r4m7j1P1J07J32J60R6Q4M6j7p8j01j38j48r2q1k2K9R6J22J14J51
$$ 63 -62 -177 -271 -318 -329 -258 -151 -19 141 237 321 367 350 272 171 33 -115 -207 -288 -310 -281 -185 -63 51 202
7873B02R4O3L2o1p9j57j37j38p4n5oO8J10J42J20J22P8K0m0q0j28j38j24j20p4
$$ 202 296 359 391 330 251 94 -43 -181 -255 -310 -316 -248 -138 4 124 246 324 344 304 224 96 -42 -166 -286 -360
7898c60oM7Q5J40J39J04J08N8l2n4j06j21j50j25p2m7M4R5J17J54J30R9O4M7k9
$$ -360 -366 -319 -234 -94 45 149 257 315 283 229 123 2 -148 -273 -345 -392 -348 -253 -136 18 148 247 311 358 329
7923C29j22j25j34j29p8n2JO2J26J06J47J20P9O5l1p1j26j44j24j02q4k1K4R5
$$ 329 207 82 -52 -181 -259 -311 -310 -248 -122 -16 131 251 330 395 364 293 167 23 -101 -203 -287 -308 -284 -189
7947a89J14J49R4R3P8mo6j06j28j51r2j19m3J0P6J20J28J25J10P2K7p0l6j18j32
$$ -189 -75 74 168 261 339 335 269 163 35 -116 -208 -327 -370 -360 -284 -164 -36 89 199 271 298 228 192 74 -58
7972e8j13j22k9pL5J14J21J61J06J07M7j7l8j21j06j34j30n6mK3P5J13J10J34
$$ -58 -171 -293 -322 -329 -294 -180 -59 102 208 315 362 345 307 186 80 -54 -184 -240 -244 -221 -146 -33 77 211
7996B11J02M9J0k5r4j09j60j22j04l9L2J2Q7J28J34P5Q5L3n0o2j14j27j43p2q3
$$ 211 313 362 372 347 253 144 -16 -138 -242 -281 -249 -237 -150 -22 112 187 272 305 255 193 79 -48 -191 -263 -346
8021c46j3L5P3R9J25J17R7M0J4o6j04j05j16j10o0l0J7P6J10R7J27Q2Q0Rm1m9
$$ -346 -359 -324 -251 -152 -27 90 187 227 241 175 71 -34 -150 -260 -320 -350 -333 -257 -147 -50 77 159 239 248 207 158
8047A58j08j01j23p9m2%L5R5J07J11P5Q4L6jo8q7j14j04r0o9J3pN4R1J04J05O9
$$ 158 50 -51 -174 -253 -295 -295 -260 -165 -58 53 128 212 248 247 179 92 -22 -126 -216 -285 -272 -279 -225 -134 -30 75 144
8074A44M9J3l7r2r1r1r5r1m%N4P0J04J10P8N5L7l4n7o7j21p9r2l0mK3O7O9J00
$$ 144 193 206 169 77 -14 -105 -200 -291 -295 -295 -241 -171 -67 43 121 176 213 179 122 55 -66 -145 -237 -267 -271 -248 -181 -112 -12
8103a2J03N1K8Om7q3o2q6j06l2k7J1N2P3P6J01M7O6%k3p4n4q5j00l7j8j1M8N9
$$ -12 91 142 170 176 129 46 -16 -102 -208 -240 -267 -256 -204 -131 -55 46 93 159 159 136 62 8 -77 -177 -214 -232 -243 -195 -136
8132a36P2P4R0N1J4k2j5n2p0o5r0m6K1K8M8P1P1O5O9K6Kqm2n6l9q7m2%K1L9O9
$$ -136 -64 10 100 151 165 143 128 76 6 -59 -149 -195 -174 -146 -98 -27 44 109 178 204 206 198 156 100 61 -26 -68 -68 -47 -8 61
8163F1O7K8R4RK1jo3k4o2k6m0k3rJ3N7L2N7P5J8kNn0l0k5o3k3m5J
$$ 61 128 156 250 259 280 279 216 192 130 104 64 41 32 45 102 134 191 266 284 282 287 237 207 182 119 96 51 52
8191E2
$$ Imaginary data points
##PAGE= N=2
##DATA TABLE= (X++(I..I)), XYDATA
0@%%%%%%%%%%%%%%%jJpQqJ4j5J6j6K2k8L0l3L9m6N3o2O9p7Q6r7J11j21J35j51
$$ 0 0 0 0 0 0 0 0 0 0 0 0 0 0 0 0 -1 0 -7 1 -7 7 -8 8 -8 14 -14 16 -17 22 -24 29 -33 36 -41 45 -52 59 -62 73 -78
40g8J69j90K08k30K55k82L10l45L81m18M60n06N59o15O82p57Q39r34J045j178
$$ -78 91 -99 109 -121 134 -148 162 -183 198 -220 240 -266 293 -322 360 -397 442 -492 553 -625
60f25J335j532J780k104K553l215M293o347J1704n1677j91728j31770q5036m814
$$ -625 710 -822 958 -1146 1407 -1808 2485 -3862 7842 -43835 -235563 -367333 -452369 -457183
74d57183O4981J34701J74980J93953J75868J35063O8880l543p7825j34839j71959
$$ -457183 -392202 -257501 -82521 111432 287300 422363 491243 487700 409875 275036 103077
85A03077j78232j57997j10662m8445K2000Q5847J35616J60434J59021J30057Q0375
$$ 103077 -75155 -233152 -343814 -392259 -370259 -284412 -148796 11638 170659 300716 381091
96C81091J6421m9378j07820j48174j65176j55148j20999o7588m470N9052J11937
$$ 381091 397512 348134 240314 92140 -73036 -228184 -349183 -416771 -421241 -362189 -250252
107b50252J46245J56463J41853J04715N1719q257o5103j09627j34264j35082j12145
$$ -250252 -104007 52456 194309 299024 350743 342486 277383 167756 33492 -101590 -213735
118b13735o9395j3682M5841R9276J38066J56061J50516J22313P6480K0584l6247
$$ -213735 -283130 -296812 -250971 -151695 -13629 142432 292948 415261 491741 512325 476078
129D76078q4841j17139j28409j17042q5532l9001J4176O5426J05765J29141J30790
$$ 476078 391237 274098 145689 28647 -56885 -95886 -81710 -16284 89481 218622 349412
140C49412J11618P3017K2322k6930p8325j14492j32958j30627j08684p0669k3673
$$ 349412 461030 534047 556369 529439 451114 336622 203664 73037 -35647 -106316 -129989
151a29989K4817O6623R4993J05161R5883O8889K8761j7939o3271r9936j22039
$$ -129989 -105172 -38549 56444 161605 257488 326377 355138 337199 273928 173992 51953
162E1953j26173j11523q0852l9215O661M9487Q2217R9860R9875Q2644N1182J1048
$$ 51953 -74220 -185743 -266595 -305810 -299149 -249662 -167445 -67585 32290 114934 166116 177164
174A77164l1000o7928r3631j03743r6682p3667l8595L045M4323P8500J00176J06022
$$ 177164 146164 78236 -15395 -119138 -215820 -289487 -328082 -325037 -280714 -202214 -102038 3984
186C984R5214O9761L4057n854m3545p2735q8610q8816p3633m5610r475K8572O2220
$$ 3984 99198 168959 203016 197162 153617 80882 -7728 -96544 -170177 -215787 -225262 -196690 -134470
199a34470Q6032R6033R0723P1053M0595M186l2209o2579q2153q7957p9299n7825
$$ -134470 -48438 47595 138318 209371 249966 254152 221943 159364 77211 -10746 -90045 -147870
211a47870k7257P106L9618O4980P8947P9470O6608M2672J1559k1488n1015p2289
$$ -147870 -175127 -168021 -128403 -63423 15524 94994 161602 204274 215833 194345 143330 71041
223G1041q2009p8661o2922l7590o912K4222N0522O7831P3456O6702M8711K2554
$$ 71041 -10968 -89629 -152551 -190141 -197053 -172831 -122309 -54478 18978 85680 134391 156945
235A56945p273l5876n8624p1844p3313o2998m2760j5904J3217L9596N9018O8437
$$ 156945 149672 113796 55172 -16672 -89985 -152983 -195743 -211647 -198430 -158834 -99816 -31379
247c1379O6311N3149L1199M175k3382m7066o2864o8329o2730m7050k3986K582
$$ -31379 34932 88081 119280 123455 100073 53007 -9857 -78186 -140916 -187966 -211952 -209370
259b09370K8229M8767O0895O2735N4024L6505J3131j2272l5386n2409o0656n8962
$$ -209370 -181141 -132374 -71479 -8744 45280 81785 94916 82644 47258 -5151 -65807 -124769
271a24769m7641k8580n215J8730L9398N3345N8508N4098M1207K1952l88k2058
$$ -124769 -172410 -200990 -206205 -187475 -148077 -94732 -36224 17874 59081 81033 80645 58587
283E8587l9421m9776n1610m4483k9795j0118J1460L1242M6178N3768N3005M4074
$$ 58587 19166 -30610 -82220 -126703 -156498 -166616 -155156 -123914 -77736 -23968 29037 73111
295G3111K8579R073j1108k8695m0909m5720m2551l2045j5983K927K1478L6647
$$ 73111 101690 110763 99655 70960 30051 -15669 -58220 -90265 -106248 -103321 -81843 -45196
307d5196M5856M7843M2196K9910J3111n378k2613l5849m2885m2698l5592k2761
$$ -45196 660 48503 90699 120609 133720 128342 105729 69880 26995 -15703 -51295 -74056
319g4056o362J0641K5630L6011M0195L7653K8712J5111r25j6775k9813l7904l9871
$$ -74056 -80418 -69777 -44147 -8136 32059 69712 98424 113535 112610 95835 66022 28118 -11753
332a1753l5624k5821j2217K822J6865K7692L3513L3508K7912J7681M614r147k1197
$$ -11753 -47377 -73198 -85415 -82593 -65728 -38036 -4523 28985 56897 74578 79192 70045 48848
345D8848k9724l3260l1567k4726j4105j575J0993K1491K8223L0139K7247K0042
$$ 48848 19124 -14136 -45703 -70429 -84534 -86109 -75116 -53625 -25402 4737 31984 52026
357E2026R661j928j2911k1453k6258k6534k2440j4659m576O232J5865K2812K5965
$$ 52026 61687 59759 46848 25395 -863 -27397 -49837 -64496 -69072 -62840 -46975 -24163 1802
370A802K4999K0154J2175K613p062j5244k0594k2273k0228j4866p061J813J0210
$$ 1802 26801 46955 59130 61743 54681 39437 18843 -3430 -23658 -38524 -45585 -43772 -33562
383c3562J6759K0529K0933J7949J2232M788l186j0359j5556j7973j7397j4055
$$ -33562 -16803 3726 24659 42608 54840 59628 56442 46083 30527 12554 -4843 -18898
395a8898q497j707M974J0714J4407J5638J4310J0625N381n85o241j0695j3247
$$ -18898 -27395 -29102 -24128 -13414 993 16631 30941 41566 46947 46362 40121 29426 16179
408A6179j3611j1818q284l639J332N846R068J0628J0367Q458N137J114k845o241
$$ 16179 2568 -9250 -17534 -21173 -19841 -13995 -4927 5701 16068 24526 29663 30777 27932 21691
422B1691q470r285q536o563l712m69K641N027O387O651N816M057J736o14k736
$$ 21691 13221 3936 -4600 -11163 -14875 -15344 -12703 -7676 -1289 5362 11178 15235 16971 16357 13621
437A3621m257m924m765l884k514q77O72J870K575K803K513J813J001J99m83r12
$$ 13621 9364 4440 -325 -4209 -6723 -7600 -6928 -5058 -2483 320 2833 4646 5647 5846 5363 4451
453D451j019q91o85n03l17l30n18q31j062j308j275r23l14M43J360K194K719K738
$$ 4451 3432 2541 1856 1353 1036 706 188 -643 -1705 -3013 -4288 -5211 -5525 -5082 -3722 -1528 1191 3929
471C929K271J293j39j728l203m323m853m610l489j752M46K791M815O143O450N812
$$ 3929 6200 7493 7354 5626 2423 -1900 -6753 -11363 -14852 -16604 -16158 -13367 -8552 -2409 4041 9853
487I853M057J485j456m291o610p822p792o403l784l83L383O797R216J0280R782
$$ 9853 13910 15395 13939 9648 3038 -4784 -12576 -18979 -22763 -23146 -19763 -12966 -3750 6530 16312
502A6312P605M105j33m445q137j0514j1080r818o756k314K728P507J1303J3339
$$ 16312 23917 28022 27889 23444 15307 4793 -6287 -16105 -22861 -25175 -22447 -14940 -3637 9702
516I702J3363J1183P064J829l963r071j2801j4424j3679j0596n657L74O502J1654
$$ 9702 23065 34248 41312 43141 39178 30107 17306 2882 -10797 -21393 -27050 -26676 -20174 -8520
530h520J4985J5895J4153J0038M085k761r237j4419j7384j7591j4927r908l169
$$ -8520 6465 22360 36513 46551 50636 47875 38638 24219 6835 -10756 -25683 -35591 -38760
543c8760M108J0768J5625J7823J7096J3403P216l46q133j4843j9307k0768j8978
$$ -38760 -34652 -23884 -8259 9564 26660 40063 47279 46933 38800 23957 4650 -16118 -35096
556c5096j4109o931J445R590J6175K0077K0601J7643J1621L458n454j3705j9935
$$ -35096 -49205 -56136 -54691 -45101 -28926 -8849 11752 29395 41016 44474 39020 25315 5380
569E380k2847k2164j7832j0468j281Q201J6481K2131K4166K2264J6710Q327j431
$$ 5380 -17467 -39631 -57463 -67931 -69212 -61011 -44530 -22399 1767 24031 40741 49068 47637
582D7637j1061j8861k3519k4255k0960j3985m559N792J5391K2737K6382K5858
$$ 47637 36576 17715 -5804 -30059 -51019 -65004 -69563 -63771 -48380 -25643 739 26597
594B6597K1265J3204L042p590j6934k3328k5872k4013j8110q969J771J2466K1294
$$ 26597 47862 61066 64108 56518 39584 16256 -9616 -33629 -51739 -60708 -58937 -46471 -25177
607b5177K6756K7981K4731J7446P279m068j4743k3067k7593k7476k2871j4392
$$ -25177 1579 29560 54291 71737 79016 74948 60205 37138 9545 -17931 -40802 -55194
619e5194l452Q182J8606K5952K9082K7488K1193J1341n15j2425k2507k8980l0722
$$ -55194 -58646 -50464 -31858 -5906 23176 50664 71857 83198 82683 70258 47751 18771 -11951
632a1951k7558j9915q945L482J5234K4603K9723K9921K5071J5955M054q694k0132
$$ -11951 -39509 -59424 -68369 -64887 -49653 -25050 4673 34594 59665 75620 79674 70980 50848
645E0848k8409l2054l0625k4198j3780j146J1601K2469K9610L1765K8746K0987
$$ 50848 22439 -9615 -40240 -64438 -78218 -79364 -67763 -45294 -15684 16081 44827 65814
657F5814R634l373j5783k5679l1388l1922k7265j8093n857P329J9439K8387L2680
$$ 65814 75448 72075 56292 30613 -775 -32697 -59962 -78055 -83912 -76583 -57144 -28757 3923
670C923L1747K5602J5278K434j0761k2199l0003l2767l0122k2488j1003K391J5547
$$ 3923 35670 61272 76550 78984 68223 46024 16021 -16746 -46868 -69356 -80359 -77968 -62421
683f2421K6197L2645L3779K9474K0235P714o113j8953k8673l3621l3036k6985
$$ -62421 -36224 -3579 30200 59674 79909 87623 81510 62557 33884 263 -32773 -59758
695e9758j6347k997J0957K3104L1555L4767L2303K4438J2598j436j5244k6563
$$ -59758 -76105 -79102 -68145 -45041 -13486 21281 53584 78022 90620 89184 73940 47377
707D7377l3488l4958l0727k1436q634N523J8745K8830L4083L3651K7675J7081
$$ 47377 13889 -21069 -51796 -73232 -81866 -76343 -57598 -28768 5315 38966 66641 83722
719H3722L583j0593k3033l1813l5415l3354k5861j4252m46J3366K4884L2136L3993
$$ 83722 87305 76712 53679 21866 -13549 -46903 -72764 -87016 -87462 -74096 -49212 -17076 16917
732A6917L0220K1346Q823n250j8591k8970l4742l4899k9446j9268n950Q229K1036
$$ 16917 47137 68483 77306 72056 53465 24495 -10247 -45146 -74592 -93860 -99810 -91581 -70545
745g0545L0216L4378L2788K5772J4355N03j3497k5404l3092l5416l1929k3181
$$ -70545 -40329 -5951 26837 52609 66964 67467 53970 28566 -4526 -39942 -71871 -95052
757i5052j0579L798J7580K8435L4708L5205K9967J9854O465p885k0945l0356l4724
$$ -95052 -105631 -101833 -84253 -55818 -21110 14095 44062 63916 70381 62496 41551 11195 -23529
770b3529l3352k6364j4910r61J3158K5256L3209L5777L2503K4044J1717k466j6136
$$ -23529 -56881 -83245 -98155 -99116 -85958 -60702 -27493 8284 40787 64831 76548 74082 57946
783E7946k6971l3361l4111k9291j9604o636P377K0231K9771L4364L3359K6986
$$ 57946 30975 -2386 -36497 -65788 -85392 -92028 -84651 -64420 -34649 -285 33074 60060
795F0060J6132K696j1166k3106l1282l4249l1602k3797j2039J719J5163K6112
$$ 60060 76192 78888 67722 44616 13334 -20915 -52517 -76314 -88353 -86634 -71471 -45359
807d5359L2752L4026K9721K0511P933n942j8815k8541l3552l2974k6994j6417
$$ -45359 -12607 21419 51140 71651 79584 73642 54827 26286 -7266 -40240 -67234 -83651
819h3651l191J0689K2779L1160L4476L2151K4539J3005n97j4082k5109l1896l3318
$$ -83651 -86842 -76153 -53374 -22214 12262 44413 68952 81957 81360 67278 42169 10273 -23045
832b3045k9277k0274p906N786J8547K8314L3430L3112K7447J7346M561q949k0783
$$ -23045 -52322 -72596 -80502 -74716 -56169 -27855 5575 38687 66134 83480 88041 79092 58309
845E8309k9075l2528l0569k3569j2663L16J3262K4052L0815L2632K9121K0942
$$ 58309 29234 -3294 -33863 -57432 -70095 -69779 -56517 -32465 -1650 30982 60103 81045
857H1045R335l646j5964k5550l0909l1112k6160j6972m938P912J9431K7765L1502
$$ 81045 90380 86734 70770 45220 14311 -16801 -42961 -59933 -64871 -56959 -37528 -9763 21739
870B1739L0136K3798J3592J187j1384k2037k9036l1186k8212k0646r615K964J5011
$$ 21739 51875 75673 89265 90452 79068 57031 27995 -3191 -31403 -52049 -61664 -58700 -43689
883d3689K4559K9992L0527K6007J7140N535o939j8359k6630l0496k9357k3423
$$ -43689 -19130 10862 41389 67396 84536 90071 83132 64773 38143 7647 -21710 -45133
895d5133j3688j696J0381K0769K7650K9899K7247K0110R747k226j3744k2902k8332
$$ -45133 -58821 -60517 -50136 -29367 -1717 28182 55429 75539 85286 83060 69316 46414 18082
908A8082k9000k4952j6872o116N657J6371K4340K8251K7567K2330J3564K573q744
$$ 18082 -10918 -35870 -52742 -58858 -53201 -36830 -12490 15761 43328 65658 79222 81795 73051
921G3051j8546k5255k7811k5758j9611j0210P67J1513K0302K5719K6793K3469
$$ 73051 54505 29250 1439 -24319 -43930 -54140 -53373 -41860 -21558 4161 30954 54423
933E4423J6227O321m613j4857k2708k6832k6611k2162j4196l989O687J6064K2652
$$ 54423 70650 76971 72358 57501 34793 7961 -18650 -40812 -55008 -58997 -52310 -36246 -13594
946a3594K5348K3745J8073R328j071j1304j9867k5148k6447k3525j6892p647K686
$$ -13594 11754 35499 53572 62900 61829 50525 30658 5510 -20937 -44462 -61354 -69001 -66315
959f6315J2377J9868K3917K3915J9923J2623L217o714j5459k1674k4284k2985
$$ -66315 -53938 -34070 -10153 13762 33685 46308 49525 42811 27352 5678 -18606 -41591
971d1591j7948r986m96Q975J6922K2045K3468K1104J5401P191k076j0836j7733
$$ -41591 -59539 -69525 -70021 -61046 -44124 -22079 1389 22493 37894 45085 43009 32173 14440
984A4440k1584k1871j8520j2125l728N239J3336J9189K1901K1040J6780R830J321
$$ 14440 -7144 -29015 -47535 -59660 -63388 -58149 -44813 -25624 -3723 17317 34097 43927 45248
997D5248p295j4658j9528k1108j9259j4257o902J513R584J6050J9785K0186J7297
$$ 45248 37953 23295 3767 -17341 -36600 -50857 -57759 -56246 -46662 -30612 -10827 9359 26656
1010B6656J1576L889m333j1831j7338j9941j9300j5554r184j487O438J3140J7655
$$ 26656 38232 42121 37788 25957 8619 -11322 -30622 -46176 -55360 -56847 -50409 -37269 -19614
1023a9614J9228J7554J3102O473j101q428j4272j7675j8196j5697j0634l878L449
$$ -19614 -386 17168 30270 36743 35642 27214 12942 -4733 -22929 -38626 -49260 -53138 -49689
1036d9689J0099J5143J7562J7123J4006Q633J907n042j0964j5060j6604j5407
$$ -49689 -39590 -24447 -6885 10238 24244 32877 34784 29742 18778 3718 -12886 -28293
1048b8293j1702o095M45O889J2137J5338J5974J4097R866M144k220q156j2647
$$ -28293 -39995 -46090 -45645 -38756 -26619 -11281 4693 18790 28656 32800 30580 22424 9777
1061I777j5018j4869j2318p755j949M175R505J3284J4823J3928J0836N980K51
$$ 9777 -5241 -20110 -32428 -40183 -42132 -37957 -28452 -15168 -345 13583 24419 30399 30650
1074C0650n404j0129j3039j3695j2108q492l423K111P375J1375J3535J3478J1309
$$ 30650 25246 15117 2078 -11617 -23725 -32217 -35640 -33529 -26154 -14779 -1244 12234 23543
1087B3543P392K372k870p532j0803j2171j1474q900m775P1M867Q888J1385J2013
$$ 23543 30935 33307 30437 22905 12102 -69 -11543 -20443 -25218 -25147 -20280 -11392 -7 12006
1101A2006J0784P821L631j009n351q837j0664j0819r138o053k014K271O111Q823
$$ 12006 22790 30611 34242 33233 27882 19045 8381 -2438 -11576 -17629 -19643 -17372 -11261 -2438
1115b438J0066R632P603M366M01l546o935r125r807q936o667l379L76L935O794
$$ -2438 7628 17260 24863 29229 29630 26084 19149 10024 217 -8719 -15386 -18765 -18389 -14454 -7660
1130g660Q398Q593P362M900J631j858m971p302q368q045o499l916p34K448N165
$$ -7660 738 9331 16693 21593 23224 21366 16395 9093 725 -7320 -13819 -17735 -18469 -16021 -10856
1145a0856O967P560O921N163K609l34l150n363o636o801n859m005j530J152L544
$$ -10856 -3889 3671 10592 15755 18364 18030 14880 9517 2881 -3920 -9779 -13784 -15314 -14162 -10618
1160a0618N274O140N995M892L004P05j644l614m977n437n057l813k052L3K022
$$ -10618 -5344 796 6791 11683 14687 15392 13748 10134 5157 -280 -5337 -9150 -11202 -11169 -9147
1175i147L578M586M728M170K940J246n62k239l467m084m055l333k100o30R38K272
$$ -9147 -5569 -983 3745 7915 10855 12101 11539 9300 5833 1749 -2306 -5639 -7739 -8369 -7431 -5159
1191e159L147L514L304K512J404J19j150k179k728k881k537j770p29L25J290J946
$$ -5159 -2012 1502 4806 7318 8722 8841 7691 5512 2784 -97 -2634 -4404 -5133 -4808 -3518 -1572
1207a572K350K332J902J215M49l68j029j476j601j451j110n80K8N48R56J148J186
$$ -1572 778 3110 5012 6227 6676 6308 5279 3803 2202 751 -359 -939 -911 -363 593 1741 2927
1224B927R91P09L79K4k18l84m75l95l02j50n6M3N3Rq3j29j49j38j1J27L05M54
$$ 2927 3918 4627 5006 5030 4812 4428 3953 3558 3256 3106 3050 3093 3146 3155 3072 2943 2794 2656 2645 2772 3077 3531
1246C531N67N70L95J60j73n74r91j232j330j230r34m54J35P27J224J530J564J266
$$ 3531 4098 4668 5063 5223 5050 4476 3485 2253 923 -307 -1241 -1695 -1560 -833 391 1921 3485 4751
1264D751P29qp79j582k133k418k290j795j011KJ043J928K514K728K455J716O80
$$ 4751 5480 5472 4693 3111 978 -1440 -3730 -5525 -6536 -6534 -5491 -3563 -1049 1679 4134 5850 6530
1281F530m99j693k592l151l169k625j626l11J115K459L400L841L749K964J724
$$ 6530 6031 4338 1746 -1405 -4574 -7199 -8825 -9136 -8021 -5562 -2162 1679 5428 8392 10116
1296A0116J70j383k780l667l932l546k497j025P68K536L896M670M778M084K756
$$ 10116 10286 8903 6123 2456 -1476 -5022 -7519 -8544 -7776 -5240 -1344 3326 8104 12188 14944
1311A4944R21j047k900m293m916m801l809k196j32J983L766N006N429M881L535
$$ 14944 15865 14818 11918 7625 2709 -2092 -5901 -8097 -8229 -6246 -2480 2526 7955 12836 16371
1326A6371J491q36l129m997o061o233n372l706j434J050L364N034N873N610M405
$$ 16371 17862 17026 13897 8900 2839 -3394 -8766 -12472 -13906 -12856 -9492 -4458 1415 7025 11430
1341A1430K377k25k880n153o673p226o656n056k662J28K868N065O426O628N687
$$ 11430 13807 13582 10702 5549 -1124 -8350 -15006 -20062 -22724 -22596 -19728 -14663 -8237 -1609 4078
1356D078L801J190j727m422o430p422p314n921l608o64K458N124P078P809P351
$$ 4078 7879 9069 7342 2920 -3510 -10932 -18246 -24167 -27775 -28439 -25981 -20857 -13779 -5970 1381
1371A381N614L046p1l159n709p348p681o764m624j619J733M864P300Q637Q572
$$ 1381 6995 10041 9970 6811 1102 -6246 -13927 -20691 -25315 -26934 -25201 -20337 -13037 -4400 4172
1386D172P156M669J350k133n215p409q306p820n960l033N17M058P008Q870R308
$$ 4172 11328 15997 17347 15214 9999 2590 -5716 -13536 -19496 -22529 -22012 -17954 -10946 -2076 7232
1401G232Q324N954K665j076m625p383q891q916p431m700j130K656O051Q497R518
$$ 7232 15556 21510 24175 23099 18474 11091 2200 -6716 -14147 -18847 -19977 -17321 -11270 -2773 6745
1416F745R053P103L928J32l719p004r139r813q881o540l116P89M586P580R262
$$ 6745 15798 22901 26829 26961 23242 16238 7099 -2714 -11595 -18135 -21251 -20462 -15876 -8296 966
1431I66R431Q023N167J425k688o352r142j0497j0145q276n077j055L020O589R034
$$ 966 10397 18420 23587 25012 22324 15972 6830 -3667 -13812 -22088 -27165 -28220 -25200 -18611 -9577
1446i577R880R021O664L076j089n167q454j0368j0674r201o238k213K127O215
$$ -9577 303 9324 15988 19064 17975 12808 4354 -6014 -16688 -25889 -32127 -34340 -32213 -25998
1460b5998R281J0801J0625Q684N385J280l071o823r342j0275r401o880l121J316
$$ -25998 -16717 -5916 4709 13393 18778 20058 16987 10164 822 -9453 -18854 -25734 -28855 -27539
1474b7539N609R174J1306J1725J0381P452L408j053n206q392j0059r967q120m842
$$ -27539 -21930 -12756 -1450 10275 20656 28108 31516 30463 25257 16865 6806 -3161 -11281 -16123
1488a6123o73L730P641J0323J1424J0695Q290M533M2m422q193j0568j1249j0120
$$ -16123 -16796 -13066 -5425 4898 16322 27017 35307 39840 39882 35460 27267 16699 5450 -4670
1502d670p318l400J052N295Q602J0368J0382Q566N228Q97l680p839j0791j2084
$$ -4670 -11988 -15388 -14336 -9041 -439 9929 20311 28877 34105 35002 31322 23483 12692 608
1516F08j1497r177n410r12L681P530J0033J0713R587O768K705j894o321r669j1599
$$ 608 -10889 -20066 -25476 -26388 -22707 -15177 -5144 5569 15156 21924 24629 22735 16414 6745 -4854
1531d854j1607r840o453k085K650O826R954J1338J0846Q619M959M88l998p846
$$ -4854 -16461 -26301 -32754 -34839 -32189 -25363 -15409 -4071 6775 15394 20353 20841 16843 8997
1545H997j0384j1165j0091p314l320J274N684R254J1332J1582R993O889K674j935
$$ 8997 -1387 -12552 -22643 -29957 -33277 -32003 -26319 -17065 -5733 5849 15842 22731 25405 23470
1559B3470o099r226j0768j0497q415m918m93M018P950J0651J1606J0754Q153M293
$$ 23470 17371 8145 -2623 -13120 -21535 -26453 -26946 -22928 -14978 -4327 7279 18033 26186 30479
1573C0479k40m717q331j0526j0936r508o472k340K219O497R645J1251J1028R000
$$ 30479 30239 25522 17191 6665 -4271 -13779 -20251 -22591 -20372 -13875 -4230 7021 18049 27049
1587B7049N434J094l566p510j0294j1332j0564q073m297J82M559Q147J0300J0696
$$ 27049 32483 33577 30011 22501 12207 875 -9689 -17762 -22059 -21877 -17318 -9171 1129 11825
1601A1825R379O360K322k186o425r572j1247j1155r311o007j819K623O499R273
$$ 11825 21204 27564 29886 27700 21275 11703 456 -10699 -20010 -26017 -27836 -25213 -18714 -9441
1615i441J0419R764P515L937l02m590q110j0400j0971r787p089l184J144N282
$$ -9441 978 10742 18257 22194 21892 17302 9192 -1208 -12179 -21966 -29055 -32239 -31095 -25813
1629b5813Q534J0337J0477Q808N781J797k489o329r085j0317r792p675m185J6
$$ -25813 -17279 -6942 3535 12343 18124 19921 17432 11103 2018 -8299 -18091 -25766 -29951 -29935
1643b9935M246P826J0168J0876R810P267L487o62m724p937r703r856q297n346
$$ -29935 -25689 -17863 -7695 3181 12991 20258 23745 23083 18359 10422 719 -9137 -17434 -22780
1657b2780j412K740O557R261J0547J0101Q095M823Q11l275o717r028r809q903
$$ -22780 -24192 -21452 -14895 -5634 4913 15014 23109 27932 28743 25468 18751 9723 -86 -8989
1671h989o549l132Q78M726P786R551R836Q489N762K132j814n514q202r611r468
$$ -8989 -15538 -18670 -17792 -13066 -5280 4271 14107 22596 28358 30490 28676 23162 14960 5349 -4119
1686d119p716m814j145K650O002Q270R118Q451O331L108o60m378p439r325r736
$$ -4119 -11835 -16649 -17794 -15144 -9142 -872 8246 16697 23028 26136 25476 21098 13659 4334 -5402
1701e402q583o183k770R35M462P100Q489Q382O867M089O11l031o279q434r309
$$ -5402 -13985 -20168 -22938 -22003 -17541 -10441 -1952 6430 13297 17386 17997 14966 8687 253 -9056
1716i056q695o729l671p7L494O383Q217Q701P673N453K390j082m326o741q056
$$ -9056 -17751 -24480 -28151 -28228 -24734 -18351 -10134 -1433 6240 11693 14083 13001 8675 1934 -6122
1731f122q006o577m030p82K612N622P816Q708Q296O596L972P31k508n208o933
$$ -6122 -14128 -20705 -24735 -25517 -22905 -17283 -9467 -759 7537 14133 18105 18836 16328 11120 4187
1746D187p494o724m787j988J131M138O471P831P875O705M482J552j618m454o546
$$ 4187 -3307 -10031 -14818 -16806 -15675 -11537 -5066 2765 10640 17345 21827 23379 21761 17307 10761
1761A0761p526p319n886l538o31K322M847O513P038O365M619K046r19l725o005
$$ 10761 3235 -4084 -9970 -13508 -14139 -11817 -6970 -457 6581 12946 17565 19611 18692 14967 8962
1776H962p312p405o429m451j790J092L720N642O557O356N117K965L18k343m662
$$ 8962 1650 -5755 -12184 -16635 -18425 -17333 -13613 -7971 -1414 4942 10059 13024 13342 10999 6337
1791F337o195o718o148m607k309L25K907M969O200O426N624L923J639q78l253
$$ 6337 142 -6576 -12724 -17331 -19640 -19315 -16408 -11439 -5239 1187 6811 10734 12373 11495 8242
1806H242m946n869n783m754k933n59J837L922N387N995N590M315K395R6k194m110
$$ 8242 3296 -2573 -8356 -13110 -16043 -16602 -14765 -10843 -5456 539 6129 10444 12839 12935 10741 6631
1822F631n241n551m885l476j470P99K868M494N346N339M423K821Q04j348l270
$$ 6631 1390 -4161 -9046 -12522 -13992 -13193 -10325 -5831 -485 4854 9277 12098 12902 11554 8284
1837H284m566n122m801l728k024L1K059L714M744N022M488L211J478m62k346l714
$$ 8284 3718 -1404 -6205 -9933 -11957 -11926 -9867 -6153 -1409 3613 8101 11312 12790 12328 9982 6268
1853F268m477m489l765k395o40J160K815L951M462M237L333J920J69j524k963
$$ 6268 1791 -2698 -6463 -8858 -9498 -8338 -5523 -1572 2890 7127 10460 12380 12549 11025 8062
1868H062l898m207l810k798j381K35J799L004L681L775L211K094O84q81k301l299
$$ 8062 4164 -43 -3853 -6651 -8032 -7797 -5998 -2994 687 4462 7673 9767 10451 9570 7269 3970
1884C970l774l647l002j783m10J064K268L137L338L070K315J101k18j563k578
$$ 3970 196 -3451 -6453 -8236 -8646 -7582 -5314 -2177 1161 4231 6546 7647 7429 5866 3288
1899C288l155l241k764j885o94O13J757K626L008K930K369J454L23q90j825k501
$$ 3288 133 -3108 -5872 -7757 -8451 -7838 -6081 -3455 -447 2483 4852 6306 6629 5739 3914 1413
1915A413k709k526j850r17J43J168J988K473K572K226J562O26l18j259j907k266
$$ 1413 -1296 -3822 -5672 -6589 -6446 -5278 -3290 -817 1755 3981 5543 6169 5851 4592 2685 419
1931D19k227j818j149k84N86J346J884K047J953J503Q00K8p64j354j739j865j680
$$ 419 -1808 -3626 -4775 -5059 -4473 -3127 -1243 804 2757 4260 5060 5088 4324 2970 1231 -634 -2314
1948b314j137n08J92Q83J345J620J638J394Q82K63l46q78j239j438j347j009n52
$$ -2314 -3451 -3959 -3767 -2884 -1539 81 1719 3113 3995 4258 3912 3034 1795 357 -990 -1999 -2551
1965b551l9N27R43J210J274J131P86L87q7n03q16r90r75q30n38j54J88N51P20
$$ -2551 -2590 -2063 -1120 90 1364 2495 3281 3668 3581 3078 2262 1272 297 -533 -1071 -1225 -1037 -486 234
1984B34Q38Q12N64L38N5k52m61o27o27n91m26k39k9J92K92L85L77L13J72K6j05
$$ 234 1072 1884 2448 2786 2841 2589 2128 1501 874 283 -143 -382 -411 -219 73 458 835 1148 1320 1346 1241
2005A241k03k71k97k54k36j36r0m0J9K8jj4k7k5m0rK8Q3J52R4P8O7m1j45k20k59
$$ 1241 1038 767 470 216 -20 -156 -246 -286 -267 -239 -240 -254 -281 -306 -346 -355 -327 -244 -92 2 80 147 106 -39 -259 -518
2031e18k98k28j53j0J71K99M52N11N13M54K70N3j68l80n22n59n27l61r1J39M50
$$ -518 -816 -1044 -1197 -1207 -1036 -737 -285 226 739 1193 1463 1516 1348 968 446 -113 -640 -1001 -1092 -953 -503
2052e03O83Q41Q59P30N06J59j67n06p84q91q91p62l78l3L67P48J001J061R80P20
$$ -503 180 1021 1880 2610 3116 3275 3108 2602 1818 927 36 -726 -1104 -1137 -770 -22 979 2040 3020 3740
2072C740L22j46o41r88j285j275j158q12l35K12O85J067J251J237R72N39n2o26
$$ 3740 4062 3916 3275 2287 1002 -273 -1431 -2243 -2578 -2366 -1681 -614 637 1874 2846 3385 3333 2707
2090B707j141j497j663j529j174o55K1O00J145J429J486J329Q69K41m49j076j593
$$ 2707 1566 69 -1594 -3123 -4297 -4952 -4931 -4331 -3186 -1757 -271 1058 1927 2168 1719 643 -950
2107i50j830j776j436q99k11N48J211J655J860J733J361P13k7q08j436j835j915
$$ -950 -2780 -4556 -5992 -6891 -7102 -6554 -5343 -3688 -1828 -95 1266 1979 1952 1144 -292 -2127 -4042
2124d042j673j137m44L98J140J820K123K131J802J202M19m94j256j791k082j968
$$ -4042 -5715 -6852 -7296 -6898 -5758 -3938 -1815 316 2118 3320 3739 3245 1989 198 -1884 -3852
2140c852j506p93O1R81J728K205K345K109J547P02k54j149j877k298k317j991
$$ -3852 -5358 -6151 -6090 -5109 -3381 -1176 1169 3278 4825 5527 5273 4124 2247 -51 -2368 -4359
2156d359j278l35O13J494K128K449K323J819J003K1r98j871k397k591k344j716
$$ -4359 -5637 -5972 -5359 -3865 -1737 712 3035 4854 5857 5878 4880 3009 612 -1979 -4323 -6039
2172f039p84K78J242K029K513K571K184J455M74o15j561k330k679k571k085j188
$$ -6039 -6823 -6545 -5303 -3274 -761 1810 3994 5449 5923 5308 3747 1417 -1262 -3833 -5918 -7106
2188g106j66R38J887K506K758K555J932R65j36j266k063k689k747k462j666o19
$$ -7106 -7272 -6334 -4447 -1941 817 3372 5304 6269 6133 4867 2804 115 -2632 -5094 -6760 -7379
2204g379N40J571K449K794K849K276J406L06q97j898k613k904k731k057j051J33
$$ -7379 -6839 -5268 -2819 -25 2824 5100 6506 6812 5915 4017 1404 -1500 -4231 -6288 -7339 -7206
2220g206J318K288K905L029K666J895Q25m18j567k412k860k825k320j386k13R79
$$ -7206 -5888 -3600 -695 2334 5000 6895 7720 7302 5735 3323 463 -2362 -4682 -6068 -6281 -5302
2236e302K094K830L197L000K322J360R3j119k157k797k997k636j918p81M36J582
$$ -5302 -3208 -378 2819 5819 8141 9501 9594 8475 6318 3521 524 -2112 -4030 -4811 -4375 -2793
2252b793K511L057L055K551J697M77q03j968k783l207l073k460j468k43R93K073
$$ -2793 -282 2775 5830 8381 10078 10555 9752 7784 5001 1794 -1279 -3739 -5207 -5450 -4457 -2384
2268b384K784K999K715J945Q52m73j658k660l227l256k815j868p01O15J828K699
$$ -2384 400 3399 6114 8059 8911 8438 6780 4120 893 -2363 -5178 -7046 -7747 -7132 -5304 -2605
2284b605L077L001K356J357J35j185k216k920l187k888k094r92L08J548K567L134
$$ -2605 472 3473 5829 7186 7321 6136 3920 1000 -2187 -5075 -7169 -8161 -7853 -6305 -3738 -604
2300f04L200K779J905P33n59j744k618l059k974k431j428k66J023K119K890L164
$$ -604 2596 5375 7280 8013 7454 5710 3092 33 -2941 -5372 -6800 -7066 -6043 -3924 -1034 2130
2316B130K940K207J167j08j330k367l006l167k798j988q80L99J590K505K995K980
$$ 2130 5070 7277 8444 8336 7006 4639 1633 -1534 -4332 -6320 -7200 -6801 -5211 -2706 289 3269
2332C269K493J492L51r18k050k845l164l027k340j287n6J181K258K905L053K727
$$ 3269 5762 7254 7605 6687 4637 1792 -1372 -4399 -6739 -8026 -8082 -6901 -4643 -1738 1315 4042
2348D042J926Q22m24j618k528l015l041k531j576m47Q18J919K742L065K925K258
$$ 4042 5968 6790 6366 4748 2220 -795 -3836 -6367 -7943 -8390 -7572 -5653 -2911 154 3079 5337
2364E337J271R3j147k164k849l010k753j957r11L18J445K401K914K934K514J669
$$ 5337 6608 6701 5554 3390 541 -2469 -5222 -7179 -8090 -7772 -6327 -3926 -1012 1922 4436 6105
2380F105N38o70j782k553k977k873k275j350k09R98K038K737K907K689J991R90
$$ 6105 6643 5973 4191 1638 -1339 -4212 -6487 -7837 -8046 -7048 -5010 -2273 634 3323 5314 6304
2396F304k03j346k271k799k873k509j649n88O13J657K510K865K799K263J352K22
$$ 6304 6101 4755 2484 -315 -3188 -5697 -7346 -7934 -7321 -5664 -3154 -289 2510 4773 6125 6347
2412F347r35j896k580k827k592j944r59J77J292K157K711K764K448J647O66m84
$$ 6347 5412 3516 936 -1891 -4483 -6427 -7386 -7209 -5917 -3760 -1049 1715 4163 5810 6476 5992
2428E992j508k310k678k647k152j357k65Q22J752K500K659K568J965J065Qj061
$$ 5992 4484 2174 -504 -3151 -5303 -6660 -6925 -6103 -4351 -1851 808 3376 5341 6406 6414 5353
2444E353j898k487k609k333j625o79L50J359K159K535K597K184J392M17o40j548
$$ 5353 3455 968 -1641 -3974 -5599 -6278 -5928 -4569 -2410 125 2722 4906 6298 6715 6075 4527
2460D527k216k540k434j887j031j8R50J818K309K510K269J579P21l21j268k014
$$ 4527 2311 -229 -2663 -4550 -5581 -5599 -4649 -2831 -522 1988 4257 5836 6557 6236 4968 2954
2476B954k390k448k077j328l88N52J464K076K339K262J764R71P0q86j677k209
$$ 2954 564 -1884 -3961 -5289 -5677 -5125 -3661 -1585 754 3016 4780 5751 5821 4935 3258 1049
2492A049k336k132j557p15J87J099J802K189K244J915J305M65m35j298j837k181
$$ 1049 -1287 -3419 -4976 -5691 -5504 -4405 -2603 -414 1830 3745 5050 5515 5080 3782 1945 -236
2508b36k109j709r95j86P24J478J968K154J986J519P66o4r05j559j983k056j824
$$ -236 -2345 -4054 -5049 -5235 -4511 -3033 -1065 1089 3075 4594 5360 5296 4391 2832 849 -1207 -3031
2525c031j256m68L17J107J683K009J947J607R90K01n91j311j765j977j832j420
$$ -3031 -4287 -4755 -4438 -3331 -1648 361 2308 3915 4905 5106 4515 3204 1439 -538 -2370 -3790
2541c790p36M4Q07J405J770J894J661J153M75k98r70j500j781j794j476r09k23
$$ -3790 -4526 -4482 -3675 -2270 -500 1394 3055 4208 4683 4385 3415 1915 134 -1660 -3136 -4045 -4268
2558d268M72J112J572J739J655J307P11L3o36j195j605j677j531j080n02J59P82
$$ -4268 -3796 -2684 -1112 627 2282 3589 4300 4333 3697 2502 897 -780 -2311 -3391 -3893 -3734 -2952
$$ [...]
8191c9
##END NTUPLES=NMR FID
##END=
