##TITLE=1H ikalashn
LY-OP.1
18.4.2024
##JCAMPDX= 6.0         $$ Bruker NMR JCAMP-DX V2.0
##DATA TYPE= NMR FID
##DATA CLASS= NTUPLES
##ORIGIN= UXNMR, Bruker Analytische Messtechnik GmbH
##OWNER= root
$$ TOPSPIN		Version 1.3
$$ 2024-04-18 13:56:19.390 +0400  Irina@DPX200
$$ Compression mode = diff/dup
##.OBSERVE FREQUENCY= 200.131300845
##.OBSERVE NUCLEUS= ^1H
##.DELAY= (6, 6)
##.ACQUISITION MODE= SIMULTANEOUS
##.ACQUISITION SCHEME= undefined
##.AVERAGES= 8
##.DIGITISER RES= 18
##SPECTROMETER/DATA SYSTEM= spect
##.PULSE SEQUENCE= zg
##.SOLVENT NAME= CDCl3
##.SHIFT REFERENCE= INTERNAL, CDCl3, 1, 16.50952
##AUDIT TRAIL= $$ (NUMBER, WHEN, WHO, WHERE, WHAT)
$$ ##TITLE= Audit trail, TOPSPIN		Version 1.3
$$ ##JCAMPDX= 5.01
$$ ##ORIGIN= Bruker BioSpin GmbH
$$ ##OWNER= Irina
$$ $$ F:/spectra/data/iren/nmr/1H/4/audita.txt
$$ ##AUDIT TRAIL=  $$ (NUMBER, WHEN, WHO, WHERE, VERSION, WHAT)
(   1,<2024-04-18 13:56:09.500 +0400>,<Irina>,<DPX200>,<TOPSPIN 1.3>,
      <created by zg
	started at 2024-04-18 13:55:31.265 +0400,
	POWCHK disabled, PULCHK disabled
       configuration hash MD5:
       BE 6D 3F 07 2A EA 11 49 91 17 2B D3 AF B3 58 0D
       data hash MD5: 16K
       A5 D8 DE 57 F9 CC 41 93 F1 30 A9 69 18 4C 03 10>)
$$ ##END=
$$ 
$$ $$ hash MD5
$$ $$ 3A 90 B0 74 C3 41 82 A2 CA FE 39 B4 A5 FC 42 87
##$RELAX= 
##$RELAX= 
##$RELAX= 
##$RELAX= 
##$RELAX= 
##$RELAX= 
##$RELAX= 
##$RELAX= 
$$ Bruker specific parameters
$$ --------------------------
##$DU= <F:/spectra>
##$EXPNO= 4
##$NAME= <1H>
##$PROCNO= 1
##$TYPE= <nmr>
##$USER= <iren>
##$AMP= (0..31)
100 100 100 100 100 100 100 100 100 100 100 100 100 100 100 100 100 100 
100 100 100 100 100 100 100 100 100 100 100 100 100 100 
##$ANAVPT= -1
##$AQSEQ= 0
##$AQ_mod= 1
##$AUNM= <au_zg>
##$AUTOPOS= <>
##$BF1= 200.13
##$BF2= 200.13
##$BF3= 200.13
##$BF4= 200.13
##$BF5= 200.13
##$BF6= 200.13
##$BF7= 200.13
##$BF8= 200.13
##$BYTORDA= 1
##$CFDGTYP= 0
##$CFRGTYP= 5
##$CHEMSTR= <none>
##$CNST= (0..63)
1 1 145 1 1 1 1 1 1 1 1 1 1 1 1 1 1 1 1 1 1 1 1 1 1 1 1 1 1 1 1 1 1 1 
1 1 1 1 1 1 1 1 1 1 1 1 1 1 1 1 1 1 1 1 1 1 1 1 1 1 1 1 1 1 
##$CPDPRG= <>
##$CPDPRG1= <>
##$CPDPRG2= <>
##$CPDPRG3= <>
##$CPDPRG4= <mlev>
##$CPDPRG5= <mlev>
##$CPDPRG6= <mlev>
##$CPDPRG7= <mlev>
##$CPDPRG8= <mlev>
##$CPDPRGB= <>
##$CPDPRGT= <>
##$D= (0..63)
0 2 0 0 0 0 0 0 0 0.06 0 0.03 0 0 0 0 0.0002 0 0 0 0 0 0 0 0 0 0 0 0 0 
0 0 0 0 0 0 0 0 0 0 0 0 0 0 0 0 0 0 0 0 0 0 0 0 0 0 0 0 0 0 0 0 0 0 
##$DATE= 1713434166
##$DBL= (0..7)
120 120 120 120 120 120 120 120 
##$DBP= (0..7)
150 150 150 150 150 150 150 150 
##$DBP07= 0
##$DBPNAM0= <>
##$DBPNAM1= <>
##$DBPNAM2= <>
##$DBPNAM3= <>
##$DBPNAM4= <>
##$DBPNAM5= <>
##$DBPNAM6= <>
##$DBPNAM7= <>
##$DBPOAL= (0..7)
0.5 0.5 0.5 0.5 0.5 0.5 0.5 0.5 
##$DBPOFFS= (0..7)
0 0 0 0 0 0 0 0 
##$DE= 6
##$DECBNUC= <off>
##$DECIM= 32
##$DECNUC= <off>
##$DECSTAT= 4
##$DIGMOD= 1
##$DIGTYP= 9
##$DL= (0..7)
0 120 120 120 120 120 120 120 
##$DP= (0..7)
150 150 150 150 150 150 150 150 
##$DP07= 0
##$DPNAME0= <>
##$DPNAME1= <>
$$ [...]
##$SW= 20.0189087838548
##$SWIBOX= (0..15)
0 0 2 0 0 0 0 0 0 0 0 0 0 0 0 0 
##$SW_h= 4006.41025641026
##$TD= 16384
##$TD0= 1
##$TE= 300
##$TE2= 300
##$TE3= 300
##$TEG= 300
##$TL= (0..7)
0 120 120 120 120 120 120 120 
##$TP= (0..7)
150 150 150 150 150 150 150 150 
##$TP07= 0
##$TPNAME0= <>
##$TPNAME1= <>
##$TPNAME2= <>
##$TPNAME3= <>
##$TPNAME4= <>
##$TPNAME5= <>
##$TPNAME6= <>
##$TPNAME7= <>
##$TPOAL= (0..7)
0.5 0.5 0.5 0.5 0.5 0.5 0.5 0.5 
##$TPOFFS= (0..7)
0 0 0 0 0 0 0 0 
##$TUNHIN= 0
##$TUNHOUT= 0
##$TUNXOUT= 0
##$USERA1= <user>
##$USERA2= <user>
##$USERA3= <user>
##$USERA4= <user>
##$USERA5= <user>
##$V9= 5
##$VALIST= <valist>
##$VCLIST= <CCCCCCCCCCCCCCC>
##$VD= 0
##$VDLIST= <DDDDDDDDDDDDDDD>
##$VPLIST= <PPPPPPPPPPPPPPP>
##$VTLIST= <TTTTTTTTTTTTTTT>
##$WBST= 1024
##$WBSW= 25
##$XGAIN= (0..3)
0 0 0 0 
##$XL= 0
##$YL= 0
##$YMAX_a= 787084
##$YMIN_a= -450826
##$ZGOPTNS= <>
##$ZL1= 120
##$ZL2= 120
##$ZL3= 120
##$ZL4= 120
##$ABSF1= 10
##$ABSF2= 0
##$ABSG= 5
##$ABSL= 3
##$ALPHA= 0
##$AQORDER= 0
##$ASSFAC= 0
##$ASSFACI= 0
##$ASSFACX= 0
##$ASSWID= 0
##$AUNMP= <proc_1d>
##$AXLEFT= 0
##$AXRIGHT= 0
##$AXTYPE= 0
##$AXUNIT= <>
##$AZFE= 0.1
##$AZFW= 0.1
##$BCFW= 1
##$BC_mod= 2
##$BYTORDP= 1
##$COROFFS= 0
##$CY= 7568.61572265625
##$DATMOD= 1
##$DC= 2
##$DFILT= <>
##$DTYPP= 0
##$F1P= 17.4489326093798
##$F2P= -7.48496080290002
##$FCOR= 0.5
##$FTSIZE= 32768
##$FT_mod= 4
##$GAMMA= 1
##$GB= 1
##$INTBC= 1
##$INTSCL= 1
##$ISEN= 128
##$LB= 0.2
##$LEV0= 0
##$LPBIN= 0
##$MAXI= 945.577
##$MC2= 0
##$MEAN= 0
##$ME_mod= 0
##$MI= -402.1523
##$NCOEF= 0
##$NC_proc= 0
##$NLEV= 6
##$NOISF1= 8.587773
##$NOISF2= 6.764455
##$NSP= 1
##$NTH_PI= 0
##$NZP= 0
##$OFFSET= 16.50952
##$PC= 1
##$PHC0= 290.283
##$PHC1= 119.7537
##$PH_mod= 0
##$PKNL= yes
##$PPARMOD= 0
##$PPDIAG= 0
##$PPIPTYP= 0
##$PPMPNUM= 100
##$PPRESOL= 1
##$PSCAL= 0
##$PSIGN= 0
##$REVERSE= no
##$SF= 200.13
##$SI= 32768
##$SIGF1= 18.5376
##$SIGF2= -6.396296
##$SINO= 400
##$SIOLD= 32768
##$SREGLST= <1H.CDCl3>
##$SSB= 3
##$STSI= 0
##$STSR= 0
##$SW_p= 4006.41025641026
##$SYMM= 0
##$S_DEV= 0
##$TDeff= 0
##$TDoff= 0
##$TI= <>
##$TILT= no
##$TM1= 0
##$TM2= 0
##$TOPLEV= 0
##$USERP1= <user>
##$USERP2= <user>
##$USERP3= <user>
##$USERP4= <user>
##$USERP5= <user>
##$WDW= 1
##$XDIM= 8192
##$YMAX_p= 0
##$YMIN_p= 0
$$ End of Bruker specific parameters
$$ ---------------------------------
##NTUPLES= NMR FID
##VAR_NAME=  TIME,          FID/REAL,        FID/IMAG
##SYMBOL=    X,             R,               I
##VAR_TYPE=  INDEPENDENT,   DEPENDENT,       DEPENDENT
##VAR_FORM=  AFFN,          ASDF,            ASDF
##VAR_DIM=   8192,          8192,            8192
##UNITS=     SECONDS,       ARBITRARY UNITS, ARBITRARY UNITS
##FACTOR=    0.0002496,     1,               1
##FIRST=     0,             0,               0
##LAST=      2.0444736,     23,              -16
##MIN=       0,             -450826,         -450826
##MAX=       2.0444736,     787084,          787084
$$ Real data points
##PAGE= N=1
##DATA TABLE= (X++(R..R)), XYDATA
0@%%%%%%pPpJ4j4J5k2K9l6M4n2O5q1R7j19J42j68J99k33K75l20L73m30M92n62
$$ 0 0 0 0 0 0 0 -7 0 -7 7 -7 8 -14 15 -21 23 -29 36 -45 52 -67 75 -93 106 -127 148 -172 201 -229 263 -299
31b99O42p32Q30r40J060j191J334j494J671j861K070k295K542k816L113l436L791
$$ -299 343 -389 441 -499 561 -630 704 -790 881 -980 1090 -1205 1337 -1479 1634 -1802 1989
48A989m181M605n073N588o158O796p506Q304r207J0241j1440J2845j4518J6557
$$ 1989 -2192 2413 -2660 2928 -3230 3566 -3940 4364 -4843 5398 -6042 6803 -7715 8842
62H842j9104K2389k6814L3136m2999O0698j02568L91282M62222j88983q5907k27078
$$ 8842 -10262 12127 -14687 18449 -24550 36148 -66420 324862 787084 598101 512194 285116
74B85116j41067j66789o0186l4519O8962R3022J54708J37180J38184P3549K9489
$$ 285116 144049 -22740 -82926 -117445 -48483 44539 199247 336427 474611 548160 577649
85E77649n4347j02500j62640j74652j82281j43295j01892l1123K6759Q9940J22917
$$ 577649 523302 420802 258162 83510 -98771 -242066 -343958 -375081 -348322 -258382 -135465
96a35465J43634J28508R9223M4133j1780p2661j15975j45346j46027j26756q3130
$$ -135465 8169 136677 235900 280033 268253 195592 79617 -65729 -211756 -338512 -421642
107d21642k9184L2550Q6278J28142J47302J44564J17560P3744J8570l6826q4885
$$ -421642 -450826 -418276 -331998 -203856 -56554 88010 205570 279314 297884 261058 176173
118A76173j15982j26323j13465q0620l2594K1802P3817J14238J36851J37483J16309
$$ 176173 60191 -66132 -179597 -260217 -292811 -271009 -197192 -82954 53897 191380 307689
129C07689P7098K6256k7701p5955j10439j25821j19931r4052n2774l319M5777
$$ 307689 384787 411043 383342 307387 196948 71127 -48804 -142856 -195630 -198949 -153172
140a53172Q6384J11558J17325J02763P0630K6376k2641o8197j02729j20816j19690
$$ -153172 -66788 44770 162095 264858 335488 361864 339223 271026 168297 47481 -72209
151g2209r9670o4393k0000K6185O6442R4201J04897R7206P2699L5546p904n0182
$$ -72209 -171879 -236272 -256272 -230087 -163645 -69444 35453 132659 205358 240904 233000 182818
163A82818q4211j04552j07844r3595o4449k5321J7213N6287Q5322R9491R6901
$$ 182818 98607 -5945 -113789 -207384 -271833 -297154 -279941 -223654 -138332 -38841 58060
174E8060P8113M6154O780l3435o7852r0695r8332q9583o6132l2073O999M4314
$$ 58060 136173 182327 189107 155672 87820 -2875 -101207 -190790 -256922 -288995 -281996 -237682
186b37682P3731R0289R1514P7182M9804J4270k3582n7413q1541r2012q7352o8528
$$ -237682 -163951 -73662 17852 95034 144838 159108 135526 78113 -3428 -95440 -182792 -251320
198b51320l8748l033L2343O1697Q0207Q4930P5140N2963K2193j1940m3627o7542
$$ -251320 -290068 -293101 -260758 -199061 -118854 -33924 41216 94179 116372 104432 60805 -6737
210f737p9758p8423o3905l8621p007K5672N4016P3526Q0932P5269N7860L1661
$$ -6737 -86495 -164918 -228823 -267444 -274451 -248779 -194763 -121237 -40305 34964 92824 124485
222A24485J091k8535n2401o6442o8746n8741l8379j1228J8169M4964O4573P3836
$$ 124485 125576 97041 44640 -21802 -90548 -149289 -187668 -198896 -180727 -135763 -71190 2646
234B646P1337N7566L4900P083k1164m5083o0981o6211o0100m3773k0246O529L1974
$$ 2646 73983 131549 166449 173532 152368 107285 46304 -19907 -80007 -123780 -144026 -137497 -105523
247a05523N1835O2592O2739N2220L2750P721j8639m1933n8491o5383o1840m8462
$$ -105523 -53688 8904 71643 123863 156613 164334 145695 103762 45271 -20112 -81952 -130414
259a30414k7711l088K1268M1149N3393N6046M8815L3031J1491j2073l3723m9799
$$ -130414 -158125 -161213 -139945 -98796 -45403 10643 59458 92489 103980 91907 58184 8385
271H385n7600n5997m5403k7604n564J6913L6130M8988N3611M9174L6823J8634
$$ 8385 -49215 -105212 -150615 -178219 -183783 -166870 -130740 -81752 -28141 21033 57856 76490
283G6490k115k2056l7683m6439m7036l9467k4923o058J4023L1952M4914N0706
$$ 76490 74375 52319 14636 -31803 -78839 -118306 -143229 -149287 -135264 -103312 -58398 -7692
295g692M8418L8776K3343M731j3880k9349l9181m1869l7076k5657r632Q155K4838
$$ -7692 40726 79502 102845 107576 93696 64347 25166 -16703 -53779 -79436 -89068 -80913 -56075
308e6075L7498M4046M3546L6119K2942O352j0800k5788l6091m0187l7363k8379
$$ -56075 -18577 25469 69015 105134 128076 134428 123628 97840 61749 21562 -15801 -44180
320d4180j4781J010J6422K8733L5903L6977L1697K1106O986q183k1813l1869l6595
$$ -44180 -58961 -57951 -41529 -12796 23107 60084 91781 112887 119873 111690 89877 58008 21413
333B1413l5327k8435j7304l675J0089K1606K9055L1285K8174K0069Q674m137j6154
$$ 21413 -13914 -42349 -59653 -63328 -53239 -31633 -2578 28707 56881 76950 85624 81487 65333
346F5333k5526l0552l0569k5765j6975n625O278J6689K4090K7149K5628J9811
$$ 65333 39807 9255 -21314 -47079 -64054 -69679 -63401 -46712 -22622 4527 30155 49966
358D9966J0732Q5j0424j9013k4230k5316k2231j5502o259L773J3005J9946K3438
$$ 49966 60698 60783 50359 31346 7116 -18200 -40431 -55933 -62192 -58419 -45414 -25468 -2030
371b030K3023J8855J1737K909o130j3875j8971k0746j8940j4002o723J520R369
$$ -2030 20993 39848 51585 54494 48364 34489 15518 -5228 -24168 -38170 -44893 -43373 -34004
384c4004J5547J9012J9277J6491J1107M108l332r847j4494j6551j5732j2319o980
$$ -34004 -18457 555 19832 36323 47430 51538 48206 38359 23865 7314 -8418 -20737 -27717
397b7717o93N580J0683J3814J4519J2895R169M062j527o550j0460j2424j2245
$$ -27717 -28410 -22830 -12147 1667 16186 29081 38250 42312 40785 34235 23775 11351 -894
410h94j0141o573k081K534O450R028R965R283O998L612j93l749o621q283q450
$$ -894 -11035 -17608 -19689 -17155 -10705 -1677 8288 17571 24569 28181 27988 24239 17618 9335 885
425H85p310n134k235Q09L438N330O172N931M749K782N96j580l329m343m572m082
$$ 885 -6425 -11559 -13794 -12985 -9547 -4217 1955 7886 12635 15417 16013 14433 11104 6761 2189 -1893
441a893k947j529%J271K153K568K509J962J241M67k28p34r79q83p22n21l27l16
$$ -1893 -4840 -6369 -6369 -5098 -2945 -377 2132 4094 5335 5802 5574 4840 3861 2978 2256 1735 1408 1092
459A092m34o80r57j182j251r70m54K10J054J834K442K550K181J396J01j382k759
$$ 1092 658 -22 -979 -2161 -3412 -4382 -4836 -4626 -3572 -1738 704 3254 5435 6831 6932 5550 2791
476B791l887m502m347l412j862K11K369M318N572O012N452L832J516j227l891
$$ 2791 -1096 -5598 -9945 -13357 -15219 -15008 -12639 -8321 -2749 3263 8715 12547 14063 12836 8945
491H945o055p204p205n892l458j96L274O431Q634R590Q995O854L518m67m496p840
$$ 8945 2890 -4314 -11519 -17411 -20869 -21065 -17791 -11360 -2726 6864 15859 22713 26231 25764 21268 13428
507A3428r883j0162q753n686j397L323P703J0952J2569J2128R653N529M24m891
$$ 13428 3545 -6617 -15370 -21056 -22453 -19130 -11427 -475 12094 24222 33875 39404 39828 34937
521C4937r490j2508j3423j2114q687l659K087P623J1963J4403J4404J1906P350
$$ 34937 25447 12939 -484 -12598 -21285 -24944 -22857 -15234 -3271 11132 25536 37442 44792
534D4792J404n050j0725j4836j6600j5653j2153o638oO686J2300J5751J6479J4417
$$ 44792 46196 41146 30421 15585 -1015 -16668 -28821 -35459 -35465 -28779 -16479 -728 15751 30168
548C0168R720L155m225j1060j6341j9029j8690j5328r362j903O026J2924J7652
$$ 30168 39888 43043 38818 27758 11417 -7612 -26302 -41630 -50992 -52895 -46869 -33945 -16293
561a6293J9358J7775J3142O049k223j0291j6793k0547k0994j7856j1668l424N566
$$ -16293 3065 20840 33982 40031 37808 27517 10724 -9823 -30817 -48673 -60341 -63765 -58199
574e8199J3710J9730K2461K1537J7028R630O03q520j6266k1235k2547j9996j4009
$$ -58199 -44489 -24759 -2298 19239 36267 45897 46500 37980 21714 479 -22068 -42064 -56073
587e6073n390M284J3433K0549K4380K4254K0222J2846L428o595j5452k1663k4113
$$ -56073 -61463 -57179 -43746 -23197 1183 25437 45659 58505 61933 55338 39886 18223 -5890
600e890k2523j7045q495J573J1565J9796K4787K5756K2486J5447N780m899j4853
$$ -5890 -28413 -45458 -53953 -52380 -40815 -21019 3768 29524 52010 67457 73237 68338 53485
613E3485k2349k6119k5600k0752j2412j922Q939J8393K4711K6878K4558J7892
$$ 53485 31136 5017 -20583 -41335 -53747 -55669 -46730 -28337 -3626 23252 47810 65702
625F5702Q141l169j4174k2935k8001k8490k4343j6129n233O507J7164K4895K8300
$$ 65702 73843 70674 56500 33565 5564 -22926 -47269 -63398 -68631 -62124 -44960 -20065 8235
638H235K6965K1009J1311l75j2132k2047k8288k9869k6550j8759p864M438J5944
$$ 8235 35200 56209 67520 67145 55013 32966 4678 -25191 -51741 -70500 -78364 -73926 -57982
651e7982K4870K9568K9430K4349J5196L528q762j9484k7006k9836k7716k0877
$$ -57982 -33112 -3544 25886 50235 65431 68959 60197 40713 13707 -16129 -43845 -64722
663f4722j0365J952J4081K4014L0026L1159K7235J8846P384n183j6893k5665k9997
$$ -64722 -75087 -73135 -59054 -35040 -5014 26145 53380 72226 79610 74427 57534 31869 1872
676A872k9279k3533j3731j425J1198K2115K9482L1953K9195K1550J0377k629j5178
$$ 1872 -27407 -50940 -64671 -66096 -54898 -32783 -3301 28652 57847 79397 89774 87145 71967
689G1967k5201l1011l1615k6933j7664n444P774J9698K8294L2140L0584K3833
$$ 71967 46766 15755 -15860 -42793 -60457 -65901 -58127 -38429 -10135 22005 52589 76422
701G6422J2996j10j3282k4310l1358l3224k9631k1087r151M230J6915K6610L1726
$$ 76422 89418 89308 76026 51716 20358 -12866 -42497 -63584 -72735 -68505 -51590 -24980 6746
714F746L1498K5930J5882L115j0230k1950l0082l3224l0910k3539j2291R55J3949
$$ 6746 38244 64174 80056 83171 72941 50991 20909 -12315 -43225 -66764 -79055 -78100 -64151
727f4151K4536L0915L2119K7881J8972O805o554j8807k8019l2541l1696k5619
$$ -64151 -39615 -8700 23419 51300 70272 77077 70523 51716 23697 -8844 -40540 -66159
739f6159j5254k362J0923K2316L0005L2591K9761K1848J0255l079j5970k6260
$$ -66159 -81413 -83775 -72852 -50536 -20531 12060 41821 63669 73924 70845 54875 28615
751B8615l2065l2642k7731j8172n541Q039K0174K9051L2940L1358K4464J3483
$$ 28615 -3450 -36092 -63823 -81995 -87536 -79497 -59323 -30272 2668 34026 58490 71973
763G1973J83j3103k4267l1231l3075k9356k0669q557M953J7654K7364L2421L2100
$$ 71973 72156 59053 34786 3555 -29520 -58876 -79545 -88102 -83149 -65495 -38131 -5710 26390
776B6390K6368J6273L479r878k1581k9574l2631l0298k2876j1655J385J4215K4568
$$ 26390 52758 69031 72510 62632 41051 11477 -21154 -51452 -74328 -85983 -84598 -70383 -45815
789d5815L0754L1748K7437J8543O512o619j8613k7530l1885l0895k4881j4661
$$ -45815 -15061 16687 44124 62667 69179 62560 43947 16417 -15468 -46363 -71244 -85905
801h5905k138J0729K1716K9031L1353K8475K0737R490l372j5720k5439l0904l1233
$$ -85905 -88043 -77314 -55598 -26567 4786 33261 53998 63488 60116 44396 18957 -11947 -43180
814d3180k6367j7104m977Q003J9561K7823L1432K9731K3032J2508p9j2700k3081
$$ -43180 -69547 -86651 -91628 -83625 -64064 -36241 -4809 24922 47954 60462 60383 47683 24602
827B4602k9544l1076k7326j9037p428N300J7182K6165L0815L0250K4700J5086
$$ 24602 -4942 -36018 -63344 -82381 -89809 -84509 -67327 -41162 -10347 19903 44603 59689
839E9689L026r510k0256k7563l0210k7798k0647j0089K141J3995K3508K9060K9749
$$ 59689 62715 53205 32949 5386 -24824 -52622 -73269 -83358 -81217 -67222 -43714 -14654 15095
852A5095K5613J7198O038o067j7057k5099k8868k7773k2030j2557j024J0743K0675
$$ 15095 40708 57906 63944 57877 40820 15721 -13147 -40920 -62950 -75507 -76531 -65788 -45113
865d5113K7211K9159K6368J9215Q903k794j3976k2667k7498k7679k3149j4657
$$ -45113 -17902 11257 37625 56840 65743 62949 48973 26306 -1192 -28871 -52020 -66677
877f6677l680P977J8346K5676K8676K7052K0944J1352l1j1270k0571k6233k7476
$$ -66677 -70357 -62380 -44034 -18358 10318 37370 58314 69666 69635 58365 37794 11561 -15915
890a5915k4010j6505o124N227J5752K3651K7530K6927K1818J3104K352q736j8307
$$ -15915 -39925 -56430 -62554 -57327 -41575 -17924 9606 36533 58351 71455 73807 65071 46764
903D6764k4607k6808k4504j8071q668K141J2536K0759K5444K5896K2051J4527
$$ 46764 22157 -4651 -29155 -47226 -55894 -53753 -41217 -20458 4986 30882 52933 67460
915F7460M649n934j5476k2304k5397k4259j9076j0715o46R473J8011K3441K4958
$$ 67460 72109 66175 50699 28395 2998 -21261 -40337 -51052 -51698 -42225 -24214 -773 24185
928B4185K2362J6026P063l030j2512j9857k3778k3760j9674j2322k927O935J5651
$$ 24185 46547 62573 69636 66606 54094 34237 10459 -13301 -32975 -45297 -48224 -41289 -25638
941b5638K1714K4087K2538J7202Q995o47j0085j7826k2481k3337k0278j3872n159
$$ -25638 -3924 20163 42701 59903 68898 68251 58166 40340 17859 -5478 -25756 -39628 -44787
954d4787M351J3124J9585K2706K2042J7675J0369J349p799j5654k0795k2446k0359
$$ -44787 -40436 -27312 -7727 14979 37021 54696 65065 66414 58615 42961 22166 -280 -20639
967b0639j5004p126J853J0357J7091K0853K1158J7918J1656L576n043j2781j8317
$$ -20639 -35643 -42769 -40916 -30559 -13468 7385 28543 46461 58117 61693 56650 43869 25552
980B5552k0731j9673j5385q562l79P784J4616J8944K0078J7866J2729N492k604
$$ 25552 4821 -14852 -30237 -38799 -39178 -31394 -16778 2166 22244 40110 52839 58331 55727
993E5727j0228j6053j9166j9030j5803r922k439N340J2130J6916J8675J7363J3035
$$ 55727 45499 29446 10280 -8750 -24553 -34475 -36914 -31574 -19444 -2528 16147 33510 46545
1006D6545O533j086q493j4502j8124j8691j6254j1190m332L035R822J4766J7049
$$ 46545 53078 51992 43499 28997 10873 -7818 -24072 -35262 -39594 -36559 -26737 -11971 5078
1019E078J6457J3029P304L23o707j2659j6500j7639j5911j1656n598J274P773
$$ 5078 21535 34564 41868 42191 35484 22825 6325 -11314 -27225 -38881 -44479 -43205 -35432
1032c5432J2858J5635J5706J3193Q396K293m186r883j3906j5528j4618j1251o068
$$ -35432 -22574 -6939 8767 21960 30356 32649 28463 18580 4674 -10854 -25472 -36723 -42791
1045d2791M2O187J1159J4263J5004J3298R433M096j787p331j1457j3586j3391
$$ -42791 -42749 -36562 -25403 -11140 3864 17162 26595 30691 28904 21573 10116 -3470 -16861
1058a6861j0966o629j189M374R287J2537J3777J2666R539M858n39n809r999j2478
$$ -16861 -27827 -34456 -35645 -31271 -21984 -9447 4330 16996 26535 31393 30854 25045 15046 2568
1072B568j2782j1052p453k642K498P185J0583J2051J1569R066N070K29m632q681
$$ 2568 -10214 -21266 -28719 -31361 -28863 -21678 -11095 956 12525 21591 26661 26890 22258 13577
1086A3577j1264j1952j0756p792l619J024N409Q704J0542J0489Q692N440J278
$$ 13577 2313 -9639 -20395 -28187 -31806 -30782 -25373 -16669 -6127 4362 13054 18494 19772
1099A9772k983o786r330j0370r671p424l927P8M044P228R172R552Q357N838K360
$$ 19772 16789 10003 673 -9697 -19368 -26792 -30719 -30641 -26597 -19369 -10197 -645 7712 13550 15910
1114A5910j406m855p385q663q452o822m048o14K862N855P862Q508P785N829K940
$$ 15910 14504 9649 2264 -6399 -14851 -21673 -25721 -26335 -23473 -17618 -9756 -1248 6537 12366 15306
1129A5306k98l488n875p316p422o303m099j217J825M532O465P276O898N433L097
$$ 15306 15008 11520 5645 -1671 -9093 -15396 -19495 -20712 -18887 -14355 -7890 -614 6284 11717 14814
1144A4814L29k443m753o069o437n702m002j699Q61L225N020N897N793M753K999
$$ 14814 15143 12700 7947 1878 -4559 -10261 -14263 -15962 -15101 -11876 -6856 -959 4834 9587 12586
1159A2586P64j542l489m796n266m889l677j922J11K067L617M495M630M005K726
$$ 12586 13350 11808 8319 3523 -1743 -6632 -10309 -12231 -12120 -10053 -6436 -1941 2689 6694 9420
1174I420J032p37k363l564m058l914l169j871l40J180K477L256L515L178K307
$$ 9420 10452 9715 7352 3788 -270 -4184 -7353 -9224 -9564 -8384 -5907 -2651 864 4042 6349
1189F349J119k41j482k417k980k937k458j615n54N97J543K164K472K265J705R13
$$ 6349 7468 7227 5745 3328 348 -2589 -5047 -6662 -7216 -6619 -5076 -2912 -440 1825 3530 4443
1205D443K6q61j529j929j990j720j224n37J54P37J151J295J245R87N52O5m15p70
$$ 4443 4469 3608 2079 150 -1840 -3560 -4784 -5321 -5167 -4430 -3279 -1984 -739 248 800 865 450 -320
1223c20r49j014q50o45l39r2J47K62L32K97J93Q2J7o5l0KP2J39J53J11L2j23l00
$$ -320 -1269 -2283 -3133 -3778 -4117 -4209 -4062 -3800 -3468 -3171 -2978 -2896 -2879 -2944 -2974 -2972 -2900 -2761 -2608 -2497 -2465 -2588 -2888
1246b888m37n07n10l84j51J96N51Q70J099J176J125Q04L43j73p08j101j285j299
$$ -2888 -3325 -3832 -4342 -4726 -4877 -4681 -4130 -3260 -2161 -985 140 944 1287 1114 406 -695 -1980 -3279
1264c279j006m82J80Q77J553J950K166J945J437P20j92j087j816k220k228j910
$$ -3279 -4285 -4767 -4587 -3710 -2157 -207 1959 3904 5341 6061 5869 4782 2966 746 -1482 -3392
1280c392j173k07Q40J790K478K824K576K006J014k01j422k462l113l292k938k091
$$ -3392 -4565 -4772 -3932 -2142 336 3160 5736 7742 8756 8555 7133 4671 1558 -1734 -4672 -6763
1296f763q42M81J792K737L318L229K594J493M3j507k821l766m102l830k895j475
$$ -6763 -7605 -7124 -5332 -2595 723 3952 6546 8039 8082 6575 3754 -12 -4114 -7944 -10839 -12314
1312a2314J56J822L176L970M114L547K356P16j097k753l953m545m361l399j850
$$ -12314 -12158 -10336 -7160 -3190 924 4471 6827 7543 6446 3693 -260 -4805 -9166 -12565 -14415
1327a4415J24K104L766M884N210M735L481J610m29k441l972m851m785l917k270
$$ -14415 -14291 -12187 -8421 -3537 1673 6408 9889 11499 11070 8629 4657 -194 -4979 -8896 -11166
1342a1166j46K080M057N443N978N640M332K386R7k204m122n272n500m741l179
$$ -11166 -11312 -9232 -5175 268 6246 11886 16218 18604 18701 16497 12375 7103 1603 -3138 -6317
1357f317r81J400L641N304O132N981M786K830L46k226m413n888o486n916m428
$$ -6317 -7298 -5898 -2257 3047 9179 15160 19946 22776 23122 20896 16483 10595 4109 -1807 -6235
1372f235k182L60K889M909O074O197N231L297P65k033m514o322p139o839n405
$$ -6235 -8417 -8057 -5168 -259 5815 12012 17243 20540 21305 19272 14758 8436 1297 -5542 -10947
1387a0947l118l58K481M822O343O751O003M155J519j371m177o269p400p301o023
$$ -10947 -14065 -14423 -11942 -7120 -777 5974 11977 16132 17651 16280 12103 5834 -1566 -8867 -14890
1402a4890l751q14K191M919O687P430O899N201K629m37l421n820p261p453o466
$$ -14890 -18641 -19455 -17264 -12345 -5658 1772 8671 13872 16501 16064 12643 6823 -438 -7891 -14357
1417a4357m285j391J735M689O808P879P659O176L693O27k538n208p046p606o883
$$ -14357 -18642 -20033 -18298 -13609 -6801 1078 8737 14913 18606 19233 16695 11487 4441 -3165 -10048
1432a0048m968k179J091M208O670Q072Q190O971M617J529j830m802o981p955p543
$$ -10048 -15016 -17195 -16104 -11896 -5226 2846 11036 18007 22624 24153 22323 17521 10540 2585 -4958
1447d958n836l136J60L457O213P896Q329P364N079J970j521m781p277q608q502
$$ -4958 -10794 -13930 -13770 -10313 -4100 3796 12125 19489 24568 26538 25017 20236 12959 4351 -4151
1462d151p020m396j141K374N332P384Q089P389N399K374j169m555p312q891r143
$$ -4151 -11171 -15567 -16708 -14334 -9002 -1618 6471 13860 19259 21633 20464 15909 8597 -294 -9437
1477i437p921n531k232J285M545O936Q061P792O136L381kl472o380q300q919q029
$$ -9437 -17358 -22889 -25121 -23836 -19291 -12355 -4294 3498 9634 13015 13013 9541 3161 -5139 -14058 -22087
1493b2087n880k706Q74M309P057Q610Q791P476N029J713j820m949p241q216p765
$$ -22087 -27967 -30673 -29799 -25490 -18433 -9823 -1032 6444 11473 13186 11366 6417 -824 -9040 -16805
1508a6805n902k926O03M173P163R015R481Q466O154K885p72m200o821q218q098
$$ -16805 -22707 -25633 -25030 -20857 -13694 -4679 4802 13268 19422 22307 21535 17335 10514 2296 -5802
1523e802o591l896m24L169O266Q384R147Q409O279L121n03m100o955q689q948
$$ -5802 -12393 -16289 -16713 -13544 -7278 1106 10253 18662 24941 28062 27559 23459 16504 7815 -1133
1538a133p779n315k026J539M820P187Q267P987O215L396j04l678o673q651r268
$$ -1133 -8912 -14227 -16253 -14714 -9894 -2707 5560 13547 19762 23158 23054 19376 12703 4052 -5216
1553e216q445o302l185L60L756O491P973Q090O812M325J052k431n583p785q793
$$ -5216 -13661 -19963 -23148 -22788 -19032 -12541 -4568 3522 10334 14659 15711 13280 7697 -88 -8881
1568h881q304o494l571r5L375O328Q190Q646P717N517K377j090m387o846q148
$$ -8881 -17185 -23679 -27250 -27345 -23970 -17642 -9452 -806 6911 12428 14805 13715 9328 2482 -5666
1583e666q028o521l848m78L003O072Q140Q959Q307O334L397l8l365o092p679p904
$$ -5666 -13694 -20215 -24063 -24541 -21538 -15466 -7326 1633 9940 16274 19671 19633 16268 10176 2497 -5407
1599e407o774m457j309K108N185P476Q550Q258O612L950O67k660n528p437q027
$$ -5407 -12181 -16638 -17947 -15839 -10654 -3178 5372 13630 20242 24192 24859 22199 16671 9234 1207
1614A207p310n333k510P54L873O322P696P802O565M228J143k144n090p194q182
$$ 1207 -6103 -11436 -13946 -13192 -9319 -2997 4699 12501 19066 23294 24437 22293 17203 10009 1827
1629A827p832o206l646m89K665N265O954P391O528M496J666j538m509o796q019
$$ 1827 -6005 -12211 -15857 -16346 -13681 -8416 -1462 5929 12457 16953 18619 17081 12572 5776 -2243
1644b243p916o554m173j146K016M804O688P441O878N148K562m94l447n826p244
$$ -2243 -10159 -16713 -20886 -22032 -20016 -15212 -8524 -1083 5795 10943 13505 13011 9564 3738 -3506
1659c506p388o348m256j398J670M465O495P487P261N835L557O42k230m734o334
$$ -3506 -10894 -17242 -21498 -22896 -21226 -16761 -10266 -2779 4482 10317 13874 14516 12286 7552 1218
1674A218o867o140m453j913R50L715N871P063P159O089M100J376j418m003n839
$$ 1218 -5649 -11789 -16242 -18155 -17205 -13490 -7619 -556 6603 12692 16792 18168 16750 12747 6908
1689F908o649o319m979k753p4K647M893O308O665N974M179J761r87l538n536o589
$$ 6908 259 -6060 -11039 -13792 -13866 -11219 -6326 -18 6647 12621 16800 18561 17574 14036 8500 1911
1705A911o561n417l412q76J799M130N722O309N876M373K152m38k962n008o219
$$ 1911 -4650 -10067 -13479 -14355 -12556 -8426 -2704 3605 9481 13854 16006 15568 12606 7598 1379
1720A379o385n539l750j434J180L467N154N989N792M594K633K51k216m254n586
$$ 1379 -5006 -10545 -14295 -15729 -14549 -11082 -5928 61 5853 10447 13080 13331 11115 6861 1275
1735A275o036n461m023j917M77K756M534N529N601M749L091R28j376l470m910
$$ 1275 -4761 -10222 -14245 -16162 -15685 -12929 -8395 -2866 2735 7484 10575 11503 10127 6657 1747
1750A747n577n319m146k331j06K084L961N134N464M888L501J591n94k643m171
$$ 1747 -3830 -9149 -13295 -15626 -15732 -13648 -9687 -4553 911 5799 9300 10891 10297 7654 3483
1765C483n036m965m080k478m31J715L553M835N342M981L835K084O3j943l536m546
$$ 3483 -1553 -6518 -10598 -13076 -13507 -11792 -8239 -3404 1938 6919 10754 12838 12901 10958 7422 2876
1781B876m666m057k662q77J115K882M245M841M707L790K239L86j534l136m240
$$ 2876 -1790 -5847 -8509 -9386 -8271 -5389 -1144 3697 8404 12194 14433 14819 13285 10149 5909
1796E909m606m201l113j556K51J926L293M089M117L484K248N93j146k733l896
$$ 5909 1303 -2898 -6011 -7567 -7316 -5390 -2097 1992 6109 9593 11841 12434 11288 8555 4659
1811D659m392m225l391k061m02J249K624L537L800L412K408J027n54k071l205
$$ 4659 267 -3958 -7349 -9410 -9812 -8563 -5939 -2402 1398 4810 7218 8245 7691 5620 2415
1826B415l857l829l217k013n68R80K376L345L749L498K755J523Q6j329k519l180
$$ 2415 -1442 -5271 -8488 -10501 -11069 -10089 -7713 -4368 -619 2879 5634 7157 7243 5914 3395 215
1842B15l324k908j933o61P56J993K995L457L347K802J738M31q77k001k792l036
$$ 215 -3109 -6017 -7950 -8611 -7855 -5862 -2867 590 3937 6739 8477 8908 8031 6030 3238 202
1858B02k788k066r93J72J390K351K844K938K512J672N79n74j674k438k823k689
$$ 202 -2586 -4652 -5645 -5473 -4083 -1732 1112 4050 6562 8234 8813 8239 6565 4127 1304 -1385
1874a385k191j310k54P56J747K290K496K290J626P17k98j227k033k462k425k108
$$ -1385 -3576 -4886 -5140 -4384 -2637 -347 2149 4439 6065 6782 6484 5257 3224 762 -1663 -3771
1890c771j364m55N28J324J988K207K098J656Q93J6q73j574k009k100j868j288
$$ -3771 -5135 -5590 -5062 -3738 -1750 457 2555 4211 5104 5120 4247 2673 664 -1436 -3304 -4592
1906d592n39K99J026J673J926J903J563R47J81n04j203j655j766j625j251o13
$$ -4592 -5131 -4832 -3806 -2133 -207 1696 3259 4206 4387 3883 2680 1025 -741 -2366 -3617 -4230
1922d230R2P07J258J573J594J379R35L57k84q65j255j458j388j127o75j03M27
$$ -4230 -4138 -3431 -2173 -600 994 2373 3308 3665 3381 2516 1261 -197 -1585 -2712 -3387 -3490 -3063
1939c063Q91J230J324J177Q96M12o5n65r15j138j150r97n98k20K42O46R49J048
$$ -3063 -2172 -942 382 1559 2455 2867 2802 2237 1322 184 -966 -1963 -2561 -2781 -2539 -1893 -944 104
1957A04R91P69M26O1l45o32q42q53p57n27k16J15M41O57P99P67O15M06R6j55m04
$$ 104 1095 1864 2290 2351 2006 1374 532 -321 -1078 -1605 -1821 -1706 -1265 -608 191 958 1573 1979 2075 1920 1516
1978A516n45n96n58m05j80L9K38M28N04M92M16K88J25n4k12l17l54l61k32j85
$$ 1516 971 375 -183 -588 -768 -729 -491 -63 441 933 1349 1637 1762 1708 1496 1179 825 464 232 47
1998D7m8N5J90K18J94J89J15M5n5j07j44j79j60j34r8o9l5k0k9p1n1p1p2n1n0
$$ 47 -1 54 244 462 656 845 960 1005 950 843 699 520 360 226 128 59 24 4 -25 -96 -147 -218 -290 -341 -391
2023c91K9MQ4Q3N4kn5j01k12k27k61k01j50q5M7J84K43L54L10K84J39jq8l07l74
$$ -391 -362 -358 -274 -191 -137 -139 -194 -295 -507 -734 -995 -1196 -1346 -1431 -1384 -1200 -957 -603 -293 -9 130 129 41 -266 -640
2048f40l79l85k34j15J22K78M54N30N72M72L27J33j34l29n11n77n31m20k26N1
$$ -640 -1019 -1404 -1638 -1753 -1631 -1353 -899 -369 203 675 1002 1135 1001 672 161 -416 -947 -1367 -1593 -1542
2068a542L21N25O89P60O15M86K07j54l92o37p99p88o48m26o3K27N66P50Q60P49
$$ -1542 -1221 -696 -7 753 1368 1854 2061 1907 1515 878 79 -709 -1357 -1783 -1846 -1619 -1053 -303 557 1306
2088A306N93K40j22m89p83r96r99q92o39k16J56N04Q09R92R03P17L81k7m72q32
$$ 1306 1899 2139 2017 1528 745 -251 -1250 -2142 -2781 -2997 -2841 -2337 -1528 -536 367 1084 1465 1438 966 134
2108A34j060j142j065p77l47J09N22R15J082J109R94O32J85l16p45j005j213j146
$$ 134 -926 -2068 -3133 -3910 -4257 -4148 -3626 -2711 -1629 -520 474 1106 1291 975 230 -775 -1988 -3134
2126c134q82m34mN49R38J233J333J223Q51M34r8o29j048j251j232j062o34n5M27
$$ -3134 -4016 -4450 -4454 -3905 -2967 -1734 -401 822 1673 2107 2009 1380 332 -919 -2151 -3213 -3847 -3902 -3475
2145c475R23J329J436J379J045N50L3n59j070j344j388j234q28k90K92Q75J262
$$ -3475 -2552 -1223 213 1592 2637 3187 3220 2661 1591 247 -1141 -2375 -3203 -3493 -3201 -2326 -1064
2162a064J515J458J186P12J13n01j031j393j540j372j011n08J50P32J208J519
$$ -1064 451 1909 3095 3807 3920 3419 2388 995 -545 -1917 -2928 -3436 -3286 -2554 -1346 173
2178A73J574J304Q85K84l32r67j387j543j550j217p22r6N52J088J536J596J437
$$ 173 1747 3051 3936 4220 3888 2921 1534 -9 -1559 -2776 -3498 -3594 -3042 -1954 -418 1178 2615
2195B615J052M60j64q17j363j621j628j413r36k89M07R75J476J649J581J237O71
$$ 2615 3667 4127 3963 3146 1783 162 -1466 -2879 -3815 -4104 -3697 -2722 -1246 403 1984 3221 3892
2212C892j4o60j257j606j697j531j045l72K51R35J484J722J737J437R37K09m49
$$ 3892 3878 3218 1961 355 -1342 -2873 -3918 -4290 -4039 -3104 -1620 102 1839 3276 4213 4422 3973
2229C973j069j517j697j529j144n32J59Q50J410J758J834J576J099M46k44r24
$$ 3973 2904 1387 -310 -1839 -2983 -3515 -3356 -2506 -1096 662 2496 4072 5171 5617 5373 4449
2245D449j440j691j654j353q24j07N77J208J647J760J620J202N81j68q54j398
$$ 4449 3009 1318 -336 -1689 -2513 -2620 -2043 -835 812 2572 4192 5394 5975 5807 4953 3555
2261C555j755j848j577j115m12L10R66J463J681J638J276O98lp34j319j770j872
$$ 3555 1800 -48 -1625 -2740 -3152 -2842 -1876 -413 1268 2906 4182 4880 4877 4143 2824 1054 -818
2278h18j686j249n56J26Q49J399J728J724J459R11K32m80j141j620j751j705j283
$$ -818 -2504 -3753 -4309 -4183 -3334 -1935 -207 1517 2976 3887 4119 3639 2498 878 -873 -2578 -3861
2295c861o65M7P36J357J746J815J636J152M81j96q99j455j695j723j406q45j89
$$ -3861 -4526 -4479 -3743 -2386 -640 1175 2811 3963 4444 4248 3349 1894 199 -1524 -2930 -3775 -3964
2312c964N36J190J617J776J682J281O75o0p37j356j689j772j586j085m48K61R15
$$ -3964 -3428 -2238 -621 1155 2837 4118 4793 4733 3996 2640 951 -821 -2407 -3492 -3940 -3679 -2764
2329b764J439J720J640J382Q04J13n96j191j660j812j669j209o41Q2P39J325J661
$$ -2764 -1325 395 2035 3417 4221 4334 3738 2547 887 -925 -2594 -3803 -4444 -4362 -3623 -2298 -637
2346f37J708J469R91L05l76j028j538j705j656j324p40n6N85J205J619J725J535
$$ -637 1071 2540 3531 3836 3460 2432 894 -811 -2467 -3791 -4531 -4587 -4002 -2797 -1178 547 2082
2363B082J145N22j35q45j346j612j671j416r24k67L98R72J483J673J550J277P20
$$ 2082 3227 3749 3614 2769 1423 -189 -1860 -3276 -4200 -4467 -4069 -3097 -1614 59 1609 2886 3606
2380C606K8o03j184j571j629j513j056n00J60P85J305J599J602J351Q81K36l96
$$ 3606 3634 3031 1847 276 -1353 -2866 -3922 -4422 -4262 -3477 -2172 -573 1029 2380 3261 3497 3101
2397C101r98j441j596j547j172o35LO08J194J520J613J405R91M06k03q26j309
$$ 3101 2103 662 -934 -2481 -3653 -4288 -4285 -3677 -2483 -963 650 2055 3046 3452 3249 2423 1114
2414A114j510j532j247p47j66M49J022J407J540J441J091N76o9o44j127j457j481
$$ 1114 -396 -1928 -3175 -3922 -4088 -3639 -2617 -1210 330 1771 2862 3438 3369 2725 1598 141 -1340
2431a340j316q72l27K55Q03J284J451J441J171P30J38m24r50j325j403j319j004
$$ -1340 -2656 -3528 -3855 -3600 -2797 -1513 -62 1379 2550 3280 3418 2994 2044 719 -684 -2003 -3007
2448c007n07R4O32J108J369J404J235Q61L27k50p85j148j373j336j057o28q3M35
$$ -3007 -3514 -3420 -2788 -1680 -311 1093 2328 3189 3516 3266 2481 1333 -40 -1376 -2433 -3061 -3144 -2709
2466b709R45J278J350J241R01M16r2o38j049j327j312j120p51k40K69P77J136
$$ -2709 -1764 -486 864 2105 3006 3422 3330 2692 1643 316 -996 -2116 -2867 -3107 -2838 -2061 -925
2483i25J265J213R48N43J1n25q75j209j266j141p93l79J15O29R59J212J198J006
$$ -925 340 1553 2501 3044 3055 2530 1655 446 -820 -1961 -2754 -3133 -3018 -2389 -1430 -218 980 1986
2501A986O69J83k64p30j049j179j085q72m71j2M33Q61J089J193J053P38L55j48
$$ 1986 2655 2838 2574 1844 795 -384 -1469 -2341 -2812 -2824 -2391 -1530 -441 752 1805 2543 2898 2750
2519B750n41r07j096j086q84n67j35K97P12R94J086J026P69M01j4m48q10j003
$$ 2750 2209 1302 206 -880 -1764 -2331 -2466 -2169 -1457 -463 623 1649 2418 2819 2805 2357 1547 544
2537E44j074q87o51k30J70N68Q24J025R85P85M53P3l49o60r07r80r25o71l35M2
$$ 544 -530 -1417 -2068 -2298 -2128 -1560 -736 289 1274 2059 2512 2585 2236 1576 669 -311 -1236 -1907 -2242 -2200
2557b200M40P29R30R10P87N26J98k00n52p79r10q78p03m22n4K94O18Q01Q77P88
$$ -2200 -1760 -1031 -101 809 1596 2122 2320 2120 1568 789 -121 -999 -1702 -2124 -2178 -1884 -1266 -465 412 1200
2577A200N78K73r7l78o62q53q16p24m43j56J80M91P22Q18P55O04L37J7l05n59
$$ 1200 1778 2051 1954 1576 914 61 -755 -1479 -1922 -2078 -1898 -1407 -685 133 888 1492 1829 1846 1541 982
2597I82p38p69o98m78k05Q4M12O07P65P07O01L80Q8j85m46o55p19o57n08k53N6
$$ 982 244 -525 -1223 -1701 -1906 -1822 -1410 -803 -38 669 1270 1650 1738 1553 1107 452 -267 -924 -1432 -1685 -1629
2618a629K76N16O50O79N88M01J58j00l42n65o24o12n21k83n8J82M07N71N95N59
$$ -1629 -1353 -837 -187 492 1080 1481 1639 1539 1197 632 8 -604 -1125 -1408 -1466 -1284 -877 -306 289 848
2638H48M36K10j7k67m45n50n77n00l35j32J16K99M99N39M99M36K34K2j69l80m80
$$ 848 1284 1494 1477 1210 765 215 -362 -862 -1197 -1329 -1213 -914 -415 124 623 1059 1293 1315 1146 766 286
2659B86n10m73l46j38K3K30L88M83M74M16K37O9j12l02l88m56m35l28j88NJ67
$$ 286 -224 -697 -1043 -1181 -1158 -928 -540 -57 417 833 1070 1139 1027 725 337 -119 -554 -882 -1070 -1065 -898
2680h98K79M20M22L51K74J15m7k14l45l43m01l42j70m5R0K23L32L40L59K29J40
$$ -898 -619 -199 223 574 848 963 916 702 357 14 -387 -729 -899 -944 -854 -631 -299 41 400 629 769
2701G69Rj43k45l33l01k97j99p4L9J40K66K94K70K49J31N5q1j88k37k78k48j92
$$ 769 778 635 390 57 -244 -541 -740 -814 -775 -635 -369 -75 195 444 575 630 549 361 124 -154 -402 -594
2723e94o7J6J37J79K41K39J94J49O0l6j02j95j79k20j44p4k4R0J41K05J95J59
$$ -594 -661 -645 -508 -329 -88 151 345 494 554 518 416 221 42 -178 -322 -396 -420 -330 -189 16 211 370
2745C70J03O4j7n7j29j65j54j16p7k4J8J13Q1J27J14R6M1nl4p9r7j11j02q9k0
$$ 370 473 537 520 463 334 169 15 -101 -178 -202 -184 -71 10 137 251 347 388 383 349 270 173 62 -40 -129 -149
2770a49J0K3N1O1P7M7%J9l2l9p4m1m4n7k7Qj5J6j1N2J1j4K5j7k5MqpL2lLk5Rj9
$$ -149 -139 -116 -65 -4 73 120 120 139 107 68 -6 -47 -91 -148 -175 -167 -182 -166 -177 -125 -114 -128 -103 -120 -145 -141 -149 -156 -124 -127 -124 -149 -140 -159
2804a59k5rk3NJ2OL9R1K4Q9L5J2K2nn7m5n5j8j9NM6O4Q3J25J08Q5M1Rk9o0q6j40
$$ -159 -184 -193 -216 -211 -199 -193 -154 -63 -39 50 85 97 119 114 57 12 -43 -61 -80 -75 -29 35 118 243 351 436 477 486 457 397 311 171
2836A71o9m8l5M7P9R7J35J01J22N9J2q2j03j40j63j74j30l4j7O9Q6J63J22J33
$$ 171 102 54 19 66 145 242 377 478 600 659 671 589 486 346 183 9 -121 -155 -172 -103 -17 146 268 401
2860D01P4Kr0j23j99k13j79j60j00l8O5J12J90J87J73J21K9m1r5k23k14k36j84
$$ 401 475 477 387 264 65 -148 -327 -487 -587 -625 -560 -448 -258 -71 102 223 252 211 116 -107 -321 -557 -741
2883g41j02k7Q8J40K27K45K35J96J06k6r8j55k38k39j99j53l0M8J70K61K83K82
$$ -741 -843 -870 -782 -642 -415 -170 65 261 367 341 243 88 -150 -389 -588 -741 -771 -723 -553 -292 -9 273
2905B73K29J47L7p4j49k49k77k51j80p4M7J53K62K87L12K64J71P0o0j86k66l12
$$ 273 502 649 686 612 463 214 -63 -314 -494 -568 -521 -368 -106 181 493 757 928 998 938 752 486 174
2927A74k85k28j27j2J11K68K82L06K84J95Q8n6j87k83l64l35k95j99n3O6J82K85
$$ 174 -111 -339 -466 -478 -367 -99 183 489 773 968 1056 1000 813 530 166 -169 -464 -663 -716 -650 -468 -183
2949a83L04K87K52Q2j1j96l02l73l89l36k67j22OJ55L00L12L40K56J68J8j40k75
$$ -183 121 408 660 742 731 535 233 -140 -529 -865 -1132 -1254 -1248 -1093 -793 -481 -141 115 283 301 161 -114
2971a14l37m04l46k62j21jK13L10L77M26L40K60R3n5j75k85l73l08k18j21N1K13
$$ -114 -451 -855 -1201 -1463 -1584 -1585 -1372 -1062 -685 -259 81 341 434 379 204 -81 -454 -762 -980 -1101 -1050 -837
2993h37L33M31M69M10L18J92K4j38k58l45l65k96j71l8J20K97L64M23L76K96J73
$$ -837 -504 -73 396 806 1124 1316 1340 1202 944 599 234 -62 -233 -271 -151 146 510 933 1309 1605 1778
3014A778j2j81l36m32m68m27l43j61j2J52K55L49L39K45J51n4j81l40m45n15m51
$$ 1778 1766 1585 1249 817 349 -78 -421 -582 -594 -442 -187 162 501 746 897 843 662 322 -123 -638 -1089
3035a089l63k43k9J40K54L98L97L69K45R2n4k36l30l81l74l05j15J9J99L52N02
$$ -1089 -1452 -1695 -1724 -1584 -1330 -932 -535 -166 79 171 117 -119 -449 -830 -1204 -1509 -1624 -1605 -1406 -1054 -552
3056e52N23M37L91K12P0j09k66l43l50l20j65k1J50L01M08M73M25L51J89J0j76
$$ -552 -29 408 799 1011 1081 972 706 363 13 -307 -472 -493 -343 -42 366 839 1264 1615 1804 1814 1638
3077A638l16m02m86m16l40j84KJ21K75L45L51K92J73j0j71l38m58m72m93l39k21
$$ 1638 1322 920 434 18 -322 -506 -504 -383 -108 237 588 880 1053 1043 872 534 76 -396 -889 -1228 -1449
3098a449m6J30L29L76M12L94K84J44l9j75l11l92l42k67j33K4J87L78M77M86M50
$$ -1449 -1495 -1365 -1036 -660 -248 146 430 574 535 360 49 -343 -685 -952 -1085 -1061 -874 -496 -19 467 917
3119I17L71K04N0j49k43l62l74l20k21n5N9K53L29M08L50K81J40j2k31l64m54
$$ 917 1288 1492 1542 1393 1150 788 414 94 -127 -182 -123 130 459 867 1217 1498 1638 1626 1395 1031 577
3140E77n08m64l66k35o9P1K23K92L10K41J69l8j59l39m11m57m11l30k09NJ48L07
$$ 577 69 -395 -761 -996 -1065 -994 -771 -479 -169 72 241 203 44 -295 -706 -1163 -1574 -1904 -2113 -2108 -1960 -1653
3162a653M21M38M32L24J55L5j15k03k93k54k18p1P9K41L94M72N15N04L78K29Q8
$$ -1653 -1232 -794 -362 -38 117 152 37 -166 -459 -713 -931 -1002 -923 -682 -288 184 699 1203 1581 1810 1898
3183A898q2j93l13l17k70j85p3Q9K25L03L30L24K22Q6m5k16l65m37n46m41l79
$$ 1898 1816 1623 1310 993 723 538 465 554 779 1082 1412 1736 1958 2044 1999 1783 1418 981 435 -6 -385
3204c85k58j18K2J54K09K39J75P4k6k19l09m17m36m34l20j77p7J17K51L46L62
$$ -385 -643 -761 -739 -585 -376 -137 38 112 86 -133 -442 -859 -1295 -1729 -2049 -2226 -2303 -2186 -1935 -1589 -1227
3225a227L60K85J51L4j23j82k39k26j49o2Q5K18L45M22M99M34L77K47J08l9j55
$$ -1227 -867 -582 -431 -397 -520 -702 -941 -1167 -1316 -1378 -1293 -1075 -730 -308 191 625 1002 1249 1357 1318 1163
3246A163k40k42k23j37k1R6K32K57L21L06K43R5j4j71k83l58m00l83k91k25q0
$$ 1163 923 681 458 321 300 396 628 885 1206 1512 1755 1850 1836 1665 1382 1024 624 241 -50 -275 -355
3267c55P8J07K03K06J54P0j6j41k82l45l74l60k70j68p1R7J97K73K77K90K25J09
$$ -355 -277 -170 33 239 393 463 447 306 24 -321 -695 -1055 -1325 -1493 -1564 -1467 -1270 -997 -720 -430 -205 -96
3289i6L1j15j79k42k04j66n8J6J61K64L06L48L62K51J86M5p7j21k40k00j99j32
$$ -96 -65 -180 -359 -601 -805 -971 -1029 -1013 -852 -588 -282 66 428 679 865 910 833 712 472 272 73 -59
3311e9p1R1J27K41K43K33K02P8K7j32k07k74l12k62k43j45m9Q4J33J59J76J86
$$ -59 -130 -39 88 329 572 805 1007 1085 1112 980 773 499 187 -75 -318 -463 -512 -428 -295 -136 40 226
3333B26R2Kq0j55k56k42k42k05j40QR2J46K21K61K27J83Q7J6p6j17j93j43j54
$$ 226 318 320 240 85 -171 -413 -655 -860 -1000 -992 -900 -754 -533 -272 -45 138 225 241 165 48 -145 -288 -442
3356d42q1K5Q0J71K10K46K22J75J27K2o3j18j99j63j52j15n6J9R5J65J72J63J19
$$ -442 -523 -498 -418 -247 -37 209 431 606 733 755 692 574 375 212 60 -55 -111 -92 3 168 340 503 622
3379F22P9Nj00j52j72k22k09j52r0oL9J04J16J49J23P4J4k8j13j57j54j54j52
$$ 622 701 706 606 454 282 60 -149 -301 -391 -397 -358 -254 -138 11 134 208 222 194 81 -76 -230 -384 -536
3402e36p7LK5J34J29J75J42J20M8L1p2r4j36j29r7n7k2P2R2J48J39J33J56L2L6
$$ -536 -613 -610 -585 -451 -322 -147 -5 115 163 194 122 28 -108 -237 -334 -391 -413 -341 -249 -101 38 171 327 359 395
3427C95n2p2j20j22j07n4n6J6Q9J03Q7J19J01M7J4l4q9q4j32j28p0l3l3N1O1J05
$$ 395 343 271 151 29 -78 -132 -188 -172 -83 20 107 226 327 374 388 354 265 181 49 -79 -149 -182 -215 -164 -103 2
3453BR1P8N3nJ1p8p2j05j18n4m7kL2O6N9Q7P2Q3K2J4m2q6n8q5n1p8J5L3K8Q5P9
$$ 2 93 171 224 219 230 152 80 -25 -143 -197 -244 -246 -214 -148 -89 -2 70 153 175 189 147 61 3 -82 -133 -211 -196 -163 -135 -50 29
3484B9P0N3K1Lk1m2q6m9m7n4mRK4K1Q7N5J8RK8k3m6k7q1m2n6k2L2%J9N6O4K4K3
$$ 29 99 152 173 176 155 113 27 -22 -69 -123 -127 -118 -94 -73 14 69 87 96 124 101 55 28 -53 -95 -151 -173 -141 -141 -122 -66 -2 22 45
3517D5rJ5k7m8j5o1j8k2oL3L4J4M8L1K4L8j3jk7j6j3j8k0JK1J6J9M6J5J1KJ1l
$$ 45 36 51 24 -24 -39 -100 -118 -140 -146 -113 -79 -65 -17 14 38 76 63 62 35 19 6 -12 -32 -31 -10 6 25 71 86 97 99 110 107
3550A07l8jRl4j6J4PQMj5L9%j6J0Kll1J1j6j5LJ5l7NrPj8J0k4kNOj6QPok0Lmr
$$ 107 69 68 77 43 27 41 48 56 60 45 84 84 68 78 80 77 46 57 41 26 29 44 7 12 3 10 -8 2 -22 -24 -19 -13 -29 -21 -14 -20 -40 -37 -41 -50
3590e0k2l9J6J1plPOL5rJ5Kk6j6onj2rqJK7jJ6K1M2%JL0k0J6j3k4j0O%J3J0M1
$$ -50 -72 -111 -95 -84 -91 -94 -87 -81 -46 -55 -40 -38 -64 -80 -86 -91 -103 -112 -120 -119 -92 -93 -77 -56 -14 -14 -13 17 -3 13 0 -24 -34 -28 -28 -15 -5 36
3628C6K2M8J4KlJ5l5k0k0k7lj7J5J3K9J7M1L2J4jj3l0l7n3l3k1j1k0OK0K7N1J1
$$ 36 58 106 120 122 119 134 99 79 59 32 29 12 27 40 69 86 127 159 173 172 159 129 92 39 6 -15 -26 -46 -40 -20 7 58 69
3661F9K5Oj6m3l7l4n4k6l9j5K4J7L5M3L4L6J2%l8k8o0k5l0l9KlK0L8P3L8J2K4
$$ 69 94 100 84 41 4 -30 -84 -110 -149 -164 -140 -123 -88 -45 -11 25 37 37 -1 -29 -89 -114 -144 -183 -181 -184 -164 -126 -53 -15 -3 21
3693B1J2J0m5m2m6j6l4j9L0L6M4K6M7N2K3PJ1j0n5n8pm8k7RM6L4L7N6M6M1J0L0
$$ 21 33 43 -2 -44 -90 -106 -140 -159 -129 -93 -49 -23 24 76 99 106 117 107 52 -6 -13 -61 -88 -79 -33 1 38 94 140 181 191 221
3725B21n8m3j9o9k6k8Kj6L9L7M2M9K4J9k3nm0p4m0m9n3Kj9K7M8K9M6K1L1%k6l3
$$ 221 163 120 101 32 6 -22 -20 -36 3 40 82 131 155 174 151 146 106 32 -8 -57 -110 -108 -127 -100 -52 -23 23 44 75 75 49 16
3757A6n8m3o0m4%j4K5L2M1P0J4L3Pqpl9l7n9%m5OJ8L5M8N5P0L4K3Jk5ko1n0l8
$$ 16 -42 -85 -145 -189 -189 -203 -178 -146 -105 -35 -21 12 19 11 4 -35 -72 -131 -131 -176 -170 -152 -117 -69 -14 56 90 113 114 89 87 26 -24 -62
3791f2j5j5M6J6N7M4J9Q8J4jj4k4o0k9m6n1%j1K6K1N4L5M3K6j2k0l5m7m4n3l4
$$ -62 -77 -92 -46 -30 27 71 90 178 192 191 177 153 93 64 18 -33 -33 -44 -18 3 57 92 135 161 149 129 94 47 3 -50 -84
3822h4k5Rj9L8J1M4N6J5J2qj1m9m8m3k4l6nJ2L8J0P5M9K5L4J7k7j7qm0n7rk0%
$$ -84 -109 -100 -119 -81 -70 -26 30 45 57 49 38 -11 -59 -102 -126 -162 -167 -155 -117 -107 -32 17 42 76 93 66 49 41 1 -56 -65 -85 -85
3855h5N3L1K0N2K5M0Rj8%l0m3k8k6l9kJ7mM4K3J5K9Oj5j6m6k2n8k1m0j2J5nJ7
$$ -85 -32 -1 19 71 96 136 145 127 127 97 54 26 0 -39 -41 -24 -28 16 39 54 83 89 74 58 12 -10 -68 -89 -129 -141 -126 -131 -114
3888a14N2K2RM2pj3j1j5k9l2k0K9l7K9L5M8KO9MK8J4kk2pm6k4%PQJ5J2L8qN3L
$$ -114 -62 -40 -31 11 4 -9 -20 -35 -64 -96 -116 -87 -124 -95 -60 -12 -10 59 63 91 105 103 81 74 28 4 4 11 19 34 46 84 76 129 132
3923A32PJk6k5l0m8ql4k1J4J0L1J4nKNK2l1j2k1j1m1J0j2k7JJ4K4M6K4JKmj2j6
$$ 132 139 140 114 89 59 11 3 -31 -52 -38 -28 3 17 12 14 19 41 10 -2 -23 -34 -75 -65 -77 -104 -103 -89 -65 -19 5 6 8 4 -8 -24
3958b4J0j1j4j5K4k2KK6PL8K4QllJ3l3j8j3k1j4j9J4K5%jL9L6Pqr%l6%j3o4J6
$$ -24 -14 -25 -39 -54 -30 -52 -50 -24 -17 21 45 53 50 47 60 27 9 -4 -25 -39 -58 -44 -19 -19 -20 19 55 62 54 45 45 9 9 -4 -68 -52
3994e2KJ0L4JL2M4k3L5Mj0j3j3nm6Jj8PJ5J9K4J9QK1Kj9rk3l4j7k2Mk1KK2K1p
$$ -52 -50 -40 -6 -5 27 71 48 83 87 77 64 51 46 0 1 -17 -10 5 24 48 67 75 96 98 79 70 47 13 -4 -26 -22 -43 -41 -19 2 -5
4030eJ0J5J2ok2j6l3k5l1k7ljJL0J6K9L1lK2J3%ro3Pk5PjL5J1K1N5J3M8jJ8l4
$$ -5 5 20 32 26 4 -12 -45 -70 -101 -128 -131 -132 -131 -101 -85 -56 -25 -28 -6 7 7 -2 -65 -58 -83 -76 -77 -42 -31 -10 45 58 106 105 123 89
4066H9Jk0j8k9j1RoJ4ON2L4QJ0lrl0l5k0m7k5k6JJ2j0K6J0J2K9l0J8k7k8j4n3
$$ 89 90 70 52 23 12 21 15 29 35 87 121 129 139 136 127 97 62 42 -5 -30 -56 -55 -43 -53 -27 -17 -5 24 -6 12 -15 -43 -57 -110
4100a10%n8K8j8K7J8K7N1JL2rJ1jl7jl0j8%L0jK9M7L9N2KK1Lk4ok0l0j2m0J6Q
$$ -110 -110 -168 -140 -158 -131 -113 -86 -35 -34 -2 -11 0 -1 -38 -39 -69 -87 -87 -57 -58 -29 18 57 109 111 132 135 111 105 85 55 43 3 19 27
4135B7J8M1NM1L9j1ml6l4l2m2k5l1j1omJ8M0K2k1L1j5pn9j5l2k9l0k1%L9K7L7
$$ 27 45 86 91 132 171 160 156 120 86 54 12 -13 -44 -55 -61 -65 -47 -7 15 -6 25 10 3 -56 -71 -103 -132 -162 -183 -183 -144 -117 -80
4168h0K1K6PJJ2kl8j7j6j5J7j3K2L0O0M7rM3OK6k5j0j5oo0KJ0j9L5KO4J8%J9k
$$ -80 -59 -33 -26 -25 -13 -15 -53 -70 -86 -101 -84 -97 -75 -45 15 62 53 96 102 128 103 93 78 72 12 14 24 5 40 42 106 124 124 143 141
4203A41k7k0m2k0k7m3k1K6j0J8K7K1%K4j3k0Qn9k8j9m5L8m4N2J2L3J1J7J8K2%
$$ 141 114 94 52 32 5 -38 -59 -33 -43 -25 2 23 23 47 34 14 22 -37 -65 -84 -129 -91 -135 -83 -71 -38 -27 -10 8 30 30
4234C0k5j9%mn2J3oK5nL8NM7PLOj3lm4Jl6j4K0QJ6KJ8JK9Oj3pj0j7j4m0j5K0J4
$$ 30 5 -14 -14 -18 -70 -57 -63 -38 -43 -5 0 47 54 57 63 50 47 3 4 -32 -46 -26 -18 -2 0 18 19 48 54 41 34 24 7 -7 -47 -62 -42 -28
4272b8l1N1qPL5%rLLrj9l0J8l4lJ2J8L4J5mK7J0mk3pj0l1JJ3l0J9pKK6J2K3k4
$$ -28 -59 -8 -16 -9 26 26 17 20 23 14 -5 -35 -17 -51 -54 -42 -24 10 25 21 48 58 54 31 24 14 -17 -16 -3 -33 -14 -21 -19 7 19 42 18
4309A8J2J2k4j1oj0j3pJ3jNL0pj8K5QJ2j6j5j0J3j5J7m5K9MOj8L0j0%QJ0J3n1
$$ 18 30 42 18 7 1 -9 -22 -29 -16 -17 -12 18 11 -7 18 26 38 22 7 -3 10 -5 12 -33 -4 0 6 -12 18 8 8 16 26 39 -12
4344a2pmK3j3j3QJM%kJj5J9k5K3j5qJ2oK5k0lkMNJ0mkRJ8k1QJ8JrK2j3rmOk1R
$$ -12 -19 -23 0 -13 -26 -18 -17 -13 -13 -15 -14 -29 -10 -35 -12 -27 -35 -23 -29 -4 -24 -27 -29 -25 -20 -10 -14 -16 -7 11 -10 -2 16 17 8 30 17 8 4 10 -11 -2
4386bPj0M5j2LJ6Qrnpk5%j2j8K9k2k6M4j1J3RlJ2ok2Pj6jk8JQLJ5%L7J2J5j2k5
$$ -2 5 -5 40 28 31 47 55 46 41 34 9 9 -3 -21 8 -14 -40 4 -7 6 15 12 24 18 -4 3 -13 -14 -42 -41 -33 -30 -15 -15 22 34 49 37 12
4425A2J3l6j3k0j7JJ0J4j3K0M6lJ4KLl4j2lk6l0l0J2J7nL9L6lL9mlMk7j6j6k3
$$ 12 25 -11 -24 -44 -61 -60 -50 -36 -49 -29 17 14 28 30 33 -1 -13 -16 -42 -72 -102 -90 -73 -78 -39 -3 -6 33 29 26 30 3 -13 -29 -52
4460e2mj5J9K9J4L3K3K9L3Lk6jl6j9k2l1lJ4K4QJ9L6K8J3lk8j3no4m6j1k0%pK1
$$ -52 -56 -71 -52 -23 -9 24 47 76 109 112 86 85 49 30 8 -23 -26 -12 12 20 39 75 103 116 113 85 72 67 3 -43 -54 -74 -74 -81 -60
4495f0M1J3K6J1nNk5m2n4rk8j1kJ4K1L5N2N1QNOpl2k3m0jm7J3K6K8L6N1K4M2K3
$$ -60 -19 -6 20 31 26 31 6 -36 -90 -99 -127 -138 -140 -126 -105 -70 -18 33 41 46 52 45 13 -10 -50 -51 -98 -85 -59 -31 5 56 80 122 145
4530A45J4m9j6m6l0k3m8J0PJL9L8L0M4Rmj9l4o9l8m3k8j6l4L9M5M0L5J0N7lk1
$$ 145 159 110 94 48 18 -5 -53 -43 -36 -35 4 42 72 116 125 121 102 68 -1 -39 -82 -110 -126 -160 -121 -76 -36 -1 9 66 63 42
4562D2k1n5l1p6qQj1J4O5L1M7O0J9M0Pl0k8l9l9n9mJK8L8M4L9O8N0K0l7J1m5o0
$$ 42 21 -34 -65 -141 -149 -141 -152 -138 -73 -42 5 65 84 124 131 101 73 34 -5 -64 -68 -67 -39 -1 43 82 150 200 220 183 194 149 89
4595H9n2m8m0j0J1J1N5L9N0K2J3ol5l6n8p5m2m2l1J3j0N0O1K7M6L7r%m4m0o7l8
$$ 89 37 -11 -51 -61 -50 -39 16 55 105 127 140 134 99 63 5 -70 -112 -154 -185 -172 -182 -132 -71 -44 2 39 30 30 -14 -54 -121 -159
4627a59n2l7J2M8N0N2O2P3K6K4qol8l5n8l1Jj0L5L2P0P4N4K8K1%j2n1p0l0m6o5
$$ -159 -211 -248 -236 -188 -138 -86 -24 49 75 99 91 85 47 12 -46 -77 -76 -86 -51 -19 51 125 179 207 228 228 216 165 95 65 19 -46
4659d6J0qM2L4P7L4L6Qlj4o8o7o3r3qm1oK5M8N7M4K8L8Oj0o3m0r0l4n4jj8K1P6
$$ -46 -36 -44 -2 32 109 143 179 187 184 170 102 35 -28 -121 -129 -170 -176 -151 -103 -46 -2 26 64 70 60 -3 -43 -133 -167 -221 -222 -240 -219 -143
4693a43N4O6N3N4j2J4m0l5o4l5l8m4J8RN4P4O1O9M0JJ2l1n3l2o7n5k6l8M9MQ8
$$ -143 -89 -23 30 84 72 86 46 11 -53 -88 -126 -170 -152 -143 -89 -15 46 115 155 156 168 137 84 52 -15 -70 -96 -134 -85 -81 7
4724GM7N0N9QLk8l7n3o6n6j4l7J5J9P1L4O6M1M4j0k5m1m4p5m9k7k5J1ML9O1N0
$$ 7 54 104 163 171 174 146 109 56 -10 -66 -80 -117 -102 -83 -12 22 88 129 173 163 138 97 53 -22 -71 -98 -123 -112 -108 -69 -8 42
4756D2M3L4jk3k9n0n0r1l5l9j0N2L5N0K4Q2NK6Nn5n8k4o3m1nk0M2J9P7N4O1M3
$$ 42 85 119 118 95 66 16 -34 -125 -160 -199 -209 -157 -122 -72 -48 34 39 65 70 15 -43 -67 -130 -171 -176 -196 -154 -135 -58 -4 57 100
4788A00K8L2m1l0m8n3j8k7qJ4L9L4Q7N6L7N9k9j7l8m4n2o5l4l9RNN7M0L4K9J8
$$ 100 128 160 119 89 41 -12 -30 -57 -65 -51 -12 22 109 165 202 261 232 215 177 133 81 16 -18 -57 -48 -43 14 54 88 117 135
4819A35kk7l2r2m6l1o6j3l3J8L7J3M6M0L7NK5l6o5m7l7k7l3L9J9M0K9N8O3N9L
$$ 135 133 106 74 -18 -64 -95 -161 -174 -207 -189 -152 -139 -93 -53 -16 -11 14 -22 -87 -134 -171 -198 -231 -192 -173 -133 -104 -46 17 76 79
4850G9L5l5rj5m2k1k9J2%N5M6M2M8L4L6j2k1l6j4o1l9m4rk8J9K2K8O8J5koj4n2
$$ 79 114 79 70 55 13 -8 -37 -25 -25 30 76 118 166 200 236 224 203 167 153 92 53 9 0 -28 -9 13 41 109 124 122 116 102 50
4883E0m0o5n2k4k7k0QO1L1KK4J3K9lk9m5j2n0rl4JJ3O8L8L4M8L0PK4pk8k7k8j2
$$ 50 10 -55 -107 -131 -158 -178 -170 -109 -78 -76 -52 -39 -10 -13 -42 -87 -99 -149 -158 -192 -191 -178 -110 -72 -38 10 40 47 71 64 36 9 -19 -31
4917c1rj7K4J1P1L5L0J9K5J3k0l4m2k4k3k8J6j8lM4K1L4j1K4J7l0l0n0m2mk4m7
$$ -31 -40 -57 -33 -22 49 84 114 133 158 171 151 117 75 51 28 0 16 -2 -5 39 60 94 83 107 124 94 64 14 -28 -32 -56 -103
4949a03J4oJ4L1J7M7%Pj0l3k6k6l5j9PqJ3L6J3M3K3L0jrJ0l4rk5j5%j0J3J7J9
$$ -103 -89 -95 -81 -50 -33 14 14 21 11 -22 -48 -74 -109 -128 -121 -129 -116 -80 -67 -24 -1 29 28 19 29 -5 -14 -39 -54 -54 -64 -51 -34 -15
4983a5O0J8mL6Kj1j2m0ml7lk5J7J8J6ML1J4l%kk2k4l2ol1j8J7jK0PK1K2%Jpj0
$$ -15 45 63 59 95 97 86 74 34 30 -7 -10 -35 -18 0 16 20 51 65 62 62 60 38 14 -18 -24 -55 -73 -56 -57 -37 -30 -9 13 13 14 7 -3
5020cj1j2k7j8J4j9K4%K5J4K2J4pK1l4Pk6o%jLJ3oJ3M%L0J7k7J3l0j8jqQm2K5
$$ -3 -14 -26 -53 -71 -57 -76 -52 -52 -27 -13 9 23 16 37 3 10 -16 -22 -22 -23 -20 -7 -13 0 4 4 34 51 24 37 7 -11 -12 -20 -12 -54 -29
5057b9nK7lKK9rLk2KJ4j5j1j0Kk1L0LJ4j1RL1okrQj5pppkPN%j2L5MmPj6qrj1n
$$ -29 -34 -7 -10 -8 21 12 15 -7 -5 9 -6 -17 -27 -25 -46 -16 -13 1 -10 -1 30 24 22 13 21 6 -1 -8 -15 -17 -10 -5 -5 -17 18 22 18 25 9 1 -8 -19 -24
5100b4%K0l5mL6Pj6J8j2L2k0k4QjkJ6qNLj0K7JlrJ0QkqPj4PprJ0oK5nJrlMjj4
$$ -24 -24 -4 -39 -43 -7 0 -16 2 -10 22 2 -22 -14 -15 -17 -1 -9 -4 -1 -11 16 17 14 5 15 23 21 13 20 6 13 6 -3 7 1 26 21 22 13 10 14 13 -1
5143aK4kk5K1NnJk0JQj1J8nLk4QJ3kQJ5Rk3mqL0j6nrJ4K5k4OOJ3m%Ml8JK5j8L
$$ -1 23 21 -4 17 22 17 18 -2 -1 7 -4 14 9 12 -12 -4 9 7 15 30 39 16 12 4 34 18 13 4 18 43 19 25 31 44 40 40 44 6 7 32 14 17
5185A7QOprJ7k0K7j6J6Jk3Mj1MNj7J5kj6RJ8K%oJ5j6j1Nok3OJ6Rj1MK2nKQmPj3
$$ 17 25 31 24 15 32 12 39 23 39 40 17 21 10 14 19 2 17 15 -1 8 26 28 28 22 37 21 10 15 9 -14 -8 8 17 6 10 32 27 29 37 33 40 27
5227B7k2OJ0k0pL0lNk3J9%j1nJ1l5K1j4j1Pj3K2lJ4J3j0K1j6%j2J4k0oPjmOmK8
$$ 27 5 11 21 1 -6 24 21 26 3 22 22 11 6 17 -18 3 -11 -22 -15 -28 -6 -9 5 18 8 29 13 13 1 15 -5 -11 -4 -5 -9 -3 -7 21
5265B1JjL8j0pj1qj5j3KpnJ6KMPjK6j4j9j3k2jj5JJrMqK1j6J5PnmJ2j9k2K0j7
$$ 21 22 21 59 49 42 31 23 8 -5 -3 -10 -15 1 3 7 14 13 39 25 6 -7 -29 -30 -45 -44 -43 -52 -48 -56 -35 -51 -36 -29 -34 -38 -26 -45 -67 -47 -64
5305f4Rj6J1J2J3K6J8j3JJrJ2j4%jk2J5k9L5K7llJ6J7l6Mj7j1J6k3Qp%k2J0%J1
$$ -64 -55 -71 -60 -48 -35 -9 9 -4 -3 -2 -11 1 -13 -13 -14 -36 -21 -50 -15 12 9 6 22 39 3 7 -10 -21 -5 -28 -20 -27 -27 -49 -39 -39 -28
5342b8MoOnj1k5Mnj7jMkJ4JJ7K3poJ0j2k9M2o5N1k7K4j8M4pjK5K5k4Qj9K3Kn1
$$ -28 -24 -30 -24 -29 -40 -65 -61 -66 -83 -84 -80 -82 -68 -67 -50 -27 -34 -40 -30 -42 -71 -29 -94 -43 -70 -46 -64 -20 -27 -28 -3 22 -2 6 -13 10 12 -39
5380c9J6lJ3KK6k4L5oj1L8n1M0k0j4J4k3mJ6j1l2N5kk1J3LJ7k3j2opmj6j6O1l3
$$ -39 -23 -26 -13 -11 15 -9 26 20 9 47 -4 36 16 2 16 -7 -11 5 -6 -38 17 15 -6 7 10 27 4 -8 -14 -21 -25 -41 -57 4 -29
5415b9j1K2j7LJ5mL3n6K1jn0K2L9j0j9L7JJ4J0k0L2Lm3K8J4j7k8K6nL2j6j4K1
$$ -29 -40 -18 -35 -32 -17 -21 12 -44 -23 -24 -74 -52 -13 -23 -42 -5 -4 10 20 0 32 35 -8 20 34 17 -11 15 10 42 26 12 33
5448C3L7Qm6K9J1k5k4K3k3J7K3k5j6K0J3mk1J3J7l9Nmkk7K3l5oJ7J5mJ4jk7J6
$$ 33 70 78 32 61 72 47 23 46 23 40 63 38 22 42 55 51 30 43 60 21 26 22 20 -7 16 -19 -25 -8 7 3 17 16 -11 5
5482Ej3J3j6Ok5L2j6J0J3J0j0J1j0J7J7j3k6K0oj1oK8oJ1qQL0k1j2NpQJ3k9j2
$$ 5 -8 5 -11 -5 -30 2 -14 -4 9 19 9 20 10 27 44 31 5 25 19 8 2 30 24 35 27 35 65 44 32 37 30 38 51 22 10
5517A0RK2k2Nj8J4lNk3PJ4pj0j9%L0j8J2k4J9QLJ3qpj2mLLK3pmrJ4J6j3k1LjK1
$$ 10 19 41 19 24 6 20 17 22 -1 6 20 13 3 -16 -16 14 -4 8 -16 3 11 14 27 19 12 0 -4 -1 2 25 18 14 5 19 35 22 1 4 3 24
5557B4k2j2PLJ4Nj8PKpnJk1J6j2JkK3k1jPJ4k4NJ7Qpn%rlPj2MK6J2j9K6J2k8N
$$ 24 2 -10 -3 0 14 19 1 8 10 3 -2 -1 -22 -6 -18 -17 -19 4 -17 -18 -11 3 -21 -16 1 9 2 -3 -3 -12 -15 -8 -20 -16 10 22 3 29 41 13 18
5598A8j2JLj4J1Lj8L3k7J3j2J3KOl3K1nnj2KlMk0lkK7KJ1j0j0lPK6m0mK4l8J3
$$ 18 6 7 10 -4 7 10 -8 25 -2 11 -1 12 14 20 -13 8 3 -2 -14 -12 -15 -11 -31 -34 -36 -9 -7 4 -6 -16 -19 -12 14 -26 -30 -6 -44 -31
5636c1K5j2K0j1J2%oMkjj6nK5j6J6Kk4K7J3%RJ0pj7nj9JkllJ1nj7L2j0K2k2kJ4
$$ -31 -6 -18 2 -9 3 3 -3 1 -1 -2 -18 -23 2 -14 2 4 -20 7 20 20 29 39 32 15 10 -9 -8 -10 -13 -16 -5 -10 -27 5 -5 17 -5 -7 7
5675Gl3K2nJk1J8j1K3JJMJ3JNRj6l0J5j3J%oJ5J1Ljj3K1Kj8j8KK0ll2J3Klj5L0
$$ 7 -26 -4 -9 -8 -29 -11 -22 1 2 3 7 20 21 26 35 19 -11 4 -9 -8 -8 -14 1 12 15 14 1 22 24 6 -12 -10 10 7 -25 -12 -10 -13 -28 2
5715BrK1mKj8Kk6L4pl1K8Lj0K4J0MMkj2jnj2K0pj1qlJ3RKLmR%kqKj3k4J1nKMK4
$$ 2 -7 14 10 12 -6 -4 -30 4 -3 -34 -6 -3 -13 11 21 25 29 27 15 14 9 -3 17 10 -1 -9 -12 1 10 12 15 11 20 20 18 10 12 -1 -25 -14 -19 -17 -13 11
5759A1qLj7J8jJk4J0qlJ1lJ0k4kJ0K1J0JQj2j0K7l9RKk1L8k0J7KJ6qKlMpj2J1
$$ 11 3 6 -11 7 6 7 -17 -7 -15 -18 -7 -10 0 -24 -26 -16 5 15 16 24 12 2 29 -10 -1 1 -20 18 -2 15 17 33 25 27 24 28 21 9 20
5798B0m1J8J1j1MMj0K0k3J1J3pk4PJ5Jk4j1L5k4LqL4pj0K0knlk3PJ2JJ0kMKk9
$$ 20 -21 -3 8 -3 1 5 -5 15 -8 3 16 9 -15 -8 7 8 -16 -27 8 -16 -13 -21 13 6 -4 16 14 9 6 -17 -10 2 3 13 11 15 17 -12
5836a2K0J4mJ6l0j0J7j5LqJ4nj5K5j3Ok8J4JoJ7j4J1pMNRJ%rK3ooj%Mk2J0Jj1
$$ -12 8 22 18 34 4 -6 11 -4 -1 -9 5 0 -15 10 -3 3 -25 -11 -10 -16 1 -13 -2 -9 -5 0 9 10 10 1 24 18 12 11 11 15 -7 3 4 -7
5876gJnJ7MONk1JMJ2j4JJL%%mMNj9J6pj1Qlk3mK5k8J4j9K2Lj1J3j0J0j0Pj7L0
$$ -7 -6 -11 6 10 16 21 0 1 5 17 3 4 5 8 8 8 4 8 13 -6 10 3 -8 0 -3 -26 -30 -5 -33 -19 -38 -16 -13 -24 -11 -21 -11 -21 -14 -31 -1
5917aj2J2PqknK0j3J6nKPqj3mqK7l1j4OMj3J7qpOj2k%J6j3J6jmrKL5mpJ9l5J0
$$ -1 -13 -1 6 -2 -4 -9 11 -2 14 9 11 18 10 -3 -7 -15 12 -19 -33 -27 -23 -36 -19 -27 -34 -28 -40 -42 -42 -26 -39 -23 -24 -28 -37 -35 0 -4 -11 8 -27 -17
5959a7jmNJ2pMK0j2jjj3J5Kj0KnLk9M5j2MjlLml1LlK7m5K4j2%J2LJk5L9J2qkq
$$ -17 -18 -22 -17 -5 -12 -8 12 0 -1 -2 -15 0 2 -8 -6 -11 -8 -37 8 -4 0 -1 -4 -1 -5 -36 -33 -36 -9 -54 -30 -42 -42 -30 -27 -26 -51 -12 0 -8 -10 -18
6001a8J1rk6PONojL6qPk1K4JqJ0k3RpjlJ5J4j4RPj8pRQ%j3j5NMj7L5rj5RoL5k4
$$ -18 -7 -16 -42 -35 -29 -24 -30 -31 5 -3 4 -17 7 8 0 10 -13 -4 -11 -12 -15 0 14 0 9 16 -2 -9 0 8 8 -5 -20 -15 -11 -28 7 -2 -17 -8 -14 21 -3
6044cJ6k9J7k2Moj1J5K9j2J5QPJ0j3kj5J8j2K4n4J7j5J0JoL3NQNJ5j4j1j0j6K
$$ -3 13 -16 1 -21 -17 -23 -34 -19 10 -2 13 21 28 38 25 23 8 26 14 38 -16 1 -14 -4 -3 -9 24 29 37 42 57 43 32 22 6 8
6080HOj1mlmK4%jJ8k1K7k1Jk8jMOJ4k5jJ1K1k1L8l0L0j2Mj0%KLmL6%RJ3j4J0k0
$$ 8 14 3 -1 -4 -8 16 16 15 33 12 39 18 19 -9 -10 -6 0 14 -11 -12 -1 20 -1 37 7 37 25 29 19 19 21 24 20 56 56 65 78 64 74 54
6120E4k9K1Kk0k3nmPK0ORk3K6PNk8j4j7mJ0k5j7OM0LL2jK2J2J8k5J7j0j3j7oM
$$ 54 25 46 48 28 5 0 -4 3 23 29 38 15 41 48 53 25 11 -6 -10 0 -25 -42 -36 4 7 39 38 60 72 90 65 82 72 59 42 36 40
6157D0k6L0rJ1L2pK2KLlk7l0ll2Mj5pJ6k8J9kK5qj0J3Qj9m0Jj0J4mj7R%M5J9k3
$$ 40 14 44 35 46 78 71 93 95 98 95 68 38 35 3 7 -8 -15 1 -27 -8 -10 15 7 -3 10 18 -1 -41 -40 -50 -36 -40 -57 -48 -48 -3 16 -7
6195gK3lJj2k3Nj0kJ5KNJ6%L0k3J6j5J2k0omJ2Ok8lM1pJ3J0ln%l4PRk0J0J0KJ4
$$ -7 16 13 14 2 -21 -16 -26 -28 -13 -11 -6 10 10 40 17 33 18 30 10 4 0 12 18 -10 -13 28 21 34 44 41 36 36 2 9 18 -2 8 18 20 34
6235C4J7J9k8K3Jj3k2k4mj3j5Kj8K4%K0k4L7%k8j1k5k1k0pk2%J3j7M1J9LK0OL7
$$ 34 51 70 42 65 66 53 31 7 3 -10 -25 -23 -41 -17 -17 3 -21 16 16 -12 -23 -48 -69 -89 -96 -118 -118 -105 -122 -81 -62 -59 -39 -33 4
6270Djk1l1j3oLl0M2OK7L8j0N7J6QJ1lk3l2k2npk9J6K5mK4L0oQJ3l8Ll4l4m1l0
$$ 4 3 -18 -49 -62 -68 -65 -95 -53 -47 -20 18 8 65 81 89 100 97 74 42 20 15 8 -21 -5 20 16 40 70 64 72 85 47 50 16 -18 -59 -89
6307h9j4j8nK8QOM0jlJ0km1j2l3qk5mK8J4J3M6M2J8J4J9jpk4l4PqpK9J4KM3J2
$$ -89 -103 -121 -126 -98 -90 -84 -44 -45 -48 -38 -40 -81 -93 -126 -134 -159 -163 -135 -121 -108 -62 -20 -2 12 31 30 23 -1 -35 -28 -36 -43 -14 0 2 45 57
6344E7L7J3lJ5qm6lk2l1pNk0OK4J2J2J7Nj7pj4l4j1l6nJoqJ4J4K7K5jKj5j1J0
$$ 57 94 107 104 119 111 65 62 40 9 2 7 -13 -7 17 29 41 58 63 46 39 25 -9 -20 -56 -61 -60 -66 -74 -60 -46 -19 6 5 7 -8 -19 -9
6381il7j2mj9J3J4K0J0L9KQJ4lj7Kj4l2L6k9j0K4QOJ3J4J6%j2Lml6NJ4k4j4K1
$$ -9 -46 -58 -62 -81 -68 -54 -34 -24 15 17 25 39 36 19 21 7 -25 11 -18 -28 -4 4 10 23 37 53 53 41 44 40 4 9 23 -1 -15 6
6417Fj3J4K9%K3Jj9k6%Kj3j4jk0J1J0L4j9J5jk0L4l4j6plpkkOPJ9pJ7J9k7mj4
$$ 6 -7 7 36 36 59 60 41 15 15 17 4 -10 -11 -31 -20 -10 24 5 20 19 -1 33 -1 -17 -24 -27 -34 -36 -38 -32 -25 -6 -13 4 23 -4 -8 -22
6455b2j8%k2J4rK0kJ8QPJ6j8K7j7%m7K5j7j3J4J8J3J6K7K2j6KMpmj3ml0kj7L1
$$ -22 -40 -40 -62 -48 -57 -37 -39 -21 -13 -6 10 -8 19 2 2 -45 -20 -37 -50 -36 -18 -5 11 38 60 44 46 50 43 39 26 22 -8 -10 -27 4
6491Dj9L0J8Klmolk2nk4j1j7Jj1K2K6L4j8K6j7Qj8j8k1k3j6J3RJ0PJ2L2J9pK9
$$ 4 -15 15 33 35 32 28 22 19 -3 -8 -32 -43 -60 -59 -70 -48 -22 12 -6 20 3 11 -7 -25 -46 -69 -85 -72 -63 -53 -46 -34 -2 17 10 39
6527C9J1l0nj6k3qk0K2JML7kN3oKNj5Knm5l2k0J1%NL0qK0K0J1J6j1Nj5l3k3k7
$$ 39 50 20 15 -1 -24 -32 -52 -30 -29 -25 12 10 63 57 59 64 49 51 46 1 -31 -51 -40 -40 -35 -5 -13 7 27 38 54 43 48 33 0 -23 -50
6564e0kJ2QJ7K7J0J6K1j1J0ok1pl6mj8J1pNL9RMM0j4J2j3Jj8k4k0j3k5L6k5L2
$$ -50 -52 -40 -32 -15 12 22 38 59 48 58 52 31 24 -12 -16 -34 -23 -30 -25 14 23 27 67 53 65 52 53 35 11 -9 -22 -47 -11 -36 -4
6599dK9ML6j8J2k0Nl2Nj0k1lPRj3K8J6K7Qkj0kk6j8%nj0kJ0J3J2K9MJL0n4J9l1
$$ -4 25 29 65 47 59 39 44 12 17 7 -14 -17 -10 -1 -14 14 30 57 65 63 53 51 25 7 7 2 -8 -10 0 13 25 54 58 59 89 35 54 23
6637B3j5Qjqk2KK3oL2KlJOj9j6nJ0k0J0j9JJK2L3l7J7M9k3noOl2rRpj2J1pJ2K9
$$ 23 8 16 15 7 -15 -13 10 4 36 38 35 36 42 23 7 2 12 -8 2 -17 -16 -15 7 40 3 20 69 46 41 35 41 9 0 9 2 -10 1 -6 6 35
6677C5l6J9%j1j5J4j9J1j6Pj0lOj2QNpPj0J2knj6RJ3k0moNJ8mrK3k0JK6k2K0O
$$ 35 -1 18 18 7 -8 6 -13 -2 -18 -11 -21 -24 -18 -30 -22 -17 -24 -17 -27 -15 -17 -22 -38 -29 -16 -36 -40 -46 -41 -23 -27 -36 -13 -33 -32 -6 -28 -8 -2
6716bK0j5Kj2l%KrK1j9nJ7j0kJ4J0J4oPk2j9RqqJ1j1J6%j4RJ7K3j8Mj4Pl0jqM
$$ -2 18 3 5 -7 -10 -10 -8 -17 4 -15 -20 -3 -13 -15 -1 9 23 17 24 2 -17 -8 -16 -24 -13 -24 -8 -8 -22 -13 4 27 9 13 -1 6 -24 -25 -33 -29
6756b9k0NK7J0L0j4J8JmJ0k8Pl2pj6NoJ5LM4J2mK4k4j9jm0Nk1Jj4j9M3J4QK8J3
$$ -29 -49 -44 -17 -7 23 9 27 28 24 34 6 13 -19 -26 -42 -37 -43 -28 -25 19 31 27 51 27 8 7 -33 -28 -49 -48 -62 -81 -38 -24 -16 12 25
6793B5L0ll0Nk0m0k2j4Mk3O5MRM6K4MRQj6k8k4j2l0%j8K4J8L5L1K6qJ7Oj5m4l6
$$ 25 55 52 22 27 7 -33 -55 -69 -65 -88 -23 -19 -10 36 60 64 73 81 65 37 13 1 -29 -29 -47 -23 -5 30 61 87 79 96 102 87 43 7
6829Gj4l2j9qPL5RL8L3K7j1Rj9j7l0n0m3Mk8J5J6N1M7K2K9J5Nm5Oo0l3l9j4l1
$$ 7 -7 -39 -58 -66 -59 -24 -15 23 56 83 72 81 62 45 15 -35 -78 -74 -102 -87 -71 -20 27 49 78 93 98 53 59 -1 -34 -73 -87 -118
6863a18L5K1J9J9N1K0K8K5l2j7n9k3n6k3lRJL8M0K3O0K3Pqj9m8l6k5n3j5k8M3
$$ -118 -83 -62 -43 -24 27 47 75 100 68 51 -8 -31 -87 -110 -113 -104 -103 -65 -25 -2 58 81 88 80 61 13 -23 -48 -101 -116 -144 -101
6895a01K1L5L8N4N2J6j9l0j6p8j9l7m8J0PJ8O3M0K7N6K3k2Po6o7j7n5o0PnL5M3
$$ -101 -80 -45 -7 47 99 115 96 66 50 -28 -47 -84 -132 -122 -115 -97 -34 6 33 89 112 90 97 31 -36 -53 -108 -168 -161 -166 -131 -88
6927h8M2N2M1K0J4J1n9n7n0l2m7l0RJ7M2N7O2O2J4K2j3k6o1k8o5m5oqoN4O5M8
$$ -88 -46 6 47 67 81 92 33 -24 -74 -106 -153 -183 -174 -157 -115 -58 4 66 80 102 89 63 2 -26 -91 -136 -142 -150 -156 -102 -37 11
6959A1N5M3L5j4j5n7n2r7mm7j5J7L0P5K7O7K3L3Oj8n0n5l9n4m2l3L0L0K6P1O6
$$ 11 66 109 144 130 115 58 6 -91 -95 -142 -157 -140 -110 -35 -8 59 82 115 121 103 53 -2 -41 -95 -137 -170 -140 -110 -84 -13 53
6990E3N0K7kj4k2k7q0n9n3l5K3RM8O9N4Q0K9lj4km8p3o7m0l9NON2P0O2L8M5J5
$$ 53 103 130 128 114 92 65 -15 -74 -127 -162 -139 -130 -82 -13 41 121 150 147 133 131 83 10 -57 -97 -136 -131 -125 -73 -3 59 97 142 157
7023A57J5l7n7n7n2n2n6kK4K8M7R0L5N2J7J3k6m1o9m0q8k3Qk0M6N2O8N7O3K1m
$$ 157 172 135 78 21 -31 -83 -139 -141 -117 -89 -42 48 83 135 152 165 139 98 29 -11 -99 -122 -114 -134 -88 -36 32 89 152 173 169
7054A69k1l9n2q2l4n1j4j5K5P3M9N7O9L2PNn0m8o8p4m2k5k0M7M6O5P7L9K9M2j6
$$ 169 148 109 57 -25 -59 -110 -124 -139 -114 -41 8 65 134 166 173 178 128 80 12 -62 -104 -129 -149 -102 -56 9 86 125 154 196 180
7085A80k8o1q1n4l5k4j6J3L0Q3N6O3N1j0Mj8m3r9m9m0m3k2NN2O4L8O3O4RJ4m0
$$ 180 152 91 10 -44 -79 -103 -119 -106 -76 7 63 126 177 167 171 153 110 11 -38 -78 -121 -143 -138 -86 -22 16 79 143 152 166 126
7116A26l3n5p5m0m7l6OM0M8P5M3N6M7j1k1Mo6o3n8m6m3KM1K4P1O3L9L8J8K0n1
$$ 126 93 38 -37 -77 -124 -160 -154 -114 -66 9 52 108 155 144 123 127 61 -2 -60 -106 -149 -147 -106 -82 -11 52 91 129 147 167 116
7147A16m5o5m5o7j1k6K1L9M0Q4L5N3KPj9o5m9o9l0l1k0QN1L9N9O2M4J7Pk2m4l3
$$ 116 71 6 -39 -106 -117 -143 -122 -83 -43 41 76 129 131 138 119 54 5 -64 -94 -125 -145 -137 -86 -47 12 74 118 135 142 120 76 43
7179D3p4m3l9lkM1M3M9M1O1J0J0Mo3k4q0m5k3ml3M2M4N6K0O4K3JJ4n3n2n6k9m6
$$ 43 -31 -74 -113 -116 -118 -77 -34 15 56 117 127 137 141 78 54 -26 -71 -94 -98 -131 -89 -45 11 31 95 118 119 133 80 28 -28 -57 -103
7212a03m3NJ7M8N5M1O9J0M3k3k4k1n9m6o3knlL4P1PO5N6J0J2k0l2p9k5n0l1k7
$$ -103 -146 -141 -124 -76 -21 20 89 99 142 119 95 74 15 -31 -94 -96 -101 -104 -70 1 8 73 129 139 151 131 99 20 -5 -55 -86 -113
7244a13K6L6J1O3L5K0M2Mk7j0m7n1l9m0k1qM0J2O4K7N4J4J4j7k6k9o4qm3k4j1
$$ -113 -87 -51 -40 23 58 78 120 124 97 87 40 -11 -50 -90 -111 -119 -79 -67 -3 24 78 92 106 89 63 34 -30 -38 -81 -105 -116
7275a16M7J7L6M2M0J6K7j4k9k5n1l7j7n0K3NJ9M8L6M8KK2%k0l8l7j6o3pj8NK8
$$ -116 -69 -52 -16 26 66 82 109 95 66 41 -10 -47 -64 -114 -91 -86 -67 -19 17 65 67 89 89 69 31 -6 -22 -85 -92 -110 -105 -77
7307g7OP5L3J5J0qPm0ql9m5k9Pk0J7M2K1K2K9M2Mj2k0m0j0m8k8K8l1K4J0L8L0
$$ -77 -71 4 37 52 62 54 61 21 13 -26 -71 -100 -93 -113 -96 -54 -33 -11 18 60 64 52 32 -8 -18 -66 -94 -66 -97 -73 -63 -25 5
7340EL1lJJ3k2l7m0k5mk5K4k2J6N9J0L4jK6Lj9j3m5k7pk9nL1OK2J8L3OMJ0j9k2
$$ 5 36 33 34 47 25 -12 -52 -77 -81 -106 -82 -104 -88 -29 -19 15 14 40 43 24 11 -34 -61 -68 -97 -102 -71 -65 -43 -25 8 14 18 28 9 -13
7376a3ok1l1j3pJ9PQPM0%L2j9k1J8k5k2j6nj8pNK6QL5MPJ5l2J6k5J3k5j6MPqJ4
$$ -13 -19 -40 -71 -84 -91 -72 -65 -57 -50 -10 -10 22 3 -18 0 -25 -47 -63 -68 -86 -93 -88 -62 -54 -19 -15 -8 7 -25 -9 -34 -21 -46 -62 -58 -51 -59 -45
7414d5KL2J4J0QNj7j4RLl2j0K0oNJ3MJ3RmNpj7j5L6n0RlP%J5pRQmrPj5J2j8kN
$$ -45 -43 -11 3 13 21 26 9 -5 4 7 -25 -35 -15 -21 -16 -3 1 14 23 19 24 17 0 -15 21 -29 -20 -23 -16 -16 -1 -8 1 9 5 -4 3 -12 0 -18 -20 -15
7456a5mQK1Pm0K8lJ0K6lqk2%K1%Kj8J4j8JJJ0j2J0jj0J2j1NNjJ0%k2mMjJK3q%
$$ -15 -19 -11 10 17 -23 5 2 12 38 35 27 5 5 26 26 28 10 24 6 7 8 18 6 16 15 5 17 6 11 16 15 25 25 3 -1 3 2 3 26 18 18
7497A8j3K3jK2Jkjj0J0k4J9l0kJ2K5rkPJ8j3K1qk0rjmnMmnMJ3L9k8JK5j2k0j0
$$ 18 5 28 27 49 50 48 47 37 47 23 42 12 10 22 47 38 36 43 61 48 69 61 41 32 31 27 22 26 22 17 21 34 73 45 46 71 59 39 29
7536B9ql1J6k2J0OJ6rK5MjRmPj6k3j8pJj6K7mPL0J9j0K0j4Kj5j2k3QJj2lJ7qJ9
$$ 29 21 -10 6 -16 -6 0 16 7 32 36 35 44 40 47 31 8 -10 -17 -16 -32 -5 -9 -2 28 47 37 57 43 45 30 18 -5 3 4 -8 -11 6 -2 17
7575A7NK8M%Jk4j1m8Mkj8QKK2K0J2PK1J8ol8qol6mMmJPM0NK0J5oRj3k2j7l4ok
$$ 17 22 50 54 54 55 31 20 -28 -24 -26 -44 -36 -34 -12 8 20 27 48 66 60 22 14 8 -28 -32 -28 -32 -31 -24 16 21 41 56 50 59 46 24 7 -27 -33 -35
7616c5lpjM3K6K1PJ4k1j2k7Rm7j8nk0J3pL5J4J9L1J4Pj4k3j0j6l9Jkj6K5jM3J0
$$ -35 -38 -45 -46 -3 23 44 51 65 44 32 5 14 -33 -51 -56 -76 -63 -70 -35 -21 -2 29 43 50 36 13 3 -13 -52 -51 -53 -69 -44 -45 -2 8
7652HM3j%Kk2j6m4kl3MoJ0J6L6J1K0M0k2rrj4k8k9k5j6J6jK9J9K4L2J5J4j9j8
$$ 8 51 50 50 52 30 14 -30 -32 -65 -61 -67 -57 -41 -5 6 26 66 44 35 26 12 -16 -45 -70 -86 -70 -71 -42 -23 1 33 48 62 43 25
7687B5j1j0k5m0pKk0N1K6K1J6L8Jpj5J2m7po1J1j1j8L9J9J4M1OK0rmk6k7l5j9
$$ 25 14 4 -21 -61 -68 -66 -86 -35 -9 12 28 66 67 60 45 57 10 3 -58 -47 -58 -76 -37 -18 -4 37 43 63 54 50 24 -3 -38 -57
7721e7pk9OJ2J6M2L3M0nj0pj5m7ml4k4J2k0K1K8K4M2L8pK0k9Ol3k1l6J0j5j4J6
$$ -57 -64 -93 -87 -75 -59 -17 16 56 51 41 34 19 -28 -32 -66 -90 -78 -98 -77 -49 -25 17 55 48 68 39 45 12 -9 -45 -35 -50 -64 -48
7755d8K8KN2PL0pK8l3k0l4j0m0%l0J1L5K5K8L0K8J0k6k8Lo6Jk4kj2QoL8N8LJ0
$$ -48 -20 -18 34 41 71 64 92 59 39 5 -5 -45 -45 -75 -64 -29 -4 24 54 82 92 66 38 41 -25 -24 -48 -50 -62 -54 -60 -22 36 39 49
7790D9L0j4ql7j4pm3j7l6K6LN3K2J6K0K1Pk2k1j6l7j8l9Nj1J6K9L4M4J9R%Jk8
$$ 49 79 65 57 20 6 -1 -44 -61 -97 -71 -68 -15 7 23 43 64 71 49 28 12 -25 -43 -82 -77 -88 -72 -43 -9 35 54 63 63 64 36
7824C6j3k7o4J2l3K1K1J8J8N9j6M3Pj9j0l4l1pm0k7QK1J3N1K5J8J4K0Km4j1o0
$$ 36 23 -4 -68 -56 -89 -68 -47 -29 -11 48 32 75 82 63 53 19 -12 -19 -59 -86 -78 -57 -44 7 32 50 64 84 86 42 31 -29
7856b9j8nj1k6J4L2K7K0K9K7K3l1J7k9l8l3l3j1mJ0L0N3mL1K1Ljj7j7k8j8l2J3
$$ -29 -47 -52 -63 -89 -75 -43 -16 4 33 60 83 52 69 40 2 -31 -64 -75 -79 -69 -39 14 10 41 62 65 64 47 30 2 -16 -48 -35
7889c5mlJK4K3K7K7QJ6j7j7k1m6nm4pL3mJ3M0OM3J4j3Ml8k1k2k4k5k0J9L1KM6
$$ -35 -39 -42 -41 -17 6 33 60 68 84 67 50 29 -17 -22 -66 -73 -40 -44 -31 9 15 58 72 59 63 25 4 -18 -42 -67 -87 -68 -37 -35 11
7924A1J9J5LK0j0ql8k7Ml0kk5J2K5L2J7L8jK0j8j9l3k3pl1Nlj2L6K2LK8J6nnQ
$$ 11 30 45 48 68 58 50 12 -15 -11 -41 -43 -68 -56 -31 1 18 56 55 75 57 38 5 -18 -25 -56 -51 -54 -66 -30 -8 -5 23 39 34 29 37
7960C7m1lk5m0J6PNj3M2K5K2jK0Kqk0j8l2J0k9JK6j2M7mL1J5J9nk6j2k2l1%m2
$$ 37 -4 -7 -32 -72 -56 -49 -44 -57 -15 10 32 31 51 53 45 25 7 -25 -15 -44 -43 -17 -29 18 14 45 60 79 74 48 36 14 -17 -17 -59
7995e9J8nqL1L5K0pKJ4k4j4j6k9j6j1JJ3pK5OJ1L0RK1k3j5j9Jj2k3pJ2J2PK2M1
$$ -59 -41 -46 -54 -23 12 32 25 27 41 17 3 -13 -42 -58 -69 -68 -55 -62 -37 -31 -20 10 19 40 17 2 -17 -16 -28 -51 -58 -46 -34 -27 -5 36
8031C6J5k2M5k2k4k3pk3%j5jPOJ6K5J4%Plk6mk0pj1%j2LK3QK5K2kPmjj5j9qm0
$$ 36 51 29 74 52 28 5 -2 -25 -25 -40 -41 -34 -28 -12 13 27 27 34 31 5 1 -19 -26 -37 -37 -49 -46 -23 -15 10 32 30 37 33 32 17 -2 -10 -50
8070e0%jK4K8j5L4JJ1%Ok6j2nk7J1qj4K9j5QL0oK0J3j9njm1Ok9%pK9j5J2L6mL0
$$ -50 -50 -51 -27 1 -14 20 21 32 32 38 12 0 -5 -32 -21 -29 -43 -14 -29 -21 9 3 23 36 17 12 11 -30 -24 -53 -53 -60 -31 -46 -34 2 -2 28
8108B8%mlRl7k4J5k2J5j2K2J6J7oJ3J3nPprj0k0pKj2L0LJRJ0J8k2OLk6Rl5RKj1
$$ 28 28 24 21 30 -7 -31 -16 -38 -23 -35 -13 3 20 14 27 40 35 42 35 26 16 -4 -11 -9 -21 9 12 13 22 32 50 28 34 37 11 20 -15 -6 -4 -15
8148a5K0qK9jJ0J7J8j1%k5j6kj1jK0j1J7KL0Jj7JJ8lroj9Qk7K0J9l6L7Qmj4L2
$$ -15 5 -3 26 25 35 52 70 59 59 34 18 16 5 4 24 13 30 32 62 63 46 47 65 62 53 47 28 36 9 29 48 12 49 57 53 39 71
8185G1k4j5MpNj1
$$ 71 47 32 36 29 34 23
8191B3
$$ Imaginary data points
##PAGE= N=2
##DATA TABLE= (X++(I..I)), XYDATA
0@%%%%%%%%%%%%%%%jJpQqJ4j5J6j6K1k5K8l2L6m3M7n3O1o9P8q6R6j08J23j37J52
$$ 0 0 0 0 0 0 0 0 0 0 0 0 0 0 0 0 -1 0 -7 1 -7 7 -8 8 -8 13 -12 16 -16 20 -23 24 -29 32 -37 41 -45 51 -57 66 -71 81
41H1j69J86k08K31k53K79l09L39l75M13m53N01n53O10o75P51q38R38j058J201
$$ 81 -88 98 -110 121 -132 147 -162 177 -198 215 -238 263 -290 320 -355 396 -442 496 -562 639
61F39j377J599j892K296k891L864n724J0582m6818j77109j23034p8838m059O1244
$$ 639 -738 861 -1031 1265 -1626 2238 -3486 7096 -39722 -216831 -339865 -418703 -422762 -361518
75c61518J25660J62435J78515J60025J20114N7278j0631p8945j30211j61555j63505
$$ -361518 -235858 -73423 105092 265117 385231 442509 431878 352933 222722 61167 -102338
86a02338j40558r2905l2455L3821R1846J34803J52998J45999J13406O2777Q52
$$ -102338 -242896 -335801 -368256 -334435 -242589 -107786 45212 191211 304617 367394 368246
97C68246o0356j11862j44193j53239j36670r8262m3984J6613P4167J18470J42982
$$ 368246 307890 196028 51835 -101404 -238074 -336336 -380320 -363707 -289540 -171070 -28088
108b8088J43535J20924P8792K4695l2266q2324j17354j31241j21907r0939m3746
$$ -28088 115447 236371 315163 339858 307592 225268 107914 -23327 -145234 -236173 -279919
119b79919J1911O6853J11708J39159J45001J28329R2040M2435j2051o2514j00585
$$ -279919 -268008 -201155 -89447 49712 194713 323042 415082 457517 445466 382952 282367
130B82367j19956j17680r4706n5169n705M5043Q8462J17226J26645J15096Q4595
$$ 282367 162411 44731 -49975 -105144 -110849 -65806 22656 139882 266527 381623 466218
141D66218M0378j0242n9004r7834j20626j23984j07726p5027l1575J5150N7212
$$ 466218 506596 496354 437350 339516 218890 94906 -12820 -87847 -119422 -104272 -47060
152d7060Q7564J01313R6212P3209L6619p612n2032q9195j13039j19723j08423
$$ -47060 40504 141817 238029 311238 347857 340245 288213 199018 85979 -33744 -142167
163a42167q0948m2083J655M3085P5553R3795R4952P9392M9905J1627k8788o4434
$$ -142167 -223115 -265198 -263543 -220458 -144905 -51110 43842 123234 173139 184766 155978 91544
175I1544q9329r9254r2605p0328l6352L761M3423P6150R6496J01387R0306O5211
$$ 91544 2215 -97039 -189644 -259972 -296324 -292563 -249140 -172990 -76494 24893 115199 180410
187A80410L0506p812m3238o9976q3566q1801o5211l6768j381L5102O6303Q7068
$$ 180410 210916 203104 159866 89890 6324 -75477 -140688 -177456 -178837 -143735 -77432 9636
199I636R4026Q6218O4801L3623j995l6305o3741p9769q2021p0434m7367j6648
$$ 9636 103662 189880 254681 288304 286309 250004 186263 106494 24473 -45961 -93328 -109976
211a09976J6258M5760O6776P6106P2143N5585K9390j982l3412n9699p6544q1247
$$ -109976 -93718 -47958 18818 94924 167067 222652 252042 250060 216648 156949 80405 -842
223h42p3418n4429k7470K720L1074N3063O5009O5028N3375L2089M881k3681m8815
$$ -842 -74260 -128689 -156159 -153439 -122365 -69302 -4293 60735 114110 146199 151080 127399 78584
236G8584o6138p3026o8364n2895k9279j576K5634M7962O1640O4585N6419L8814
$$ 78584 12446 -60580 -128944 -181839 -211118 -212694 -187060 -139098 -77458 -12873 43546 82360
248H2360J4582j1858l6189n4165o2956o1149m8956k8683l764K1714M3439N7839
$$ 82360 96942 85084 48895 -5270 -68226 -129375 -178331 -207014 -210778 -189064 -145625 -87786
260h7786O2556N6973M2325K0967l326k6451m4559n4668n5275m6324k9489p782
$$ -87786 -25230 31743 74068 95035 91709 65258 20699 -33969 -89244 -135568 -165057 -172839
272a72839J5282L5684N0089N6201N3076M1513K3364J883j9300l6772m7614n0111
$$ -172839 -157557 -121873 -71784 -15583 37493 79006 102370 104253 84953 48181 567 -49544
284d9544m4065l0543j1963Q550K7491M1753M9075M8254L9588K4563N852j3468
$$ -49544 -93609 -124152 -136115 -127565 -100074 -58321 -9246 39008 78596 103159 109011 95543
296I5543l0191m1577m5655m2136l1539j5744K525K0127L4174M2426M3368L7117
$$ 95543 65352 23775 -21880 -64016 -95555 -111299 -108774 -88647 -54473 -12047 31321 68438
308F8438K4754Q363r269k5209l6751m2046m0454l2281j8830k661J3580K7180L5944
$$ 68438 93192 101555 92286 67077 30326 -11720 -52174 -84455 -103285 -105946 -92366 -65186 -29242
321b9242L8290L4140K4234J0299n357j9931l1118l6994l6900l0757j9701n793
$$ -29242 9048 43188 67422 77721 72364 52433 21315 -15679 -52579 -83336 -103037 -108830
333a08830Q699K1450L0172L3649L1418K4001J2678n62j3402k3686k9857l0942
$$ -108830 -100131 -78681 -48509 -14860 16558 40559 53237 52675 39273 15587 -14270 -45212
345d5212k6742j8151o691N762J7182K5528K9656K8895K3666J4658L689p455j7009
$$ -45212 -71954 -90105 -96796 -91034 -73852 -48324 -18668 10227 33893 48551 52240 44785 27776
358B7776k3207k5257k2915j6580p436K968J2898K0617K4899K5238K1562J4509
$$ 27776 4569 -20688 -43603 -60183 -67619 -64651 -51753 -31136 -6237 19001 40563 55072
370E5072N453m197j2734j8837k1477k0337j5872q713j35Q275J5154J9373K0349
$$ 55072 60525 56328 43594 24757 3280 -17057 -32929 -41642 -41777 -33502 -18348 1025 21374
383B1374J7984J2647N479k417r722j5116j7924j7624j4545r161k480M269J0060
$$ 21374 39358 52005 57484 55067 45345 30229 12305 -5319 -19864 -29025 -31505 -27236 -17176
396a7176J3907J5250J3978J0368N140q89o539j0938j3502j3729j1822q119l273
$$ -17176 -3269 11981 25959 36327 41467 40578 34039 23101 9599 -4130 -15952 -24071 -27344
409b7344J756O271R503J0899J0419Q256M759N87l474o804q880r437q409o133l015
$$ -27344 -25588 -19317 -9814 1085 11504 19760 24519 25106 21632 14828 5948 -3489 -11898 -18031 -21046
424b1046M04L587N933P130P042N879L810J174j378l563m986n489n059l858k167
$$ -21046 -20642 -17055 -11122 -3992 3050 8929 12739 13913 12535 8972 3986 -1503 -6562 -10420 -12587
439a2587l08J488K768L454L469K960J987Q05k67j136j682j885j646j253p69l17
$$ -12587 -12895 -11407 -8639 -5185 -1716 1244 3231 4036 3769 2633 951 -934 -2580 -3833 -4602 -4919
455d919m1N7Lj00k64l04j26K60P17J238J698J951J844J305M77o04j752k717l260
$$ -4919 -4960 -4903 -4900 -5000 -5264 -5568 -5694 -5434 -4717 -3479 -1781 170 2014 3319 3796 3192 1440 -1277 -4537
474d537l281k675j445K63K057L766N000N536N159M008K010l97k820m853o118o335
$$ -4537 -7818 -10493 -11938 -11675 -9618 -5852 -852 4684 9843 13851 15861 15464 12644 7791 1673 -4662
490d662n389l396o12K454N450P621Q672Q367O660L768M9l706o967r245r873q853
$$ -4662 -10051 -13447 -14059 -11605 -6155 1466 10138 18505 25165 28933 28982 25276 18309 9064 -809 -9662
506i662o291k519J847O077R338J1156J1154R181N513P69m266q818j2091j3334
$$ -9662 -15953 -18472 -16625 -10548 -1210 9946 21100 30281 35794 36563 32297 23479 11388 -1946
520a946j2489r575n028M34N924J0388J3113J3638J1744P721K231l879r540j3806
$$ -1946 -14435 -24010 -29038 -28604 -22680 -12292 821 14459 26203 33924 36155 32276 22736 8930
534H930j5855j5441j2467p399j021N552J1222J5113J6406J4910J0877M857k127
$$ 8930 -6925 -22366 -34833 -42232 -43253 -37701 -26479 -11366 5040 19950 30827 35684 33557
547C3557q915j4334j7367j7632j4909r566k430N176J2118J7216J9460J8573J4587
$$ 33557 24642 10308 -7059 -24691 -39600 -49166 -51596 -46420 -34302 -17086 2374 20947 35534
560C5534Q069K33p785j4477j8718j9841j7500j2039m382M277J2410J8737K1957
$$ 35534 43603 43836 36051 21574 2856 -16985 -34485 -46524 -50906 -46629 -34219 -15482 6475
573F475K1710J7956J1094K412o701j4669k0232k2317k0588j5351p357J989J1151
$$ 6475 28185 46141 57235 59647 52946 38277 18045 -4272 -24860 -40211 -47568 -45579 -34428
586c4428J8547K2863K3507K0186J3364M318n599j4641k1409k4587k3717j9006
$$ -34428 -15881 6982 30489 50675 64039 68357 62758 48117 26708 2121 -21596 -40602
598d0602j1086j310Q700J7231K2827K4507K2071J5726O627l770j3791k1699k6095
$$ -40602 -51688 -52998 -44298 -27067 -4240 20267 42338 58064 64691 60921 47130 25431 -664
611f64k6316k2280j4564m430O392J6078K3130K6114K4670J8965R932r58j1940
$$ -664 -26980 -49260 -63824 -68254 -61862 -45784 -22654 3460 28130 47095 57027 56069 44129
624D4129k1069k6699k8072k4791j7299o897M723J5599K3978K8302K7866K2809
$$ 44129 23060 -3639 -31711 -56502 -73801 -80698 -75975 -60376 -36398 -8096 19770 42579
636D2579J3949K587r216j9459k6428k8997k6633j9661r309K760J4440K3932K9495
$$ 42579 56528 59115 49899 30440 4012 -24985 -51618 -71279 -80588 -77828 -63388 -39456 -9961
649i961L0172K5980J7503O194o096j7260k5485k9276k8115k2154j2306l00J1937
$$ -9961 20211 46191 63694 69888 63792 46532 21047 -8229 -36344 -58498 -70804 -71104 -59167
662e9167K2335K9081L1048K8063K0404R385l107j5006k4403k9664k9852k5048
$$ -59167 -36832 -7751 23297 51360 71764 81149 78042 63036 38633 8969 -20883 -45931
674d5931j6001m143Q510J9807K7833L1185K9527K2748J2185m68j3146k3695l0318
$$ -45931 -61932 -66075 -57565 -37758 -9925 21260 50787 73535 85720 85252 72106 48411 18093
687A8093l1870k8191j9813q064N050J7285K6620L1415L0933K5181J5119K359j0888
$$ 18093 -13777 -41968 -61781 -69845 -64795 -47510 -20890 10525 41458 66639 81758 84117 73229
700G3229k2396l0260l3104l0501k2869j1374J916J4888K5321L1412L2257K7639
$$ 73229 50833 20573 -12531 -43032 -65901 -77275 -75359 -60471 -35150 -3738 28519 56158
712E6158J8366O007p426j9559k8496l2571l1262k4684j3958q76J2397K3602L0918
$$ 56158 74524 80531 73105 53546 25050 -7521 -38783 -63467 -77425 -78301 -65904 -42302 -11384
725a1384L3089K9875K1721J0005l289j5885k5812l1267l1379k6232j6516m014
$$ -11384 21705 51580 73301 83306 80017 64132 38320 7053 -24326 -50558 -67074 -71088
737g1088R357K1266K9674L3233L1413K4369J3336J41j2981k3919l0765l2355k8507
$$ -71088 -61731 -40465 -10791 22442 53855 78224 91560 91701 78720 54801 24036 -8319 -36826
750c6826j9823p724N740J8252K7757L2630L2070K6097J5712K656j0825k2637l0646
$$ -36826 -56649 -64373 -58633 -40381 -12624 20006 52076 78173 93885 96541 85716 63079 32433
763C2433l3485l0870k3160j1575J886J4899K5320L1368L2123K7377J7939N464
$$ 32433 -1052 -31922 -55082 -66657 -64771 -49872 -24552 6816 38939 66316 84255 89719
775H9719q081k0225k9113l3167l1743k5195j4429j444J1675K2763K9913L1936
$$ 89719 81638 61413 32300 -867 -32610 -57805 -72234 -73678 -62003 -39240 -9327 22609
787B2609K8597K0470Q844m264j6676k6299l1551l1540k6349j6737m459Q567K0102
$$ 22609 51206 71676 80520 76256 59580 33281 1730 -29810 -56159 -72896 -77355 -68788 -48686
800d8686K8225L1549K9612K2697J1967p84j3393k3802l0195l1543k7684j9143
$$ -48686 -20461 11088 40700 63397 75364 74580 61187 37385 7190 -24353 -52037 -71180
812g1180p457N472J7442K6473L0959L0269K4475J4506K102j0735k1728k9166l1681
$$ -71180 -78637 -73165 -55723 -29250 1709 31978 56453 70959 73061 62326 40598 11432 -20249
825b0249k8977k1441j0342K416J4702K4421K9975L0413K5768J6749M866p738j9160
$$ -20249 -49226 -70667 -81009 -78593 -63891 -39470 -9495 20918 46686 63435 68301 60563 41403
838D1403k7321l0897k9378k3016j2850o67J1575K1724K8200K9844K6488J8744
$$ 41403 14082 -16815 -46193 -69209 -82059 -82726 -71151 -49427 -21227 8617 35105 53849
850E3849P819m342j5808k4596k9222k9014k4053j5077l667Q294J8756K6084K8987
$$ 53849 61668 57326 41518 16922 -12300 -41314 -65367 -80444 -84111 -75817 -57061 -30977 -1990
863a990K6992K0558J0662j016j2471k1813k7461k8572k4899j7020o348N376J6191
$$ -1990 25002 45560 56222 55206 42735 20922 -6539 -35111 -60010 -77030 -83378 -78002 -61811
876f1811K4239K8245K7472K2129J3114J908r575j9439k5926k8081k5471j8635
$$ -61811 -37572 -9327 18145 40274 53388 55296 45721 26282 356 -27725 -53196 -71831
888g1831q601K782J3776K2353K7196K7439K3167J5030M408o858j6910k4043k7117
$$ -71831 -80432 -77650 -63874 -41521 -14325 13114 36281 51311 55719 48861 31951 7908 -19209
901a9209k5615j9845j0759N9J0825J9661K5212K6472K3320J6309O626m094j4087
$$ -19209 -44824 -64669 -75428 -75369 -64544 -44883 -19671 6801 30121 46430 53056 48962 34875
914C4875k1661k5579k5151k0654j2700k697P700J6725K2859K5195K3281J7512
$$ 34875 13214 -12365 -37516 -58170 -70870 -73567 -65867 -49142 -26283 -1088 22193 39705
926C9705Q905j188j1007j8912k3547k4233k0874j3928m683N343J4512K1279K4500
$$ 39705 48610 47422 36415 17503 -6044 -30277 -51151 -65079 -69762 -64419 -49907 -28628 -4128
939d128K3677J8997J1269J753p923j6113k1435k3068k0682j4761o254L363J2507
$$ -4128 19549 38546 49815 51568 43645 27532 6097 -16971 -37653 -52414 -58668 -55305 -42798
952d2798J9645K3490K3536J9819J2896L921n495j3820j9716k2132k0760j5883
$$ -42798 -23153 337 23873 43692 56588 60509 55014 41194 21478 -654 -21414 -37297
964c7297q356O10R471J6677K1081K1970J9274J3365N290l564j1756j7935k1044
$$ -37297 -45653 -45043 -35572 -18895 2186 24156 43430 56795 62085 58521 46765 28830 7786
977G786k0673j6917j0417k259O135J3444J8322K0076J8501J3773O719j440r334
$$ 7786 -12887 -29804 -40221 -42480 -36345 -22901 -4579 15497 33998 47771 54490 53050 43716
990D3716j5645j9346j9787j7053j1499m081L932J1201J6496J9015J8332J4565
$$ 43716 28071 8725 -11062 -28115 -39614 -43695 -39763 -28562 -12066 6949 25281 39846
1002C9846Q425Q84o722j3142j7265j8414j6469j1777n063K476R590J5105J8033
$$ 39846 48271 49155 42433 29291 12026 -6388 -22857 -34634 -39697 -37221 -27631 -12526 5507
1015E507J8017J5074R605K693m585j0964j5410j7147j5937j2120o209O88P447
$$ 5507 23524 38598 48203 50896 46311 35347 19937 2790 -13147 -25267 -31476 -30788 -23341
1028b3341J2895J6165J6730J4584J0002L832k910r057j3573j5820j5376j2430
$$ -23341 -10446 5719 22449 37033 47035 50867 47957 38900 25327 9507 -5869 -18299
1040a8299p513j327M921J0252J3802J5009J3642J0043M718j276p085j1648j4262
$$ -18299 -25812 -27139 -22218 -11966 1836 16845 30487 40530 45248 43972 36887 25239 10977
1053A0977j4489j2343q263k824K944Q165J1879J3550J2938J0153N624K34n252
$$ 10977 -3512 -15855 -24118 -26942 -23998 -15833 -3954 9596 22534 32687 38311 38545 33293
1066C3293r748j2655j3387j1941q586l797J497O467J0240J2249J2125R947O162
$$ 33293 23545 10890 -2497 -14438 -23024 -26821 -25324 -18857 -8617 3632 15757 25704 31866
1079C1866J297l773q155j1114j2257j1374q628m566K06M840Q528J0689J1011R486
$$ 31866 33163 29390 21235 10121 -2136 -13510 -22138 -26704 -26498 -21658 -13130 -2441 8570 18056
1093A8056O358K189k294o396r335j0700j0320q263m880p92L372O879R145R850
$$ 18056 24414 26603 24309 17913 8578 -2122 -12442 -20705 -25585 -26377 -23005 -16126 -6981 2869
1107B869Q916O509L077q04m515p394q926q977p564m906j426K230N437P732Q679
$$ 2869 11785 18294 21371 20567 16052 8658 -268 -9245 -16809 -21715 -23141 -20911 -15474 -7742 937
1122I37Q203O420L605K21l077n811p501p835o951m862j968J193M103O285P378
$$ 937 9140 15560 19165 19386 16309 10498 2997 -4838 -11789 -16651 -18619 -17426 -13323 -7038 340
1137C40P228N894L610P67k141m656o333o878o350m702k415K84K846M822N970O084
$$ 340 7568 13462 17072 17839 15698 11042 4709 -2169 -8519 -13221 -15636 -15352 -12506 -7684 -1714 4370
1153D370N162L404J120j302l440n029n653n409m279k476l39J805L540M654M925
$$ 4370 9532 12936 14056 12754 9314 4285 -1368 -6777 -11056 -13532 -13871 -12066 -8526 -3872 1053
1168A053M425L165J432m90k251l584m297m298l538k250o83J045K472L453L821
$$ 1053 5478 8643 10075 9585 7334 3750 -547 -4845 -8383 -10633 -11316 -10271 -7799 -4346 -525
1183e25L623K741J498Q6j333k459l086l230k801j915q20M86J548K360K693K647
$$ -525 3098 5839 7337 7423 6090 3631 545 -2685 -5486 -7401 -8221 -7735 -6187 -3827 -1134 1513
1199A513K123J236K81p60j542k072k241j991j461p31P9Q13J338J611J623J375
$$ 1513 3636 4872 5153 4393 2851 779 -1462 -3453 -4914 -5645 -5566 -4753 -3415 -1804 -181 1194
1215A194Q80K83k78p60j070j170j042p78m15pK74N64O75O80N68L93K11M2p1r7
$$ 1194 2074 2357 2079 1319 249 -921 -1963 -2741 -3156 -3163 -2889 -2325 -1650 -970 -402 -9 202 244 173 76
1235G6q7JK2P7R1K1p8j84k72l05k34j27R7L50O10Q15Q87Q16O19K73j82o15j007
$$ 76 -11 -10 12 89 180 201 123 -61 -333 -638 -872 -999 -902 -552 58 873 1760 2576 3195 3468 3286 2671 1664
1258A664j269j319j122p20j98M04J015J440J643J517J130M40l29j124j796k265
$$ 1664 395 -924 -2046 -2766 -2964 -2560 -1545 -105 1538 3055 4185 4625 4296 3172 1376 -889
1274h89k409k111j513o57K82J257J951K278K273J789R00j68j287k320k972l228
$$ -889 -3298 -5409 -6922 -7579 -7297 -6040 -4089 -1811 462 2251 3151 2983 1696 -624 -3596 -6824
1290f824k921k229j099K06J458K502L125L169K667J755M25r90k365l264l709l522
$$ -6824 -9745 -11974 -13073 -12867 -11409 -8907 -5782 -2613 54 1809 2234 1244 -1121 -4385 -8094 -11616
1306a1616k759j441Q8J717L099L981M226L788K794J249m89k105l391m102m074
$$ -11616 -14375 -15816 -15728 -14011 -10912 -6931 -2705 1083 3877 5126 4637 2532 -859 -4961 -9035
1321i035l310j920q0J773L487M641N139M762L645J960p1k066l701m674m830m169
$$ -9035 -12345 -14265 -14345 -12572 -9085 -4444 695 5457 9102 11062 10991 8925 5224 550 -4280 -8449
1337h449k696p52J452L406M862N573N322M259K461K00k103m040n364n734n208
$$ -8449 -11145 -11897 -10445 -7039 -2177 3396 8718 12977 15438 15638 13535 9495 4131 -1603 -6811
1352f811l794j723O32K893M633N660N640M671K900N53j976m188n817o509o136
$$ -6811 -10605 -12328 -11696 -8803 -4170 1490 7130 11801 14701 15254 13278 9090 3273 -3236 -9372
1367i372m867k752k19K304M452N780O095N334L676J288j395l897n808o787o689
$$ -9372 -14239 -16991 -17210 -14906 -10454 -4674 1421 6755 10431 11719 10324 6427 619 -6168 -12857
1382a2857n496l342o69K175M631O353O984O481M901K473l78l122n353o643o749
$$ -12857 -18353 -21695 -22364 -20189 -15558 -9205 -2221 4260 9161 11634 11256 8134 2781 -3862 -10611
1397a0611n746l615q01K188M990O940P928P614O116L724P23k287m811o482o925
$$ -10611 -16357 -19972 -20773 -18585 -13595 -6655 1273 8887 15003 18727 19450 17163 12352 5870 -1055
1412a055o170m231j526J564M514O725P994P944O640M287J251j947m809o843p709
$$ -1055 -7225 -11456 -12982 -11418 -6904 -179 7815 15759 22399 26686 27937 25990 21181 14338 6629
1427F629p303n565l023R1L195N756P317P615O649M463J451j849m942p294q532
$$ 6629 -674 -6239 -9262 -9171 -5976 -220 7097 14712 21361 25824 27275 25426 20484 13190 4658
1442D658q327o917m375j188K167N040O998P687P019N050K160j233m489p098q564
$$ 4658 -3669 -10586 -14961 -16149 -13982 -8942 -1944 5743 12762 17812 19972 18739 14250 7152 -1412
1457a412q657p424m955j677J861N038P325Q418Q026O294L523J38l298o140p925
$$ -1412 -10069 -17493 -22448 -24125 -22264 -17226 -9901 -1483 6543 12837 16360 16498 13200 7060 -865
1472h65q392p443n178k015J538M856P421Q821Q799P308M739J402k130n251p425
$$ -865 -9257 -16700 -21878 -23893 -22355 -17499 -10078 -1257 7542 14850 19589 20991 18861 13610 6185
1487F185q262p738n841k908N68M029O813Q566Q936P785N484K221j343m702p191
$$ 6185 -2077 -9815 -15656 -18564 -17996 -13967 -7154 1412 10348 18133 23617 25838 24495 19793 12602
1502A2602q496q351o783m076o84K877N963Q017Q745Q020N929K817q27m285p109
$$ 12602 4106 -4245 -11028 -15104 -15788 -12911 -6948 1069 9814 17834 23763 26580 25753 21468 14359
1517A4359q758q890p648n144j720J900N183P528Q607Q169O368L413j71l760o769
$$ 14359 5601 -3289 -10937 -16081 -17801 -15901 -10718 -3190 5417 13586 19954 23367 23196 19436 12667
1532A2667q716r214q239n949k747Q69M283O908Q318Q266O774M139P21k891n975
$$ 12667 3951 -5263 -13502 -19451 -22198 -21329 -17046 -10138 -1820 6446 13220 17359 18080 15189 9214
1547I214q161r015q461o473l501J4L560O395Q174Q552P478N193K026j494m757
$$ 9214 1053 -7962 -16423 -22896 -26397 -26383 -22823 -16428 -8254 298 7776 12969 14995 13501 8744
1562H744p160q405q221o619l894m44L061O121Q192Q956Q271O236L290k28l589
$$ 8744 1584 -6821 -15042 -21661 -25555 -25999 -22938 -16817 -8625 331 8602 14838 18128 17900 14311
1577A4311o307p844q022o789m338j069K444N589P885Q922Q523O757L949N06k960
$$ 14311 8004 160 -7862 -14651 -18989 -20058 -17614 -12025 -4140 4782 13305 20062 24011 24517 21557
1592B1557n843p783q234p381n257k223J173M403O802Q167Q093O665M124Q87k534
$$ 21557 15714 7931 -303 -7684 -12941 -15164 -13991 -9588 -2786 5381 13474 20139 24263 25150 22616
1607B2616n525p652q486p978o198l474j87L034N680P292P658O670M522J564j737
$$ 22616 17091 9439 953 -7025 -13223 -16697 -16884 -13850 -8170 -878 6780 13450 17972 19536 17799
1622A7799m751p075q202q060o644m126j069K186N012O920P621P055N224K517o23
$$ 17799 13048 5973 -2229 -10289 -16933 -21059 -22128 -19942 -14930 -8010 -389 6666 11890 14407 13784
1637A3784l671o136p537p724o585m347j384J812M727O822P809P514N943L455M56
$$ 13784 10113 3977 -3560 -11284 -17869 -22216 -23600 -21788 -17061 -10239 -2430 5084 11027 14482 14938
1652A4938k620n188o816p247o441m504j762J332M200O433P613P607O370M125J290
$$ 14938 12318 7130 314 -6933 -13374 -17878 -19640 -18308 -14108 -7675 -62 7545 13915 18040 19330
1667A9330j696m351o179o908o442m874k480M26L227N517O927P240O333M417J792
$$ 19330 17634 13283 7104 196 -6246 -11120 -13600 -13174 -9947 -4430 2497 9737 16070 20487 22279
1682B2279j082l768n782o861o695n544l434p72J947M341N936O529N981M362J997
$$ 22279 21197 17429 11647 4786 -1909 -7453 -10887 -11659 -9712 -5371 565 7094 13075 17437 19434
1697A9434p14l421n551o794o975o068m210j703J003L442N269O060N832M506K413
$$ 19434 18720 15299 9748 2954 -4021 -10089 -14299 -16002 -14999 -11557 -6288 -228 5604 10110 12523
1712A2523j53k744m925o299o633n992m308k010O54L117N026O064O057N066L245
$$ 12523 12370 9626 4701 -1598 -8231 -14223 -18531 -20541 -19887 -16770 -11744 -5680 377 5443 8688
1727H688Q80j591l752n223n796n410m055j996M25K785M769N936O173N484L907
$$ 8688 9568 7977 4225 -998 -6794 -12204 -16259 -18255 -17830 -15045 -10276 -4340 1833 7317 11224
1742A1224J787n63k750m430n199n140m173k420k72J984L908N215N657N234L907
$$ 11224 13011 12448 9698 5268 69 -5071 -9244 -11664 -11936 -9952 -6044 -829 4828 10062 13969
1757A3969J994k43k376m151n181n320m570l122j208R85K921M293M982M743L687
$$ 13969 15963 15720 13344 9193 4012 -1308 -5878 -9000 -10208 -9223 -6302 -2009 2973 7716 11403
1772A1403K038l0k103l833m958n249m759l487j701L57K246L789M539M548L834
$$ 11403 13441 13411 11308 7475 2517 -2732 -7491 -10978 -12679 -12322 -10076 -6287 -1748 2800 6634
1787F634K367N68j398l045m247m704m426l400j820J7J866L367M287M511L965K820
$$ 6634 9001 9569 8171 5126 879 -3825 -8251 -11651 -13471 -13454 -11588 -8221 -3934 577 4542 7362
1803G362J218n47k228l457m103m043l342k041l84J318K794L781M181L903K970
$$ 7362 8580 8033 5805 2348 -1755 -5798 -9140 -11181 -11565 -10247 -7453 -3672 509 4412 7382
1818G382J552n0j643k934l703l814l320k248q33P61K193L261L765L675K928J721
$$ 7382 8934 8884 7241 4307 604 -3210 -6530 -8778 -9611 -8850 -6657 -3396 369 4044 6972 8693
1834H693K90j214k453l313l550l211k380j054L37J717K783L356L428K876J870
$$ 8693 8983 7769 5316 2003 -1547 -4758 -7138 -8192 -7855 -6138 -3355 1 3429 6305 8175
1849H175O09p44j981k821l148l010k327j287j3J222K242K894L061K676J918Q55
$$ 8175 8784 8040 6059 3238 90 -2920 -5247 -6534 -6547 -5325 -3083 -189 2872 5548 7466 8321
1865H321l63j502k380k793k811k330j522m24O97J667K321K633K454J829R76p7
$$ 8321 7958 6456 4076 1283 -1528 -3858 -5380 -5804 -5107 -3440 -1119 1514 3968 5797 6773 6696
1881F696j142j955k440k540k279j558o63L23J250J930K258K208J836J048J43p34
$$ 6696 5554 3599 1159 -1381 -3660 -5218 -5881 -5558 -4308 -2378 -120 2088 3924 4972 5115 4381
1897D381j519k031k195k031j459p47J81R72J613K002K012J730J152L67m12j100
$$ 4381 2862 831 -1364 -3395 -4854 -5601 -5420 -4448 -2835 -833 1179 2909 4061 4428 4016 2916
1913B916j577j840j751j341p28l8P04J241J628J757J567J093N17j78p84j221j499
$$ 2916 1339 -501 -2252 -3593 -4321 -4359 -3655 -2414 -786 971 2538 3631 4148 3970 3186 1965 466
1930D66j495j251p92k22L88Q77J260J413J272J032N41rm90r20j210j233j090p59
$$ 466 -1029 -2280 -3072 -3294 -2906 -2029 -769 644 1916 2948 3489 3480 2990 2070 860 -373 -1463 -2222
1948b222l32J83O01R26J092J100Q48N36J11k89o46q60r80q65o63l14N0L99O59
$$ -2222 -2554 -2371 -1770 -844 248 1348 2196 2732 2843 2554 1908 1048 68 -797 -1460 -1774 -1724 -1325 -666
1967f66Q33Q17P09M72J45j42m08o25o62o75n26k64o8K30L89N35N54M83L14J43
$$ -666 167 984 1693 2165 2310 2168 1760 1135 473 -202 -728 -992 -1060 -830 -441 94 648 1131 1445 1588
1987A588q9k49l89m42m10l75k41j00O8J67K66K71K44J94O4j3j22j76j99j96j63
$$ 1588 1499 1250 861 419 9 -366 -607 -707 -639 -472 -206 65 309 503 567 554 432 256 57 -139 -302
2008c02j11l7mN8O7O0L1M2M0J1mM9L6R1J01P2P4L4po9r4j36j10o2NQ7J80K71L11
$$ -302 -413 -450 -454 -396 -329 -269 -238 -196 -156 -145 -149 -100 -64 27 128 200 274 308 301 232 138 2 -108 -170 -165 -78 102 373 684
2037F84L41K83K19Q0o9j88k81l04l19k30r1N7K58L93M56N01M47K96J49j18l08
$$ 684 1025 1308 1527 1607 1538 1350 1069 765 446 216 125 182 440 833 1289 1790 2237 2533 2682 2564 2256
2058B256m84n71n46m87k93l3J79M14N74O13N70L96J95j27m32o32p55q09p29m88
$$ 2256 1772 1201 655 168 -125 -158 21 435 1009 1622 2192 2588 2783 2656 2224 1592 837 28 -701 -1189
2078a189j94J33M18O56P70P27N79K89q9m11p23r18r95q46o60l14J32M37P76R30
$$ -1189 -1383 -1250 -832 -176 594 1321 1900 2189 2100 1689 966 48 -947 -1793 -2453 -2767 -2635 -2198 -1422 -492
2098d92R42Q00M79P7l28p12r65j077j016p33l95P5M92Q54J118J114J019P28K71
$$ -492 450 1250 1729 1806 1478 766 -199 -1276 -2292 -3025 -3420 -3345 -2853 -1999 -881 233 1252 1980 2251
2117B251j74n95j000j136j132q83n15n7M35Q64J210J296J195R15M90k8n59r58
$$ 2251 2077 1482 482 -654 -1786 -2669 -3184 -3241 -2806 -1942 -732 564 1759 2674 3164 3136 2577 1619
2135A619j230j261j114p27k56K91Q04J192J353J311J057O08K3n31j040j327j448
$$ 1619 389 -872 -1986 -2713 -2969 -2678 -1874 -682 671 1982 3039 3647 3670 3139 2099 772 -676
2152f76j363r71m91Q9O67J086J375J385J140O96J22m61j035j442j568j543j189
$$ -676 -2039 -3010 -3501 -3412 -2745 -1659 -284 1101 2241 2937 3059 2598 1563 121 -1447 -2990 -4179
2169d179o68o1N48J071J357J492J300R22L49k97q93j296j592j570j256q18j51
$$ -4179 -4847 -4908 -4360 -3289 -1932 -440 860 1782 2131 1834 941 -355 -1947 -3517 -4773 -5591 -5742
2186e742M70J076J438J635J558J217O46K8o16j171j471j571j332r35k74L86R92
$$ -5742 -5272 -4196 -2758 -1123 435 1652 2298 2326 1710 539 -932 -2503 -3835 -4770 -5044 -4658 -3666
2203c666J476J743J712J401Q64K31n04j082j479j649j493j131n18J75Q27J343
$$ -3666 -2190 -447 1265 2666 3530 3761 3257 2175 696 -953 -2446 -3577 -4095 -3920 -3093 -1750
2219a750J667J717J474R78K88m36j018j553j745j683j317p64r1O25J211J604J730
$$ -1750 -83 1634 3108 4086 4374 3938 2920 1367 -378 -2061 -3378 -4142 -4233 -3608 -2397 -793 937
2236I37J532J118M64k20r26j424j696j743j476r31k74M92J079J548J794J695J332
$$ 937 2469 3587 4051 3831 2905 1481 -215 -1958 -3434 -4365 -4639 -4147 -3068 -1520 274 1969 3301
2253C301P33K2o36j278j607j742j547j099m34K74R49J494J774J774J473R21K37
$$ 3301 4034 4056 3420 2142 535 -1207 -2754 -3853 -4287 -4013 -3064 -1570 204 1978 3451 4372 4609
2270D609n00j137j599j771j662j285o46M6P99J341J704J797J537J060L62l44j024
$$ 4609 4109 2972 1373 -398 -2060 -3345 -3991 -3945 -3146 -1805 -101 1696 3233 4293 4655 4311 3287
2287C287j548j769j746j379q59r5O11J232J682J780J654J252N89j39q20j394j685
$$ 3287 1739 -30 -1776 -3155 -4014 -4109 -3498 -2266 -584 1196 2850 4102 4691 4552 3732 2338 653
2304F53j737j484r83k52M11J090J586J809J772J380Q08J15n97j194j612j738j589
$$ 653 -1084 -2568 -3551 -3803 -3392 -2302 -716 1093 2865 4245 5053 5168 4571 3377 1765 27 -1562
2321a562j160n08J54Q77J387J737J729J496R41K55m19j137j574j769j702j356
$$ -1562 -2722 -3230 -3076 -2199 -812 925 2654 4150 5091 5346 4927 3790 2216 447 -1255 -2611
2337b611p50p0O18J242J581J703J540J057L91k82r74j485j710j761j447r16k22
$$ -2611 -3361 -3431 -2813 -1571 10 1713 3253 4310 4701 4419 3445 1960 250 -1511 -2958 -3874 -4096
2354d096M65J066J566J683J566J238O47o9p52j283j593j724j472j022l94L07R33
$$ -4096 -3631 -2565 -999 684 2250 3488 4135 4066 3314 2031 438 -1286 -2758 -3780 -4174 -3867 -2934
2371b934J416J671J633J366Q47J72n03j078j483j640j552j157o05J02P05J227
$$ -2934 -1518 153 1786 3152 3999 4171 3668 2590 1107 -533 -2085 -3242 -3847 -3745 -3040 -1813
2387a813J590J620J449R67L66l07r46j368j609j586j294p75j13N22J052J468J578
$$ -1813 -223 1397 2846 3813 4179 3872 2926 1558 -51 -1637 -2931 -3706 -3819 -3297 -2245 -777 801
2404H01J452J104N15j40p83j231j551j570j347q99k87L64R05J358J526J470J180
$$ 801 2253 3357 3872 3732 2949 1718 167 -1403 -2750 -3649 -3936 -3572 -2667 -1309 217 1687 2867
2421B867O97K2n90j099j405j524j401r93m59J85P13J224J421J467J224Q01K61
$$ 2867 3564 3586 2996 1897 492 -1032 -2433 -3426 -3885 -3700 -2987 -1763 -342 1125 2349 3150 3411
2438C411l57r00j296j463j394j085o31l6N34R97J354J402J286R44M22j73o96j160
$$ 3411 3054 2154 858 -605 -1999 -3084 -3715 -3751 -3217 -2220 -866 536 1822 2766 3188 3015 2319 1159
2456A159j358j375j146p68j85L84Q41J225J399J286J015N47j3n33j018j276j318
$$ 1159 -199 -1574 -2720 -3488 -3673 -3289 -2448 -1223 176 1462 2477 3024 3011 2478 1460 184 -1134
2473a134j188q01l39K33O85J141J314J273J039O52J35m17q14j185j253j187r06
$$ -1134 -2322 -3123 -3462 -3229 -2544 -1403 -89 1184 2223 2875 3010 2593 1779 594 -659 -1846 -2752
2490b752m42O1N40R51J192J214J075P49K66k27o81j023j177j180r15n70j18L67
$$ -2752 -3194 -3133 -2593 -1642 -450 764 1839 2588 2854 2627 1946 923 -254 -1434 -2349 -2919 -3037 -2670
2508b670Q03J075J168J098Q16M15m5m86q92j080j087r75o63k05K20O77R85J080
$$ -2670 -1867 -792 376 1474 2290 2705 2660 2174 1282 202 -885 -1860 -2523 -2728 -2508 -1831 -846 234
2526B34J071Q67N01R2l82p47r67j091r30p13l14Q8N31Q45J016J002Q60N47J40
$$ 234 1305 2172 2673 2765 2383 1636 669 -422 -1352 -2065 -2379 -2291 -1760 -915 101 1103 1963 2510 2650
2545B650k67o56q85r93r75p61l94j8L59O82R13R29Q50N79K50j40n18p84r04r37
$$ 2650 2383 1727 842 -151 -1126 -1887 -2281 -2299 -1940 -1258 -345 584 1434 2013 2263 2123 1605 821 -83 -1020
2565a020p38m70j36K40N53P82R19Q27O61L46Kl60o30q13q49p51n09k02J56M81
$$ -1020 -1758 -2228 -2364 -2124 -1571 -789 130 957 1618 1964 1966 1606 976 163 -686 -1437 -1946 -2148 -1992 -1511
2585a511O81Q28Q28O75M07Q8k34n13p12p77p32n62k46O4L59N88P45P42O58M52
$$ -1511 -830 -2 826 1501 1908 1996 1762 1249 537 -240 -972 -1534 -1780 -1716 -1357 -769 -24 718 1376 1828
2605A828J42j66m38o05p24p17n60l16m1K50M99O48O68O43M20K30o4l55n26o64
$$ 1828 1970 1804 1366 761 37 -680 -1240 -1556 -1597 -1347 -848 -200 468 1111 1531 1761 1697 1342 816 152
2625A52o67n32l60j33J66L82N30O34N81M65K55Mk18m59n35o20n19l83j82M9L12
$$ 152 -515 -1047 -1407 -1540 -1374 -992 -462 172 753 1218 1473 1477 1259 800 265 -355 -874 -1257 -1439 -1390 -1078
2646a078M18N78N54M58K98O3j59l51m65n34n15l61k14kK09L94M56N17M60K87R3
$$ -1078 -660 -82 472 930 1228 1291 1132 781 316 -218 -733 -1094 -1308 -1310 -1101 -707 -251 266 726 1013 1106
2667A106n3k57m37m18m97l42k22j8J42L06L89M63L93L00J42k1j89l05l66m17l57
$$ 1106 1053 796 359 -59 -556 -898 -1120 -1138 -996 -690 -301 162 555 855 997 976 787 482 116 -301 -658
2688f58k20p4N5K42L15L82L46K91J61N5j49k33l12l67k93k33j10K6J58K40L29
$$ -658 -878 -952 -897 -655 -340 42 388 679 840 895 746 513 201 -166 -459 -692 -802 -776 -618 -378 -49
2709d9K95K90J70O0n1j89k62k83k56k00j32RJ07J57K72K51K43J76O8l5j16k03
$$ -49 246 536 706 766 715 526 264 -19 -275 -475 -607 -598 -491 -334 -62 189 432 608 676 641 525 322
2731C22j98k42j79j07j2N0J39J42K24J88J35P2l7o8j31j74j95j47r1o7PP7J22
$$ 322 124 -118 -297 -404 -416 -366 -227 -85 139 327 462 534 497 429 298 124 -71 -218 -309 -376 -369 -292 -170
2754a70J49J03Q2O6K3n1r0j31j28j01p8n6J7J7P0P3R2P1K6J4jm2p5m7o0l8l0J5
$$ -170 -21 82 164 230 253 202 112 -19 -147 -248 -326 -382 -365 -348 -278 -205 -113 -42 -16 -2 -3 -45 -120 -167 -227 -265 -295 -280
2782b80J1M6L3O7PM0pK0k0J4jnOK9J6PqN3k2J7J0k5M0j7N1K8P5N4M4JJ0Ql8m2
$$ -280 -269 -223 -190 -123 -116 -76 -83 -63 -83 -69 -70 -75 -69 -40 -24 -17 -25 28 6 23 33 8 48 31 82 110 185 239 283 284 294 302 264 222
2816B22o4l9m3PK2M4L3J11P8N1L2j3l8p7j05j13j11q1l2l9M8P2J20R9N5O6Kn9
$$ 222 158 119 76 83 105 149 182 293 371 422 454 441 403 326 221 108 -3 -84 -116 -155 -107 -35 85 184 239 305 307 248
2844B48p5j76j62j66j10q6LM2J17J20J64J31R3J2m1p7j63j88j51j61p7j2Q8J19
$$ 248 173 -3 -165 -331 -441 -527 -524 -482 -365 -245 -81 50 143 155 114 37 -126 -314 -465 -626 -703 -715 -627 -508
2868e08J90K10K14J56P4k3p2j42j52k53j39r8j8Q5J32K35K61K38K23J21M8o5j50
$$ -508 -318 -108 106 262 336 313 241 99 -53 -306 -445 -543 -561 -476 -344 -109 152 390 613 734 782 717 567
2891E67k14k16k04j39o6M9J62J90K97K66K44J47L4n3j81k61k75k56k10j19mQ6
$$ 567 353 137 -67 -206 -272 -223 -61 129 426 692 936 1083 1117 1064 883 622 347 91 -119 -238 -242 -156
2913a56K02K74K56K37J51N9r3j83l07l47l11k89j87q5P6J69K57K84K72J83R6p1
$$ -156 46 320 576 813 964 1023 930 747 440 93 -218 -507 -694 -779 -703 -534 -277 7 279 462 558 487
2935D87j73k84l33l46l11j93p9M4J94L11L27L52K72J82J6r3k20k98l44k92k06
$$ 487 314 30 -303 -649 -960 -1153 -1232 -1188 -994 -683 -356 -4 268 450 466 373 153 -145 -489 -781 -987
2956i87r6N7K33L19L79M21K99K57R8n7j94l15l38l20k91j59M2J43K88L58L86L40
$$ -987 -1083 -1026 -793 -474 -95 326 625 882 980 923 729 414 76 -244 -535 -694 -652 -509 -221 137 523 863
$$ [...]
8191a6
##END NTUPLES=NMR FID
##END=
