##TITLE=1H ikalashn
LY hexene-1 B3
16.4.2024
##JCAMPDX= 6.0         $$ Bruker NMR JCAMP-DX V2.0
##DATA TYPE= NMR FID
##DATA CLASS= NTUPLES
##ORIGIN= UXNMR, Bruker Analytische Messtechnik GmbH
##OWNER= root
$$ TOPSPIN		Version 1.3
$$ 2024-04-16 14:02:40.359 +0400  Irina@DPX200
$$ Compression mode = diff/dup
##.OBSERVE FREQUENCY= 200.13120078
##.OBSERVE NUCLEUS= ^1H
##.DELAY= (6, 6)
##.ACQUISITION MODE= SIMULTANEOUS
##.ACQUISITION SCHEME= undefined
##.AVERAGES= 8
##.DIGITISER RES= 18
##SPECTROMETER/DATA SYSTEM= spect
##.PULSE SEQUENCE= zg
##.SOLVENT NAME= CDCl3
##.SHIFT REFERENCE= INTERNAL, CDCl3, 1, 16.00952
##AUDIT TRAIL= $$ (NUMBER, WHEN, WHO, WHERE, WHAT)
$$ ##TITLE= Audit trail, TOPSPIN		Version 1.3
$$ ##JCAMPDX= 5.01
$$ ##ORIGIN= Bruker BioSpin GmbH
$$ ##OWNER= Irina
$$ $$ F:/spectra/data/iren/nmr/1H/4/audita.txt
$$ ##AUDIT TRAIL=  $$ (NUMBER, WHEN, WHO, WHERE, VERSION, WHAT)
(   1,<2024-04-16 13:58:24.390 +0400>,<Irina>,<DPX200>,<TOPSPIN 1.3>,
      <created by zg
	started at 2024-04-16 13:57:46.093 +0400,
	POWCHK disabled, PULCHK disabled
       configuration hash MD5:
       BE 6D 3F 07 2A EA 11 49 91 17 2B D3 AF B3 58 0D
       data hash MD5: 16K
       E9 44 EF 75 AD 50 69 87 2E 74 58 6B 5F 3D 92 C8>)
$$ ##END=
$$ 
$$ $$ hash MD5
$$ $$ 66 9C 34 B4 62 75 F8 27 6D C1 C9 77 1E 56 C7 54
##$RELAX= 
##$RELAX= 
##$RELAX= 
##$RELAX= 
##$RELAX= 
##$RELAX= 
##$RELAX= 
##$RELAX= 
$$ Bruker specific parameters
$$ --------------------------
##$DU= <F:/spectra>
##$EXPNO= 4
##$NAME= <1H>
##$PROCNO= 1
##$TYPE= <nmr>
##$USER= <iren>
##$AMP= (0..31)
100 100 100 100 100 100 100 100 100 100 100 100 100 100 100 100 100 100 
100 100 100 100 100 100 100 100 100 100 100 100 100 100 
##$ANAVPT= -1
##$AQSEQ= 0
##$AQ_mod= 1
##$AUNM= <au_zg>
##$AUTOPOS= <>
##$BF1= 200.13
##$BF2= 200.13
##$BF3= 200.13
##$BF4= 200.13
##$BF5= 200.13
##$BF6= 200.13
##$BF7= 200.13
##$BF8= 200.13
##$BYTORDA= 1
##$CFDGTYP= 0
##$CFRGTYP= 5
##$CHEMSTR= <none>
##$CNST= (0..63)
1 1 145 1 1 1 1 1 1 1 1 1 1 1 1 1 1 1 1 1 1 1 1 1 1 1 1 1 1 1 1 1 1 1 
1 1 1 1 1 1 1 1 1 1 1 1 1 1 1 1 1 1 1 1 1 1 1 1 1 1 1 1 1 1 
##$CPDPRG= <>
##$CPDPRG1= <>
##$CPDPRG2= <>
##$CPDPRG3= <>
##$CPDPRG4= <mlev>
##$CPDPRG5= <mlev>
##$CPDPRG6= <mlev>
##$CPDPRG7= <mlev>
##$CPDPRG8= <mlev>
##$CPDPRGB= <>
##$CPDPRGT= <>
##$D= (0..63)
0 2 0 0 0 0 0 0 0 0.06 0 0.03 0 0 0 0 0.0002 0 0 0 0 0 0 0 0 0 0 0 0 0 
0 0 0 0 0 0 0 0 0 0 0 0 0 0 0 0 0 0 0 0 0 0 0 0 0 0 0 0 0 0 0 0 0 0 
##$DATE= 1713261501
##$DBL= (0..7)
120 120 120 120 120 120 120 120 
##$DBP= (0..7)
150 150 150 150 150 150 150 150 
##$DBP07= 0
##$DBPNAM0= <>
##$DBPNAM1= <>
##$DBPNAM2= <>
##$DBPNAM3= <>
##$DBPNAM4= <>
##$DBPNAM5= <>
##$DBPNAM6= <>
##$DBPNAM7= <>
##$DBPOAL= (0..7)
0.5 0.5 0.5 0.5 0.5 0.5 0.5 0.5 
##$DBPOFFS= (0..7)
0 0 0 0 0 0 0 0 
##$DE= 6
##$DECBNUC= <off>
##$DECIM= 32
##$DECNUC= <off>
##$DECSTAT= 4
##$DIGMOD= 1
##$DIGTYP= 9
##$DL= (0..7)
0 120 120 120 120 120 120 120 
##$DP= (0..7)
150 150 150 150 150 150 150 150 
##$DP07= 0
##$DPNAME0= <>
$$ [...]
##$SW= 20.0189187932491
##$SWIBOX= (0..15)
0 0 2 0 0 0 0 0 0 0 0 0 0 0 0 0 
##$SW_h= 4006.41025641026
##$TD= 16384
##$TD0= 1
##$TE= 300
##$TE2= 300
##$TE3= 300
##$TEG= 300
##$TL= (0..7)
0 120 120 120 120 120 120 120 
##$TP= (0..7)
150 150 150 150 150 150 150 150 
##$TP07= 0
##$TPNAME0= <>
##$TPNAME1= <>
##$TPNAME2= <>
##$TPNAME3= <>
##$TPNAME4= <>
##$TPNAME5= <>
##$TPNAME6= <>
##$TPNAME7= <>
##$TPOAL= (0..7)
0.5 0.5 0.5 0.5 0.5 0.5 0.5 0.5 
##$TPOFFS= (0..7)
0 0 0 0 0 0 0 0 
##$TUNHIN= 0
##$TUNHOUT= 0
##$TUNXOUT= 0
##$USERA1= <user>
##$USERA2= <user>
##$USERA3= <user>
##$USERA4= <user>
##$USERA5= <user>
##$V9= 5
##$VALIST= <valist>
##$VCLIST= <CCCCCCCCCCCCCCC>
##$VD= 0
##$VDLIST= <DDDDDDDDDDDDDDD>
##$VPLIST= <PPPPPPPPPPPPPPP>
##$VTLIST= <TTTTTTTTTTTTTTT>
##$WBST= 1024
##$WBSW= 25
##$XGAIN= (0..3)
0 0 0 0 
##$XL= 0
##$YL= 0
##$YMAX_a= 333427
##$YMIN_a= -360381
##$ZGOPTNS= <>
##$ZL1= 120
##$ZL2= 120
##$ZL3= 120
##$ZL4= 120
##$ABSF1= 10
##$ABSF2= 0
##$ABSG= 5
##$ABSL= 3
##$ALPHA= 0
##$AQORDER= 0
##$ASSFAC= 0
##$ASSFACI= 0
##$ASSFACX= 0
##$ASSWID= 0
##$AUNMP= <proc_1d>
##$AXLEFT= 0
##$AXRIGHT= 0
##$AXTYPE= 0
##$AXUNIT= <>
##$AZFE= 0.1
##$AZFW= 0.1
##$BCFW= 1
##$BC_mod= 2
##$BYTORDP= 1
##$COROFFS= 0
##$CY= 7568.61572265625
##$DATMOD= 1
##$DC= 2
##$DFILT= <>
##$DTYPP= 0
##$F1P= 17.4489326093798
##$F2P= -7.48496080290002
##$FCOR= 0.5
##$FTSIZE= 32768
##$FT_mod= 4
##$GAMMA= 1
##$GB= 1
##$INTBC= 1
##$INTSCL= 1
##$ISEN= 128
##$LB= 0.15
##$LEV0= 0
##$LPBIN= 0
##$MAXI= 945.577
##$MC2= 0
##$MEAN= 0
##$ME_mod= 0
##$MI= -402.1523
##$NCOEF= 0
##$NC_proc= 0
##$NLEV= 6
##$NOISF1= 8.587773
##$NOISF2= 6.764455
##$NSP= 1
##$NTH_PI= 0
##$NZP= 0
##$OFFSET= 16.00952
##$PC= 1
##$PHC0= 188.779
##$PHC1= -1.397372
##$PH_mod= 0
##$PKNL= yes
##$PPARMOD= 0
##$PPDIAG= 0
##$PPIPTYP= 0
##$PPMPNUM= 100
##$PPRESOL= 1
##$PSCAL= 0
##$PSIGN= 0
##$REVERSE= no
##$SF= 200.13
##$SI= 32768
##$SIGF1= 18.5376
##$SIGF2= -6.396296
##$SINO= 400
##$SIOLD= 32768
##$SREGLST= <1H.CDCl3>
##$SSB= 3
##$STSI= 0
##$STSR= 0
##$SW_p= 4006.41025641025
##$SYMM= 0
##$S_DEV= 0
##$TDeff= 0
##$TDoff= 0
##$TI= <>
##$TILT= no
##$TM1= 0
##$TM2= 0
##$TOPLEV= 0
##$USERP1= <user>
##$USERP2= <user>
##$USERP3= <user>
##$USERP4= <user>
##$USERP5= <user>
##$WDW= 1
##$XDIM= 8192
##$YMAX_p= 0
##$YMIN_p= 0
$$ End of Bruker specific parameters
$$ ---------------------------------
##NTUPLES= NMR FID
##VAR_NAME=  TIME,          FID/REAL,        FID/IMAG
##SYMBOL=    X,             R,               I
##VAR_TYPE=  INDEPENDENT,   DEPENDENT,       DEPENDENT
##VAR_FORM=  AFFN,          ASDF,            ASDF
##VAR_DIM=   8192,          8192,            8192
##UNITS=     SECONDS,       ARBITRARY UNITS, ARBITRARY UNITS
##FACTOR=    0.0002496,     1,               1
##FIRST=     0,             0,               0
##LAST=      2.0444736,     1,               5
##MIN=       0,             -360381,         -360381
##MAX=       2.0444736,     333427,          333427
$$ Real data points
##PAGE= N=1
##DATA TABLE= (X++(R..R)), XYDATA
0@%%%%%%%%%jRj6J6j7K6l4M2n1O0p6R2j09J27j49J76k06K40k77L19l67M20m80
32b56N46o22P06p92Q87r97J118j248J391j548J719j903K104k326K569k833L124
49A639l444L792m176M602n077N608o204O881p656Q551r601J0857j2387J4293j6753
64i075K0069k4798L2143m5196P5321k69180q8587N20993q2677l83924j05470L76072
76A5691J81130j92735j83596J64060J61534q0188j34830R0475J13648p8273j57500
87a00584K7655J22644N599j28769p7554K2638O7987M5926j4784j07193p3044J14804
99i4675K02582j8021k33952o7937K60477K00894j73645k53769R2541K68394j5487
110A67402k57135m9884K06300N1308k15668r4008J94493J14525k02780j79796
$$ y = [0, 0, 0, 0, 0, 0, 0, 0, 0, 0, -1, 8, -8, 8, -9, 17, -17, 25, -26, 34, -42, 50, -59, 68, -81, 95, -111, 129, -148, 171, -196, 224, -256, 290, -332, 374, -418, 469, -528, 590, -658, 733, -815, 904, -999, 1105, -1221, 1348, -1485, 1639, -1805, 1987, -2189, 2413, -2664, 2944, -3260, 3621, -4035, 4516, -5085, 5772, -6615, 7678, -9075, 10994, -13804, 18339, -26857, 48464, -220716, -309303, 211690, 129013, -254911, -360381, 15691, 196821, 4086, -179510, -15450, 146084, 65896, -68934, 21541, 135189, 56916, -100584, -72929, 49715, 55314, -73455, -151009, -128371, -60384, -14458, -29242, -136435, -209479, -94675, 107907, 89886, -144066, -212003, 48474, 249368, 75723, -178046, -85505, 182889, 167402, -89733, -139617, 66683, 117991, -97677, -191685, 2808, 117333, -85447, -265243]
120b65243J66823K42885q4706k58466M839K57016J04651j66481j33308Q9948J37023
131I4981l883q1279l4022R652J5128K6306Q323n5851o1045L0672P0623j8801p6464
144g5660Q998P6147q326p7440K5644J17891k838j42718k6248J74206R5675j60161
156E170j60406J10495J99403m4877k12250l4559J73399P5149j31047r7094Q2656
167c3961Q9681n2793p1762M7483P0957l6356o6688L3671P8409r174p2164j3985
179c6682N1644K6109k4515k6184j1105o141J7830L7318r417o9190k3666P9812
191E813O5478o1340q9697L7927J08099O27r7171j9256Q7970L3524p7058m1658
203d6742O8625M5123p2176o6702N7361P8328m4582r6821J2458R5959J9117p8400
$$ y = [-265243, -98420, 144465, 59759, -198707, -193868, 63148, 167799, 1318, -131990, -42042, 94981, 91098, 9819, -24203, -14551, 577, 26883, 35206, -20645, -81690, -51018, 19605, 804, -75660, -66662, 9485, 1159, -76281, -50637, 67254, 64416, -78302, -104550, 69656, 165331, 5170, -155236, -44741, 154662, 109785, -102465, -137024, 36375, 111524, -19523, -116617, -33961, 55720, 2927, -68835, -21352, 49605, 13249, -53439, -19768, 58641, 49467, -22697, -36682, 14962, 41071, 16556, -9628, -20733, -26874, -9044, 28274, 18857, -50333, -73999, 5813, 71291, 9951, -79746, -41819, 66280, 66907, -30264, -49520, 38450, 71974, -5084, -46742, 21883, 67006, -5170, -71872, -14511, 63817, 19235, -77586, -65128, 30831, 49948, -28452]
215b8452l8218N7295N2518k2029l6994R779K6373J773n764N193m018j6703J598
228B351J9317m082k9567p373K1905J375k8826n136L0715N378l8108j0496M9323
241F776L0551m3202m1154M1546O3301j7777o4959Q71O4173J7864n4535l1971L6519
254H003L0499l0749l6485J5377K7614j5884l1247P390K8080k361k4969j346K3934
267b144J1125r983n173Q500P631L236N245j5j0861l632J5416R191j9866k2366
281a3696J0049K1716j0572l1353k603K5931M262k7445j0756K5620J7120j9464
293a1191j6986K1443K7798q693k3493Q152K9690M263k3473q775J8162J0871j5061
306A2707j6306L041P438o317j1756k866K025k059l020Q82J033m45L751P391K323
$$ y = [-28452, -66670, -9375, 43143, 21114, -15880, -6101, 20272, 22045, 16281, 21474, 17456, 753, 2351, 21668, 17586, -11981, -19354, 2551, 3926, -24900, -30036, 679, 6057, -32051, -42547, 6776, 37327, -5875, -47029, -5483, 57818, 40041, -24918, -24047, 40126, 57990, 3455, -28516, 8003, 38502, 7753, -28732, -13355, 14259, -1625, -32872, -25482, 2598, 237, -24732, -26078, -2144, 8981, -1002, -6175, 2325, 9956, 13192, 18437, 18422, 7561, 3929, 19345, 28536, 8670, -13696, -3647, 18069, 7497, -23856, -26459, -528, 3734, -23711, -34467, -8847, 8273, -11191, -28177, -6734, 21064, 12371, -11122, -2970, 26720, 30983, 7510, -1265, 16897, 27768, 12707, -3599, -558, 6880, 563, -11193, -14059, -12034, -14093, -17113, -16231, -15198, -15643, -11892, -4501, -2178]
321b178j711N517J1959L343p138k35J2007N081j2275j0852O357P717j0853j7660
335a0921j096R747l038j5441m826J0748O027p439m227J0134J1366j67l065O447
349D249J0342K424l409M14L945R2m399l820k662l991m419k979l770n576k914J836
365a4637J041l151r99O430P213L36j026O566R722J840m075J566P263J123p583
380A1629m986K518L15q003p853j24J397m697n750J002M204k3j745L358O236K503
396a9J59L600N366J190j582J531K815k266n359j087J748l455p755k609L381l64
412d706o415k487N658M329k834j631O352O634j119k491M672O071k148n813R32
427E004M576k721q286k545L525r70o789k601L959J336l677K95O415K868l341Q66
$$ y = [-2178, -3889, 1628, 13587, 16930, 9792, 9557, 21564, 26645, 14370, 3518, 9875, 17592, 6739, -10921, -12017, -2270, -5308, -20749, -25575, -14827, -8800, -16239, -20466, -10332, 1034, 867, -2198, 4249, 14591, 17015, 13606, 14020, 17965, 18057, 13658, 9838, 7176, 3185, -1234, -4213, -7983, -13559, -16473, -14637, -13596, -16747, -17746, -11316, -4103, -3767, -4793, 1773, 11495, 13335, 9260, 10826, 18089, 19212, 11629, 6643, 9161, 9476, 1473, -6380, -6504, -5107, -9804, -15554, -14552, -10348, -10371, -12116, -8758, -2522, -19, 140, 3740, 9106, 10296, 8714, 10245, 13060, 10794, 5435, 4348, 6096, 2641, -5114, -7723, -4342, -4706, -11121, -13608, -7950, -3621, -6455, -8086, -1734, 4900, 3781, 1290, 5962, 12033, 9885, 4072, 5004, 9580, 6859, -1427, -3972, -447, -1417, -8206, -10807, -6848, -5512, -9189, -8894, -2479, 389, -2952, -2086]
443b086Q591M363n683l558O841N461o921q832K474N441n847j0517M89O867l100
458f017r935R84J1136K265q989r45J3152Q451o540n589Q263R405l724p987J346
473E276M306m474p583qJ626o795p964K669N977m369q107L806J0891J158n936L605
489e922J1530K077o633K777J1909Jj3671l350J3135L606j8175j3999R874J1639
503D798j1626j8488L184J5402r03j3276J071J4948L815q982J746J5520N200j1065
517A344l601J3323P754j1264j1170M728O403p034r837K24J115p146l841P465L265
532h272j0970n897J4489J4396q034j3159R505K0123m46j5312O67J5798R89j5824
546a947l146J3819L58k0436q445J6841R087j9428j7639J3065K0163o514j8899
$$ y = [-2086, 6505, 10868, 5185, 1627, 8468, 13929, 7008, -1824, 650, 6091, 244, -10273, -9784, -2917, -6017, -15952, -14968, -3832, -1567, -10556, -11501, 1651, 10102, 3562, -2027, 6236, 15641, 11917, 3930, 5276, 9582, 5108, -2475, -2483, -857, -7652, -15616, -12947, -6970, -11339, -19446, -15640, -4749, -3591, -9527, -5922, 5608, 7685, 1052, 3829, 15738, 15739, 2068, -1282, 11853, 15459, -2716, -16715, -6841, 4798, -6828, -25316, -22132, -6730, -7633, -20909, -19838, -4890, -1075, -10057, -8311, 7209, 12409, 1344, -2257, 11066, 18820, 7556, -3614, 1114, 7517, 483, -9354, -9130, -8015, -15161, -19002, -11537, -8272, -19242, -25139, -10650, 3746, -4288, -17447, -7942, 12181, 11735, -3577, -2910, 12888, 13877, -1947, -5093, 8726, 9084, -11352, -19797, -2956, 6131, -13297, -30936, -17871, 2292, -4222, -23121]
559b3121L069J9019L976j0630J73J1625J239q417K886J1792k647j5247j424J4339
573F632K325j6434q581J0351O151j0198o344Q738L975j0618k661J6210Q201j6076
587h329j1388J8168K0322j1362k2675N758K3628N92k1256n255J5902M121j5205
600f979m878J3549L029j6607n939J7681J0207j6266j4128J3492J8052o506j5876
613a1169L387J3807p10r211K908P847o204r839P915J3576p761j8769L015K0485
627I277K120j9792o899J6429Q911j2691p920J1609O998j2172o717J4882J0045
640A4080j5700j4881J3922J9823q870k2264K314K0859K837j6970n094J2653M176
653F885j0284j767J1020O05j3481j855J5817N471j5991r808J3290J2315r462j2472
$$ y = [-23121, -20052, -1033, 2943, -7687, -7514, 4111, 5350, -3067, -181, 11611, 8964, -6283, -7707, 6632, 8957, -7477, -16058, -5707, 444, -9754, -16098, -7360, -3385, -14003, -16664, -454, 7747, -8329, -19717, -1549, 18773, 7411, -15264, -9506, 14122, 14714, -6542, -11797, 4105, 8226, -6979, -11857, 1692, 4721, -11886, -17825, -144, 10063, -6203, -20331, -6839, 11213, 4707, -11169, -7782, 6025, 5315, -3896, -988, 6859, 655, -9184, -1269, 12307, 4546, -14223, -11208, 9277, 11397, -8395, -15294, 1135, 10046, -2645, -10565, 1044, 8042, -4130, -10847, 4035, 14080, -1620, -16501, -2579, 17244, 8374, -13890, -11576, 9283, 12120, -4850, -9944, 2709, 6885, -3399, -5166, 5854, 6459, -7022, -8877, 6940, 12411, -3580, -13388, -98, 12217, 2755, -9717]
667i717O096J0351n248q354O647Q294q841j0811R742J5172p611j8944L022K0465
681A0263K678j8846p055J5182Q818j1634q466R427O980r741o994J0601Q414j1226
695a599j1708R476J4369o054j5444J826J4010J156j1038j818Q455N72p453J533
709c717Q857k204j1414R81J3644K105j4228n902J2412Q093j0133r346P330Q264
723D742o740q063O663Q198p416j0131P046J2845m591j4433J455J5177K878j2999
737e369n216J0564O400p783o007O006M571o423m835O176M698p208o848N865P770
752B361m479q326K713Q082r38o242J466O205j306n551K705P254k233q733Q85R729
768C592Q80j0580m147Q705N064p945o812N546O451m615o315M248O954l059o560
$$ y = [-9717, -3621, 6730, 1482, -6872, -225, 8069, -772, -11583, -1841, 13331, 5720, -13224, -10202, 10263, 12941, -5905, -12960, 2222, 11040, -594, -9060, 367, 7347, -2394, -9388, 1213, 9627, -1599, -13307, -3831, 10538, 4484, -10960, -9134, 4876, 6032, -5006, -6824, 1631, 2203, -5250, -3717, 5140, 2936, -8478, -7497, 6147, 8252, -5976, -11878, 534, 8627, -1506, -10852, -3522, 4742, -1998, -10061, -3398, 4800, -2616, -12747, -5701, 7144, 2553, -11880, -10425, 4752, 7630, -5369, -10585, -21, 6379, -1404, -7411, -1405, 3166, -3257, -8092, -1916, 2782, -4426, -11274, -5409, 2361, -2118, -10444, -7731, 351, -587, -6829, -5363, 842, -464, -6015, -3310, 3944, 1711, -7022, -6137, 3592, 4472, -6108, -10255, -1550, 3514, -4431, -11243, -5697, 754, -3861, -10176, -5928, 1026, -2033, -8593]
783h593L330Q347r83p683J12P954J873o708k991M964K649m527l102K922J612l896
799d720k170L618K046m083k676M329M121l044l743L319N154j572m248J829M839
814B999j141m898N60M836n53n855j205N036J520n452l160M184L729l200l787K577
830c810M355j019l168J423L789k72k805P26L103l25l109j23K656j86l207p90K381
847c81K88k873q40K593R67k585r67L084J991k455j873K870L157j831l191J459
863e87L668o07l807m42L166O84l236j683K220J528k043j829J461J858r05j484
879b038R74J752k82j064O37J209l44q14O38P42r93j063R96J104j481j922J057
896h92K225r52k835K83L146N47l007j075L023K076k296k326J942K833j128k977
$$ y = [-8593, -5263, 3084, 2101, -5582, -5470, 2484, 4357, -2351, -5342, -378, 2271, -2256, -5358, -2436, -824, -4720, -6890, -3272, -1226, -5309, -7985, -3656, 465, -2579, -6322, -3003, 2151, 579, -3669, -1840, 2999, 1858, -3040, -2480, 2356, 1803, -4052, -5257, -221, 1299, -4153, -7313, -3129, 600, -2600, -6387, -3810, 545, -474, -3642, -2219, 1570, 1298, -1507, -781, 2322, 1997, -1112, -1235, 1421, 1235, -1972, -2762, -381, -93, -2966, -3806, -1213, -246, -2831, -3798, -714, 1277, -1178, -3051, -181, 2976, 1145, -2046, -587, 3081, 2474, -1333, -1775, 1391, 2075, -1161, -2844, -624, 904, -1139, -2968, -1507, 351, -554, -2038, -1064, 688, 406, -658, -21, 1188, 844, 30, 668, 1410, 417, -646, 350, 1454, -27, -1949, -892, 1333, 381, -2454, -2171, 975, 1522, -1485, -2560, 463, 2539, 243, -2083, -141, 2692, 1564, -1413]
912a413M05K836J32k762r60K102J193j700j550R24J414l32j065j5O48L18Q4Km33
931a72k46Q87R00r33j523O84K035l48k635m30K751J103k883k046K545K875j908
948F56l482J120L971O1l893j009L603K014k846k656J895K919r22k880j14K346
964G83P56j666j256P04J241J97q58r43J58J457R19j454j904J105K930k27l594
981a652r66L811K284l616l663K771M711j652n437J41N624J401n249k823M418M045
997D148l144m652J685M835j59m387j087L476J946k289k340R26K077K59j373j199
1013a278J89J579J216j361k559N47L725Q65m262k560M233M394l415o009J949P136
1029D389o2p655k156P365M221o433o044M819P293k803p875O23P712J543o736l230
$$ y = [-1413, -1008, 1828, 1960, -802, -1762, 340, 1533, -167, -1717, -793, 621, 289, -776, -791, -143, 175, 259, 261, -172, -418, 469, 1369, 436, -1087, -403, 1632, 1284, -1351, -1781, 970, 2073, -810, -2856, -311, 2564, 656, -2826, -1706, 2265, 2326, -1567, -2576, 1027, 3041, 195, -2461, -566, 2353, 1431, -1449, -1563, 783, 1539, -127, -1383, -679, 562, 759, -99, -1042, -884, 573, 1492, 38, -1866, -761, 2169, 1942, -1652, -2618, 1193, 3477, -139, -3802, -1031, 3680, 2028, -3409, -3268, 2356, 3757, -1492, -4315, 103, 4148, 1004, -3648, -1963, 2872, 2713, -1674, -2761, 715, 2661, 372, -1968, -1042, 1035, 1294, -79, -1278, -1089, 490, 1706, 345, -2214, -1667, 2058, 2923, -1339, -3899, 334, 4728, 1313, -4696, -2747, 4389, 4327, -3328, -5484, 1881, 6102, -331, -6375, -1556, 5737, 2934, -4941, -4318, 3394, 4937, -1799, -5029]
1045e029N217M373l227m662J253M091M03k811j459J028J636P05r90k227l73L111
1061A039K202l236m115K624N948j164p282p94Q096L285q028n835P022Q224n169
1076B817j0074K475J0949M82j0820l470R555N882p472p441M978Q067k393p642
1090d107J98O571J512m944k415L079K570j242j991l98O08J333J192j534l320O53
1106b235N129J121o272l586O470O403n428q782L403J0651o16j1417k471J1122
1120C492N398r981q027P878R839n423j1049K426J1179M48j0458l095Q819N066
1134F512o394o002L843N930j378m730l26K855R68q23p42j118o77K123K297k630
1150b92m385J979O131q14p656j071Q598L485q756o052Q133Q748o401j0941L842
$$ y = [-5029, 188, 4561, 1334, -3328, -2075, 2016, 2419, -392, -1851, -823, 813, 1518, 528, -1699, -2072, 1039, 3241, 5, -4110, -1486, 4462, 3298, -3984, -4778, 3318, 6603, -1425, -7260, -238, 7986, 2817, -7257, -4782, 6167, 6649, -4171, -7641, 1914, 7796, 324, -7117, -2139, 5928, 3535, -4107, -3909, 2662, 4174, -770, -3185, -106, 2464, 1222, -769, -1167, -559, 774, 1966, 432, -2888, -2235, 2894, 4015, -2257, -5843, 627, 7030, 1602, -7180, -3777, 6874, 6258, -5159, -7630, 3492, 8890, -1091, -9118, -1240, 8599, 3176, -7873, -5447, 5732, 6180, -4278, -7373, 1446, 6512, 118, -5884, -2041, 3889, 2511, -2219, -2545, 310, 1278, 455, -287, -1405, -2082, 41, 2338, -292, -4677, -2698, 3433, 2619, -5037, -6108, 2490, 5975, -2781, -8833, -700, 8048, 1647, -9294, -5452]
1165e452J2330p54j2724k719J1647N474r949p851P165Q763m578r018J938Q256
1179B528O4o933j394N379K210l617k124K068J485q23l10Q6j387m46K831J258m320
1196c445l253M529N262m272p561K711R214n39j0109j985J0268M711r300o958P907
1211b820Q876n810j0174L337J0617r52j0584j749R395L568p939n231N708N696
1225A938l635n440J794M498n01k979K23J676l60m44J304j22k441J11L594L04m811
1242e291j573N384K841n858m727N411O474m466q050K894R349o16r662j564R557
1257A03M016q314n804O769P139m779p736K691P586j012p085n70N965J477m861
1272d415j987L664K070k505j515J919J020j370MJ729n89k186J119L203j076m264
$$ y = [-5452, 6878, 6124, -6600, -9319, 2328, 7802, -2147, -9998, -2833, 5930, 1352, -7666, -5728, 2528, 2592, -4341, -5735, -356, 1854, -1763, -3887, -1819, -334, -1157, -1467, -1381, -2768, -3214, -383, 875, -3445, -6698, -2169, 3093, -1179, -8740, -6029, 3185, 2646, -7463, -9448, 820, 5531, -3769, -10727, -2820, 6056, 246, -9928, -6591, 4026, 3074, -7510, -9259, 136, 3704, -4235, -9466, -3758, 1938, -1697, -7137, -5343, -845, -1346, -4325, -4102, -2426, -2786, -3230, -1926, -2048, -4489, -4378, -784, -480, -5291, -6864, -1480, 1361, -4497, -9224, -3813, 2661, -1805, -9855, -6961, 2388, 1772, -7890, -9454, 103, 4119, -4195, -9999, -3230, 3909, -870, -8606, -5915, 1671, 659, -6426, -6996, -1031, 446, -4415, -6402, -2738, -668, -3173, -4688, -2769, -1749, -3119, -3115, -1386, -1975, -4161, -3042, 161, -915, -5179]
1288e179M87N138M67n855j857N948L343n620m718M854O059l536o725K260P376
1303B442m40p161r05O867K420n914l380M822M098l661m316K412M150j519l734
1318c819Q48L218m80k572N47K301n60j916J011K141j111k241J439K784j333l264
1334c007J134L819o64m344n1M607Q72m711j761M507K778m015l409L416M185k456
1350I00m405J716M660p45m456L9M209O42l830j111L343J408k927j622K513J647
1366A981k217j632K025J661j856j598J901J759j777j834J836K117j701k373J565
1381a43K679j336l021R73L209n56l446L2L500M96l461j036L311J583l002j983
1397b201K675K384k218k609J792K782j339k846Q96K800n39k775J72K593N2k479
$$ y = [-5179, -4692, 446, 913, -4942, -6799, -851, 2492, -3128, -7846, -2992, 3067, -469, -7194, -4934, 2442, 2002, -5159, -6064, 803, 3223, -2691, -6071, -1249, 2849, -812, -5128, -2716, 1434, -85, -3819, -2971, 247, -233, -2805, -2258, 43, -517, -2433, -1422, 719, -392, -2633, -1194, 1590, 257, -3007, -1873, 1946, 1282, -3062, -3113, 1494, 2366, -2345, -4106, 401, 3179, -836, -4245, -829, 3356, 900, -3505, -1789, 2871, 2126, -2330, -2291, 1918, 2560, -1270, -2381, 962, 2370, -557, -2179, 334, 1981, -236, -1868, 157, 1818, -38, -1636, 265, 2024, 247, -1587, 249, 2366, 665, -1708, -143, 2536, 1200, -1821, -848, 2361, 1805, -1641, -1609, 1891, 2387, -1074, -2110, 1201, 2784, -218, -2201, 474, 2858, 640, -1969, -177, 2605, 1266, -1580, -684, 2116, 1577, -1198, -1026, 1567, 1619, -860]
1413h60l08K301M48k162n61K052O62j983p25J966Q48j971r83J982J175j990j446
1430a555J935J717j841k070J621K369j377k657R68K853n48l011O2L016M17k894
1446i95r01K672J325k387j604J981J804j602j887J228J850r37j760P08J610o06
1462D99j515N42J403n71j435O18J462o58j618O43J838n42k055L89K272m3k445
1479a216k99K531P44k490j176K320J558k043j924J668K113j303k258Q62K238n11
1495H14k158K19K008J5j794p6J661J79j522j34J535R9j555j12J641J68j821l48
1513a181J888N57k029r01K003J222j939j567J739J912j440k098J125K316o98k294
1529a385L73K269k8k088k22J903L36j744m30J549L66j536l44J516L08j657l09
$$ y = [-860, -1168, 1133, 1581, -581, -1142, 910, 1572, -411, -1136, 830, 1678, -293, -1276, 706, 1881, -109, -1555, 380, 2097, 256, -1814, -193, 2176, 799, -1858, -890, 1963, 1415, -1596, -1534, 1482, 1899, -995, -1896, 776, 2101, -286, -1890, 91, 1895, 293, -1594, -366, 1484, 547, -1213, -505, 1105, 499, -1016, -474, 929, 358, -1077, -459, 1003, 345, -1273, -630, 1208, 666, -1389, -1000, 1272, 1229, -1216, -1515, 1016, 1760, -730, -1906, 414, 1972, -71, -1995, -327, 1786, 483, -1775, -913, 1325, 814, -1344, -1125, 883, 898, -896, -972, 689, 868, -654, -788, 747, 846, -709, -821, 820, 988, -833, -1181, 707, 1264, -765, -1666, 337, 1559, -380, -1947, -208, 1704, 264, -1834, -709, 1607, 909, -1385, -1012, 1257, 1229, -859, -1081, 822, 1158, -586, -1016, 533, 899, -637, -981, 535, 843, -814, -1123]
1546a123J810M85j976o80K164J072k190j442K172J930j969k368J614K738j177
1561A060l042N84L087l7l055n44K779J002k446j307K028J484j592j434J270J357
1577A194j022j112R62R15j019p59J231O98j511q50J762J135k005j605K076K146
1593B236j944k768J650L327j117l740M36M001L42m026j167L807J916l404k545
1608b996K791K954k102l162J377L160p36k908K63K560P6k131j65J767P6j505J40
1625e41J385m41j543O70J776q56k266P91K765n64l292J03L745O39l952j417M008
1642A010K405l688l214L164L980k375m497J401M679m87m689n30M279J202l831
1657a191j827L111K121k493k160J902K083j389j714J235J473j138j069J385R36
$$ y = [-1123, 687, 1172, -804, -1484, 680, 1752, -438, -1880, 292, 2222, 253, -2115, -501, 2237, 1060, -1982, -1398, 1689, 1652, -1403, -1947, 832, 1834, -612, -1919, 109, 1593, 1, -1433, -163, 1194, 172, -940, 22, 937, -82, -841, 390, 1088, -423, -1273, 489, 1624, -381, -1986, 90, 2236, 292, -2476, -826, 2501, 1384, -2356, -1920, 2081, 2423, -1603, -2770, 1037, 2953, -451, -2996, -205, 2749, 647, -2515, -1138, 2022, 1286, -1622, -1359, 1201, 1277, -854, -1019, 748, 824, -681, -541, 844, 403, -1140, -470, 1306, 450, -1816, -1025, 1740, 1176, -2116, -2013, 1732, 2371, -1581, -2998, 1010, 3415, -273, -3487, -323, 3657, 1282, -3215, -1814, 2865, 2378, -2311, -2841, 1438, 2640, -1191, -3018, 93, 2214, -279, -2439, -537, 1546, 157, -1557, -322, 1151, 13, -1056, 329, 1265]
1672A265j698r57K060J154k502j750K612K294k758l183K386L871j913m584J123
1687b580N065o1n217q87N207K130m694k967M105L788l157m248K130M362j242m321
1703b587K25L764K60l366p66K621P70k151o39J780L68j533J02J795k74j986O10
1720a007K634m40l146J74L707M27m237j359M286K219m356l378L703M238l111n061
1736d707K030N558q32n636k61N517J576m850k283M175L082l170l258K245L245
1751B431j484k999P66K416n85k056L60J468o69j235R66J150j408j273J887J835
1767A570k011k335K185L285j775l951J273M689l37n105p78N121J889m956l091
1782d327M210L918l444m618K311M916j231m888K53M655P63m055j304L442J825
$$ y = [1265, -433, -1390, 670, 1824, -678, -2428, 184, 2478, -280, -3463, -1077, 2794, 881, -3703, -2580, 2485, 2424, -2793, -3680, 1527, 3657, -1037, -4004, 101, 3889, 732, -3516, -1386, 2976, 1734, -2587, -2362, 1402, 1662, -1704, -2470, 151, 921, -1230, -1869, -89, 279, -1254, -1152, 643, 369, -1617, -1007, 1627, 1187, -1959, -1785, 1922, 2349, -1888, -3247, 1039, 3258, -1098, -4476, -773, 3465, 354, -4707, -2677, 2881, 2049, -3587, -3848, 1669, 3245, -1605, -3888, 287, 3369, 199, -3059, -814, 2431, 947, -2052, -1286, 1130, 545, -1511, -1151, 317, -352, -1587, -621, 529, -879, -2152, -265, 1570, -441, -2776, -591, 2694, 919, -3032, -1759, 2930, 2593, -2512, -3290, 1831, 3720, -1236, -4327, -117, 3801, 357, -4261, -1950, 2966, 1735, -3153, -2900, 1755, 2518, -1537, -2841, 601, 2426]
1797B426k616j836J969J705j408j332J123Q55j185m99J413K25j892k83K328N68
1813A561k768j073L029J769l023k492K843L303k372l952J726M507q20m784j81
1828b727M817J227m508k171L941K926l122l379K219L554j384l428O43L079j78
1843A509k715k08K243K48j935k77J612J27j506R2J519k50j634M66K020l77k326
1860a392K82K798J89l083p97L218J443l206k279K746K761k383l363J547L535r79
1876A037l713K28L631M71l355r23L106J573k519j737K140K019j513j961J097J740
1892A321q91j659N58J241q25j351O70J111r79j380R42J553r34j729R67K157n60
1909B12k159N17K611O1k608l44K731Q50k733j465K331J714k273k361J469K331
$$ y = [2426, -190, -2026, -57, 1648, 240, -1092, 31, 886, -299, -798, 615, 840, -1052, -1335, 993, 1561, -1207, -2280, 749, 2518, -505, -2997, -154, 3149, 777, -3175, -1449, 3058, 2238, -2546, -2727, 2090, 3317, -1191, -3362, 579, 3505, 383, -2996, -777, 2777, 1393, -2035, -1392, 1687, 1509, -1206, -1414, 829, 1077, -858, -1135, 477, 604, -902, -810, 709, 459, -1175, -709, 1311, 934, -1392, -1110, 1688, 1877, -1206, -2003, 1215, 2658, -548, -2827, -81, 2680, 297, -3066, -1519, 2016, 1037, -2676, -2448, 1183, 1654, -1701, -2624, 482, 2055, -464, -2201, -61, 1958, 445, -1516, -419, 1321, 430, -1229, -671, 570, -255, -1606, -936, 175, -804, -2184, -1242, 311, -623, -2352, -1385, 772, 212, -1947, -1430, 1181, 1242, -1366, -1710, 1021, 1871, -862, -2327, 4, 1718, -555, -2916, -1447, 884]
1925H84j273k621O01K450k12k267k2K253M98j789l66J890P86j465o24J459P40
1942I22j334q12J087O07j330r40J010O67j372j062J152J118j211j329J191J750
1958A14p74j656Q17K162j41j916J05K132L70j969o74J772P47j816j256J274J097
1975C88j379j514Q91J371p84j416O02J521k51j198M60J483k2j119K47J408J7j295
1993e90q2J302J10j494n09J193M02j446q05J108P70j112r53R89J177o97j046P97
2011h86J408l21j139M17J379q6j206j0J147M3j201k97R69J29j151m02R66L57j072
2030i56m95J060O94r40o69J019J033p46r58P71J213m81j246L39J296j95j363j09
2048g33J222K12j239m69J042N61q99o19P61P07n65n82N15O12m15m96M13M67m49
$$ y = [884, -389, -3010, -2409, 41, -171, -2438, -2460, -207, 291, -1498, -1864, 26, 812, -653, -1277, 182, 922, -412, -1224, -137, 470, -860, -1800, -790, -123, -1495, -2557, -1405, -287, -1498, -2827, -1636, 114, -660, -2316, -1499, 663, 522, -1394, -1289, 843, 1213, -756, -1430, 342, 1089, -727, -1983, -709, 388, -991, -2505, -1614, -243, -1027, -2443, -1841, -320, -571, -1769, -1309, 174, 152, -967, -720, 688, 705, -590, -672, 630, 740, -754, -1263, -70, 332, -1114, -1919, -811, -41, -1153, -2106, -1117, 60, -637, -1683, -886, 522, 201, -938, -521, 858, 772, -434, -444, 703, 746, -455, -752, 217, 346, -805, -1207, -241, 116, -956, -1451, -391, 303, -637, -1306, -287, 746, 0, -958, -187, 1026, 545, -701, -362, 934, 739, -624, -733, 489, 701, -538, -1007, 35, 596, -303, -922, -161, 546, -19, -601, -86, 526, 111, -385, 28, 495, 46]
2067D6m89M51M53n43n73N56O78n56p96N80J020l73j090L04J319k3j325k33J326
2086G32M38j314q07J028Q67r81j169N92J143m01j172J63J153J74q45j08R04L95
2104G92m91j81N12K19l46j05K59j45n06jL38l49p99O2P24j68r98l9J170L88j053
2125g17l85J321J028q61r84R54J434m80j455J51J391J4j551o34J011M61j147r65
2143a414N74P45m93p54L05P55N9l12K66N35J29M1L33J86k74l8N09N8q66n05O35
2164D74L87j076j100N63J029o53j457K43J603K13j440l03J687J031j060r25J176
2181C92J422n52j319L04J255j11j311m19P69J67r04o14K96K30l13k35J38N1j2
2200g66L99M00k16k94O88R23k77r68K88J319K8j475n49J289O53j474j321R17J312
$$ y = [46, -443, 8, 461, -82, -655, -99, 579, 23, -773, -193, 827, 454, -636, -332, 987, 964, -361, -594, 732, 1170, -144, -951, 77, 944, -37, -1206, -614, 529, 128, -1044, -881, 272, 446, -399, -507, 397, 792, 301, 120, 632, 851, 505, 400, 659, 514, 8, 7, 345, -4, -803, -741, -17, -185, -1183, -1222, -52, 336, -717, -1102, 219, 1247, 386, -598, 356, 1790, 1310, -145, 6, 1397, 1411, -140, -774, 237, 698, -449, -1414, -840, -95, -588, -1342, -1037, -282, -223, -535, -269, 266, 395, 436, 769, 955, 681, 643, 1152, 1210, 344, -161, 474, 861, -215, -1315, -752, 277, -376, -1833, -1590, 13, 226, -1214, -1517, 170, 1201, 141, -784, 392, 1814, 1262, -57, 247, 1502, 1391, 80, -339, 430, 597, -307, -921, -625, -395, -708, -943, -805, -754, -766, -367, 33, -183, -477, 211, 1134, 857, -111, 177, 1496, 1524, 49, -500, 789, 1442, -32, -1353, -436, 876]
2219H76r06j720L54J732L2j659l17J677R30j136r05J051J252l90j011K01Q85L5
2237I81o46j94K22r2k30L3j07m64j26N03R6p26k81Q88N72q37o94J013J223p02
2257D32j415O10J837q2j929m42J859R01j679j436J109J540q03j695K33J484Qj337
2275h05k44J166M13r29m38Q19O04m85m88L53M21j14j36J06j50k71L55N46m70j001
2295g48K23J284R8j519n72J422R93j260j278R54J475o53j575M25J650j29j732
2312i42j84J759N59j612r61J347J270q75j371M43J255m3r27j08N90J3l66J30K66
2331B43m24m35M55N33n35p52L90P72l57q21L87R67l30j072L84J471j3j623k81
2350a041J800Q59j611j350J173J543q22j748J65J400q1j363k02J047J31j054j34
$$ y = [876, -30, -1750, -1396, 336, 368, -1291, -1608, 69, 999, -137, -1042, 9, 1261, 871, -140, 61, 946, 981, 335, 141, 363, 271, 41, 74, -33, -497, -623, -120, -24, -750, -1031, -143, 429, -408, -1102, -89, 1134, 432, -983, -373, 1464, 1382, -547, -989, 870, 1771, 92, -1344, -235, 1305, 502, -1193, -960, 524, 532, -805, -1049, 117, 530, -399, -837, -18, 586, 101, -387, -34, 387, 273, 137, 243, 93, -178, 177, 723, 253, -748, -525, 759, 857, -662, -1234, 188, 1181, -79, -1357, -403, 1072, 419, -1156, -731, 919, 790, -942, -1126, 633, 1192, -420, -1381, -34, 1236, 361, -1010, -567, 688, 645, -282, -390, 200, 213, -153, -23, 243, -181, -616, -161, 372, -163, -915, -525, 247, -110, -931, -544, 423, 93, -979, -595, 876, 863, -760, -1041, 759, 1618, 7, -1343, -170, 1373, 551, -1197, -1032, 368, 287, -1076, -1278, -231, -100, -1154, -1288]
2367a288J093L71r35l36J020P08n88n01N32N00l45k68L95j2q12k29Q61J89j317
2386i62q44J012J010r35j349N72J461j64j221K01J432J87j108J2J421L81j355
2403b49n92J288Q32j238j343N94J075n59j294k9P70q8o93J35O38j73m99N23R88
2422H6j34q18K91J177J63r63k04Q79J50r46l81P19N9j179n23R79N09j212r50R86
2442a312J262n86j196M89J454J27r70N8J109K09q42j00Q81P2j072m00Q54K93j086
2461g56p52O30O13o19o88M51O28l18l81O09O70m41m98P31R56m47r96L08J136j21
2481G15j210k37R09J65j026l98P45L21q93m29Q79O18p63o67Q28J004m23q88L77
2500c73R94q3p91K2O73o4o95K9N91j71p99J8Q16N1q96k03Q98M05p24l98P34N21
$$ y = [-1288, -195, 176, -759, -1095, -75, 633, 45, -456, 76, 576, 231, -37, 358, 346, -466, -695, 166, 355, -962, -1806, -794, 216, -719, -2068, -1496, -35, -199, -1420, -1219, 213, 400, -708, -696, 725, 1106, -249, -841, 447, 1279, 41, -1302, -708, 367, -192, -1486, -1515, -745, -833, -1526, -1391, -753, -926, -1425, -902, 86, -48, -866, -575, 602, 765, -198, -402, 477, 627, -319, -700, 19, 78, -1101, -1624, -645, -136, -1348, -2298, -1312, -50, -636, -1832, -1343, 111, 238, -732, -674, 435, 644, -198, -298, 583, 655, -417, -817, 37, 330, -756, -1508, -878, -265, -884, -1572, -1121, -493, -811, -1192, -583, 87, -354, -852, -121, 835, 388, -608, -300, 836, 715, -495, -732, 177, 342, -684, -1082, -337, -16, -909, -1338, -459, 159, -604, -1271, -443, 561, 138, -750, -373, 621, 538, -253, -231, 442, 378, -317, -288, 303, 132, -667, -649, 167, 218, -678, -881, 17, 422, -302, -700, 34, 555]
2522E55n65m58O51N53o44o78O06Q11n44j011K86J053j06j052j18R39L03p71k93
2541d83P05L71n72l21O11L88n99m63N21N12n18o12L07N47k70n45K16M66k13m18
2561c70L35N80k75o16L56Q52j34q90l0R16J87r04m05P03L94p28n69N48N35n76
2581i1o40M91P48l28p52K74Q86M6p11p1O93K31n16k00M04J05m62j63L57L7n86
2602b48k16M82J90n49l20M95M05l93l44M84M98l42m18M74O26l36o81K50P88j44
2622G01q85j54P26J74p79m03N30L43n15m10M30M24l37l86M01N28k32m25K60N29
2642E20j05m43R5M14j06m50N7L55j59n46N1M92n5o35j25O31K09n45k75N41M21
2663C42l72l70M22M92k87m79K92N40j92o11P8N43j9o16j19M59P2m45j51L72J09
$$ y = [555, -10, -468, 183, 736, 92, -586, 20, 831, 287, -724, -438, 615, 509, -543, -661, 278, 581, -190, -483, 222, 593, 21, -300, 311, 699, 100, -363, 158, 670, 152, -460, -153, 394, 124, -421, -205, 261, 48, -370, -35, 545, 270, -346, 10, 862, 728, -162, -192, 724, 911, 7, -398, 305, 699, -29, -598, -50, 485, -91, -731, -240, 508, 180, -572, -298, 588, 634, -77, -148, 545, 776, 260, 60, 464, 569, 107, -56, 301, 338, -248, -464, 18, 208, -341, -661, -166, 239, -154, -498, -14, 484, 142, -276, 198, 824, 488, -193, 57, 845, 701, -184, -338, 388, 562, -217, -620, -90, 253, -262, -672, -242, 182, -155, -541, -140, 388, 156, -269, -9, 520, 415, -28, 67, 481, 375, -75, -18, 337, 178, -368, -317, 175, 120, -515, -640, -9, 200, -345, -620, -79, 342, -30, -400, 22, 514, 227, -252, 40, 580, 388, -223, -145, 398, 379, -237, -356, 103, 175, -270, -421, -49, 60]
2684F0l64j31M38J82l98j81M75L10l77l18L83M01l16m11K78M36k83n07J72N31
2704C80j73o46J2O07Q6o10k03N30L06m17l01L65L69k55l03K74L40k00l07J87L27
2725C68j76l56J39K93j48l46J09L05j54l99J39M30j18n06N9O15O6n94j63O25L19
2746E07n28l88M77M90l71n44K67N47j85o03L4N64J6n39j47M61J69l76j85L13J92
2767A71k30j43K53J29k07p3K60P4k85p2L45R7m03j92M13K48m62m00L95N09l54
2788G3o21K11P08o9p09p9P12K50o11l41N64M58m40n00L35N19k00n40P3M50J6l98
2810a39j00K67N7j71j5J13p9j24J90K16k22k95K37M37j61m92R8N62Nn97j20O13
2832B80K00o59l62O01M94n50o78L79P75j67q07m7P45K50n46l39M30L68k58k99
$$ y = [60, -304, -435, 3, 185, -213, -394, 81, 391, 14, -304, 79, 480, 164, -247, 31, 467, 184, -323, -151, 380, 207, -439, -427, 180, 266, -344, -547, -17, 289, -128, -429, -64, 305, 50, -253, 21, 361, 161, -146, 41, 368, 192, -164, -25, 268, 120, -226, -117, 188, 34, -365, -226, 204, 86, -420, -361, 254, 320, -274, -437, 188, 507, -21, -409, 68, 558, 187, -357, -90, 457, 272, -331, -297, 267, 283, -256, -403, 58, 227, -149, -334, -21, 171, -59, -202, 51, 180, -27, -100, 160, 234, -51, -123, 222, 319, -84, -276, 137, 385, -77, -477, -82, 427, 73, -548, -337, 371, 302, -407, -486, 226, 476, -135, -476, 88, 546, 106, -394, -59, 460, 260, -280, -207, 243, 259, -139, -239, 28, 85, -86, -101, 12, -67, -191, -1, 215, -7, -302, -65, 372, 211, -281, -183, 379, 384, -213, -333, 280, 480, -179, -541, 60, 554, 4, -674, -295, 480, 313, -494, -541, 204, 454, -92, -431, -1, 367, 109, -190]
2852a90K07K38j72k12J41J70j50j70Q6J11j18n4J20nk49RM12Q6m97k45N83M93
2874E94m70o71L08P94o7q23j35P31K64o66l69N21L87m76m90M04N35k81o12J43
2894c79O36P0n24j86L78K71j56j69J5M6OJ16M4k40k25K35L40j99m60O7M75J1m94
2917c22m3N06J13n25j72O03L56n95n19N06P15l17q30O9P92J55p03l21M81L63l32
2938b0l32K21K63j90k00K21K09j98k15J78K34j10j73P7J00j20k9K13J9l54j26
2959c32M44L12m62n20L69O52j67p06k4O89J70n73k54M86K84m28l24L99L70l71
2979A4m50K79N19j58n30KM84J19l47j27K24Q5j20J8J47j15k04J25L39j26m11l
3001b36M22Q9m16j69L64J99l55j90L66K41l78k99M00M38l30n28K17O07n3n88r8
$$ y = [-190, 17, 255, 83, -129, 12, 182, 32, -138, -52, 59, -59, -113, 7, 2, -247, -238, 174, 260, -237, -482, 101, 594, 124, -547, -239, 555, 488, -335, -470, 261, 525, -141, -510, 11, 398, -78, -568, -164, 371, 90, -522, -379, 257, 327, -197, -383, -5, 266, 110, -59, -44, 2, 8, 124, 168, -72, -297, -62, 278, 79, -381, -314, 161, 172, -322, -365, 141, 254, -271, -443, 160, 516, -79, -598, -92, 623, 306, -524, -455, 337, 492, -211, -532, -51, 312, -20, -352, -131, 132, -58, -258, -37, 172, -26, -241, -63, 171, 61, -112, -35, 65, -55, -84, 129, 148, -206, -332, 112, 424, -38, -558, -189, 463, 296, -410, -434, 255, 425, -148, -402, 84, 368, -60, -384, 15, 385, 14, -436, -157, 362, 204, -326, -324, 160, 279, -68, -195, 29, 114, -6, 12, 159, 44, -160, -35, 304, 178, -233, -236, 186, 275, -141, -310, 54, 253, -102, -292, 74, 315, -63, -362, 38, 476, 146, -382, -165, 442, 389, -199, -297]
3022b97M80J72m00k01K73J45k89j26K89J18l26j64L30K50k77k87K40L33j65k68
3042a70J57K47j34k50J90K73k17l74J56M22j09n13m7M70J08m31k00L37K16k82
3062a51j80K88K06k61k04L17L05k78l36K49L95j60m20N9L42n3l70k1K83m6l73
3083d09KL66J3m07p3M44J97l42k22L62L14k03k67K13K76j71k62J53K37k08l77
3104c64J12L17j48m30k1L64K6l48n5L43J07k47k1L64J34k64j09L71K14l23k74
3125b52K47K71k51l95R5K66j82l62O0K97j03l38R6M10L5l30J3M57J91k87j32L36
3147A42K21k65k05J87J44k68k77J38J65k60l29J21K81j08l02Q8L52L1k09R9L23
3168F9L3k00P7L16J1l37o3K85O8l91k28K16J56l11k77K11K24j93k41K41L72j03
$$ y = [-297, 183, 355, -45, -246, 27, 172, -117, -243, 46, 164, -162, -326, 4, 254, -23, -310, -70, 263, 98, -170, -13, 234, 100, -150, 40, 313, 96, -278, -122, 300, 191, -322, -369, 101, 209, -222, -422, -85, 131, -151, -331, -43, 163, -98, -302, 15, 320, 42, -294, -45, 350, 190, -230, -171, 171, 118, -252, -273, 10, -36, -409, -407, -41, -28, -435, -508, -64, 133, -209, -431, -69, 245, 42, -225, -12, 264, 93, -169, -16, 221, 13, -364, -252, 65, -83, -513, -534, -170, -144, -492, -547, -204, -97, -344, -365, -1, 133, -131, -240, 131, 345, 22, -252, -5, 266, 15, -380, -285, -19, -201, -563, -503, -206, -309, -647, -551, -141, -106, -436, -423, 34, 225, -62, -194, 142, 363, 98, -107, 80, 224, -44, -321, -183, -18, -278, -607, -486, -205, -313, -615, -527, -175, -144, -353, -254, 69, 102, -98, -21, 295, 306, -31, -94, 191, 259, -132, -360, -144, 12, -299, -576, -365, -141, -334, -575, -334, 38, -65]
3190f5k86J86M38K9l37j9L54J10l26j68K01P1k70j97J46Q0k43j62K10J55j65j32
3212c90K16K61p8j27J80K30j03j77J66K12j93l16Q3K78j19m45m9L49P8l81j52
3233d77L54K39k15j78K73L08j35k19J88K97j01l16J6K58n0l00j05J36Mj88n9J24
3255a46j1j13O3K31K4j53M7L35R8k34p0K65J47k99k23J79J55k88l27J43K51k00
3277a26l64R0M01L2l15l5M09K24j99j15K37K25j31j68J00J13j62k01K4N3j77j91
3299b76L3P7j09j03J15J45n9o3K15K54p7j61J78L67o1l69j4L42K9m22k59K41J58
3322A81l31l34J64K65j40l00J20L57M6k16M6L34J41j60n3K04R4j25j07O8l9j58
3344E7q5N2q7k07l5J62nk19k0K71J47k11o8L05K78j77k27K22L34j16l77J5L22
$$ y = [-65, -351, -165, 273, 302, -35, -54, 300, 410, 84, -84, 117, 188, -82, -279, -133, -53, -296, -458, -248, -93, -258, -390, -174, 87, 9, -118, 62, 292, 189, 12, 178, 390, 197, -119, -36, 242, 123, -322, -371, -22, 56, -325, -477, -123, 116, -99, -277, -4, 304, 169, -50, 138, 435, 334, 18, 34, 292, 242, -58, -163, -27, -23, -211, -270, -146, -157, -270, -207, 24, 48, -105, -58, 277, 375, 141, 71, 336, 483, 184, -39, 140, 295, 7, -320, -177, 74, -126, -490, -400, 1, 33, -282, -317, 92, 316, 117, 2, 239, 464, 333, 165, 265, 378, 216, 15, 39, 92, -85, -276, -243, -166, -275, -378, -263, -118, -177, -240, -25, 229, 152, -9, 169, 536, 475, 106, 92, 434, 463, 41, -218, 23, 181, -150, -484, -320, -55, -195, -495, -375, -18, 28, -188, -142, 192, 333, 173, 120, 324, 418, 293, 186, 254, 215, 57, -28, 24, -63, -270, -305, -143, -148, -367, -387, -116, 31, -180, -248, 57, 335, 158, -69, 153, 487, 371, -6, 9, 331]
3367C31Jm08j71K66J29l07k41J84K21j27k11J35K28%j43O5J91K4q6L7J01m3r8
3390G8M8Q3j32j76R8J37j41k43L3K72l3k85k8L18J00k64j16K99K28k49k40K27
3412A4L20j44l18N8K98Lk90p8K11Q2k04r8J40N8j23o3J27M8j32m5J37R4j38o9
3436a12J51R0j32q0J74J07j57j64J76J95j72k64J00K76n2l46l7K93P4k56j32K41
3458b7J36j64j35J82J83j27j62J43J91p4j90M3J80n9j66NJ07n7j40L6J35q9j62
3481b11P3K14j6k23MK92Q8k14r4K17J26j80j68J42J53j87k15J04J83j12k57L4
3503b47K40K2k05j2K06J06j36m0J83P6j13m2J28L6j73j03J48L2j98j42J09R4j55
3526a86j37J18J66p6j23J55K28n9j62R9K68qk60m0K11M7k62j85J45O6k00j81Q9
$$ y = [331, 332, -76, -247, 19, 148, -159, -400, -216, 5, -122, -333, -198, 30, 30, -113, -48, 143, 167, 81, 118, 219, 176, 78, 126, 209, 77, -99, -1, 136, -5, -248, -215, 57, 24, -261, -289, 29, 129, -135, -251, 48, 276, 27, -213, 14, 334, 190, -128, -70, 228, 231, -59, -137, 74, 156, -48, -146, -6, 52, -71, -134, -7, 41, -91, -136, 1, 95, -43, -112, 39, 129, -3, -83, 91, 198, 41, -123, 53, 248, 76, -188, -88, 188, 136, -210, -247, 46, 120, -136, -268, -27, 109, -55, -190, -8, 175, 48, -114, 29, 220, 146, -44, -1, 179, 120, -46, -41, 66, 9, -131, -95, 40, -49, -211, -138, 76, 60, -163, -159, 133, 221, 7, -87, 130, 256, 76, -92, 50, 203, 16, -199, -95, 88, -24, -281, -247, -7, 15, -190, -202, 4, 110, -26, -66, 117, 193, 80, 38, 166, 202, 29, -74, 74, 106, -92, -234, -125, -31, -186, -323, -205, -39, -115, -238, -83, 145, 86, -76, 23, 291, 283, 23, -17, 194, 241, -21, -206, -61, 5, -195, -376, -287]
3549b87J42j15j28J21J96k3q9J10K22Kr9O0J41k7j50OP6j01k25k5J07p3k64l2
3573d55J91N4j98n0K59J94j15o9K21K29q1j63J26J95q6k81k9J68o6l08j28J43
3595b49K0k02j00J29J34p7k1J66J54mRJ59J00o3n2J17L2j37j46K7K8k12j87L9
3619c36J04j40k09R1K47Oj87Q4L13J44j55m2K50J71j42j77R1J47j46k60j2R8j02
3642a62k32l4J12J4j12oJ53P7lN9J54O2k4O3J28j2j29qJ03n6k24j03J11Lk27j40
3668d33J61J27j32j56J78K60k4j62J07K88O6j87n1K10Q6k04j57Q0N8j46j66KP7
3691a18p2j17N0J07Lk2R2J04J3J1R6R9n0o0P9R0j25j78K5J33r6k52l6J85M0k23
3717b22q0K17J54j18j13J69K38m5j64P6K13j9j96m1J37Jj51j20M6L6j03n9L9L5
$$ y = [-287, -145, -260, -388, -267, -71, -94, -183, -73, 149, 151, 52, 112, 253, 226, 76, 82, 158, 57, -168, -193, -86, -159, -423, -455, -264, -210, -408, -458, -199, -5, -120, -189, 32, 261, 180, 17, 143, 338, 252, -29, -58, 110, 44, -264, -392, -249, -229, -431, -531, -402, -268, -345, -366, -200, -46, -50, -41, 118, 218, 155, 103, 220, 252, 115, -31, -4, 24, -188, -375, -336, -232, -372, -581, -490, -243, -237, -424, -340, -27, 117, -38, -80, 170, 341, 199, 22, 113, 260, 114, -146, -158, -60, -162, -394, -428, -316, -302, -414, -420, -267, -190, -193, -134, 20, 82, 58, 121, 249, 237, 108, 100, 203, 147, -77, -180, -69, -66, -293, -433, -272, -145, -277, -433, -255, 5, -19, -181, -74, 214, 280, 93, 42, 252, 338, 134, -23, 57, 115, -31, -197, -195, -118, -190, -307, -257, -150, -147, -169, -77, 27, 40, 51, 147, 246, 196, 136, 215, 305, 180, 2, 27, 160, 64, -188, -224, -39, 1, -222, -302, -85, 69, -49, -162, 7, 245, 200, 36, 112, 325, 306, 110, 69, 206, 207, 56, -64, -18, 18, -85, -144, -105, -70]
3741g0m8K0R9M2p3N5J53L7j16j8J79M1j67j09J22R6j74j90Q9J68j09k38K6K44
3765E9L4k17o0K29J53j33j22J27J80o2j49M4J06k8j41lO7k3r1rL3k5o4M3Q0m7
3791a9p3R5J15n4j26Q1J78k9k01rK19L6k26j18J89J27j76j91J33J81p5k18L3K26
3815I8Nk04k7J79P5j38q8J17R3q3r3P0P0n9m8O4K4p5k6P7L7j21n0J32O6j37j08
3842a50J23J37j19j84J09K10o5k18K4K59K8k21p5K43J20j87j57J51J54j32j69
3863a19O4J32p1j48J5J21j7j16K9R7J6q8N6J11k2r1M9J34l0j34KJ42j7j91m0J57
3889D1L5k00r9J64J21j52j44J39J98o2j71R1K29j2j87J7J77M0j91o6J26L1j59
3912c4j11R0M9j19p3R4O5q5l9J34R4p3m9J47R6q8j00J16J22j02j89N5J42r5k27
$$ y = [-70, -118, -98, 1, 43, -30, 25, 178, 215, 99, 81, 260, 301, 134, 25, 147, 243, 69, -121, -32, 136, 27, -211, -185, 59, 93, -124, -184, 45, 198, 65, -57, 70, 250, 188, 39, 83, 189, 161, 20, 17, 84, 61, -30, -39, -6, -31, -95, -52, 28, -19, -92, 3, 118, 64, -62, 19, 197, 168, -33, -42, 177, 213, -13, -131, 58, 185, 9, -182, -49, 132, 57, -161, -128, 98, 103, -101, -128, 51, 126, -12, -100, 17, 110, 27, -66, 4, 74, 15, -33, 31, 55, -20, -46, 31, 68, -53, -103, 29, 95, -42, -150, -27, 110, -9, -193, -84, 126, 61, -157, -133, 126, 154, -67, -142, 101, 221, 34, -123, 28, 182, 50, -119, -55, 77, 6, -142, -127, -6, -23, -139, -110, -13, 3, -85, -29, 82, 60, -31, 18, 152, 122, -12, -10, 132, 115, -76, -116, 41, 76, -124, -223, -59, 62, -90, -234, -95, 103, 41, -130, -39, 190, 178, -9, 8, 185, 225, 34, -32, 94, 125, -34, -145, -55, -6, -125, -198, -104, -39, -124, -163, -29, 65, -8, -57, 90, 186, 98, -2, 114, 236, 134, -55, 0, 142, 47, -180]
3937a80OJ75j2j96m9K10J04j64p3J94J68j08j08J19J78p8j50M4J23o7j72j3R0
3960D1n1j53j3J02k0j01J8J46Pp7L9J88K7j40J5J83M0j94p2J47P4k08j73J31J26
3985H2j70j88R0J86o6j58O3K22K6j55K3K17O3j51n6J57N8j60r9O7O0j40j16M9
4009i6P1j13r1R5J02n9q3J22J47m6q5J04J63m7j45K1J53l4k30j7J48ok20p8J55
4034f9P1j65r3J65J40j05r6J37J72l9j31P1J72m4j64J0J19k0j81m8J10mj61m6
4058a99J17M0j24l4J45R5r6k8J42J18r7p5J13J00r2j50N6J01q6j63J9J15n2j66
4082b01J1J68Qj36nJ77P4j14m6J56J01j22q4J03R6r8j42N3Q9q0j46QJ17k1j25
4107a59mJ30K0r1NJ28M3q8JJ17M7j15m4R7N1j25r0P4P7j02j11P0R4p4j09N5J59
$$ y = [-180, -174, 1, -11, -207, -256, -46, 58, -106, -179, 15, 183, 75, -33, 86, 264, 186, 36, 80, 203, 136, -36, -49, 41, -10, -163, -176, -74, -94, -195, -177, -31, -24, -101, -62, 126, 153, 13, 28, 211, 251, 57, -15, 132, 206, -2, -175, -44, 82, -88, -276, -186, 0, -66, -224, -161, 61, 87, -68, -45, 172, 235, 84, 28, 185, 243, 83, -16, 51, 111, -29, -145, -96, -25, -138, -229, -134, -32, -91, -174, -52, 95, 49, -36, 68, 231, 184, 39, 60, 213, 179, -51, -68, 80, 74, -146, -224, -69, 2, -163, -256, -91, 49, -56, -152, -15, 157, 118, -13, 58, 230, 186, 22, 32, 151, 131, -50, -98, 12, 8, -153, -199, -82, -42, -166, -200, -55, 40, -56, -84, 58, 176, 79, 4, 117, 217, 125, -25, 31, 132, 46, -117, -98, 17, -35, -201, -190, -22, -14, -150, -155, 22, 96, -18, -64, 92, 193, 71, -13, 90, 186, 88, -54, -1, 88, 8, -138, -130, -13, -34, -159, -163, -33, -13, -104, -99, 29, 72, -16, -15, 102, 149, 34, -10, 87, 138, 13, -77, -3, 74, -28, -139, -69, 25, -49, -158, -103, 56]
4134E6l4j25L9J58K0j22k9J36M3j14p3J01O8j09r4P1O4p4j07O0R1l5j02M2J23
4159E4qj03J9J16Lr4oJ07jj05mQ0K0j01o1J03M5q9q1R6Q9p7q1P3R2m4j00M6J10
4188I8k2j18K1J13Rj19m6J00M7j10o0J00N7q3o5P7Q1o5r7P5R5n0r3K0J17j5j08
4215d1%R1Or8j0Q0K8r0l4Q1M8r0n3Q7P5o4q4O8P9o4r1N8J10n8j14M6J11l4j28
4244h5lJ35Qj35l8J21O0j18o9Q6R5q2r5P2J00m7r6K9J15l2r8RR6Nj06PQ5j3q8
4273h2oR1%j04rR9L0j24m4J23O8j08r3J14J23r3j17Q1J45o8j60L7J51j1j69l4
4299a60J40M1j23r1R4R9o6p0N4P9l9m5M5O6m9l7O1M1n5n7N6N0p0q4N8P7n4j33
4327a72M4J46k2j67nJ86N5j59q2J67J15j09j29R2J46o1j53K0J35j5j39l4J12K8
$$ y = [56, 22, -103, -64, 94, 114, -8, -37, 99, 142, 28, -45, 56, 124, 15, -79, -8, 56, -18, -125, -65, 26, -9, -111, -69, 54, 46, -57, -38, 78, 81, -13, -19, 88, 87, -18, -22, 58, 78, -23, -84, 19, 64, -25, -106, -10, 79, 2, -79, -6, 86, 42, -58, -12, 98, 76, -42, -21, 92, 101, -18, -64, 36, 83, -27, -87, 13, 70, -13, -78, -1, 80, 15, -82, -7, 88, 38, -55, -35, 82, 67, -41, -41, 50, 56, -42, -52, 28, 56, -34, -68, 13, 61, -29, -82, 5, 80, 16, -68, 0, 79, 15, -76, -18, 92, 34, -80, -34, 77, 43, -85, -88, 47, 55, -80, -118, 3, 63, -55, -124, -38, 57, -25, -120, -48, 52, 5, -91, -62, 53, 21, -77, -68, 28, 33, -73, -66, 19, 6, -82, -88, 3, 3, -101, -110, -11, 19, -105, -149, -26, 42, -66, -159, -45, 78, -15, -132, -51, 94, 26, -134, -97, 54, 43, -126, -160, -20, 21, -102, -193, -99, 0, -66, -136, -82, -3, -42, -87, -42, 24, -25, -62, -1, 40, -15, -72, -16, 34, -36, -120, -62, 15, -39, -172, -128, 18, -4, -171, -176, 10, 65, -94, -176, -9, 106, -3, -132, -40, 106, 45, -108, -88, 47, 32, -107, -141, -29, -1]
4351aq9m7O7M4n6qN1Rl1L4O8j7q5L0J18Lj53l5J58O2j67j21J49J31j36j69R4J84
4379H7m7j99K0K12L8j82o8J77J04j12j23P5J16l5r6oP7k1n0PK0k9j7N1J9o7j8
4406f7Q4O0r1o2J00J21r6j47Q1J78m7k09pK13N8k28j11J99J43j42j73R9J80m5
4430I1j61QJ45L2j23m4R9M4p1m2L5K5k3j2L1m6l5O0N9n9q8O3J39l6j68RJ90N1
4458A73j90j16J89J32j41j90J01J99n5k17J0K04M6j93p0J53J12j21r5O8J11k5
4480H5r4NN5kl3Qnm3J1N6k0q2j5J19L2j29n8J44R2j13j30J19J68n4k08L3K07L3
4508A81k20q7J76J27j60j59R1J62n5j60J1J34L4j05l1Q1L1k4k8K6J3oRJk6m3O5
4535C8L2p0r4O2J21p0j56K7J95Nj85n2J82J18j43j50J22J87p2j85K1J83K3j78
$$ y = [-1, -90, -137, -70, -26, -82, -90, -39, -30, -61, -27, 41, 24, -61, -31, 87, 90, -63, -98, 60, 122, -45, -166, -17, 114, -22, -191, -97, 87, 40, -159, -139, 73, 111, -71, -139, 38, 142, 30, -93, -18, 98, 63, -33, -39, 38, 17, -33, -26, -6, -35, -52, -1, 18, -49, -67, 17, 77, -14, -76, 24, 145, 49, -98, -17, 161, 114, -95, -102, 111, 169, -59, -170, 29, 172, 30, -143, -44, 136, 91, -70, -62, 83, 115, -8, -52, 47, 91, 20, -22, 13, 38, 15, 3, 34, -12, -47, 13, 72, 13, -75, -12, 127, 91, -77, -68, 122, 173, -17, -133, 56, 188, 47, -143, -42, 157, 102, -115, -105, 99, 145, -48, -118, 35, 147, 26, -69, -1, 110, 85, -9, -4, 51, 49, 16, 24, 19, -24, -13, 43, 23, -59, -74, 45, 77, -52, -110, 34, 126, 13, -117, 2, 170, 116, -92, -59, 148, 181, -39, -126, 50, 177, 17, -142, -51, 111, 56, -104, -93, 41, 75, -30, -61, 20, 51, 27, -1, 25, 38, 32, 41, 42, 16, -27, 38, 70, 0, -94, -32, 89, 19, -137, -110, 85, 90, -95, -147, 35, 153, 10, -140, -18, 169, 97, -88, -67, 116, 139, -39]
4559c9n9J41P9j09j05O3R4m3p4J0N3mj8kOJJ8L1j8p1L6Q2j1j14j9J24N3j25r0
4588a10Q8J47j01j62N6J78Jj94k4J66Q0j38j10J32J19p0j49L9J48lj24k5Q5N8
4612H7q5m5M2L9j4l1lKNK3J3n1j8N4N2o2p8N0J09l2j13k2J44L1j31o5J11J21r8
4641C5j40N8J63l9j53KJ43M5j21q1R4R4p9r9M6R5k1p7LO6J9o4mK0L0k6KJk6RK8
4672B3j4k8k5O4K6n9p4O7Q7m2r2KJ20K5j37l0J21P5j03q6P5J07m1j31K1J18Jj09
4700c9n8J15N6q4p0N2Q5k6o2pO5Ql2k3L4J1j5Jlj7JJ7rl6rN1Rn4m8O7P1n7q4L5
4734e5J12Lj24j6J17O6j03r2R5R5p0j20L7J17j6j18k0R8M1q2p0N6Q5l3p5K1P5
4761B4mm9KK9Oj8KJ6l0j8K5J0n5j3M3L6o3n4N8P4n7p2M5J03jj12j1J31M7j19p9
$$ y = [-39, -98, 43, 122, 13, -92, -29, 65, 22, -52, -42, 11, 7, -11, -13, -7, -6, 12, 43, 25, -46, -10, 72, 61, -53, -72, 52, 105, -20, -110, -22, 125, 24, -138, -82, 96, 97, -97, -121, 45, 125, -13, -123, 9, 128, 58, -91, -52, 96, 93, -31, -56, 29, 87, 2, -43, -1, 38, 24, -7, -10, -8, -3, 20, 33, -18, -36, 18, 70, 8, -70, -20, 89, 57, -56, -78, 66, 97, -34, -99, 12, 133, 35, -105, -47, 116, 77, -76, -74, 69, 114, -7, -88, 6, 100, 21, -78, -32, 63, 42, -35, -32, 34, 53, -11, -15, 5, 35, 9, 11, 12, -14, -5, 23, 9, -19, -44, 20, 46, -13, -87, -20, 67, 25, -67, -65, 55, 80, -57, -87, 34, 109, 6, -80, -5, 102, 61, -70, -49, 69, 70, -39, -97, 18, 74, -10, -80, -28, 57, 31, -31, -38, 27, 35, 3, -20, 14, 25, 10, 11, 8, -9, -8, 9, 0, -36, -45, 6, 15, -39, -87, -20, 51, -6, -90, -55, 57, 60, -64, -80, 37, 103, 0, -92, 3, 98, 28, -92, -55, 62, 46, -72, -92, 6, 47, -35, -105, -49, 36, 3, -72, -51, 24, 20, -29, -27, 2, 8, -10, -8, 8, -22, -40, -15, -5, -60, -73, -30, 6, -57, -111, -53, 21, -36, -108, -63, 40, 39, -73, -84, 47, 94, -25, -104]
4792a04J12Q1p2j19M5J11l1j14rJ04J9r2j9N7N0n5n0O1M9l7k1L3J7k8pK7J4m8
4820b6j8O0Mo9l7P0M8p4o8O3R5m7r3L2J21j0j17QJ08K7j02m7R7O0q1p8O2Q1o1
4849Hp3K8Q0l4p2K2P0k3o8L0N7qp4K6O9j5o4%R4nq1j3R7J1q0m2R5M6q4n6O9Q9
4881I9p5p3L2R3l1j01L5Q5j2q4rQ7J6r1j1Q7K2o1l0P6L1p8j6O6L0n4o4O0O2q4
4911Gp4P1P0o7q6N0Q2k4r3L3R6Pr8JJ04K2o7l9Q1M2q2m4O5L8o6o0N0L8p3n0N3
4942a3M7n9o0O5P5l0p1M3J12k6q0J9J00%r0l1Q3K7j04n1O3L7r0n8N0N2n1n3N9
4971c5O6k9n3N8P4k2m8N1O9m0o0L9O3n0q2oO7j5j10l1Q4J7r3m6R8N3p1l8Q2P9
5001G1k8o5N9P3qq0K2N2k3q0ML3np5nM1k4o1QN5Jl7mQ8K4n3qR6M8o6m1P7M7p1
$$ y = [-104, 8, 89, 17, -102, -57, 54, 23, -91, -100, 4, 23, -69, -88, -31, 19, -36, -86, -25, 24, -13, -34, -1, 16, -12, -19, 8, 22, -26, -44, 16, 20, -49, -86, -16, 32, -42, -110, -47, 48, 1, -92, -60, 61, 51, -66, -58, 50, 77, -25, -72, 25, 85, 4, -74, -12, 69, 8, -65, -37, 43, 9, -63, -41, 29, 6, -62, -32, 25, 17, -57, -31, 38, 23, -41, -41, 53, 48, -33, -46, 51, 62, -18, -60, 35, 81, -3, -59, 10, 99, 24, -49, -17, 76, 45, -56, -21, 64, 52, -32, -41, 46, 62, -29, -40, 47, 69, 8, -22, 54, 85, 7, -9, 57, 87, 33, -31, 29, 91, 7, -67, 4, 74, 7, -79, -29, 53, 29, -64, -31, 65, 72, -26, -25, 79, 101, 34, -5, 76, 118, 36, -8, 57, 95, 29, -31, 19, 57, -16, -66, -13, 34, -25, -85, -20, 55, 25, -46, -3, 109, 83, 3, 22, 122, 122, 32, 1, 84, 111, 7, -44, 19, 56, -34, -92, -42, 10, -41, -94, -35, 31, 2, -51, 7, 81, 59, 11, 62, 131, 91, 31, 70, 133, 83, 1, -5, 62, 47, -63, -94, -10, 7, -86, -132, -34, 19, -52, -90, -8, 71, 43, -22, 37, 110, 102, 22, 44, 96, 73, -7, -3, 30, 25, -50, -55, -14, -38, -99, -91, -36, -35, -72, -76, 12, 36, -17, -25, 71, 119, 53, 12, 89, 136, 65]
5035F5q0L7P3n5j08J5P5k5r7lQ1J8p4k3Q1L4k6j8N6L3m4kM5J8m5k9M4Oo4k9M9
5066HJ2n9m3M1N2m2o6M7Q1k1p6K6J04Nq2j1R0K7q9m0P4L1o0m6M3L2m3n1L5M0k0
5097an2J4O0j9m0K0L0j3l6K2M4j2n0K7N3j7o6QP1Ro1k9O8L6p5k3N3M7n0o6K5O6
5129D3l2p1J4N3Mn9j3N2J8l3j3N6K3m3J7L3J6l6j1N1om2k5K9mn7l5M1J7m4n4M7
5161f4N0k0n0L5Q6om3K7P4K2n5j4O0J3m2o0L2Nm6o1nK6k8m1QL3rk6K5N6J5j1K9
5194A5N0J6pLL6pl2%Kqp8j5Nrn7m6K5L3l3k2M1N1J8k6M6O4K5Nj3M5J7m3k1J6q
5229H8m7o2j3Ll6m2oJJ1k5K1M0PJ3L3O0J0kJ3M9Rk6k6K3Jm8m1j2om7m6J8%ql4
5264a27K6M0K0j1K3M8M2j5J5L3J8k0j1J8j4m6k5Orm8m6JK7j7m5J1M4J0k7K9O5
$$ y = [65, -15, 22, 95, 40, -68, -53, 22, -3, -100, -103, -22, -4, -78, -101, -20, 14, -12, -30, 26, 59, 15, 13, 58, 76, 31, 2, 46, 52, -12, -41, 8, 20, -39, -82, -41, 11, -31, -97, -50, 31, 10, -66, -40, 64, 69, -13, -24, 66, 93, 4, -36, 38, 69, 9, -37, 6, 38, -5, -56, -21, 19, -1, -53, -39, 21, 2, -38, -18, 12, -1, -37, -15, 29, 17, -33, -6, 47, 30, -36, -28, 43, 52, -9, -38, 30, 66, -9, -32, 21, 68, 18, -48, -23, 43, 11, -60, -46, 7, 11, -48, -61, -9, 9, -24, -37, 19, 42, -1, 16, 49, 65, 29, 18, 69, 63, 21, -4, 25, 21, -36, -71, -30, -13, -57, -111, -64, -14, -34, -84, -49, 37, 31, -12, 15, 89, 111, 56, 42, 102, 115, 73, 13, 45, 50, 4, -57, -62, -36, -64, -105, -97, -64, -73, -99, -74, -18, -3, -14, 15, 65, 81, 74, 77, 113, 106, 74, 74, 76, 68, -10, -25, -20, -29, -86, -132, -107, -74, -107, -129, -88, -37, -19, -45, 1, 65, 90, 95, 82, 127, 144, 101, 80, 96, 88, 41, -21, -34, -31, -67, -109, -115, -114, -103, -128, -107, -67, -60, -47, -14, 46, 56, 54, 67, 116, 125, 99, 73, 96, 97, 49, 8, -4, -10, -57, -103, -85, -85, -93, -127, -101, -61, -41, -52, -29, 19, 61, 46, 61, 94, 112, 92, 81, 99, 85, 39, 14, 20, 11, -37, -83, -82, -55, -72, -117, -106, -62, -52, -79, -50, 15]
5295A5jk4K2N0L0k5l7M0K2m9l1qL1l0l9k1L2j5l0J2K9J3k6QM0J0qnK8J3k5KJ2
5328C5Nl7kL2om2j9L5L3m3n1N0M0qo6K2N3pn7rO2K1o8k4N1M5l9n5M1N2nm4J6L9
5362E0J5k2qJ7nk0QJ2m8l0J3J7l2l6LM1j7l3J0O4%m6K6Q2M0o9l2Q6O7o8q5K4O9
5395I3m1q5l0O0j7o2k8L9J4k5k0N1M2Rj9M3L9NJ6PQk0J6K2l6p8rL9j6r9n6O2M0
5428c6p2o8O0Q9j9q1N1J22J4o7J2J09N3p7o4P2N6o4r0j4M1l0p0l6K3j2k2QJ2p
5458a07ON4M0j3J7O9L9l9j2M9N7o5p6NP7m4j37l7J08oj11q4Q1Q2o1o1M5J14Pn1
5488e4L1Q4M1n6JN7J3l7l2NKm3l3j8l2m5K0M4o6m4K9R6%p7J7J36M6q2l5J09P7
5519A54p7q6O1Q2n8j29KR4j4j25n6P9M2p3m6M9N6kk4M9L5QJ5J9Pj4RL2j4n5j5
$$ y = [15, 14, -10, 12, 62, 92, 67, 30, 70, 92, 43, 12, 4, 35, 5, -34, -55, -23, -38, -68, -56, -27, -14, -40, -32, 8, 18, 10, 5, 33, 46, 21, 23, 35, 40, 3, 1, 33, 27, -15, -34, 1, 34, -9, -60, -10, 30, 22, -44, -22, 31, 24, -33, -42, 20, 41, -27, -51, 0, 45, 6, -49, -8, 44, 39, -5, 11, 50, 65, 43, 35, 52, 47, 27, 35, 47, -1, -31, -18, -1, -33, -69, -66, -25, -42, -75, -65, -1, -1, -47, -21, 61, 101, 32, 0, 86, 153, 85, 0, 24, 93, 52, -33, -63, -3, -20, -82, -110, -71, -57, -82, -102, -51, -9, 0, -19, 24, 63, 68, 84, 91, 99, 79, 95, 117, 81, 3, -6, 33, 17, -82, -138, -76, -36, -108, -176, -116, -27, -46, -127, -76, 46, 60, -7, 5, 114, 167, 90, 26, 98, 154, 90, 0, -14, 27, -3, -73, -109, -86, -98, -120, -112, -100, -107, -101, -47, -7, -20, -3, 66, 105, 66, 54, 103, 160, 95, 19, 24, 101, 57, -80, -117, -9, -15, -126, -210, -129, -47, -108, -169, -124, -10, -3, -54, -23, 61, 102, 46, 47, 104, 117, 80, 48, 53, 55, 12, -21, -39, -71, -116, -96, -52, -118, -162, -133, -37, -37, -114, -97, 39, 85, 3, -32, 77, 154, 77, -9, 52, 134, 76, -53, -51, 43, 29, -96, -152, -73, -31, -104, -150, -101, -45, -47, -71, -22, 13, 21, 36, 55, 62, 48, 57, 89, 75, 20, 5]
5550EM7j0p1n1O5L6q2q6P8J10n8j10N5J33Kr9k9J23N3q4o8O1P8o6q4K4P4k6p2
5579e2oN8Rl8pL2Lk0K7J9l0mN3J6m7m4N4N7m7j06K8J11j9j06oJ13M8j13m5J06
5609D4Q5p3j00M7J09l2j21oQ9K6r6o4N5M8n8m0L3N6k1LK4K9oJ6L9Pl3RN3j7p9
5640B6j4N6j0j06n0O9M2p5r6N7J27k6j01L6J23M3p8j6J08P0p4o9M2O2m9j01kL5
5668B9j5q2l9L3ml0pL0K3J6K6M1J1J1L9N5j3l6L5N2m1q8j7M5k2j20l6M2M9r7p7
5699a87P8R6k7q1M4J31K1o6JJ01N9o2m9M2L7m5o1l4K8k3o9k2J4j9KmJJ1K7L7L0
5730A1j2J2O6L7l1l3M5M1k8q9JM4j2j00l9O5L1p7p1N9P9k1p7K6R2L4m9k2P2M1
5760I5l7m3J9L4j0n5nK4j4k1k4PlRprNnN4nk9jN9K8n7k7L7O3l3o7lP5Po6m3N0
$$ y = [5, 52, 42, -29, -80, -15, 21, -61, -147, -69, 41, -17, -127, -72, 61, 63, -36, -65, 58, 111, 27, -41, 20, 98, 32, -52, -28, 46, 20, -52, -58, 0, 9, -29, -36, -4, -1, -21, 6, 25, -5, -9, 44, 60, 13, -31, 23, 80, 33, -73, -45, 66, 47, -59, -65, 48, 96, -17, -62, 44, 129, 56, -44, 3, 112, 80, -41, -47, 42, 68, -28, -92, -37, 11, -47, -87, -54, 2, -19, -16, 8, 37, 31, 47, 86, 93, 60, 69, 122, 105, 26, 12, 68, 58, -48, -98, -29, 13, -62, -158, -101, 26, 0, -101, -65, 58, 101, 23, 7, 115, 185, 111, 42, 84, 146, 97, -4, -6, 29, 14, -68, -107, -74, -78, -108, -115, -85, -62, -46, -20, 21, 32, 43, 82, 137, 124, 88, 123, 175, 134, 46, 29, 74, 52, -68, -104, -62, -13, -110, -187, -109, -13, -40, -121, -77, 54, 75, 9, 10, 111, 170, 108, 59, 101, 138, 93, 32, -2, 26, 3, -66, -88, -74, -93, -91, -95, -94, -83, -56, -19, 11, -1, 11, 77, 114, 83, 50, 95, 136, 108, 19, 20, 64, 52, -48, -87, -22, 9, -68, -139, -80, -1, -22, -99, -73, 19, 53, 4, -18, 54, 95, 58, 15, 34, 68, 58, 3, -2, 22, 8, -13, -37, -30, -33, -24, -31, -40, -35, -40, 14, 9, -20, -21, 38, 66, 9, -18, 19, 82, 49, -18, -21, 54, 61, -5, -48, 2]
5796BM7m6n7K4O2j5p7lQ4J6n7l3L4N5k2m8NM4Rl5LJ9J5j5J%qNJ1Mk1j0J9K1m4
5831a1k5L3M3l2p7L4P5j4p1jP8K7o4n4P3N7l9o8J3O7ko6kN5%n6l7M0L4k0m8L3
5863b5L2ml8K8Jj0J6L0j2l4JN4J2o3j2M9M4m8o2M2O5m1p3J0Q0qq2k5Q3L4q1n1
5895h8O0O7l9o7L1O4Kl6j2N1Ol1oL4j1k5qK9j3l0%J6j9l2OM4mm5NP3K4p0j2P3
5929C7O6o1n0L6O8l5p3lN7k1o4k1M8J0o8l3M9L1l6j3L9L5mpL0L1rrM6nl8k0J9
5962C2K3o1n6K0L8l4n1nO0ln1K1O8J3l4PO2L0l5l0M3L6m7l6QJ7l7n1OKj7k7J4
5995g5J9ok3M4L5J0j6J3O0Mm5PN4ln8j9M2ln0m3K1K1k3n9L2M3Kk8J6L7J1pJ7J2
6029D2JKKJ2l4mklk1l4J0J5j5l8nM6J5m4J5N4M0m5k1L7N7k2n9J2M1qm9k6L0K0
$$ y = [2, 49, 3, -54, -30, 32, 17, -60, -63, 21, 37, -20, -53, -19, 36, 14, -34, -29, 15, 24, -11, -8, 11, 26, 11, 12, 12, 4, 9, 20, 24, 3, -7, 12, 33, -11, -36, -3, 40, 8, -69, -35, 40, 26, -45, -46, 32, 59, -5, -59, 14, 71, 32, -36, -23, 44, 42, -24, -26, 29, 29, -27, -64, -24, 10, -10, -58, -25, 7, 3, -35, -7, -6, -16, 0, 30, 18, -16, -15, 39, 51, -12, -24, 25, 69, 21, -41, 1, 66, 25, -48, -38, 42, 34, -48, -73, 10, 44, -37, -88, -28, 39, 0, -67, -36, 28, 30, -6, -18, 33, 39, 8, 2, 36, 25, 0, -8, 21, 8, -22, -22, -6, -25, -57, -51, -7, -11, -56, -51, 22, 46, -24, -36, 37, 103, 42, -8, 28, 96, 61, -12, -15, 42, 21, -43, -64, -16, -6, -74, -107, -58, -27, -63, -76, -37, -2, -6, -13, 17, 48, 39, 30, 76, 71, 33, 13, 32, 55, -6, -62, -42, -4, -38, -89, -94, -34, -37, -88, -67, 1, 14, -20, -13, 49, 79, 44, 14, 57, 93, 46, 10, 18, 35, -2, -53, -47, -45, -62, -89, -75, -56, -62, -85, -41, -6, 4, -12, 1, 61, 65, 20, 27, 81, 78, 20, 1, 43, 40, -10, -53, -32, -11, -34, -93, -61, -18, -16, -44, -28, 9, 20, 13, 30, 42, 43, 45, 47, 59, 25, 21, 19, 16, -5, -39, -29, -14, -29, -67, -72, -26, -11, -55, -40, 14, 54, 9, -12, 25, 82, 60, 1, 13, 54, 46, -3, -29, 1, 21]
6063B1m5k2K9K0lj8J3K4K%J0oPJ6Ok7j4QL0l3m5oM2Jn4j4N1L2l8m2M1N0Jn1J6
6098BN3J5l7k6K5K3k9n0J2K0Nk4j8jJ2J0jlNJ9L6k5j8L3L8j2n3mL9J2m8m7M5L6
6132D4m5o0J3O3pn4j4O4L0l5l4M9M3j8k3j1L7Lk3j5J8moj1rj1RKJk5MM7Pm3j0
6167b4N1K7k4n7L0O9k0q2K0M6K4p7l1M0M3l2o1K7N1qn5KN1J1k9oJ7K7j5j6RQL
6200A9Jkj4j0QK6k3l8K1L9j4l7j6N2K7n8l3M9N5m6o1K5P4po9LN5K7n9l0L9M4k3
6233B4o5L1L8j6m5NK8Nj2j9L2j3%LQoPJ7Mk3lK9J7j7n8L2M1j8n5j1O0Qm7m7O0
6268fK9k9o1M3P0k3m9qO4J7o1rL5K7k8m0LL7kl7j3K1lOLllJ1J5JnnK4Rj5j4J9
6305B0K2j4n8J8L6kn8k1O6J4m5m0N3M6m2m1L3N0km9KN1J3n6j5L0L4m1m5K2K9r
$$ y = [21, -24, -46, -17, 3, 0, -18, -5, 19, 21, 21, 31, 25, 32, 48, 54, 27, 13, 21, 51, 18, -27, -33, 9, 10, -44, -58, -7, 25, -13, -55, -14, 36, 37, -14, 2, 55, 70, 33, 7, 32, 55, 26, -24, -12, 8, 13, -11, -29, -30, -18, -8, -9, -12, -7, 12, 48, 23, 5, 38, 76, 64, 11, 7, 46, 58, 10, -37, 8, 44, -1, -61, -48, 15, 8, -46, -60, 4, 34, -1, -35, 14, 57, 39, 16, 5, 42, 45, 22, 7, 25, 21, 15, 4, -5, -16, -7, -5, -4, -29, -25, 22, 29, -14, -24, 27, 54, 30, -27, 3, 72, 52, -30, -10, 36, 60, -17, -48, -8, 35, 3, -58, -31, 20, 12, -43, -41, 10, 21, -8, -14, 3, 30, 15, -1, 8, 16, 19, 20, 18, 4, -6, 2, 28, 5, -33, -12, 27, 13, -24, -40, 12, 39, -19, -52, -3, 52, 6, -55, -30, 44, 37, -32, -29, 26, 53, -6, -36, 3, 47, 24, -41, -10, 28, 12, -33, -28, 0, 5, -7, -26, 6, -7, -7, -4, 4, -2, 5, 22, 26, 3, 0, 29, 46, 29, -29, 3, 44, 26, -29, -40, 20, 28, -19, -66, -6, 23, -6, -67, -24, 46, 23, -26, -34, 30, 47, -14, -23, 12, 39, 11, -29, -26, 11, 9, -28, -41, -20, -23, -17, -14, -17, -20, -9, 6, 7, 2, -3, 21, 30, 15, 1, 20, 42, 28, -30, -12, 24, 22, -36, -57, 9, 23, -22, -62, -9, 37, -5, -46, -13, 37, 35, -14, -12, 39, 52, -4, -19, 11, 45, 4, -41, -19, 10, 1]
6337Ak9MK3J1k6QJ8nrK8Rrj4J4K5l7j8K0K6k3m5J1L0Oo8%M0L3m8l3N7M2l0m3K0
6372a1O2oo0oN2J1m9j6L6J0m2k3K9K5k4k4K4K8k6qL2J3rk3K9K2j5m2L6J7l0l8
6404b6PM9j6o1J6M0Ml8k1O1K3n0k4L1N4l2m8L0M6j1n2jN1j2l5j4L3Jl0j6K7J6
6436Bk3j0K3L3k5kL0Pj7m0L9L1l7k9J9L6l4m7J6O0j4m6nN0Jm7j9N4K2m7j6L5L6
6469C6l4l3K7M0k5m4K3M0rm7PK7ok2qM0Jk5oN1Km0qM1Rl1j3K7J2l0k3J9L2k1l3
6504b4J2L9k5k2LM1j9l0PL1Lk6LK4J4l9lK4J8m3j1L5K4l5l1K9K9k5m0K9L1km4
6537b3RL8J2m7nK9J9k8k6L4J7k0k3RK2lk4OJ3kk0MJ7j3k0K9J0k1qJ5K3j0l3J0
6571a0L6nl6pL7J3l6j5K6M4l9k9J7L8j7k7jL2mk6oK3J0j1j2mJ5LqpOjNqKj2J2
$$ y = [1, -28, -24, -1, 10, -16, -8, 10, 5, -4, 24, 33, 24, 10, 24, 49, 12, -6, 14, 40, 17, -28, -17, 13, 19, -49, -49, -9, 24, -24, -57, 0, 42, 12, -31, -11, 51, 45, -15, -21, 31, 42, -7, -23, 13, 23, -19, -42, -13, 12, -12, -36, -12, 16, -10, -18, 14, 27, 18, -5, 24, 46, 31, -11, 25, 42, 12, -26, -19, 30, 14, -47, -31, 9, 13, -25, -46, 15, 38, -12, -36, -5, 49, 17, -31, -1, 45, 34, -18, -19, 32, 20, -15, -29, 4, 5, -25, -41, -14, 2, -21, -31, -8, 25, 0, -2, 28, 35, 18, -22, 17, 48, 11, -18, 1, 37, 3, -44, -28, 32, 18, -28, -33, 17, 18, -29, -48, 6, 28, -19, -35, 0, 36, 2, -31, -4, 36, 11, -33, -10, 30, 21, -26, -19, 8, 2, -20, -28, 12, 13, -12, -18, 33, 35, -5, -13, 28, 37, 6, -7, 20, 32, 2, -21, -2, 30, 9, -24, -12, 27, 2, -20, -17, 24, 5, -25, -18, 13, 16, -10, -7, 17, 31, -8, -11, 13, 31, -12, -23, 12, 36, 1, -30, -1, 28, 3, -37, -8, 23, 21, -23, -14, 24, 36, -11, -16, 13, 32, 4, -22, 12, 29, 9, -14, -5, 17, 14, -10, -4, 9, 7, -13, -9, 8, -5, -25, 4, 14, -7, -15, 0, 23, 13, -20, -10, 26, 21, -15, -22, 15, 28, -8, -23, 3, 47, 8, -21, -4, 34, 17, -10, -11, 21, 17, -9, -15, 8, 18, 7, -5, -9, 6, 9, 1, -6, 0, -1, 4, -4, -2, -14, -2]
6608bJ2j5j3JK0J2l3pL3Oj1l5L1L0k8j5%K7K4l7j0K6J8k8j1jJ6Rk6lJ8jj2oLJ6
6644HNj8j0J1J8j0rnOK1j3nj7J5Rj7j7J9J4ll0RJ7Oj5j0J9J9jj9mL4rj3j7J6J8
6681B2mk5j6K3J6pk2j1J8J4j7k2K0K8j3k1KL2J6k0l5K3K9j8k5mK5Nk8j9RL3qk6
6715b6KK3J9j3k4K4J4Lj4MJ1JOj9j9J1J9j3l1MJ3Jj4k4L9K5k5k2L1K3Ml5jL9L
6750C9k5j6QK2j3l7LJ7J0k1j8K1J1pmMK8Nj0mQK4jrj0lKLk0j1kJ7j6j9KL2kj8
6788a0k1L5K4kl5K8K9kl1k4M4lk5j3J4J2k1l5J9K5lk4jJ8QjJK2RMOj3OnJj2oj1
6826GpJ1j0k1MJ1jj8mK9J4j5j1M3J9qk4NK3pm2NK5Nk7l4J0K3k2k0J4L3pj2LJ8
6862A2K4j4jPJ3Mj6Nlqj%j6j4NKj4j7MJ8Oj1NK2K3k2k0J8L8k1j4jK5%m6oK2Ml1
$$ y = [-2, 10, -5, -18, -17, 3, 15, -18, -25, 8, 14, 3, -32, -1, 29, 1, -14, -14, 13, 37, 0, -10, 16, 34, 6, -5, -6, 10, 19, -7, -10, 8, 7, -5, -11, -8, 8, 13, -5, -15, -4, 14, 4, -5, -10, -4, 17, 4, -1, -18, -3, 6, -11, -28, -9, 5, 2, -28, -19, -2, 4, -11, -21, -2, 17, 16, -3, -7, 27, 18, 5, -12, 4, 22, 18, -7, -23, 0, 16, 9, -13, -24, -6, 8, -9, -31, -11, 17, 4, -17, -15, 17, 33, 13, -22, 1, 30, 12, -13, -17, 8, 13, -15, -34, -25, 8, 0, -26, -24, -1, 18, 5, -19, 5, 19, 22, 8, 12, 23, 24, 30, 11, -8, 3, 22, 9, -22, -18, -5, -4, -18, -42, -3, 22, -3, -25, 6, 29, 33, -2, -3, 36, 39, 14, -2, 6, 28, 15, -22, -19, -2, 8, -13, -31, -10, 1, -6, -10, -6, 22, 27, 17, 13, 21, 45, 44, 35, 25, 22, 24, 27, 7, -4, -6, 11, -5, -24, -22, 10, 8, -10, -31, 4, 28, 26, -9, 19, 48, 46, 15, -9, 35, 32, 7, -6, 8, 20, -1, -36, -17, 8, 5, -19, -20, -2, 6, 5, 6, 28, 37, 41, 47, 34, 40, 35, 36, 24, 18, 7, 0, 11, 1, -20, -16, -5, -6, -24, -28, 1, 15, 0, -11, 32, 51, 43, 19, 24, 47, 40, -2, 3, 28, 33, 6, -28, -18, 5, -17, -37, -23, 10, 3, -9, -6, 12, 36, 22, 21, 28, 41, 45, 29, 34, 31, 23, 22, 22, 6, -8, -3, -1, -15, -32, -28, -10, -4, -15, -10, 12, 35, 13, -7, 11, 49, 28, 14, 13, 38, 38, -8, -14, 8, 12, -19]
6901a9k5K6J9j2j3LK3J4j1nJ2J7%mRkjPj5Ok7jJ4qrj0J4jk7mL4J1k9j2M2J3j6
6938A3k3J7L4j0m7NL5Qm0j9L2Rk9j5K2L0lk7kK0J7k4nK0lk%Pj4j1NJ7kj6OJ0L
6975A8l7RK7Rm9J2K3J5l1k2K8K6j8l6J3M2j8k1pL5Ml3mK4J7j0l0K1K2nl1J1J3
7008A7%j9jMOrLJ4rj5QK2j2j2qL0j2j6mL3nk0j5L1J1k3k3J8L8k9k6J5K8kl7LJ7
7045AJ6k7JJ5J9l2pK1K0k1j7K2J7j7j9K6J8j4k3K0J4j0l5PL5j6k7pK7Nl8nL0J2
7079A1k5rK8K0j2j6J0L2k1j6K1Ojl1RQpk1LOJk3OK0lj6PM3Lk2oL2K3k5j5J8J2
7116E0j4l2lJ5j2l0%Mnj0pJ3L6k1jK0J5KKJ6KmQJ4pj8j3J0j5k4j4jJ8k2k1J8K6
7153emk2J7L1J7qj7M6K1k1m1K9J4j3l0j8Oj1j8j7MJ0kj4QK5J4KJ3kRJ6K0k6JJ3
$$ y = [-19, -44, -18, 1, -11, -24, -21, 2, 16, 5, 0, 12, 29, 29, 25, 34, 32, 31, 38, 23, 29, 2, 1, 15, 7, -2, -12, 2, 1, -26, -30, 4, 15, -14, -26, 16, 29, 13, -10, 7, 41, 31, -16, -11, 24, 32, -8, -27, 5, 14, -15, -30, -8, 22, 19, -8, -10, 10, 27, 3, -2, 18, 15, 13, 13, 20, 6, -5, 0, 17, 15, -1, 5, 15, 18, -19, -10, 17, 26, -23, -11, 12, 27, -4, -26, 2, 28, 10, -26, -13, 29, 11, -10, -17, 18, 22, -11, -15, 9, 26, 16, -14, 7, 29, 24, -7, 4, 17, 17, -2, -3, 1, 7, -2, 1, 15, 6, -9, -1, 21, 9, -3, -11, 19, 7, -9, -13, 20, 15, -5, -20, 11, 22, -1, -24, -6, 32, 3, -23, -8, 20, 18, -19, -16, 1, 17, -10, -9, 6, 25, -7, -14, 7, 27, 6, -11, 11, 28, 11, -8, 18, 36, 22, -1, 19, 33, 23, -12, -5, 30, 14, -13, -20, 7, 12, -26, -31, -1, 11, -14, -23, 5, 25, 13, -3, 7, 39, 18, 2, 23, 29, 28, -3, 6, 14, 7, -14, -11, -5, -4, -27, -21, -1, -4, -20, -13, 30, 33, 11, 5, 37, 60, 35, 20, 38, 50, 36, 4, 1, 16, 4, -26, -26, -22, -27, -37, -44, -31, 5, -16, -17, 3, 18, 20, 22, 38, 40, 36, 44, 58, 51, 33, 20, 30, 15, -9, -23, -24, -6, -28, -49, -31, -5, -9, -31, -14, 17, 34, 26, 9, 55, 76, 55, 14, 43, 57, 44, 14, -4, 2, -9, -27, -44, -40, -30, -32, -46, -38, -13, 1, 3, 16, 14, 23, 39, 59, 33, 34, 47]
7189D7J4k1k3oJ5j7k9j1RL3l9j5K0K9oj4RK6J4j6j4K3K0j6j3rK0ok4j5QJ4j8r
7223b0KJ3J4qj0%K4Pj3kPJ5jj6qJ3J2j8j0%J1ok5j4M3J6j0j0NL5j3k2MJ6Kj0k1
7260BNKpj6qkJ2Mj6nL7J3k3OPK3J5k0%RJ5j0l8J0J0j1l1oJ3Ql3j1J8K5mnJ1K4
7298B3J8LpJ0jJ3ll0OMk0k1j5pQj6j4jJ9J0k0OK1L2%pK9K3%k6NJ2J2j6l2nJ5l1
7336cj9j2PMk1KJ7NKlJ2K2K0QpJ7jJ0pj9lOj0j1l8OKlk5JPK9l4KK0K5rkJ6K7K2
7377F2k8oJ6J3pk7Pmok3J2rj0j3j0J7Qj3kMkK1Q%J3kLK4j2j8MJ4%l7pK3ll3pK3
7417gJ7l3j6K0L3j1l0OL8Nj2qK8Rj1k2K2J0kk4OjOl4OJ0qj1%J5k6J2J2Rj4j1K7
7454A0J3k0joL1qk4OK0J9l7j5L8Kl0j6J6K1ok8J1J4J5l9j6M1K0j9k1K6J0j5j2
$$ y = [47, 61, 40, 17, 11, 26, 9, -20, -31, -22, 11, -28, -43, -23, 6, 0, -14, -5, 21, 35, 19, 5, 28, 48, 32, 19, 10, 30, 24, 0, -15, -7, 7, -11, -20, -18, -5, 9, 1, -9, -9, 15, 22, 9, 7, 14, 29, 28, 12, 4, 17, 29, 11, 1, 1, 12, 6, -19, -33, 10, 26, 16, 6, 11, 46, 33, 11, 15, 31, 33, 23, 2, 7, 9, 2, -14, -22, -24, -12, -8, -24, -29, 8, 21, -2, 4, 11, 34, 49, 29, 29, 38, 53, 43, 5, 15, 25, 14, -17, -23, -10, -2, -35, -46, -28, -3, -7, -12, -1, 23, 41, 44, 37, 47, 46, 59, 56, 26, 32, 36, 16, -5, -20, -27, -19, -35, -49, -50, -31, -21, -41, -35, -14, 18, 18, 11, 40, 63, 63, 37, 42, 54, 66, 50, 18, 13, 28, -3, -22, -34, -27, -23, -44, -42, -25, -20, -18, -21, -9, 13, 33, 41, 34, 51, 50, 60, 53, 34, 31, 37, 27, 16, -22, -16, -14, -17, -42, -41, -34, -5, -39, -37, -17, 8, -1, -3, 13, 40, 62, 34, 28, 44, 57, 50, 23, 30, 26, 20, -3, 9, 0, -10, -23, -33, -16, -8, -21, -23, -19, -21, 0, 8, 8, 21, 19, 22, 46, 34, 16, 20, 34, 34, -3, -10, 13, 10, -23, -30, -7, 10, -23, -39, -19, 14, 3, -27, -21, 17, 22, 10, 2, 30, 39, 28, 6, 28, 38, 36, 12, 18, 17, 23, -11, -5, 5, -3, -14, -14, 1, -25, -13, -1, 8, -6, -17, 10, 23, 3, 2, -4, 27, 19, -5, 1, 21, 40, 3, -12, 26, 28, -2, -18, -2, 19, 13, -15, -4, 10, 25, -14, -30, 11, 31, 12, -9, 17, 27, 12, 0]
7487@K3Njj2%Olj7K1%k2JQ%pj7NJ3k2j5J4K8qk3j2M6Lk8J1K8K7k0k2K4K6j2l6
7524A2J4J0Om3k0J7J9l5j3RK1oj9J1K1j1jK8lJ1MJ8kj1rQOl0k2K0J7m0l6J5K0
7559a4j5l1MM1K2k9kL8L0qrK1K6j2k0jJ9rm8jJ3k7k2kNJk3RJ1MjJ5K2J8qJ2K5
7596E4JqmJ0Rk4l2%J2k2l6QJ6j0l4JL4J6j1mL7K2oj0J6K9rqNkJk6pJ0l2j7lJ5
7634ij7k0NJ8j0rL0J6kJJK2K0j9j6K3J4k4k0J5Lql1kJ9jj8kJ4opKK5OrNJ6M%j0
7674A9NK1k9qJ3Jj4j6J3J8l1j5K2J1nj7OJ3J1k9nJ4J1j6j0J1J3mj8J4J8pjoJ1
7709A4kMkJ3j0JNJ0j4rnMKk2nRmj1LJ3J4j6QJ5KRj1J1PJj7NJ0qj9j1Qj2kqjMl
7752b0rJ4mK3NOJ8krK1rKRpmj1%mj4lk9j7K6pj8rJ8K1kj5J9K2LJ4j8K5M%%j2P
$$ y = [0, 23, 28, 27, 15, 15, 21, 18, 1, 22, 22, 0, 1, 9, 9, 2, -15, -10, 3, -19, -34, -20, 8, 0, -23, -35, 11, 14, -14, -3, 25, 52, 32, 10, 34, 60, 48, 12, 26, 36, 42, -1, -21, -4, 15, -20, -33, -24, -3, -9, -28, -17, 4, -7, -8, 20, 17, 28, 32, 50, 48, 37, 28, 36, 42, 12, -10, 10, 27, -13, -49, -34, -14, -29, -60, -56, -15, 7, -22, -24, 14, 44, 36, 27, 48, 74, 62, 42, 41, 60, 51, 3, 2, 15, -12, -34, -36, -31, -30, -53, -44, -33, -29, -30, -15, 7, 25, 17, 29, 54, 55, 47, 43, 53, 62, 38, 6, 6, 18, -4, -40, -32, -16, -26, -60, -59, -25, -9, -20, -24, 13, 35, 29, 19, 35, 64, 55, 47, 52, 50, 51, 25, 18, 28, -4, -21, -24, -9, -26, -46, -41, -23, -33, -42, -12, 4, 2, 3, 4, 26, 46, 27, 11, 34, 48, 24, 4, 19, 22, 14, -17, -19, 0, -1, -19, -21, -7, -13, -20, -18, 7, 13, 4, 9, 25, 29, 29, 19, 24, 45, 16, 8, 21, 22, 8, -8, 5, 23, -8, -23, -1, 10, 5, -12, -6, 7, 18, -11, -16, -2, 9, -7, -17, -6, 7, 3, -15, -1, 17, 10, 9, 3, 14, 12, 16, 14, 27, 17, 18, 23, 33, 19, 10, 5, 9, 11, -11, -16, -7, -11, -22, -19, -6, 8, -8, 0, 15, 17, 26, 15, 26, 33, 34, 17, 22, 32, 24, 5, -6, 2, -10, -12, -20, -21, -17, -20, -29, -15, -19, 4, 9, 15, 33, 31, 22, 43, 34, 36, 45, 38, 34, 23, 23, 19, 5, 2, -27, -44, -18, -25, -43, -52, -34, -13, -15, -30, -11, 11, 14, 28, 10, 35, 39, 39, 39, 27, 34]
7793C4j1j6plKj8j5llQ%mQJ0K1jRJ9J9kolOJ3j5j1j3Ok1qj8MPk3j0J0QNj4LL5
7834BLNqJ7J4J1j1oNLQk4pOqk6kkNlmMJJ1LrJ7J0%lJ3OJ0Lk6K%Lj2j8Pjj0j5m
7879c0MJ5oj0J5MjN%K3Rj0j8K7J0lk4OJ2lj7qRKpmj3J9JrKKMO%kpNJkKPlkplJ5
7926A6lkj6NJ0jj3pQJ0j9jJ7Oj7kmK3pj8OK3kqQMJ5j5%LPJj2n%Rmj6Pj2oJMj3
7970b0LJ3KnlJ4OJ1k5J9K0%k5KJ4Mk3oLRj3j1qK7j9KjORmKJ5NjjOJ6j3Ok3PrJ
8013A2j2j0oKj0Rj5o%K4rKJ2K0j1MK0Mmj1QLnlj4J4Jk6Nj3J7j0rLK4j1qJ6J1l
8053A5olK4jj6RoJ4j8rKlj4mLRj4j4K5OplOJ2Rj3NJ1KKj4J5ooMJJj7kLnRnj2J3
8098Bjj0PJ1Rk3J4MJljJ3nj1kJ1oj2j7K1Kj1j1J2JlkQoJ8qjRPj2j4K6joj0J6M
$$ y = [34, 23, 7, 0, -3, -1, -19, -34, -37, -40, -32, -32, -36, -28, -18, 3, 2, 11, 30, 49, 47, 41, 38, 44, 57, 42, 31, 18, 24, 3, -5, -23, -19, -12, -35, -45, -35, -27, -22, -36, -33, 2, 5, 10, 2, 19, 33, 44, 33, 27, 32, 35, 43, 19, 12, 18, 10, -16, -18, -20, -15, -18, -22, -18, -17, -6, -3, -12, 5, 15, 15, 12, 25, 31, 41, 44, 18, 20, 20, 23, 11, -7, 0, -1, -11, -26, -30, -26, -11, -17, -27, -12, -8, -9, -4, -4, 19, 28, 18, 0, 27, 37, 34, 10, 16, 28, 25, 8, 0, 9, 11, 4, 0, -13, 6, 7, -2, 0, 2, 6, 12, 12, 10, 3, 8, 9, 7, 9, 16, 13, 11, 4, 1, 16, 13, 11, -5, 0, 10, 9, -4, -11, -3, 7, -12, -13, 4, 10, -7, -9, -13, 10, 3, -15, -9, 14, 12, 4, 12, 16, 31, 16, 16, 19, 26, 27, 15, 10, 10, 19, 15, -1, 6, -6, -12, -11, -7, -20, -17, -4, -2, -7, -10, 4, 10, 21, -4, 15, 35, 35, 10, 12, 26, 30, 7, 1, 4, 13, 0, -11, -19, 8, -11, -9, -10, -4, 5, 1, 3, 18, 23, 22, 21, 27, 43, 30, 36, 13, 20, 11, 12, 0, -10, -16, -14, -24, -15, -30, -36, -36, -12, -21, -19, -7, 13, 2, 6, 26, 30, 26, 15, 23, 26, 21, 18, 4, 18, 19, -7, -2, -15, 2, -8, -17, -14, 10, -1, -9, 7, 18, 15, 9, 6, 30, 29, 13, 22, 16, 30, 12, 3, 5, 2, -12, -16, -13, -4, -18, -32, -7, -1, -8, -11, -5, 7, 16, 3, 8, 19, 21, 23, 9, 24, 18, 12, 16, 17, 18, 1, -1, 2, -3, 6, 1, -11, 2, 1, -9, -2, 9, 18, -5, 9, 13, 14, 11, 10, 23, 18, 7, 5, 16, 10, -2, -19, 2, 4, -7, -18, -6, -5, -8, -10, -2, -8, 10, 2, 1, 10, 17, 5, -9, 17, 16, 10, 0, 16, 20]
8140B0Pl1J2Mj6Rj5J7jmnQkmNPNk2OJ2kj9%Ok%%JJ1pk1J9J1J1k5OPLj9jJ6lkj4
8184a2J4J6j5j3J4Jm
$$ y = [20, 27, -4, 8, 12, -4, 5, -10, 7, 6, 2, -3, 5, 3, -1, 4, 11, 16, -6, 0, 12, 10, -9, -9, -3, -5, -5, -5, -4, 7, 0, -21, -2, 9, 20, -5, 1, 8, 11, -8, -9, 7, 4, 2, -12, 2, 18, 3, -10, 4, 5, 1]
8191A
$$ Imaginary data points
##PAGE= N=2
##DATA TABLE= (X++(I..I)), XYDATA
0@%%%%%%%%%%%%%%%jKkRj6J6j6J7k1K9l4L8m6N1o0O8p6R0j03J15j29J49j69J88
39I9k11K35k62K94l27L62l98M40m87N36n90O50p17P90q70R61j060J167j292J432
59G52j590J775j990K245k547K912l357L876m342L745J2925L08292r0274m44455
73b12033p362L93920J58902k83776j90820J66134J67242j29042j57792O8823J08333
84H2529r9675j44874M7359J38202j5581j30337m1841Q6657Q8475K3505l7272p0528
96g3381j4396J30437J48417o7883k22829k2175K53359J32853k30175k42728J24047
107h4454K57069o0947k74606k8983K25282M9367k09344o9913K08027J07124j93668
118g5046j37161J98298K21576j22507k49495N1184K67953N4600k17340j28171
$$ y = [0, 0, 0, 0, 0, 0, 0, 0, 0, 0, 0, 0, 0, 0, 0, 0, -1, 1, -1, 8, -8, 8, -8, 9, -12, 17, -17, 21, -25, 26, -34, 34, -42, 48, -55, 60, -69, 80, -89, 99, -112, 123, -139, 155, -172, 190, -208, 232, -255, 281, -309, 341, -376, 414, -456, 505, -555, 612, -680, 752, -838, 937, -1053, 1192, -1355, 1557, -1800, 2076, -2266, 1479, 14404, 322696, 232422, -212033, -219395, 174525, 333427, 49651, -141169, 24965, 192207, 63165, -94627, -25804, 82529, -17146, -162020, -114661, 23541, 7960, -122377, -164218, -77561, 10914, 34419, -2853, -73381, -87777, 42660, 191077, 123194, -99635, -121810, 131549, 264402, 34227, -208501, -84454, 172615, 111668, -162938, -191921, 33361, 82728, -126616, -196529, 11498, 118622, -75046, -212207, -13909, 207667, 85160, -164335, -113151, 154802, 209402, -7938, -136109]
128a36109J24622J36579m9257j19598k7689L9021K4625Q248p513m6086l5328M7802
140d0683P2073j9890p0241J7200Q0769k732p0500K0968R7436j6834j31085r575
152g3094J59160N5875j75642j33072J36028J80930q1757k12522K748J96703N9706
163A15063j51300q7459J08151R8453o2250p7900N0678P1612m1106o7710L5638
174h130P1655k4443p9327n049O1629J9993m0475l0108M971J2450J8182K2931j4789
187I490n2850k829P9986M7080p1296p8097N1613J01444j8686j05485j3136R0694
199C7928K5135q4413m0288O9996M0922p1806n5724O6042P3340n0989q6717L1930
211d4644J01148O516q6361k7882P0611M8830l8583m6531J3534L0735m442j8071
$$ y = [-136109, -11487, 125092, 75835, -43763, -71452, -32431, -7806, 442, -7071, -53157, -88485, -40683, 31390, 11500, -58741, -41541, 39228, 36496, -34004, -13036, 84400, 67566, -63519, -73094, 86066, 141941, -33701, -166773, -30745, 150185, 68428, -144094, -141346, 55357, 115063, -36237, -123696, -15545, 82908, 20658, -57242, -6564, 65048, 23942, -43768, -8130, 63525, 39082, -40245, -45294, 16335, 36328, -4147, -34255, -29284, -16834, 1348, 24279, 9490, -43360, -46189, 33797, 80877, 9581, -68516, -16903, 84541, 65855, -39630, -52766, 37928, 63063, -21350, -61638, 8358, 49280, -22526, -78250, -12208, 61132, 10143, -76574, -44644, 56504, 63020, -23341, -51223, 19388, 68218, 29635, -16896, -3362, 27373, 22931, 4860]
223D860k174l226j3686J120J6307m787k6006k169K6404N962k3174r26L1917P549
237A7971l1299m304M6596K1729m6053l5126M3539N2230l1916o7325O949O3048
249C6039O336o2845k8478M3341L0249l4430l4469K2664L2726j4103k7491J3914
261a6547L2204k356k4161K925K7008Q362j6055q194R077O318l422l312m557j0736
275c446l907J0875L569k0509j7851J4080K1623j0624k6475N065L0584N670k4310
288a5656m931K9334J6593k0240j5021K2179K3471j5002k6258P541K5386m014k9493
301f111r514J8149P383j9185j6157P192J1121m819r388K504Q562K825K70M338
315b830M993K383M209O256J005l389K038O439k428j1501m121O759o26j5531j1093
$$ y = [4860, 2686, -540, -14226, -13106, 3201, -1586, -27592, -29761, -3357, 2605, -20569, -21495, 10422, 17971, -13328, -17632, 28964, 50693, 4640, -30486, 13053, 65283, 33367, -33958, -27009, 36039, 42375, -20470, -48948, -5607, 24642, -9788, -44257, -21593, 11133, -2970, -30461, -16547, 15657, 13301, -10860, -7935, 19073, 27435, 11380, 3186, 12263, 18581, 15159, 11847, 7290, -3446, -7353, 3522, 7091, -13418, -31269, -17189, 4434, -6190, -32665, -27600, 2984, 8654, -15656, -20587, 8747, 25340, 5100, -9921, 12258, 35729, 20727, -5531, 2010, 27396, 23382, -6111, -15625, 2524, 9907, -9278, -25435, -18243, -7122, -11941, -21329, -18825, -10263, -7438, -7168, -2830, 2163, 4546, 8755, 15011, 16016, 12627, 14665, 21104, 18676, 7175, 3054, 9813, 9187, -6344, -17437]
330a7437O660P082j0439j3796M810J4627N60j0604J751J6258Q787n815k152J1442
344A1734R998l753o678L083N806l689r306l883N77l306p232m855j520j745j794
359a6563L18Q59J03K539O322M855N72K084P681O531j223k972L604N092l515q740
375G547k432L056l071j0327n782K750Q74o526m688M120N562p90j615N142P496
390A316K050n98L700N619O98k574L65J854k499n167j815k7m090o027j114K224
406f085k086n096P16O420K308l346P37P951N284k576j609N542M690l728n037J992
422F077K988m975p603j20L613l168p484n20N857J172m401K54O798L616k080J059
438A083O340K331m160o56N828J040q266n281M811K844q564q680L498O348m549
$$ y = [-17437, -10777, -3695, -14134, -27930, -23120, -8493, -7933, -18537, -16786, -528, 8259, 2444, 292, 11734, 21732, 17979, 11301, 14384, 20190, 16501, 7195, 3312, 3889, 583, -6649, -11504, -13024, -14769, -16563, -16245, -15386, -15283, -12744, -6422, -1567, -995, 1089, 8770, 15301, 14078, 11106, 14710, 19802, 16287, 7547, 5115, 8171, 5100, -5227, -11009, -8259, -7385, -13911, -18599, -14479, -8917, -9707, -11322, -6180, 1316, 3366, 2768, 6468, 12087, 12785, 10211, 10576, 12430, 9931, 4764, 2949, 2922, -1168, -7195, -8309, -6085, -8171, -13267, -12551, -6131, -3823, -7169, -6432, 1519, 6803, 4227, 2618, 8160, 12850, 9122, 4085, 6077, 9065, 4090, -3513, -3633, -20, -3188, -10672, -11192, -5335, -4163, -8564, -8310, -1512, 2104, 24, 1083, 7423, 9754, 5594, 4938, 10766, 11806, 3540, -1741, 3070, 5914, -2650, -11330, -7832, -1484, -6033]
453f033p958L691R644m32o677L954J2411K336q547k83J2074N109j0221p824O288
468G532O141p793j0815L53M267m359p104J366M265l078l757O287Q771j529m841
483d294O412J1712N62p120J989R015r98r875j005P304l696j5021l706J1396J480
498D155j7326r737J4028J3301j0023j3967R220J9301M77j2005L016J5971L073
511A9484j0751m80J2113Q74j4636n957J0342L445j4807j1897O054P467o863q929
525a4541L286O008k287o46R076N264p151k155J5012J1795j0411j3294R121J6637
539B5714n749j9276j307J3677j670j7634l909J3022K77j7927m473J8996R193j7534
553h600j2139J8149K0974q203j8321O003K0371J680j4448k290J0452q4j0768l06
$$ y = [-6033, -13991, -10300, -656, -1088, -7765, -3811, 8600, 10936, 2389, 2106, 14180, 19289, 9068, 1244, 7532, 13673, 5880, -4935, -4582, -315, -4674, -11778, -10412, -6147, -9225, -12982, -6695, 2076, 547, -4294, 2118, 13830, 14392, 7272, 9261, 18276, 17278, 7403, 6398, 13702, 10006, -5015, -8721, 2675, 4155, -13171, -22908, -8880, 4421, -5602, -19569, -10349, 8952, 9429, -2576, 440, 16411, 19484, 8733, 8253, 20366, 21240, 6604, 647, 10989, 14434, -373, -12270, -6216, 1251, -5612, -14541, -11255, -5247, -7534, -8180, 896, 6160, -991, -3146, 11866, 23661, 13250, -44, 9077, 25714, 19965, 689, -618, 13059, 11389, -6245, -10154, 2868, 3145, -14782, -19255, -259, 8934, -8600, -20739, -2590, 18384, 10181, -8140, -2137, 18234, 19914, 5466, 3176, 13628, 13544, 2776, 2470]
567B470Q430m570j5021m35J3995J011j6218n872J3680Q150r330n486J0189O198
581G191q219j885J4274N704j6041r383J7510J5632j5751k2655P800K2740l293
594A3624k3598m107J7912M585j5521m621J4181L997j4532l623J7936Q476j6752
607b043j1737J5626J6790r865j7340M577J4870j904j1787J049P698m924q801P031
621g60J1273q468j6375N702K0103l56k0372m583J8483Q470j4246q493J1938P473
635I789j1580o536J3469P969j5677j2435J5137J7446j1833k1550N555K1956N51
648A2261j9118m412J4727M965j1095k982J0294R21j2183r11J4775L400j6308p761
662a3427J4922J1341j1430j2716P576J1588n286r192N779Q026p765r196R602J2913
$$ y = [2470, 10900, 6330, -8691, -9126, 4869, 5880, -10338, -16210, -2530, 5620, -3710, -9196, 993, 7191, -1028, -2913, 11361, 17065, 1024, -8359, 9151, 24783, 9032, -13623, -5823, 16917, 13624, -9974, -14081, 3831, 8416, -7105, -11726, 2455, 6452, -8080, -11703, 6233, 14709, -2043, -13780, 1846, 18636, 8771, -8569, -3992, 10878, 8974, -2813, -1764, 5934, 1010, -7791, -760, 10513, 2045, -14330, -8628, 11475, 11119, -9253, -13836, 4647, 13117, -1129, -9622, 2316, 9789, -1791, -8327, 5142, 13111, -2566, -15001, 136, 17582, 5749, -15801, -10246, 11710, 12261, -6857, -11269, 3458, 8423, -2672, -5654, 4640, 5561, -6622, -7533, 7242, 10642, -5666, -13427, 1495, 12836, 1406, -11310, -3734, 7854, 2568, -6624, -845, 7181, -584, -9780, -178, 12735]
676A2735r070j7274N530K0042j96k0087n233J7077Q199j3357q947J0188P647r398
690b144o805J0131P462j1094r948J0681J3222p906j5158L939J5063n9j2585j777
704f978R606J382p691M70P856k191j0176J730J2545K57j4359m223J3418P068j1419
719b705r028Q565Q903o784q015O691Q056o914q850P579J1625n927j3720L181J5069
734G726P09j4435m418J1643N779r333o652O447N044o299m735O173M638o735n598
749a0046O874P613m996p883L837Q575j473p028J144O184j404n893J834O034k930
764D42q358J337R005l86j0611k738R694M720q286n898O972P047m639n967M756
779b910O935l370o495L392P494k312q232K95P614N73p798k932N504K612m908l086
$$ y = [12735, 3665, -13609, -8079, 11963, 11767, -8320, -13553, 3524, 11723, -1634, -10581, -393, 7254, -2144, -8949, 1182, 8644, -2450, -12398, -1717, 11505, 3599, -11559, -7620, 7443, 7384, -5201, -6978, 2628, 4010, -3681, -3211, 4645, 2454, -7722, -5992, 6553, 6810, -7549, -11772, 1646, 8714, -2705, -11733, -3168, 5735, -1049, -9064, -2373, 5683, -1231, -10081, -2502, 9123, 3196, -10524, -7343, 7726, 8435, -6000, -10418, 1225, 7004, -2329, -8981, -2534, 2510, -3789, -8524, -2351, 2287, -4448, -10046, -3172, 4441, -555, -8438, -4601, 3974, 2501, -4527, -3383, 2801, 1397, -4496, -2662, 3372, 442, -7916, -6579, 2426, 2040, -8571, -11309, -1615, 3105, -5181, -11079, -4107, 2940, -1699, -7666, -2910, 4025, 655, -5840, -2448, 5046, 2734, -5498, -5203, 2411, 2984, -4814, -7746, -2242, 370, -4538, -7624]
795g624L590K384l183j600M027K432l490j902M675L799l465l787L331M546k530
810A203m883J409M238j828n173N15M521q27n507l94N503J454n108k090N166L879
826B078l367l431L218M446j517l651J278L488r27l433K66K684q25l374j55K634
842e88k02l017l13K823O66k403l23L001J207k317o63L113J659k648j853K730K478
859C350k491l324J478L271j239l950j07L393M90l258j169K799J745j969j515J951
875e45K103r74j513J080J720n50j371L96J056n76j129L37O28r43r98R18R86j276
893f51j477J338K136r33k425P49L161K31k992p46L102J630k697k267K068K545
909B772j632l038O80K831j98k880n91K438J103j895j341J370J586n49j188J90
$$ y = [-7624, -4034, -1650, -4833, -6433, -2406, 26, -3464, -5366, -691, 3108, -357, -4144, -813, 3733, 1203, -3680, -2271, 1967, 139, -5034, -4519, 2, -825, -6332, -6726, -1223, 231, -4877, -6967, -1801, 2078, -1289, -4720, -1502, 2944, 1427, -2224, -946, 2542, 1615, -1818, -1552, 1132, 307, -3067, -3222, -588, -790, -3807, -4120, -1297, -631, -3034, -3357, -356, 851, -1466, -2129, 984, 2643, -5, -1858, 872, 3350, 859, -2465, -987, 2284, 1045, -2905, -3012, 381, 871, -2387, -3556, -757, 988, -981, -2496, -545, 1558, 584, -929, 151, 1871, 1321, -50, 346, 1402, 826, -303, 34, 662, -281, -1279, -361, 625, -651, -2128, -790, 1346, 413, -2012, -1263, 1898, 2129, -863, -1609, 1493, 3123, 426, -1841, 227, 2772, 1140, -1898, -1218, 1613, 1415, -1465, -2056, 382, 1485, -410, -1751, -381, 1205, 656, -532, -342]
925c42R24K25k48j91l00j22O52M94r82j268P72J732n96k369l7K736P72k829j540
944b517K805K523k224l175J569L802n43l984n50L752J505l292k421K357K799j445
960I61k988L67K656M73k029j038J223J311k10j075n72N71J279L58j514j399J328
977b98K401p20l319l66L734J597l794k981L251M242k261n094R23N630O64n487
993a878k131M915L502l815m401K416M822r40m684n13L961J567k938k209J590K273
1009A537k82j789p62Q38J496M98j528j895J048L199R5m062j698M338L460l930
1025E63n268K747O630j069p496j029P605L204o986n170N698O769l836p652J721
1040c569P918M94p318k457O043L889m292m637K220M452l92l549j032J943J660
$$ y = [-342, 582, 807, 559, 368, 68, -54, 598, 1092, 110, -1158, -386, 1346, 750, -1619, -1656, 1080, 1852, -977, -2517, 288, 2811, 587, -2588, -1019, 2783, 2240, -1744, -2294, 1458, 2963, -329, -2750, -393, 2406, 961, -2027, -1660, 996, 1469, -560, -1598, -375, 936, 726, -349, -921, -350, 929, 1287, -227, -1626, -298, 2103, 1383, -1936, -2302, 1432, 3029, -765, -3746, -495, 3747, 1486, -3608, -2685, 2945, 3609, -1878, -4009, 906, 4408, 593, -3808, -1392, 3430, 2490, -2194, -2707, 1254, 2821, -117, -2326, -736, 1537, 1255, -534, -1296, -458, 1038, 1536, 8, -1887, -839, 2360, 2455, -1607, -3305, 1033, 4493, 563, -4705, -1958, 4672, 3603, -3893, -4922, 2683, 5887, -1099, -6269, -571, 6198, 2362, -5290, -3569, 4349, 4843, -2475, -4932, 1111, 5000, 708, -3929, -1709, 2743, 2351, -1198, -2230, -287, 1373]
1055A373j65j392j520L82K769J268l253l152L036N066j989o678K11P791J975q198
1071b476m586P602P066o216r260L863J0642j018j1022k011J0342M770q585o761
1085g650O262P892l653p947J197P199P11n831k066L982K588k163k406L55J375
1100a55R53K52j542k229J227M327J65n781k288O532N022o072p672M518R819k095
1116D981j1180r54J1390L945j0687o791Q994R038o691j0529L977J1281r51j0887
1130e064j787R788M222p634n660N138O100k548n468L95L828P40j860j019k16J08
1146i37J732J445k432l321K466N350j424o872jQ260K270q733m716Q564P417p392
1162A676r936N173J1730k381j2703j049J2313M166j0895o753Q633Q496n803q943
$$ y = [1373, 1208, -184, -1704, -1322, 1447, 2715, -538, -3690, -654, 4412, 2423, -4255, -4044, 3747, 5722, -2476, -7062, 540, 7606, 1390, -7870, -4007, 6635, 5617, -5405, -7416, 2926, 7696, -889, -7650, -1388, 6504, 2851, -5096, -3899, 3300, 4011, -1820, -3886, 96, 2684, 521, -1885, -1530, -155, 798, 1050, -492, -2721, -1494, 2833, 2998, -2783, -5071, 1461, 6483, 411, -7261, -2743, 7076, 4981, -6199, -7153, 4237, 8182, -2505, -9296, -302, 8736, 2045, -8484, -4507, 6774, 5823, -5064, -6851, 2937, 7159, -475, -6135, -997, 5103, 2555, -2913, -2518, 1310, 2050, 190, -829, -1045, -937, 795, 2240, -192, -3513, -1047, 4303, 2879, -3993, -3994, 4266, 6536, -2197, -6913, 1651, 9068, 1676, -8260, -3087, 8643, 6262, -6441, -7490, 4823, 8989, -1906, -8659, -26, 8470, 2667, -6276]
1176f276L290Q809p89p596p41O236J887m462k263K794J844j417j026L27o05j87
1192a75K126P10l664k178M588M271m478o355L667Q551j632r694o57J0344L383
1207H807r888n892Q634P939o976r670M516J0433k218j0732m63J0067K727q708
1221a424m452O916N620m569n623K740N124j022l750K51K353k11j061P12K2j966
1237c40J21K996l0m347r19N159K157n672l745N771N643m955p227L806Q803j797
1253E424r559m74R681K776r062n045P531O458n871p586L654P684j861p405J52
1268c503O578J112n408j769M339K154l029j822K211J337j605n44J453l69k000
1283h65Q52K632j242l833Q02M729r6n592j114N996K610n804m014N365N437m204
$$ y = [-6276, -2986, 5823, 5034, -2562, -3303, 2933, 4820, 358, -1905, 889, 2733, 1316, 290, 617, 12, -175, 1951, 2661, -1003, -3181, 1407, 5678, 1200, -5155, -1488, 7063, 5431, -4263, -4920, 5424, 8807, -1081, -6973, 1661, 9600, 2624, -7046, -2530, 7903, 5685, -5047, -5510, 4557, 7284, -1424, -5876, 1040, 6660, 2091, -3532, -792, 4332, 3310, -440, -189, 2164, 1953, 892, 1604, 1626, -340, -219, 2777, 2747, -1600, -2519, 2640, 4797, -875, -4620, 1151, 6794, 1839, -5388, -1582, 7221, 5424, -4135, -4609, 5072, 7848, -1214, -6259, 1272, 7730, 1859, -5727, -2073, 5611, 3750, -3655, -3503, 3075, 4187, -1221, -2990, 1349, 3503, 474, -1348, 863, 2200, 595, 51, 1504, 1135, -865, -13, 2619, 1377, -2456, -1654, 3075, 2979, -2613, -3727, 2269, 4879, -925, -4939, 426, 5863, 1659]
1299A659o386K929P104j380p314k69O989J634o478k997N332L747m287m304L004
1314a017M312j931l967J171L544n75k867N14K469n17k076P99J986j086k203J283
1330a61K443j454l057J217L527r69m106L28M509M64m662j286M674K325m245l089
1346c542L774L865k955m318K084M550j250m604L54M320L06m074r21L574J269l130
1362f98j508K723J655k335j597K145J655j906j604J898J686j841j798J807J954
1377B236j795k264J615K489j469k857J139L115p63l321L09L482K55l468p53L413
1393A363J313l160j790K853K210k468k530K019K682j575k850J104K820p36k794
1408a539L50K665k5k534j97K401L88k212n12K113O23k015o96J967P77j969r38
$$ y = [1659, -4727, -1798, 5306, 3926, -3388, -3657, 3332, 4966, -1512, -4509, 823, 4570, 283, -4021, -1017, 3295, 1364, -2603, -1432, 2112, 1537, -1330, -816, 1653, 1136, -940, -141, 1845, 759, -1444, -161, 2282, 828, -2229, -1012, 2515, 1546, -2560, -2232, 2277, 2741, -1921, -3207, 1467, 3792, -453, -3542, 232, 4097, 1142, -3176, -1092, 3458, 2208, -2396, -2042, 2278, 2584, -1490, -2411, 1163, 2432, -698, -2206, 517, 2172, -163, -1760, 385, 2040, 134, -1470, 428, 2114, 273, -1525, 282, 2236, 441, -1823, -208, 2281, 812, -2045, -906, 2209, 1446, -1875, -1566, 1916, 2171, -1297, -2050, 1363, 2676, -484, -2274, 579, 2789, 321, -2209, -190, 2492, 917, -1933, -829, 1991, 1255, -1539, -1189, 1476, 1451, -1083, -1280, 1121, 1509, -703, -1215, 898, 1521, -494, -1190, 777, 1554, -415, -1353]
1425a353J973J063j997j324J958J570j904j914J749K214j537k512J192K765p88
1440A155k929L11L012J83k966o69K803J117k538j492K180J732j805j877J402J879
1456A498j082j817P96J676o46j576N65J449n59j396O19J439o47j529O70J730o19
1473E71j927M77K181k42k381j24K507N02k550r61K396J375k219j759J870K029
1489A745j488k191J087K270o66k190L73K103q4j886m4J730J35j603j44J496R6
1506G39j541j39J599J17j727k71J855M45j969p06K041J083j966j368J869J764
1522A825j590j993J293K217r01k302N12K267k15k197j37J987K81j835l96J639
1538D55L92j513l50J530L30j545k80J742M03j881n43K078Q45k183j247K196J661
$$ y = [-1353, 620, 1683, -314, -1638, 320, 1890, -14, -1928, -179, 2035, 498, -2014, -822, 1943, 1155, -1774, -1463, 1549, 1732, -1234, -1903, 900, 2017, -521, -2013, 167, 1899, 94, -1783, -381, 1498, 416, -1401, -605, 1071, 425, -1151, -586, 863, 304, -1092, -473, 966, 319, -1210, -540, 1190, 571, -1356, -879, 1302, 1060, -1321, -1445, 1062, 1564, -986, -1947, 449, 1824, -395, -2154, -284, 1745, 257, -1934, -847, 1423, 757, -1433, -1060, 1043, 959, -927, -971, 759, 894, -709, -853, 643, 739, -802, -941, 658, 775, -952, -1223, 632, 1077, -892, -1598, 443, 1526, -440, -1808, 61, 1825, 235, -1758, -465, 1752, 851, -1451, -939, 1328, 1113, -1084, -1221, 766, 1047, -788, -1184, 455, 847, -666, -1016, 514, 844, -701, -981, 761, 1164, -717, -1260, 818, 1663, -520, -1767, 429, 2090]
1555B090k099k180J796K547j420k914Q81L079l14l082k62K959P98k607j151K253
1571C74J423j807j460J427J401j127j237R64R77r83q21J099P14j374p66J641R72
1588A417j891j361K068J877k025k461J841L057j411l531P77L899n5m050p63L927
1604A315J570l627k235L098K804k456l085J746L192j033l045M72K747m8k360j50
1620a095J926J47j633jJ432l09j428N63J650p81k001Q88K540p04k984L98L549
1637B157K69l862r98M024J916l887k831L427L608k817m283J871M617r55m736j8
1653b498M509Q96m048j514L523K056k778k116K231K194j595j893J318J596j156
1668G25j280J216R43j551r43J831J000k325j434K573K006k698k720K658L578k122
$$ y = [2090, -9, -2189, -393, 2154, 734, -2180, -1299, 1780, 1466, -1616, -1878, 1081, 1879, -728, -1879, 374, 1797, -10, -1470, -43, 1358, 231, -1006, -42, 935, -48, -869, 230, 944, -430, -1196, 445, 1417, -474, -1835, 233, 2110, 85, -2376, -535, 2522, 1111, -2420, -1643, 2256, 2201, -1849, -2612, 1315, 2885, -742, -2977, 121, 2925, 469, -2616, -870, 2322, 1289, -1756, -1284, 1463, 1415, -945, -1095, 831, 978, -655, -656, 776, 467, -961, -398, 1252, 471, -1530, -642, 1898, 1194, -1790, -1392, 2157, 2426, -1436, -2434, 1590, 3506, -381, -3212, 215, 3823, 1006, -3277, -1406, 3211, 2256, -2480, -2498, 2011, 2907, -1141, -2655, 868, 2924, 146, -1970, 261, 2455, 860, -1033, 285, 1881, 725, -555, 661, 1604, 53, -890, 941, 1941, -384, -1818, 755, 2761, 63, -2657, 1, 3579, 1457]
1684A457m203J610M907n64n125l77N290J513m989k575M417L349l684m111K600
1699d85M293j718m420P03M062M2l561n17L042Q54k323o57K004N90j575j06J665
1716A893j89j855M51K263o00k951K74L401J8m063r14M264J742m373k816M107L844
1733D496l393m644K678N402j387n572L16N682R21n187j985M514K661l719l276
1748b493K629L231j914l220J038K682o63k248M46J749m66j286Q41J219j132j136
1764g23J700J556j949k064K143K776k048l681J505M314r07m997k66N111J293n141
1780a378k520M614L529l851m274K927M830j739m902P51M849K96m376j058L758
1795A456J582l056j895K230J777j711j567J200J049j143o89J248L22j640k22K129
$$ y = [1457, -2746, -1136, 3771, 3207, -1918, -2295, 2995, 4508, -481, -3056, 1361, 4710, 1026, -3085, -485, 3808, 2090, -2330, -1627, 2435, 2477, -1084, -1601, 1441, 2295, -28, -685, 1319, 1909, 334, 228, 1893, 1704, -151, 300, 2563, 1963, -988, -714, 2687, 2705, -1358, -2272, 1992, 3734, -639, -3455, 652, 4496, 1103, -3541, -863, 4539, 3152, -2420, -2104, 3578, 4499, -688, -2673, 1841, 4502, 783, -2493, 136, 3367, 1453, -1767, -729, 1953, 1290, -958, -512, 1237, 771, -515, 326, 1545, 413, -723, 977, 2533, 584, -1480, 663, 3439, 1391, -2290, -785, 3529, 2622, -2375, -2641, 2470, 3763, -1378, -3898, 716, 4245, 394, -3880, -953, 3877, 2138, -2764, -2013, 2836, 3132, -1244, -2302, 1456, 3038, -18, -1913, 317, 2094, 383, -1184, 16, 1065, -78, -767, 481, 803, -837, -1059, 1070]
1811A070L96k543p85K923J419l031k140K984K909k657l630K058M246j294m673
1826b748L25M828O95m719j689M232K563l567l186K657L479j810l524R78L253l94
1842A373k921n1K489K61k075k71J806K42j532K3J516j41j522L85J802m33k175
1859a224L21K544j00l008n22L138J062l276j894K966K510k581l064K007L518j221
1875A176l584O66L743K04l463o57L290J297k844j686K304J857j904k083J221J777
1891A314j056j769O56J411p19j283P77J251p64j159J067J558q65j546J029K019
1907A921p36k146N45K379k99k689k78K563M94k859j264K458J537k378k070J882
1923i40K400j316k415J014K686k78k274J99K385L29j966m18J818N28j721q04J333
$$ y = [1070, 1466, -1077, -1862, 1061, 2480, -551, -2691, 293, 3202, 545, -3085, -1027, 3219, 1925, -2748, -2423, 2405, 3100, -1619, -3308, 924, 3487, -80, -3266, -609, 2870, 1060, -2464, -1486, 1767, 1373, -1548, -1599, 890, 1151, -924, -1195, 611, 853, -679, -656, 860, 719, -803, -418, 1384, 951, -1224, -903, 1641, 1541, -1467, -1989, 1149, 2211, -1065, -2959, 7, 2517, -64, -3128, -1121, 2397, 1176, -2408, -1742, 2001, 2205, -1258, -1915, 1375, 2672, -172, -1858, 446, 2303, 399, -1684, -463, 1314, 258, -1511, -855, 556, -163, -1446, -669, 582, -182, -1341, -274, 1284, 419, -1127, -98, 1921, 1185, -961, -416, 1963, 1664, -1025, -1303, 1260, 1754, -1105, -2369, 89, 1626, -752, -2822, -940, 1460, 144, -2271, -1257, 1429, 1151, -1123, -924, 1461, 1790, -176, -594, 1224, 1752, 31, -773, 560]
1940E60N57j509r08J071O03j271q27J153P94j146p84J374J198j081j083J345J664
1957A710q91j652Q32J952n19k095L3J925J7k198o64J746O05j896j085J523J178
1974E21j328j250J209J573p05j279Q24J608l12j267M06J367k25j333P5J166k26
1991H24j469j76J190l3j507l78J301M12j299n63J334Q89j010p64J197J179p56
2008C71j024Q14J265n63j281L44J189l31j390n8J100o9j251k27J019J92j048k23
2026a171J094M37r44l39J148O76r25o23J019Q88q65j008P24J058o74j292L87J207
2044G97l34j369K2J270J72j228l26J173N43r36n60Q66O96o46o39N41N99m62n78
2063c99L90M71m51m61M29M83n02m92N78O50n45p01N91R27m86j051L40J173j99
$$ y = [560, 1117, -392, -1300, -229, 374, -897, -1724, -571, 223, -923, -1707, -333, 865, -216, -1299, 46, 1710, 819, -833, -1, 1951, 1432, -663, -630, 1295, 1312, -886, -1550, 196, 801, -1095, -2180, -657, 521, -807, -2057, -848, 725, 20, -1259, -435, 1173, 861, -406, 0, 1367, 1142, -191, -116, 1050, 824, -645, -821, 369, 336, -1171, -1549, -248, 164, -1135, -1698, -364, 525, -485, -1249, -52, 1127, 371, -653, 161, 1426, 863, -418, -74, 1115, 784, -606, -664, 436, 367, -884, -1111, -92, 100, -948, -1171, -77, 360, -584, -923, 225, 901, -24, -647, 372, 1260, 395, -613, 111, 1169, 495, -797, -410, 797, 463, -906, -884, 386, 558, -670, -996, 177, 720, -216, -776, 90, 786, 140, -499, 42, 641, 179, -399, -9, 462, 11, -450, -21, 462, -40, -532, 46, 696, 151, -550, 41, 968, 482, -569, -229, 944, 745]
2082G45j367j39J277K79j367o46J150Q41j010j004Q32J225m35j089L70J241N5
2099I58r38j13Q85K57p31l39M11J30n19k64J80j11m59K5L90j82n45K63Q31j3p55
2120f39J82J217L35j011l12J249P35j117j049Q44J115q58j596J77J296j81j608
2137a221m10J224N35j048o65R46R87l95n90N47R23jm18J72M55m2k88J7m6m46k55
2158a9K45j45q39m07O74L64r01p32Q95J165n11j111O24J701J42j391j31J675P26
2177B024j368j005J060J077r97j521K76J158l72j429k76R55K61q35l78O46N40
2194a84j75r6L74K91P8K99L03k38l06M73N61n68j044J92J024k89j557l96J305
2213D7N22j470j016J209J362q73j428P48J855m5j599n9J764P05j387q93J098J068
$$ y = [745, -622, -761, 516, 795, -572, -1218, -68, 773, -237, -1241, -409, 816, 381, -708, -338, 903, 958, 20, -93, 792, 1049, 318, -21, 390, 520, 1, -263, -83, -194, -653, -628, -238, -420, -965, -702, 129, 116, -639, -457, 760, 1095, 84, -228, 1021, 1756, 639, -410, 434, 1549, 691, -905, -728, 568, 387, -1221, -1631, -407, 128, -920, -1585, -639, 348, -47, -637, -90, 833, 832, 414, 586, 1041, 999, 711, 728, 682, 236, -19, 226, 81, -758, -1165, -491, -127, -1028, -1760, -865, 300, -211, -1322, -698, 1003, 1145, -246, -377, 1298, 2024, 656, -349, 711, 1788, 791, -730, -454, 704, 332, -1097, -1373, -418, -157, -992, -1370, -724, -184, -359, -455, -81, 210, 288, 587, 890, 652, 346, 819, 1380, 812, -232, -40, 984, 695, -862, -1258, 47, 569, -901, -1917, -708, 654, -219, -1647, -899, 956, 911, -688, -747, 1017, 1722, 335, -558, 540, 1608]
2231A608p81j237J95Q66j73q73k33L59Qk66J9O5k09K6N46J79n34r8Q98M90q05
2252E0n70R82R79q78j342O51J582m21j970k39J841O21j849j216J369J490r58j614
2270a492N33J631o9j372p9J301L80j008l98Q87N47o47n66M19M48k43l28N1l5j89
2290b29K40L65m49p93L66J167q8j422l02J511P94j343j116J105J410p80j508N46
2308e26J609k80j676KJ753L73j692p76J517J151j137j356O58J328k33j124o9P33
2326B55P8m86L6K81l03l50M73N03m91o17N10Q12l33p57M24R30l33r68L86J286
2346A336k50j566j24J687N04j781j178J351J430j047j703M61J601q9j350j4J266
2363E34K46r44m9J166L22r61l10J016N28q01o69M80M40n02m77K49J5o73j27P99
$$ y = [1608, 827, -410, -215, 651, 478, -395, -628, -269, -261, -527, -508, -443, -652, -626, -80, 99, -435, -533, 365, 855, 50, -520, 462, 1441, 563, -779, -128, 1454, 1033, -937, -1176, 665, 1286, -563, -1779, -410, 1080, 122, -1492, -959, 672, 603, -769, -848, 453, 833, -175, -573, 314, 861, 214, -352, 67, 515, 272, -56, -5, -40, -229, 11, 376, -73, -866, -500, 667, 579, -843, -1145, 366, 1160, -183, -1299, -194, 1216, 436, -1072, -526, 1083, 803, -873, -871, 882, 1255, -437, -1213, 304, 1455, 318, -1038, -380, 948, 715, -409, -478, 255, 333, -153, -117, 164, -139, -489, -16, 487, -4, -621, -111, 701, 368, -389, 35, 965, 632, -336, 50, 1336, 1086, -480, -604, 1083, 1587, -194, -1372, -21, 1409, 362, -1341, -880, 721, 632, -718, -732, 534, 780, -164, -213, 953, 1275, 314, 4, 1020, 1548, 747, 78, 558, 998, 496, 19, 268, 283, -390, -517, 282]
2383B82J45j095m78J270J005q86j108Q90J536k41j254K34J365K6j251j38J189
2400A491P3j497o02J221N83j391j203Q51J201n64j191K92J145J05o05K32P81l0
2418H92m34M38P86k93r25J81R37j69j202l21P63P4j021l88P53J37r42k62J145
2437A49N86j031o16J260J247o79j151O26J407j36j221q9R65kj065k84P20n7j098
2456d69l10Q95K91j002n28R11P75n52n57O33P76k66m18N33N41n06n75N70O56o77
2476G21j073K95R64l09j270j40J000J81r74k89R25M06p46l03R73N89p65n75Q41
2495D51Q57o21r70L87R14k70r77j4O56j01p08RO11j30o96J28Q39L0q26q7R41L50
2517G73p86l85P41M49o42n16N87M73o91o29O02P14o03r10M23J044j89j034qJ032
$$ y = [282, 427, -668, -1146, 124, 1129, 243, -865, 25, 1561, 1320, 66, 300, 1665, 1691, 440, 302, 1491, 1564, 67, -535, 686, 1269, -122, -1325, -474, 727, 163, -1028, -736, 409, 514, -91, 141, 922, 892, 458, 896, 1682, 1389, 464, 645, 1582, 1413, 211, -110, 653, 727, -294, -682, 71, 208, -734, -996, 149, 735, -296, -912, 348, 1595, 916, -235, 391, 1798, 1662, 441, 352, 1317, 1315, 250, -34, 686, 629, -469, -779, 116, 407, -595, -1123, -212, 563, 11, -546, 87, 863, 597, 179, 712, 1253, 747, 172, 742, 1398, 721, -352, -57, 907, 598, -672, -812, 188, 369, -605, -894, 31, 437, -309, -612, 361, 950, 185, -390, 451, 1308, 687, -283, 104, 1018, 748, -229, -243, 413, 312, -396, -387, 224, 94, -602, -474, 365, 395, -431, -518, 423, 773, -13, -398, 343, 792, 150, -366, 221, 694, 3, -626, -24, 690, 87, -823, -400, 644, 455, -579, -587, 445]
2537D45K50q50k89P39L29o36l47N67L18o38m36N39M63n23n75L99O22k87n00K56
2557a54N34j77m04K97N13l13n85L24P19k94r17K3Q75M9r50l37P78M16p34m62O49
2578a50N84n20n40N91P51l89p04L30Q48j06q08q3O72J18o66k66L93R6m62j57L87
2599h1O9m81q3N46K32m60k04N77M22l97l29M64M46m12m52L72M86m54o99K38O82
2620D82k53q80l9P74J57p53k88O74M02m67l28N23M66l42l65M13M78l13m81K30
2640I0M77k28n34M8L85j59m65O8L49j27m46J09N37l8n41QO61K08n42k09N79L86
2662F16m60l87M01M21l87n03K66M73l01o02J17N37n9n78o9N16J26m25j10M38J63
2683A93l41p1M23J69m12j55M47K42m36l20L62L42l82m38K85L88k96m96K25N26
$$ y = [445, 695, -155, -444, 295, 624, -12, -359, 208, 526, -112, -548, -9, 454, -69, -644, -245, 377, 90, -410, -154, 380, 203, -201, 96, 609, 296, -289, 35, 754, 460, -457, -434, 441, 490, -460, -797, -19, 397, -337, -799, -150, 434, -86, -626, -35, 716, 327, -377, -47, 801, 695, -113, -196, 476, 594, -72, -338, 55, 151, -311, -468, -81, -12, -493, -576, -30, 202, -258, -462, 115, 537, 140, -189, 275, 721, 309, -143, 229, 715, 261, -438, -200, 482, 229, -651, -690, 84, 241, -512, -800, -126, 276, -191, -519, 4, 470, 128, -237, 176, 654, 341, -140, 90, 567, 339, -195, -147, 238, 79, -386, -318, 31, -96, -542, -433, 104, 66, -475, -467, 194, 402, -140, -349, 230, 616, 156, -231, 170, 591, 204, -299, -33, 440, 139, -463, -346, 191, 132, -446, -515, 1, 127, -298, -408, 30, 193, -148, -219, 204, 373, -39, -194, 253, 495, 59, -261, 101, 443, 61, -377, -92, 296, 0, -496, -271, 255]
2703B55j83n79R1O46N5o04j28O00K94m54k98M00L60l13l29K45L04k50l41J94K96
2724B61k11l55J30L21j47l28J24L37j27l33J74M25j13m54R9N90Kn79j22O13K40
2745E47n87l59M81M37m53n22K83N52k53n87J02N87j1n46o4N12J79m04j72L52K11
2766B85k50j65K53J17k23r7K22Q0l07q1K99P8l76j59L90K08m33l29M52M56l66
2787E4n68L05O75j18p00qP37J61o68k82N81L83n09m75L71M88k74n63J48M95l0
2808B03m42n8L42R4k01l1J40j5r2J57J60j96k43K27L68k02m71J17N16n6n90n4
2830c27N89J42o48k80O36M40n90n77M85P65k78p80O4P92J76o53k84M84L49l44
2850A61l35K12K51j92k36J49J83j62j73J13J52q4p3J17M1j65K5L50L6m49j50N59
$$ y = [255, 72, -507, -416, 230, 285, -319, -447, 153, 447, -7, -305, 95, 455, 142, -187, 58, 362, 112, -229, -35, 261, 50, -305, -175, 146, -1, -329, -205, 132, 5, -328, -154, 271, 158, -296, -197, 393, 395, -184, -306, 307, 547, -40, -399, 82, 519, 66, -456, -173, 379, 126, -461, -359, 228, 217, -329, -393, 119, 298, -106, -278, 74, 285, 35, -130, 123, 240, 17, -80, 142, 222, -85, -166, 133, 211, -165, -324, 66, 274, -159, -488, -36, 420, 54, -514, -209, 466, 348, -352, -360, 377, 538, -130, -412, 169, 552, 43, -432, -61, 427, 153, -410, -262, 233, 203, -239, -297, 45, 139, -62, -93, 47, 32, -60, 97, 257, 61, -182, 45, 413, 211, -260, -143, 373, 317, -273, -327, 262, 404, -244, -524, 112, 552, -38, -615, -130, 635, 357, -423, -359, 433, 609, -44, -328, 156, 505, 161, -174, 38, 289, 97, -139, 10, 193, 31, -142, -29, 123, 39, -34, 83, 124, -41, -16, 334, 370, -79, -229, 330]
2872C30L82n57n99M04P44k20q23m5P58J97o91l23N81L86m90m28M51N27l43n67
2892c26K33O42j9n87j32M58K38k82k49Q1R7mL2%k18j19K53K78k27l93J45M77j9
2915C59m67j5M90J11n24j35N61K52o01m34N45O16m41q01J90Q17O5p70k65N85L65
2936E03l87l39K44L06j84k23K09J99k19k02J80K21j58k01Q6J23r7o3J57J6k99
2957a28o4M29J98m73l94M32N87k76o88Q4O83J13o40k29N24K71m61l05M02L45l90
2978B0m02L20M93k06n47Q6N11O7m13j36K73J34j73m7J22p8j87J22K64j17m03M4
3000b53M44M0m15j25M05J75l46j76L44K42l77k60L88L75l75m84K53N68j46o10
3020c33l9N28J31m48j88L36J77k74j29K92J19l00j29L53K30l18k55K62L19k06
$$ y = [330, 712, 155, -444, -40, 704, 484, -339, -384, 374, 571, -120, -443, 138, 524, 34, -394, 57, 584, 241, -326, -93, 549, 530, -57, -189, 269, 507, 225, -24, 57, 154, 150, 182, 182, -36, -155, 98, 376, 149, -244, -99, 378, 359, -108, -123, 367, 478, -46, -181, 380, 632, 31, -403, 142, 758, 317, -484, -294, 523, 588, -182, -447, 138, 503, 116, -223, 21, 327, 143, -80, 129, 328, 109, -93, 87, 308, 150, -51, 35, 158, 61, -2, 155, 171, -128, -192, 237, 435, -38, -432, 0, 587, 311, -377, -293, 390, 503, -137, -366, 158, 429, -32, -337, 65, 410, 20, -382, -62, 431, 225, -322, -236, 275, 342, -71, -207, 66, 200, 27, -20, 102, 24, -163, -41, 223, 106, -297, -253, 191, 231, -184, -309, 96, 271, -75, -251, 93, 335, -42, -302, 86, 461, 86, -398, -145, 423, 277, -333, -372, 156, 287, -161, -349, -13, 164, -110, -239, 53, 172, -128, -257, 96, 326, 8, -247, 15, 334, 128]
3040A28k92J39K51j60k50J50K47k30l27J91L79j31m68L6M89J05m35j53M10K25
3060C04l00j66K94J99k70j86K92K42l23l24K41L49k34m15P6L69n8l68J7L13j2
3081D0k97M4L88J9l50k7M51J81l92k03L58K72k89l18J74K60k38k88J21K29k11
3102g6l23J52L42j18l58R0M16N3l00oL86R4k53l8L01R0l38j37K99J23m06k93K44
3125e6K40k92l65J58L10j15k86J53L38k7k69J54M07J3l47L4M09P7l93j86K85J16
3147C58l36k74J77J38k93k26J86K35k12k22K34L59p6k42J52L70K5k47M8K71k2
3168D03l01k1K23q1l81r3K62K9l76j74L08J84k49j71K91K96j39j83K61L35j34
3189B89k94J50L65j10m14o4L16Nl86j89K12R4k40j39K08J58j70p5K65K10j29j26
$$ y = [128, -164, -25, 226, 66, -184, -34, 213, -17, -344, -153, 226, 95, -373, -337, 152, 257, -178, -331, 79, 304, 4, -162, 132, 331, 61, -125, 167, 409, 86, -238, 3, 352, 118, -297, -221, 148, 90, -278, -261, 52, 40, -257, -213, 175, 194, -156, -183, 268, 449, 57, -146, 212, 484, 195, -123, 51, 311, 73, -215, -94, 135, -76, -399, -247, 95, -23, -381, -291, 125, 178, -122, -128, 258, 352, 99, 61, 362, 452, 114, -23, 276, 399, -7, -300, -56, 184, -108, -473, -315, -5, -120, -406, -253, 85, 58, -211, -57, 350, 363, 16, 50, 459, 536, 143, -43, 242, 358, 22, -252, -75, 63, -230, -456, -270, -35, -247, -469, -235, 124, 48, -194, -42, 328, 353, 106, 154, 425, 403, 102, 81, 304, 223, -158, -251, 11, 40, -336, -510, -202, -18, -267, -438, -147, 149, 10, -173, 88, 423, 289, -5, 145, 510, 400, -14, -78, 238, 243, -143, -332, -120, -26, -266, -405, -197, -39, -209, -284, -19, 191, 62, -64]
3211f4K25K30j27j98J21J69j74k26P3J30k07k94J06K74j19l53M3M31R9l28p9L98
3233A30K31k31j81K58K42k14k90J49K31j97l51K1K57n4l03m9K38O3j46JJ97P0
3255G2o5O3K27Pj99L0K39Ml13j36K07O5l26k30K05J59k50k39K28L13j38k68J93
3278a52M42K0l22OL91J56l01k04J94J36k43k38M7R1j77j91P1J20j04j17J39J81
3300e5k3n2J76K02m9o6J67J88j45k50J14K25j88m07m0K81k4m20j83L25J96k73
3322c01k23K86L57j02k19J81L91Pk65K0K82M1k69j27J17K9k17j47L3kj49l8R5
3345b20Nj15N9K09P7j42K8L06J30j96j06K84J83k59k87J58K51k13m15K9L02l4
3367C4l93r1L26J61k65j69K69K80j16j84J47K68l2j95M9J72k8j58l1P0o8j20K9
$$ y = [-64, 161, 391, 264, 66, 187, 356, 182, -44, 29, 159, -48, -342, -236, 38, -81, -434, -391, 40, 139, -189, -268, 130, 361, 130, -51, 207, 449, 235, -55, 94, 325, 128, -223, -202, 55, 1, -302, -351, -113, -50, -196, -195, 2, 72, 7, 70, 297, 304, 105, 135, 374, 378, 65, -71, 136, 201, -125, -355, -150, 9, -241, -480, -252, 61, -77, -345, -152, 290, 310, -12, -6, 385, 541, 240, 36, 230, 366, 123, -115, -68, 23, -154, -345, -274, -154, -258, -375, -236, -55, -78, -130, 46, 248, 199, 133, 300, 488, 343, 93, 207, 432, 244, -163, -203, 78, 54, -366, -549, -224, -28, -301, -524, -238, 119, 17, -202, -21, 370, 377, 112, 132, 414, 455, 186, 59, 176, 205, -12, -159, -126, -128, -277, -315, -220, -215, -330, -271, -62, 15, -127, -99, 207, 337, 141, 35, 319, 502, 243, -44, 114, 365, 152, -263, -234, 68, 34, -359, -450, -124, 37, -228, -397, -128, 152, 36, -148, -1, 267, 235, 40, 89, 261, 233, 75, 44, 114, 46, -74, -45]
3390d5N6j17j38J06J54j13j77J05K78k6k56K2L20Q3k83q6K94J57k72k23K02K55
3412B96j81l30Q6K93j9l38m4K42Q0k12p5J71Q2j15n8J44O4j23m2J42Q8j32p3J34
3436H0Q2j49q4J51Q0j74j50J69J60j84k59J55K61r1k94K3L02O9k58q8K62J55k03
3459A5j23J78J60j45j85J29J62j25k06N6J75p1j73J3J24k3j11O1J32m0j27J00
3481b4K07k6k16K0K55N5k64r0J91J03k25j71J33J47j69j76J28K02r2k20R9K73
3503A40J6k11RK34P8j76p5J45N0j78o6J10kj78q2J31O5j66q4J59J44q6r7J59J87
$$ y = [-45, 11, -106, -244, -138, 16, -97, -274, -169, 109, 83, -173, -151, 169, 252, -31, -117, 177, 334, 62, -161, 41, 296, 115, -215, -129, 164, 145, -193, -237, 5, 85, -127, -202, -31, 51, -64, -122, 22, 86, -37, -79, 63, 151, 19, -54, 80, 162, 13, -71, 80, 160, -14, -164, 5, 165, -19, -278, -123, 138, 47, -247, -224, 78, 147, -111, -199, 63, 218, 15, -108, 70, 230, 85, -100, 29, 191, 66, -140, -84, 91, 20, -153, -140, -16, -39, -150, -89, 43, 3, -124, -24, 183, 157, -59, -39, 216, 271, 7, -83, 108, 211, -14, -185, -52, 95, -74, -250, -122, 80, -12, -232, -133, 140, 156, -55, -46, 188, 266, 90, 15, 160, 210, 32, -34, 76, 74, -104, -186, -55, 10, -156, -240, -81, 63, -23, -120, 39, 226]
$$ [...]
8191E
##END NTUPLES=NMR FID
##END=
