##TITLE=1H ikalashn
LY hexene-1 B2
16.4.2024
##JCAMPDX= 6.0         $$ Bruker NMR JCAMP-DX V2.0
##DATA TYPE= NMR FID
##DATA CLASS= NTUPLES
##ORIGIN= UXNMR, Bruker Analytische Messtechnik GmbH
##OWNER= root
$$ TOPSPIN		Version 1.3
$$ 2024-04-16 14:07:25.218 +0400  Irina@DPX200
$$ Compression mode = diff/dup
##.OBSERVE FREQUENCY= 200.13120078
##.OBSERVE NUCLEUS= ^1H
##.DELAY= (6, 6)
##.ACQUISITION MODE= SIMULTANEOUS
##.ACQUISITION SCHEME= undefined
##.AVERAGES= 8
##.DIGITISER RES= 18
##SPECTROMETER/DATA SYSTEM= spect
##.PULSE SEQUENCE= zg
##.SOLVENT NAME= CDCl3
##.SHIFT REFERENCE= INTERNAL, CDCl3, 1, 16.00952
##AUDIT TRAIL= $$ (NUMBER, WHEN, WHO, WHERE, WHAT)
$$ ##TITLE= Audit trail, TOPSPIN		Version 1.3
$$ ##JCAMPDX= 5.01
$$ ##ORIGIN= Bruker BioSpin GmbH
$$ ##OWNER= Irina
$$ $$ F:/spectra/data/iren/nmr/1H/4/audita.txt
$$ ##AUDIT TRAIL=  $$ (NUMBER, WHEN, WHO, WHERE, VERSION, WHAT)
(   1,<2024-04-16 14:06:58.218 +0400>,<Irina>,<DPX200>,<TOPSPIN 1.3>,
      <created by zg
	started at 2024-04-16 14:06:20.359 +0400,
	POWCHK disabled, PULCHK disabled
       configuration hash MD5:
       BE 6D 3F 07 2A EA 11 49 91 17 2B D3 AF B3 58 0D
       data hash MD5: 16K
       62 58 A6 7C AA D5 30 FE A4 B8 E7 B6 76 EF 56 F3>)
$$ ##END=
$$ 
$$ $$ hash MD5
$$ $$ 97 5E 65 1F 9F 66 F0 23 93 16 3D 39 10 45 D7 81
##$RELAX= 
##$RELAX= 
##$RELAX= 
##$RELAX= 
##$RELAX= 
##$RELAX= 
##$RELAX= 
##$RELAX= 
$$ Bruker specific parameters
$$ --------------------------
##$DU= <F:/spectra>
##$EXPNO= 4
##$NAME= <1H>
##$PROCNO= 1
##$TYPE= <nmr>
##$USER= <iren>
##$AMP= (0..31)
100 100 100 100 100 100 100 100 100 100 100 100 100 100 100 100 100 100 
100 100 100 100 100 100 100 100 100 100 100 100 100 100 
##$ANAVPT= -1
##$AQSEQ= 0
##$AQ_mod= 1
##$AUNM= <au_zg>
##$AUTOPOS= <>
##$BF1= 200.13
##$BF2= 200.13
##$BF3= 200.13
##$BF4= 200.13
##$BF5= 200.13
##$BF6= 200.13
##$BF7= 200.13
##$BF8= 200.13
##$BYTORDA= 1
##$CFDGTYP= 0
##$CFRGTYP= 5
##$CHEMSTR= <none>
##$CNST= (0..63)
1 1 145 1 1 1 1 1 1 1 1 1 1 1 1 1 1 1 1 1 1 1 1 1 1 1 1 1 1 1 1 1 1 1 
1 1 1 1 1 1 1 1 1 1 1 1 1 1 1 1 1 1 1 1 1 1 1 1 1 1 1 1 1 1 
##$CPDPRG= <>
##$CPDPRG1= <>
##$CPDPRG2= <>
##$CPDPRG3= <>
##$CPDPRG4= <mlev>
##$CPDPRG5= <mlev>
##$CPDPRG6= <mlev>
##$CPDPRG7= <mlev>
##$CPDPRG8= <mlev>
##$CPDPRGB= <>
##$CPDPRGT= <>
##$D= (0..63)
0 2 0 0 0 0 0 0 0 0.06 0 0.03 0 0 0 0 0.0002 0 0 0 0 0 0 0 0 0 0 0 0 0 
0 0 0 0 0 0 0 0 0 0 0 0 0 0 0 0 0 0 0 0 0 0 0 0 0 0 0 0 0 0 0 0 0 0 
##$DATE= 1713262015
##$DBL= (0..7)
120 120 120 120 120 120 120 120 
##$DBP= (0..7)
150 150 150 150 150 150 150 150 
##$DBP07= 0
##$DBPNAM0= <>
##$DBPNAM1= <>
##$DBPNAM2= <>
##$DBPNAM3= <>
##$DBPNAM4= <>
##$DBPNAM5= <>
##$DBPNAM6= <>
##$DBPNAM7= <>
##$DBPOAL= (0..7)
0.5 0.5 0.5 0.5 0.5 0.5 0.5 0.5 
##$DBPOFFS= (0..7)
0 0 0 0 0 0 0 0 
##$DE= 6
##$DECBNUC= <off>
##$DECIM= 32
##$DECNUC= <off>
##$DECSTAT= 4
##$DIGMOD= 1
##$DIGTYP= 9
##$DL= (0..7)
0 120 120 120 120 120 120 120 
##$DP= (0..7)
150 150 150 150 150 150 150 150 
##$DP07= 0
##$DPNAME0= <>
$$ [...]
##$SW= 20.0189187932491
##$SWIBOX= (0..15)
0 0 2 0 0 0 0 0 0 0 0 0 0 0 0 0 
##$SW_h= 4006.41025641026
##$TD= 16384
##$TD0= 1
##$TE= 300
##$TE2= 300
##$TE3= 300
##$TEG= 300
##$TL= (0..7)
0 120 120 120 120 120 120 120 
##$TP= (0..7)
150 150 150 150 150 150 150 150 
##$TP07= 0
##$TPNAME0= <>
##$TPNAME1= <>
##$TPNAME2= <>
##$TPNAME3= <>
##$TPNAME4= <>
##$TPNAME5= <>
##$TPNAME6= <>
##$TPNAME7= <>
##$TPOAL= (0..7)
0.5 0.5 0.5 0.5 0.5 0.5 0.5 0.5 
##$TPOFFS= (0..7)
0 0 0 0 0 0 0 0 
##$TUNHIN= 0
##$TUNHOUT= 0
##$TUNXOUT= 0
##$USERA1= <user>
##$USERA2= <user>
##$USERA3= <user>
##$USERA4= <user>
##$USERA5= <user>
##$V9= 5
##$VALIST= <valist>
##$VCLIST= <CCCCCCCCCCCCCCC>
##$VD= 0
##$VDLIST= <DDDDDDDDDDDDDDD>
##$VPLIST= <PPPPPPPPPPPPPPP>
##$VTLIST= <TTTTTTTTTTTTTTT>
##$WBST= 1024
##$WBSW= 25
##$XGAIN= (0..3)
0 0 0 0 
##$XL= 0
##$YL= 0
##$YMAX_a= 258495
##$YMIN_a= -222478
##$ZGOPTNS= <>
##$ZL1= 120
##$ZL2= 120
##$ZL3= 120
##$ZL4= 120
##$ABSF1= 10
##$ABSF2= 0
##$ABSG= 5
##$ABSL= 3
##$ALPHA= 0
##$AQORDER= 0
##$ASSFAC= 0
##$ASSFACI= 0
##$ASSFACX= 0
##$ASSWID= 0
##$AUNMP= <proc_1d>
##$AXLEFT= 0
##$AXRIGHT= 0
##$AXTYPE= 0
##$AXUNIT= <>
##$AZFE= 0.1
##$AZFW= 0.1
##$BCFW= 1
##$BC_mod= 2
##$BYTORDP= 1
##$COROFFS= 0
##$CY= 7568.61572265625
##$DATMOD= 1
##$DC= 2
##$DFILT= <>
##$DTYPP= 0
##$F1P= 17.4489326093798
##$F2P= -7.48496080290002
##$FCOR= 0.5
##$FTSIZE= 32768
##$FT_mod= 4
##$GAMMA= 1
##$GB= 1
##$INTBC= 1
##$INTSCL= 1
##$ISEN= 128
##$LB= 0.15
##$LEV0= 0
##$LPBIN= 0
##$MAXI= 945.577
##$MC2= 0
##$MEAN= 0
##$ME_mod= 0
##$MI= -402.1523
##$NCOEF= 0
##$NC_proc= 0
##$NLEV= 6
##$NOISF1= 8.587773
##$NOISF2= 6.764455
##$NSP= 1
##$NTH_PI= 0
##$NZP= 0
##$OFFSET= 16.00952
##$PC= 1
##$PHC0= 197.5566
##$PHC1= -11.79223
##$PH_mod= 0
##$PKNL= yes
##$PPARMOD= 0
##$PPDIAG= 0
##$PPIPTYP= 0
##$PPMPNUM= 100
##$PPRESOL= 1
##$PSCAL= 0
##$PSIGN= 0
##$REVERSE= no
##$SF= 200.13
##$SI= 32768
##$SIGF1= 18.5376
##$SIGF2= -6.396296
##$SINO= 400
##$SIOLD= 32768
##$SREGLST= <1H.CDCl3>
##$SSB= 3
##$STSI= 0
##$STSR= 0
##$SW_p= 4006.41025641025
##$SYMM= 0
##$S_DEV= 0
##$TDeff= 0
##$TDoff= 0
##$TI= <>
##$TILT= no
##$TM1= 0
##$TM2= 0
##$TOPLEV= 0
##$USERP1= <user>
##$USERP2= <user>
##$USERP3= <user>
##$USERP4= <user>
##$USERP5= <user>
##$WDW= 1
##$XDIM= 8192
##$YMAX_p= 0
##$YMIN_p= 0
$$ End of Bruker specific parameters
$$ ---------------------------------
##NTUPLES= NMR FID
##VAR_NAME=  TIME,          FID/REAL,        FID/IMAG
##SYMBOL=    X,             R,               I
##VAR_TYPE=  INDEPENDENT,   DEPENDENT,       DEPENDENT
##VAR_FORM=  AFFN,          ASDF,            ASDF
##VAR_DIM=   8192,          8192,            8192
##UNITS=     SECONDS,       ARBITRARY UNITS, ARBITRARY UNITS
##FACTOR=    0.0002496,     1,               1
##FIRST=     0,             0,               0
##LAST=      2.0444736,     -3,              -2
##MIN=       0,             -222478,         -222478
##MAX=       2.0444736,     258495,          258495
$$ Real data points
##PAGE= N=1
##DATA TABLE= (X++(R..R)), XYDATA
$$ [...]
572a914k461Q151M078n831k109O030J019o400L5O862k019r914N92J0272r74j2649
$$ -1914 -4375 3776 7854 2023 -86 5944 6963 563 598 7460 5441 -4473 -3881 6391 5417 -7232
588g232j258J2990L459j1699m059J1040N078r025m076Q436L314q056k050Q761
$$ -7232 -8490 4500 7959 -3740 -7799 3241 8319 -706 -4782 3654 6968 -1088 -3138 5623
602E623J160j0705k751J0415K986j1227m951R922N820p895n130O767M297n572
$$ 5623 6783 -3922 -6673 3742 6728 -4499 -9450 472 6292 -1603 -6733 34 4331 -1241
616a241k261O159J129o842j14Q324R6r875j511R729J964r863k979R003L141p855
$$ -1241 -3502 2657 3786 -3056 -3170 5154 5250 -4625 -6136 3593 5557 -4306 -7285 1718 4859 -2996
632b996k170P710J145q146j03R894P25j0895j775J1463L213j1382n105R688N695
$$ -2996 -5166 2544 3689 -4457 -4560 5334 6059 -4836 -6611 4852 8065 -3317 -8422 1266 6961
647F961p700m932O503L896n885k786N654J371o203l98P312L49q215p49Q778J483
$$ 6961 -739 -5671 832 4728 -1157 -3943 1711 3082 -3121 -3519 3793 4142 -4073 -4822 3956 5439
663E439q926k521Q229L071o841k422O063J159o218m2P004p35q654J32R999J651
$$ 5439 -3487 -6008 2221 5292 -1549 -3971 2092 3251 -2967 -3009 3995 3260 -5394 -5262 4737 6388
679F388r887l257Q685L994p173l790N791K860m975j111N609Po970k00Q095J226
$$ 6388 -3499 -6756 1929 5923 -1250 -5040 751 3611 -1364 -2475 3134 3141 -3829 -4029 4066 5292
695E292q267k100Q215L345p197m078N391L418m300k109M072J029m251M4N126l92
$$ 5292 -2975 -5075 3140 6485 -712 -4790 601 4019 -281 -2390 1682 2711 -1540 -1496 3630 3238
711C238o108J17P010J089o615j822N835J905m961j624M105L31m392M81N117j011
$$ 3238 -2870 -2753 4257 5346 -1269 -3091 2744 4649 -312 -1936 2169 2500 -1892 -1411 3706 2695
727B695o357L13O950O71o972j587O550K454n356k386M596J813m463j810L964J201
$$ 2695 -3662 -3349 3601 4272 -2700 -4287 2263 4717 -639 -3025 1571 3384 -1079 -2889 1075 2276
743B276m083j078M010O97m582j295M085J266m028j413L800J874k863j317K373
$$ 2276 -1807 -2885 1125 1822 -2760 -4055 30 1296 -2732 -4145 -345 1529 -1334 -2651 -278
758b78N85k320J39K604p44l338M86L427q46m345q9M032L80l680k13L901Q40l099
$$ -278 307 -2013 -1874 730 -14 -3352 -2866 561 -285 -4630 -4719 -687 -307 -3987 -4200 -299 541 -2558
776b558k43L240K39l113K14L617j7m012o14L715P35l978j654L028J903j985j011
$$ -2558 -2801 439 678 -2435 -2221 1396 1379 -2633 -3247 468 1203 -2775 -4429 -1401 502 -1483 -2494
793b494K173J308j276j91J901M03j647L2J925p0k232l73J758m6k028j86J850K79
$$ -2494 -321 987 -289 -480 1421 1824 177 209 2134 2064 -168 -541 1217 1171 -857 -1043 807 1086
811A086j366L50J702l61j684Q21K400k94k337K77K632J30k677q29J822K61k252
$$ 1086 -280 70 1772 1411 -273 548 2948 2654 317 594 3226 3356 679 -150 1672 1933 -319
828c19p93J741O80j496m69J554O66j120k33J315K88j205j53J304J80j463o66O80
$$ -319 -1112 629 1309 -187 -656 898 1564 444 211 1526 1814 609 456 1760 1940 477 -189 491
846D91J3r64j10O89l53q93N33J273l94j236N91J742j9j449Q4J439k56j948m76
$$ 491 504 -460 -570 119 -234 -1127 -594 679 285 -951 -360 1382 1363 -86 -2 1437 1181 -767 -1243
865a243J396L28j375m06J281M65j132m17J061M84r21k61J191P21p84o52M42L08
$$ -1243 153 481 -894 -1300 -19 446 -686 -1103 -42 442 -479 -740 451 1172 388 -264 178 486
883D86n73m18K84J32k73J02L46k75m56M41O30n13p84O66J205l31j217J83J223
$$ 486 -87 -505 -221 -89 -362 -260 86 -189 -645 -204 426 -87 -871 -205 1000 669 -548 -365 858
902H58j67j333p5J192N3j237p2J356K51j424n56J269P49r82o98R83R51n93r60
$$ 858 691 -642 -717 475 528 -709 -781 575 826 -598 -1154 115 864 -118 -816 167 1118 525 -435
921d35K72O95k06o52k9M72K05j95k96k26Q1L67N8l43K1P23K85p50m92O83M99r35
$$ -435 -163 532 326 -326 -355 117 322 127 -169 -395 -314 53 111 -232 -211 512 797 47 -445 238 737 -198
943a98q40Q99J125p66j362N03J486k92j593M6J739M11j454o13J280P51j168j045
$$ -198 -1038 -139 986 220 -1142 -639 847 555 -1038 -992 747 1158 -296 -909 371 1122 -46 -1091
961a091P77J096m42j060K00J063J53r60n46O51Q49k31r10p5J009N00r48r24O61
$$ -1091 -314 782 340 -720 -520 543 696 -264 -810 -159 690 459 -451 -526 483 983 35 -889 -228
980b28J044o01j308N27J727q9j900l38J945P29j981j353J629J802j040j862N81
$$ -228 816 215 -1093 -566 1161 1072 -828 -1166 779 1508 -473 -1826 -197 1605 565 -1297 -716
997g16J774k34j673j21J503M26j233o69R66Q76o85j180J38J301N64j061j084P88
$$ -716 1058 824 -849 -970 533 959 -274 -943 23 899 214 -966 -828 473 1037 -24 -1108 -320
1015c20J574l16j948l01K123R21k082j503J965J999j736k519J322K838q96l048
$$ -320 1254 938 -1010 -1311 812 1733 -349 -1852 113 2112 376 -2143 -821 2017 1121 -1927
1031a927M99L355J85l295p89L027J224k809j804K248K093j558k075R40J945m91
$$ -1927 -1428 1927 2112 -1183 -1972 1055 2279 -530 -2334 -86 2007 449 -1626 -686 1259 768
1047G68j760nJ477N78q83q47K80J054L51j189j307Q62K048k62k564l77K907J138
$$ 768 -992 -997 480 1058 175 -672 -392 662 1013 -176 -1483 -621 1427 1165 -1399 -1776 1131 2269
1065B269k996j875K908K517k689l064K456L677k009m109J380M372p72m550O7M559
$$ 2269 -727 -2602 306 2823 134 -2930 -474 3203 1194 -2915 -1535 2837 2065 -2485 -2418 2141
1081B141P88m173j457L505J792k910k029K170K063j296j625Q22J109n92q13K94
$$ 2141 2929 -1244 -2701 804 2596 -314 -2343 -173 1890 594 -1031 -209 900 308 -505 -211
1097b11M64N0M5l50p42M36J441m81k413Q4L338Q40l763j831L772K743l488l293
$$ -211 253 303 348 -2 -744 -308 1133 652 -1761 -1677 1661 2501 -1262 -3093 679 3422 -66 -3359
1115c359L184L704l010m253K642M673k305n253J677N762n98n751m21N379J430
$$ -3359 -175 3529 519 -3734 -1092 3581 1276 -3977 -2300 3462 2864 -2887 -3308 2071 3501
1130C501m487j840L578J828k980j892K264J791j557j442R93J093l75m99k19l81
$$ 3501 -986 -2826 752 2580 -400 -2292 -28 1763 206 -1236 -243 850 475 -24 -243 -624
1146f24N71J685n7k419m79K875R06l437j619L684K286l778k884L877L622l787
$$ -624 -53 1632 1575 -844 -1323 1552 2458 -979 -2598 1086 3372 -406 -3290 587 4209 422
1162D22m508L396N314k429n594J598N636q65n490L4N015L13m711q15M202J107
$$ 422 -4086 -690 4624 2195 -3399 -1801 3835 2970 -2520 -2486 2529 2842 -1869 -2684 1518 2625
1178B625l726j469K949J478k257j382J531J003r42m69M74k45l68P57L0j692k96
$$ 2625 -1101 -2570 379 1857 -400 -1782 -251 752 -190 -659 -185 -430 -798 -41 -11 -1703 -1999
1195a999K315N17l094j272L330J896l496k461L457L159l251l417L054L862k965
$$ -1999 316 833 -2261 -3533 -203 1693 -1803 -4264 -807 2352 -899 -4316 -1262 2600 -365
1210c65m373K440M746j970n022J202M964m93m675j3M289N78l624n64L277R47k491
$$ -365 -4738 -2298 2448 478 -4544 -3342 1622 1129 -3546 -3559 730 1308 -2316 -2880 397 1344 -1147
1227a147p37J934N14j538j94J177j14p88O85P57j001n68J592P11j881n87K740
$$ -1147 -1884 50 564 -974 -1168 9 -105 -893 -208 549 -452 -1020 572 1283 -598 -1185 1555
1244A555J229k856j653L049K064l090k498L163L114k788l438K582L768k131m048
$$ 1555 2784 -72 -1725 1324 3388 298 -2200 963 4077 1289 -2149 433 4201 2070 -1978
1259a978J640M207r03l842O37L695k94l420pL051J19k734k90K363K97k001m21
$$ -1978 -338 3869 2966 -876 -239 3456 3162 -258 -265 2786 2905 171 -119 2244 2541 540 119
1276A19J431J22j119M9P03m82m44R93L86j612o82J919Q94k232j343K130J411k341
$$ 119 1550 1672 553 602 1305 823 379 1372 1758 146 -536 1383 2277 45 -1298 832 2243 -98
1294i8j843K151J803k372k181K300K593k025k856J634K874j365k912J002K780
$$ -98 -1941 210 2013 -359 -2540 -240 2353 328 -2528 -894 1980 615 -2297 -1295 1485
1309A485p98k713M95K530l58k456n6J945J51j442J16J255k57j024N37J010o48
$$ 1485 687 -2026 -1531 999 641 -1815 -1871 74 225 -1217 -1101 154 -103 -1127 -590 420 -228
1326b28r58P64R19q64p92J055P36j357q66J584J118j554j197J631J392j576j460
$$ -228 -1186 -422 497 -367 -1159 -104 632 -725 -1591 -7 1111 -443 -1640 -9 1383 -193 -1653
1343a653J626J662j516j762J468J972j197j993R39J834q84j799P52J700o51j541
$$ -1653 -27 1635 119 -1643 -175 1797 600 -1393 -454 1380 496 -1303 -551 1149 498 -1043
1359a043P07J564o16j481M94J296n29j188N96J179n46j080M86Q25p11q58P60P82
$$ -1043 -336 1228 612 -869 -375 921 392 -796 -200 979 433 -647 -161 664 -47 -905 -145 637
1377F37q81p57J067Q80j122r76J109J086j058j083J050J024j155j206J011J201
$$ 637 -244 -1001 66 946 -176 -1152 -43 1043 -15 -1098 -48 976 -179 -1385 -374 827
1393H27j005j187J036J306r15j280Q45J256q07j265P68J320o41j233N22J087n46
$$ 827 -178 -1365 -329 977 62 -1218 -373 883 76 -1189 -421 899 258 -975 -453 634 88
1410H8j019N26R51n24q15O08Q41n81p39O18O88o63o46P14O17p78n81Q60O13q79
$$ 88 -931 -405 546 22 -793 -185 656 75 -664 -46 642 -21 -667 47 664 -114 -695 165 778 -101
1430a01o28R08N90r84n82J114O96j136p94J099Q49j105r63J052J049q43r87Q04
$$ -101 -729 179 769 -215 -797 317 1013 -123 -917 182 1031 -74 -1037 15 1064 221 -766 38
1448C8R28q11r89O90R28o23q80O05Q01n88p77M95O57m51m95N28M65n49l86N60
$$ 38 966 155 -834 -144 784 161 -719 -114 687 99 -678 -183 474 23 -472 56 521 -28 -414 146
1468A46K34p28k01Q21K23q99k26R65K21j076k82J135L81j133l98J201N27j165
$$ 146 380 -348 -549 272 495 -404 -630 335 556 -520 -802 333 714 -419 -817 384 911 -254
1486b54o40J042O22r71n95R49O09q70n58Q38N34q34n64P41N57o43m11O08K90n74
$$ -254 -894 148 770 -201 -796 153 762 -108 -666 172 706 -128 -692 49 606 -37 -448 160 450 -124
1506a24j44O54M2p36L6Q56m5r54J3R75k7j085p0J079Q7j058o2J129J46j098j76
$$ -124 -268 386 428 -308 -272 584 539 -415 -402 573 546 -539 -609 470 557 -501 -563 566 712 -386 -562
1527e62J065J74j063j95J033K42r43k84P72J02p88p3P62K9o47J63P00k86p78L64
$$ -562 503 677 -386 -581 452 694 -249 -533 239 341 -447 -520 242 271 -376 -213 487 201 -577 -213
1547b13Q38m20q85N51R72o33j176N51J249n24j316N10J465l73j499K17J445j55
$$ -213 625 205 -680 -129 843 210 -966 -415 834 310 -1006 -496 969 596 -903 -686 759 604
1565F04j380J24J372n7j295J9J244K4j183r8J024J05q15l1O43j20n01L69M82o49
$$ 604 -776 -652 720 663 -632 -613 631 655 -528 -626 398 503 -312 -343 300 180 -321 48 530 -119
1585a19o04Q02P46q55p88R66R05j032j001J049J034j184j200J277J443j221j630
$$ -119 -723 79 825 -30 -818 148 1053 21 -980 69 1103 -81 -1281 -4 1439 218 -1412
1602a412J070J745r40j796P74J829n98j771M27J646l92j600K64J473j61j270J91
$$ -1412 -342 1403 463 -1333 -559 1270 672 -1099 -672 974 582 -1018 -754 719 558 -712 -521
1619e21J121j70r35K50P08l86n51N80M37q38m38J037M16j274n63J434P11j481
$$ -521 600 430 -505 -255 453 67 -484 96 533 -305 -743 294 710 -564 -1127 307 1018 -463
1637d63o96J665Q75j769j042J837J225j913j536J783J732j627j899J320J836j190
$$ -463 -1159 506 1381 -388 -1430 407 1632 -281 -1817 -34 1698 71 -1828 -508 1328 138
1653A38j777J095J762r64j655R44J669q37j616O63J431n29j179N27R01o91p56
$$ 138 -1639 -544 1218 254 -1401 -457 1212 375 -1241 -578 853 324 -855 -328 573 -118 -874
1670h74P76N55r71m49J221M56j308l32J549L74j752l59K068N93k174p45K351R70
$$ -874 -98 457 -514 -963 258 714 -594 -926 623 997 -755 -1114 954 1547 -627 -1372 979 1949
1688A949k442j275K337J461k311j692K193J952j905k000J726K125j371k004J227
$$ 1949 -493 -1768 569 2030 -281 -1973 220 2172 267 -1733 -7 2118 747 -1257 -30
1703c0J964r36j789P88J575p16j466M66J058m95p29O02M20q54j60J184J11j424
$$ -30 1934 998 -791 -3 1572 856 -610 -144 914 419 -310 292 712 -142 -302 882 993 -431
1721d31r0J728K35j852k48J969J76k272l91K394M93k671q43K677J139k652j475
$$ -431 -521 1207 1442 -410 -658 1311 1487 -785 -1176 1218 1711 -960 -1803 874 2013 -639 -2114
1738b114K409J630k159j645K031J757j823j736J635J690j516j785J173J604r90
$$ -2114 295 1925 -234 -1879 152 1909 86 -1650 -15 1675 159 -1626 -453 1151 161
1753A61j463P30J069p87q66P49O13p76k91J044K54j094p5J281q9j516J40J747
$$ 161 -1302 -572 497 -290 -1156 -407 206 -570 -861 183 437 -657 -732 549 460 -1056 -916 831
1771H31j64k031K1K193K9k437k61K620N81k589p35K659J093k480j236K340J430
$$ 831 667 -1364 -1343 850 879 -1558 -1819 801 1382 -1207 -1942 717 1810 -670 -1906 434 1864
1788A864k129j468J929J500j820j541J591J547j372j531J115J430p98j080O88
$$ 1864 -265 -1733 196 1696 -124 -1665 -74 1473 101 -1430 -315 1115 317 -763 -75
1803g5P70p00m82P81K26r53p5J160L9j221L9J287j76j506K07J741j91j943Q8K099
$$ -75 695 -5 -487 294 520 -433 -508 652 691 -530 -491 796 620 -886 -679 1062 871 -1072 -984 1115
1823A115K4k270l07K310N15k254o73K210Q68k120j050J967J168j722j157J577
$$ 1115 1139 -1131 -1438 872 1387 -867 -1540 670 1538 -582 -1632 335 1503 -219 -1376 201
1839B01J210j391j208J142J037j064r76R12Q44p74o40P48M56p41k69Q14J58q43
$$ 201 1411 20 -1188 -46 991 -73 -1049 -137 707 -67 -707 41 497 -244 -513 301 459 -384
1857c84Q9J061j06j145J53J243k31j472J22J523j38j712j0J752J22j779k08J852
$$ -384 -295 766 660 -485 -332 911 680 -792 -670 853 715 -997 -1007 745 867 -912 -1120 732
1875G32M62j670m77J701N73j616o87J466O77j436q27J191P44j156q05Q71O25q32
$$ 732 1194 -476 -953 748 1321 -295 -982 484 1161 -275 -1102 89 833 -323 -1128 -257 368 -464
1893d64m94Q35M77o75k52P92K27p51j25P21l3q62O2Q64j97j085P6J036j59j172
$$ -464 -958 -123 354 -321 -573 219 446 -305 -430 291 258 -604 -542 322 125 -960 -884 152 -7 -1179
1913a179J30J289Jj233Q5J434J46j323j24J411L04j280l44J181K97j240m79J026
$$ -1179 -1049 240 241 -992 -907 527 673 -650 -774 637 941 -339 -683 498 795 -445 -924 102
1931A02L64j020l97R84M76p82k60Q79M15o18j46P50K09o34r7O12p3p78p1O67j44
$$ 102 466 -554 -951 33 509 -273 -533 346 761 143 -3 747 956 322 225 837 764 -14 -85 582 438
1952D38q05M8Q01o7p66J81R28j7p84K13J012k5r60JR06m1j049j83Q23J7r73j62
$$ 438 -367 -319 482 415 -351 -170 758 741 -43 170 1182 1157 197 198 1104 1063 14 -169 654 671 -302 -464
1974d64Q06J12q22r7Q18J77o58j2P92J45o57o3O12k9p12p6N09j48p28j2N91j51
$$ -464 342 454 -368 -465 353 530 -128 -140 652 797 140 77 689 660 -52 -128 381 233 -495 -507 84 -67
1996f7o95J01P08k2n97K03P96m5o83J00P09o7p67m6O05q1p12q2N54m8o07L4O03
$$ -67 -762 -661 47 25 -572 -369 427 382 -301 -201 508 441 -326 -372 233 152 -560 -642 -88 -136 -743 -709 -106
2019a06N8m65J24N75nm38J44N12j49n28J31M69k12n79J56M63k48n33K81O06k15
$$ -106 -48 -513 -389 186 181 -257 -113 399 250 -278 -147 322 110 -469 -313 150 -98 -631 -350 256 41
2040D1o04K77P31j48o64J44O87p9o48N4O30o0o20j2N29j3n14MM86Qm07J9L73r
$$ 41 -563 -286 445 297 -367 -223 464 385 -263 -209 421 361 -259 -271 258 245 -269 -265 221 229 -178 -159 214 205
2064B05l25L1K57r4k06J91J77k94k28L37K37l62k66M33L58m24l71M61M18n18n45
$$ 205 -120 -89 168 74 -132 59 236 -58 -286 51 288 -74 -340 93 451 27 -344 117 535 17 -528
2085e28M05N31m32o10L43N88l05o16L13O82j75o03K12O84l2n53MM38l9m57p0K39
$$ -528 -123 408 -24 -634 -291 297 -8 -624 -311 371 196 -407 -195 489 457 -96 -92 346 307 -150 -220 19
2107A9p0k84M3J34j22r0K51J75j56L1M34J41l86r1M66P8o22k30N19J42p56m03
$$ 19 -51 -335 -292 -158 -280 -370 -119 56 -100 -69 365 506 120 29 495 573 -49 -279 240 382 -374 -777
2129g77N97L97o51m57O70O47m24m92N61P20l12n77L18N79k66o51K0L89j79n17
$$ -777 -180 217 -434 -891 -221 426 2 -490 71 791 479 -98 220 799 533 -118 -98 291 112 -405
2149d05m3K53o9k32J31K59L3L2K45J07j00J18L23j11m22O6M49k17p65j49N71k
$$ -405 -448 -195 -264 -496 -365 -106 -73 -41 204 311 211 329 652 541 119 185 634 417 -348 -497 74 72
2171G2p78j74P66L10o31k03Q42M98n96l61P12N42n82o36L70M72m65o83J34L80
$$ 72 -706 -880 -114 196 -435 -638 204 702 106 -255 457 999 417 -219 151 623 158 -525 -391 -11
2191a1k40m39J14L57Kj01J77K12K7J11J85o2j92J78K61l16n15J16L82l17o56J84
$$ -11 -251 -690 -576 -219 -217 -318 -141 71 98 209 394 332 140 318 579 263 -252 -136 246 -71 -727 -543
2213e43O83j42p58J26R41J13q10o2R91L66q19l85P47L99p92n80N39M93n63o52
$$ -543 140 -2 -760 -634 307 420 -390 -452 539 905 86 -299 448 847 55 -525 14 507 -56 -708
2233g08L10N23k10m43J51L85K5r5J44J41n3J9J04j03j37J45P8l94k94M17L65n46
$$ -708 -398 125 -85 -528 -377 8 33 -62 82 223 170 189 293 190 53 198 276 -118 -412 5 370 -176
2255a76o36M43Q19l07q37K45R75pq60MQ64O8q73j27Q22J98q63l50P18L61o83m61
$$ -176 -812 -369 450 143 -694 -449 526 519 -341 -337 527 595 -278 -405 417 615 -248 -598 120 481 -202 -663
2277f63N14M69l32l99K51L37r4j52O5L4n9J38J58k20k50K73K87l08l87K85L77
$$ -663 -149 320 -12 -411 -160 177 83 -69 -4 30 -29 109 267 47 -203 70 357 49 -338 -53 324
2298C24l57m32M23N32m60o46M57P95l76q76L14R84j18r86rR21P5q58j86P71K14
$$ 324 -33 -465 -42 490 30 -616 -159 636 260 -616 -302 682 564 -422 -431 490 565 -293 -479 292 506
2319E06o62k17N03J61m99j58M27J00m08n7L90M5l53l6K63j3j37J88J38l00j54
$$ 506 -156 -373 130 291 -208 -366 61 161 -247 -304 86 131 -222 -258 5 -8 -145 43 181 -119 -273
2340b73M58K56o18m90N49O14n55p59L80P69l05p52K56P46j78o45L07P60j92p40
$$ -273 185 441 -177 -667 -118 496 -59 -818 -438 331 26 -726 -470 276 98 -547 -240 520 328 -412
2360d12K12P91j49q64k8P31N2p13j84M84J12l39k9L01m6j23L44L37k92l16M08
$$ -412 -200 591 442 -422 -450 281 333 -380 -564 -80 32 -307 -336 -35 -81 -204 140 477 185 -131 277
2381B77M48l53m92L01M29l90m76K80L46m81m26N23N34m67m88O40P69m04o96M50
$$ 277 725 372 -120 181 610 220 -256 24 370 -111 -537 -14 520 53 -435 205 974 570 -126 324
2401C24Q49k61q02J26O60j94p18pM10k36m98K16M80k25m42L59O37j43m80K07N25
$$ 324 1173 912 110 236 896 702 -16 -23 387 151 -347 -131 349 124 -318 41 678 535 55 262 787
2422G87q3m00Q7J84l60l40K44J22n91l89N15M44n12n03N62O57l40n14M30N98k97
$$ 787 704 304 391 575 215 -125 119 241 -350 -739 -224 220 -292 -795 -233 424 84 -430 0 598 301
2443C01m96K97M20m69n91K79M06n07o23L61N97l07n83K80O31q4l81K33M23j21
$$ 301 -195 102 522 53 -538 -259 147 -360 -983 -622 -25 -332 -915 -635 -4 -88 -469 -236 187 66
2463F6k52K42K05m06l59L50K52m88m33L86L88l71l70L99M34k48k34M52L78l62
$$ 66 -186 56 261 -145 -504 -154 98 -390 -823 -437 -49 -420 -790 -391 43 -205 -439 13 391 29
2483B9k77M80L30n39m69M55M48n12n73L45N12k82m62K86M56j79k69L28L42k66
$$ 29 -248 232 562 23 -446 9 457 -55 -628 -283 229 -53 -515 -229 227 48 -221 107 449 183
2503A83k66L50K81l93l77L08L20l48l43K55K57k80k13L17J78l27r9M75J84n01
$$ 183 -83 267 548 155 -222 86 406 58 -285 -30 227 -53 -266 51 229 -98 -197 278 462 -39
2523c9k31N08K65n47l69M62L59m22l93L75L32l72l11L76L18l63k96L89L30l97
$$ -39 -270 238 503 -44 -413 49 408 -14 -407 -32 300 -72 -383 -7 311 -52 -348 41 371 -26
2543b6l78L24L67l03l64K47L02j88k39J81J74j93r0K84J04l09o1L56P6m14j61
$$ -26 -404 -80 287 -16 -380 -133 169 -19 -258 -77 97 -96 -186 98 202 -107 -168 188 264 -150 -311
2564c11L88J30m02j60L96J61l78j11M46J58m16j04N18K16m82k63M51K97m66l71
$$ -311 77 207 -195 -355 41 202 -176 -287 159 317 -99 -203 315 531 49 -214 237 534 68 -303
2584c03L12K90l05l06K43K57k06j84K61K06k11r9K87J71k48j54K20P8k93j44J77
$$ -303 9 299 -6 -312 -69 188 -18 -202 59 265 54 -45 242 413 165 11 231 309 16 -128 49
2605D9J3k51j7K67j5l36M3L79L9l17j2M08J08l65j17L26Q0l51j48K94Q1l35j26
$$ 49 62 -189 -206 61 46 -290 -247 132 171 -146 -158 250 358 -7 -124 202 282 -69 -217 77 158 -177 -303
2628c03K92J11l07j16L43J58k31j04K71J43k11j04K02N8k19p7J85J1k52n0K27
$$ -303 -11 100 -207 -323 20 178 -53 -157 114 257 46 -58 144 202 -17 -94 91 102 -150 -200 27
2649B7Lk40oK76K7k35L5K89L1k64j6K78K0l09l5K66K6l16q3K60N6k74q6K74J15
$$ 27 30 -210 -216 60 87 -148 -113 176 207 -57 -73 205 225 -84 -119 147 173 -143 -226 34 90 -184 -270 4 119
2674A19k03o4K33P6j99l2J99K5j92l0J94Lk18l1J70qj97J5K00l4j96O6K45p4k49
$$ 119 -84 -148 85 161 -38 -70 129 154 -38 -68 126 129 -89 -120 50 42 -155 -140 60 26 -170 -104 141 67 -182
2699a82P1K87j0l01QK77J8k64m2K01J4k17J0K23k0k29rK28M5k27m2K11O8j24k3
$$ -182 -111 176 166 -135 -127 150 168 -96 -138 63 77 -140 -130 93 73 -156 -165 63 108 -119 -161 50 118 -6 -29
2724b9J17j7j25N4J22q8j54R0J76r6k03R3J92j07k00J14K31j07k15J08K66j14
$$ -29 88 71 -54 0 122 34 -120 -30 146 50 -153 -60 132 25 -175 -61 170 63 -152 -44 222 108
2746A08k86J00K88p6k99M8K92l7l08k1K71K4k49j9K28L6j90k0J87J8j37lJ22j
$$ 108 -178 -78 210 134 -165 -117 175 138 -170 -191 80 104 -145 -164 64 100 -90 -110 77 95 -42 -45 77 76
2770G6r7L3Q6q5j11R6J03j39j37J54J41j52j28J76J62j84j79K15K43j91k97J76
$$ 76 -21 12 98 13 -98 -2 101 -38 -175 -21 120 -32 -160 16 178 -6 -185 30 273 82 -215 -39
2792c9K94j42l32O3L01n7k80K2K61kk45JK46K1j84j1J78J4j12oQ0m8q8M5O6p6
$$ -39 255 113 -219 -156 145 88 -192 -170 91 89 -156 -155 91 112 -72 -83 95 109 -3 -9 71 23 -65 -20 46 -30
2818c0o1R7N7j37n2J80O3k16m7K89J36k80j69K69K13k81k68K36K65k16k92J49
$$ -30 -91 6 63 -74 -126 54 117 -99 -146 143 279 -1 -170 99 312 31 -237 -1 264 48 -244 -95
2840i5K74j42k79J30K90q8k44J13K80o9k56K8K38Pk02n3J02J3p4Poq6J6J81J8
$$ -95 179 37 -242 -112 178 90 -154 -41 239 170 -86 -58 180 187 -15 -68 34 47 -27 -20 -26 -112 -96 85 103
2865A03k03j5K65Q9k33r8K23R6k36j26K37R7k94j57K78J66l22k27L26K89k59k98
$$ 103 -100 -115 150 239 6 -92 131 227 -9 -135 102 199 -95 -252 26 192 -130 -357 -31 258 -1 -299
2887b99K25L48j36l34P6K58m0k05QJ30q7j39Q5R1j23j14J45J33q0p7Q1O1p1OJ22
$$ -299 -74 274 138 -196 -120 138 98 -107 -99 31 -56 -195 -110 -19 -142 -256 -111 22 -58 -135 -54 7 -64 -58 64
2912F4k5j86M1K52m5l36n5L42Q8l50j48L61K02k82j89K63K21k09j89K31J83k24
$$ 64 39 -147 -106 146 101 -235 -290 52 140 -210 -358 3 205 -77 -266 -3 218 9 -180 51 234 10
2934A0j80K21J75k39k29J86K38j40k17R8J83l1r6N3L6p2K1J55m4j92J1K26j4k61
$$ 10 -170 51 226 -13 -242 -56 182 42 -175 -77 106 75 -21 32 68 -4 17 172 128 -64 -53 173 159 -102
2958a02n0K53O9k44l8K43L7k51j3K75J4l04j9L35P4l61j39L09J83k85k15K25K00
$$ -102 -152 101 170 -74 -112 131 168 -83 -96 179 193 -111 -130 205 279 -82 -221 88 271 -14 -229 -4 196
2981A96j53j49J23R1j41n5J49N3j76n8K02O4k09q7J61Q0j61m1J58J4j50L8J92
$$ 196 43 -106 17 108 -33 -88 61 114 -62 -120 82 146 -63 -150 11 91 -70 -111 47 61 -89 -51 141
3004A41m6k49N4K78j5l07j9K97N2k94r1K49Q2k26m9K08O0j90l8K37J2k32j9K48
$$ 141 95 -154 -100 178 163 -144 -163 134 186 -108 -199 50 132 -94 -143 65 125 -65 -103 134 146 -86 -105 143
3028A43M5k33q0J94N5j93n9J42J4j49K6J82m3j88N0K34k5k48K9K57K2k49l6J99
$$ 143 188 -45 -125 69 124 -69 -128 14 28 -121 -95 87 44 -144 -94 140 115 -133 -104 153 175 -74 -110 89
3052H9J1k13j2J76j6j97L6K19k9k22PK42L7k14j0K27L3j88j0J60k3j72J5J68o0
$$ 89 100 -113 -125 51 35 -162 -126 93 64 -158 -151 91 128 -86 -96 131 164 -24 -34 126 103 -69 -54 114 54
3077E4j92N8J89o4k24N1K59k7j99N4K28oj82K9J97n0k09L9J88o8k51K9K15l5k26
$$ 54 -138 -80 109 45 -179 -128 131 104 -95 -41 187 181 -1 28 225 175 -34 5 193 125 -126 -97 118 83 -143
3102a43K0K15J6j47K9J88%j43O1J51p1j66N4J53r5k15J6J42q0j74M6J65n1j19
$$ -143 -123 92 108 -39 -10 178 178 35 96 247 176 10 64 217 122 -93 -77 65 -15 -189 -143 22 -29 -148
3126a48J12J74p8j43J28J90j02k10P8J77j07k42J3J49r1j95O6J75o0j38J14K12
$$ -148 -36 138 60 -83 45 235 133 -77 1 178 71 -171 -158 -9 -100 -295 -229 -54 -114 -252 -138 74
3148G4o6j50J12K13m9j91L6J39p4j90J2Q9r0j41P8J22o3r8J16J79m3j10J24J55
$$ 74 8 -142 -30 183 134 -57 -21 118 44 -146 -134 -45 -135 -276 -198 -76 -139 -237 -121 58 15 -95 29 184
3172A84o8j24P7Q9j39j54Q8P0j56j45J43J68j34j36J49K34p3j37J32J96p5j63
$$ 184 116 -8 69 158 19 -135 -47 23 -133 -278 -135 33 -101 -237 -88 146 73 -64 68 264 189 26
3194B6O2J21j13j92M4J27j03j74O5J69m8j17O8J66Lp8N5J07m7p3N4K0j38j03J00
$$ 26 88 209 96 -96 -52 75 -28 -202 -137 32 -16 -133 -65 101 104 26 81 188 141 68 122 142 4 -99 1
3219AL8j41j06J32J05j00q7J46J30r6o1J52J09j58j27J25J01j71j93R9J64j05
$$ 1 39 -102 -208 -76 29 -71 -158 -12 118 22 -39 113 222 64 -63 62 163 -8 -201 -102 62 -43
3241d3j61O3J62j6j03Q8J26j8p5O7Q5r3r3L0N0r9r6M2O0p8l9J03M4n5LJ70L6j09
$$ -43 -204 -141 21 5 -98 -10 116 98 23 90 175 82 -11 19 69 -30 -126 -84 -24 -102 -141 -38 6 -49 -46 124 160 51
3269E1k9J53N0j92j36J09Q7j81j33J30J14j10r5J31J56p7q4J41J54p3j35N5J02
$$ 51 22 175 225 33 -103 6 93 -88 -221 -91 23 -87 -182 -51 105 28 -56 85 239 166 31 86 188
3292A88r3j34oM2n1p9J8N9l9k5R1O3k2J4J25L5r3k6J07j2j80p5J00jj80n4J29
$$ 188 95 -39 -45 -3 -54 -133 -115 -56 -95 -120 -29 34 12 26 151 186 93 67 174 162 -18 -93 7 6 -174 -228 -99
3319i9O3j27n1J96J01r7n4J82J35j33j15P4Q5j12j46K5O9p9j08M7O9l3k7P8Q7
$$ -99 -36 -163 -214 -18 83 -14 -68 114 249 116 1 75 160 48 -98 -73 -4 -83 -191 -144 -75 -108 -135 -57 30
3344C0J5OP7K1m0KM7n8j17j3P0m8j55J0J23pj48J7J80O8j23jJ76N7j37p3J31N3
$$ 30 45 51 128 149 109 111 158 100 -17 -30 40 -8 -163 -153 -30 -37 -185 -168 12 80 -43 -44 132 189 52 -21 110 163
3372A63j68j15J08O5j16j09O0Q3l2n8P5P2k9oR2K7o6k3N8Jo0j3M4l9r8L4P1m0
$$ 163 -5 -120 -12 53 -63 -172 -112 -29 -61 -119 -44 28 -1 -7 85 112 46 23 81 82 22 9 53 14 -84 -50 21 -19
3400a9j14N3J36mj18K2J51J8j56oJ43J8j44l2J13K4j29n9J00M8j02l9R8N1q3m4
$$ -19 -133 -80 56 52 -66 -44 107 125 -31 -37 106 124 -20 -52 61 85 -44 -103 -3 45 -57 -96 2 53 -30 -74
3426g4Q4M6o8kM7J5m1NO2k8q3L1O1l4q6L8R4m3j19L5J18j5j19L2J26mj07J4J16
$$ -74 10 56 -12 -14 33 48 7 12 74 46 -37 -6 55 21 -65 -27 67 24 -95 -60 58 43 -76 -44 82 78 -29 -15 101
3455A01j9j26pJ29Nj46j8J04K2j10l6P9L6o4LQ9Po0RP4qq6J6P2m1p1J1P2n7p7
$$ 101 82 -44 -51 78 83 -63 -81 23 45 -65 -101 -22 14 -50 -47 42 49 -11 -2 72 64 -22 -6 66 25 -46 -35 37 -20 -97
3485i7M9Q3m3q3P6J23n0j00M1J34m2j37J3J22k4j32j9R8jj16K5R3Rp0K2J07Lq0
$$ -97 -48 35 -8 -91 -15 108 58 -42 -1 133 91 -46 -33 89 65 -67 -86 12 11 -105 -80 13 22 -48 -26 81 84 4
3513DjP9j4q1pN2l2p0K2N8o4n2P0R5l7n8Q2J13n8q4N3Q1n6j22N5P1p1j15K9R6
$$ 4 3 82 68 -13 -20 32 0 -70 -48 10 -54 -106 -36 59 22 -36 46 159 101 17 70 151 95 -27 28 99 28 -87 -58 38
3543C8l0j05N3J43J6j08L9J20pr5oO1k0q7k2L2m2p7ON3k1l8N4R2j4k3N9N4m4m9
$$ 38 8 -97 -44 99 115 7 46 166 159 64 58 119 99 12 -10 22 -20 -97 -91 -38 -59 -97 -43 49 35 12 71 125 81 32
3573C2N4K6r4j01N3L8j16j03O2J08o5p2R4J29j8p3N6J08k8j14J6Q2o2j24j6M7
$$ 32 86 112 18 -83 -30 8 -108 -211 -149 -41 -106 -178 -84 45 27 -46 10 118 90 -24 -8 74 12 -112 -128 -81
3599h1n0r3J6Q0%k0M6Q3J1lN8K6k8k7L7or4o6M2%r2n4R4O2n1mJ10R0n6k7J14P6
$$ -81 -131 -224 -208 -128 -128 -148 -102 -19 -8 -11 47 73 45 18 55 49 -45 -111 -69 -69 -161 -215 -121 -59 -110 -114 -4 86 30 3 117 193
3631A93p5q8O0O9j03j25J3O4m5r8L5Q9Pk2M7R0Pk0L0N1l2m0lj2o1n4qMo5lN9K2
$$ 193 118 30 90 159 56 -69 -56 8 -37 -135 -100 -11 -4 -26 21 111 118 98 128 179 147 107 104 92 31 -23 -31 -27 -92 -95 -36 -14
3663a4m6L0R4M8n4nR1K8p9o6O0J4j12q8M5M1o7o9P8Q2l8l8P5Q7k4n2M7N3m0o9
$$ -14 -60 -30 64 112 58 53 144 172 93 27 87 101 -11 -99 -54 -13 -80 -149 -71 11 -27 -65 10 97 73 21 68 121 81 12
3693A2Mkm6n5OJ2k9nO1J1oJ3O7K5m0kP2Qq0l8M5Lr6k9O8K3q2k4R3O8m9m4R1Q4
$$ 12 16 14 -32 -87 -81 -69 -98 -103 -42 -31 -37 -24 43 68 28 26 98 106 26 -12 33 36 -60 -89 -21 2 -80 -104 -11 57 8 -36 55 139
3727A39n0n6M5N3p7p3J4L9m7n4J4M0j5k6L6M6k0j0M3L1m2KL4j4o6oL2k4n6j5P1
$$ 139 89 33 78 131 54 -19 -5 34 -13 -67 -53 -13 -28 -54 -18 28 8 -2 41 72 30 32 66 52 -14 -20 12 -12 -68 -83 -12
3758a2Oo3NO8L4n5j7Q4L4o5m1O6K6o8p7N2M1n5m9M6M6l5k5L1L2Pl9L6K9l6rJ9
$$ -12 -6 -69 -64 4 38 -17 -34 50 84 19 -22 44 70 2 -75 -23 18 -37 -86 -40 6 -29 -54 -23 9 16 -23 13 42 6 -3 16
3790A6Kn0mJ9km9J2O2j7n8K2P6ro6kJ01jo9j7O9J5p2l2O9K9o3j9M5L3n8k4N4L3
$$ 16 18 -32 -36 -17 -19 -68 -56 6 -11 -69 -47 29 20 -46 -48 53 52 -17 -34 35 50 -22 -54 15 44 -19 -38 7 40 -18 -42 12 45
3823D5m4k9M7K1l2l0M2Kk8j5M6j1k4%K5pn6K7L8j3n8J9N3ko7J2O9qn8LQ0mq1J5
$$ 45 1 -28 19 40 8 -22 20 22 -6 -21 25 14 -10 -10 15 8 -48 -21 17 4 -54 -35 18 16 -51 -39 30 22 -36 -33 47 43 -38 -23
3857b3O3jp9j9O8J5o7j1N8K3n1j5N2K2l6PM3ln5ML7k7m9MM2k0l6J1M3j0l3K1M9
$$ -23 40 39 -40 -59 9 24 -43 -54 4 27 -24 -39 13 35 -1 6 49 46 -9 -5 32 5 -44 -40 2 -18 -54 -43 0 -10 -43 -22 27
3890B7mn9M1P3l0p6K2N3k2p9KN2pn4NO2%n5K6P6Ln6K3O1k0n6nK8k3n6J9L5k3m1
$$ 27 23 -36 5 78 48 -28 -6 47 25 -54 -52 0 -7 -61 -56 6 6 -49 -23 53 56 0 23 84 64 8 3 31 8 -48 -29 6 -17 -58
3924e8QM4j7l2O2N1l2k0L0M4m8o4K5L5l8o3J9N6m6m3K8P0k8l6N3O4k6n2L9N2l3
$$ -58 -50 -6 -23 -55 7 58 26 6 36 80 32 -32 -7 28 -10 -73 -54 2 -44 -87 -59 11 -17 -53 0 64 38 -14 25 77 44
3955D4o6RM7l6n9J6L8k3k7L0K5Nk7N4N0l5j8K0K7m3m6K2J7o5l4M3K3m7l7P0M1
$$ 44 -22 -13 34 -2 -61 -45 -7 -30 -57 -27 -2 3 -24 30 80 45 27 47 74 31 -15 7 24 -41 -75 -32 -9 -56 -93 -23 18
3986A8l5j9P1M2m7l9M7M4o1n3L0L3o4k8K7M3l4m1N8N3k7k1N6L2k5m2K5J7n2l2
$$ 18 -17 -36 35 77 30 -9 38 82 21 -32 -2 31 -33 -61 -34 9 -25 -66 -8 45 18 -3 53 85 60 18 43 60 8 -24
4016b4J8K3n9j5L8J2n8LO0L8m5j1O7K3n2l3M7Ro0m1M7J2o6k7N9K0m6j3P0M8l7
$$ -24 -6 17 -42 -57 -19 -7 -65 -62 -2 36 -9 -20 47 70 18 -15 32 41 -19 -60 -13 -1 -67 -94 -35 -15 -61 -74 -4 44 7
4047Gj8N0K9n6k3L0K6o6k4M6Nn5k0N6J6m3KO2J7l3jL5K9o3k1M2lm8j6K5J7o0j8
$$ 7 -11 39 68 12 -11 19 45 -21 -45 1 6 -49 -69 -13 3 -40 -38 24 41 8 7 42 71 8 -13 29 26 -22 -38 -13 4 -56 -74
4080g4O0J1l8JO3K6l8j6N5J7n4k2N2Lo1k0L4K1n3k0N1L5l7j2N9K8l5k6L9J9m9
$$ -74 -14 -3 -41 -40 23 49 11 -5 50 67 13 -9 43 46 -15 -35 -1 20 -33 -53 -2 33 -4 -16 43 71 36 10 49 68 19
4111A9j3L0j2l2j3K2Mm2kL6K1l2NL4K9o0pM7Mn2nM5mn1oL4om2J1M0K3m2j2O4M
$$ 19 6 36 24 -8 -21 1 5 -37 -39 -3 18 -14 -9 25 54 -6 -13 34 38 -14 -19 26 22 -29 -35 -1 -7 -49 -38 2 25 -17 -29 35 39
4146C9m3k0N6Om4jL1Lm9j2L8Jl4qM8K2m4rL0J8k8j6L2Ol6jK8ql2kK6Ll3JM6J1
$$ 39 -4 -24 32 38 -6 -7 24 27 -22 -34 4 5 -29 -37 11 33 -11 -20 10 28 0 -16 16 22 -14 -15 13 5 -27 -29 -3 0 -33 -32 14 25
4182B5l7pM1ll1rL3J2m2LL7nl8KL4J6m6nM1J3l4k0L3K0l2k1L0J0l2nJ5J1l3kK9
$$ 25 -12 -19 22 19 -12 -21 12 24 -18 -15 22 17 -21 -19 15 31 -15 -20 21 34 0 -20 13 33 1 -20 10 20 -12 -17 -2 9 -24 -26 3
4217CK0l7qK9J6l1j8M1rk4OK9rk6JL1kl7MM1kl2lM4oj7j0L0Mm1OM6rm0lL3Rl3
$$ 3 23 -14 -22 7 23 -8 -26 15 6 -18 -12 17 8 -18 -17 14 12 -25 -21 20 18 -14 -17 27 21 4 -6 24 28 -13 -7 39 30 -10 -13 20 29 -4
4255drL2Qk6k6L9Ml0j0L0Pk7nK7Ml2jJ0J2l8QK7Ol6J4K1Jl1%N3k3l2J2M0qn3j
$$ -4 -13 19 27 1 -25 14 18 -12 -22 8 15 -12 -17 10 14 -18 -19 -9 3 -35 -27 0 6 -30 -16 5 6 -25 -25 28 5 -27 -15 25 17 -36 -37
4292c7M5J8m7j2M5Ql7l8N0Pk6k4M8J6k5k7K7K2k4j6J9J4k5KPNk8PJ5oj9K2L2j6
$$ -37 8 26 -21 -33 12 20 -17 -55 -5 2 -24 -48 0 16 -9 -36 -9 13 -11 -27 -8 6 -19 -17 -10 -5 -33 -26 -11 -17 -36 -14 18 2
4326Bk8J9M1j6l2J0M9qm8nN5jo8%O6J2o3rN6K6m1j7K8L5m0k1K1J0k1k1K7kj5M
$$ 2 -26 -7 34 18 -14 -4 45 37 -11 -16 39 38 -30 -30 36 48 -15 -24 32 58 17 0 28 63 23 2 23 33 12 -9 18 16 1 5
4360EJj6LJ5J9k9j9M0J5k4l2K8N3n1n2L4M6k2p1K4O0mn6mO4Qn6oN5K9n8k4M3J2
$$ 5 6 -10 -7 8 27 -2 -21 19 34 10 -22 6 59 8 -44 -10 36 14 -57 -33 27 23 -33 -37 27 35 -21 -27 28 57 -1 -25 18 30
4394C0l8j5J6K3j2j8J%qJ0JokJ6J3k3j3L8J3n0j0K8M6o1l3N0M9l7n5L2O2k5n5
$$ 30 -8 -23 -7 16 4 -14 -13 -13 -21 -11 -10 -16 -18 -2 11 -12 -25 13 26 -24 -34 -6 40 -21 -54 -4 45 8 -47 -15 47 22 -33
4427c3J3O9mo9QM8Ol9k5M1J7l2qK3Jj2jLj2MJ8j2j2lK8ln0ON4Mo3qM4L7o0l1N8
$$ -33 -20 49 45 -24 -16 32 38 -1 -26 15 32 0 -8 15 16 4 3 6 -6 -2 16 4 -8 -11 17 14 -36 -30 24 28 -35 -43 1 38 -22 -53 5
4464EM4n1n4M2O6m7n2K2N1k1m3J5N5j2m3jM8qk5kJ4RpNj1pJ1Oj0k7J1L7j6m1P
$$ 5 49 -2 -56 -14 52 5 -47 -25 26 5 -38 -23 32 20 -23 -24 24 16 -9 -11 3 12 5 10 -1 -8 3 9 -1 -28 -17 20 4 -37 -30
4499c0O2jo5JN7Qn4k1N3K9o4l0N1M1n2m4N2M2k7m5L0M9l1l6J7L3mj8%J5j2j6J7
$$ -30 32 31 -34 -33 24 32 -22 -43 10 39 -25 -55 -4 37 -15 -59 -7 35 8 -37 -7 42 11 -25 -8 25 21 3 3 18 6 -10 7
4532GmoLK2k3k4K2K4j9l2L3L5j6n4J5O4k6n4kM5J6o1j4N6J6n0l1O0K7l8k2L8K5
$$ 7 3 -3 0 22 -1 -25 -3 21 2 -30 3 38 22 -32 -17 47 21 -33 -35 10 26 -35 -49 7 23 -27 -58 2 29 -9 -31 7 32
4565C2k0m4K8K3j8j1KK0j4KLo%LJ6j3j2K4J4k5j9J3L1k6l7K2M5j9n4J4N3j3n8
$$ 32 12 -32 -4 19 1 -10 -8 12 -2 0 3 -3 -3 0 16 3 -9 15 29 4 -15 -2 29 3 -34 -12 33 14 -40 -26 27 14 -44
4598d4PN8lm5oM7J5m5j3K8K5l4k5L2J7j9j4PK5pj6QMJrJ7j6MRmj1oK1J4l3nK0
$$ -44 -37 21 18 -27 -33 14 29 -16 -29 -1 24 -10 -35 -3 14 -5 -19 -12 13 6 -10 -2 2 3 -6 11 -5 -1 8 4 -7 -13 8 22 -11 -16 4
4635DJ8j9l8K7L0j6l9J3L9j7m8J7L0J4m3mM7ol8kL5Ol1nK6K5l3rJ4J5j4p%J5N
$$ 4 22 3 -35 -8 22 6 -33 -20 19 2 -46 -29 1 15 -28 -32 15 9 -29 -31 4 10 -21 -26 0 25 -8 -17 -3 12 -2 -9 -9 6 11
4670A1onJ4j2qJ6qrJ5J4k5j4QL0k5k0J2L1j7l3J5L2pl9J0L6nl1KL0j3k5%L1K3
$$ 11 5 0 14 2 -6 10 2 -7 8 22 -3 -17 -9 21 -4 -24 -12 19 2 -31 -16 16 9 -30 -20 16 11 -20 -18 12 -1 -26 -26 5 28
4705B8m0j6K6K4k4j3J9J1Lj9%J2omOjrrJ3qKQjNj5PRj1k2K4J9k1j8RK3j8k3LL7
$$ 28 -12 -28 -2 22 -2 -15 4 15 18 -1 -1 11 5 1 7 6 -3 -12 1 -7 -5 3 2 7 -8 -1 8 -3 -25 -1 18 -3 -21 -12 11 -7 -30 -27 10
4744A0j9l2KL1Qk7jL0jk3mK5J2k2qK4Rj9j8K1Qqj3J1J6j2kRpLRJLj9LJ8j2k1J6
$$ 10 -9 -41 -39 -8 0 -27 -28 2 1 -22 -26 -1 11 -11 -19 5 14 -5 -23 -2 6 -2 -15 -4 12 0 -2 7 0 3 12 13 16 -3 0 18 6 -15 1
4783AJ4pk9J5K1j5k2JL2Mk3LL4ll5LK0J2k6k2L0Pk1mK2Rl0kJ9J5k1mK4nj2JJ6
$$ 1 15 8 -21 -6 15 0 -22 -21 11 15 -8 -5 29 26 -9 -6 14 26 0 -22 8 15 -6 -10 12 21 -9 -11 8 23 2 -2 22 17 5 6 22
4820B2qj8J1J0j7pP%lk4KK4Jk4LL5j6j5oL3Nk2mJ3Kk5PRKk0NK0J1k4LJ3J6l0j
$$ 22 14 -4 7 17 0 -7 0 0 -3 -27 -25 -1 0 -24 -21 14 -2 -17 -23 10 15 -7 -11 2 4 -21 -14 -5 -3 -23 -18 2 13 -11 -8 5 21 -9 -10
4859a0K0nj4RJ0kprJ6j1j6J4J8pk5LL3j9j0kK1kk2J3NLk5J2J2Ok7PL0j0k2nK4
$$ -10 10 5 -9 0 10 8 1 -8 8 -3 -19 -5 13 6 -19 -16 17 -2 -12 -14 7 5 -17 -4 1 4 -21 -9 3 9 -18 -11 19 9 -13 -18 6
4896Fpj4MK0Ll2J1J7j6oQK4j6j1J7J8j5k1OJ0nk4J4Rj3k1QK6j7j1PK5mk0J2J7
$$ 6 -1 -15 -11 9 12 -20 -9 8 -8 -14 -6 18 2 -9 8 26 11 -10 -4 6 1 -23 -9 0 -13 -34 -26 0 -17 -28 -21 4 0 -20 -8 9
4932Ij0j8RJ5j9j4J4jmrJ3J4k6jL3Oj2rK1K1j9l%J2j7j8J9Mk3j2J6J2j1j8J2K9
$$ 9 -1 -19 -10 5 -14 -28 -14 -15 -19 -28 -15 -1 -27 -28 5 11 -1 -10 11 32 13 10 10 22 5 -13 6 10 -13 -25 -9 3 -8 -26 -14 15
4968A5rj4J7J1rqJ4Pk7qONj0j5J0%j6JJ8Rj2mK8J6k1MJ3Nj7j0J7Ll3JJ1Lrk2K5
$$ 15 6 -8 9 20 11 3 17 24 -3 -11 -5 0 -10 -25 -15 -15 -31 -30 -12 -3 -15 -19 9 25 4 8 21 26 9 -1 16 19 -14 -13 -2 1 -8 -30 -5
5007eJ3j8kJ3J3qjONj4NRk4npJ4j0j7OJ9lk5J5J7%oNK1Jj2rJ5jj9%J0Oj5j4K9
$$ -5 8 -10 -12 1 14 6 5 11 16 2 7 16 -8 -13 -20 -6 -16 -33 -27 -8 -11 -36 -21 -4 -4 -10 -5 16 17 5 -4 11 10 -9 -9 1 7 -8 -22 7
5047Goj5lK9MqnJ8LrnJ1mj9OKj8Mj3J2j1rJ4J6lj0KJ7j8jJ3Plk6J9J6j2k2QK3
$$ 7 1 -14 -17 12 16 8 3 21 24 15 10 21 17 -2 4 6 -12 -8 -21 -9 -20 -29 -15 1 -2 -12 -10 7 -11 -12 1 8 5 -21 -2 14 2 -20 -12 11
5087A1j5j5J2J6Jj4kK6nk0PJ2%j2LQqlrJ1lj6J3Rj0pJQoj7J1J3k0mQJ5nj4J3J0
$$ 11 -4 -19 -7 9 10 -4 -6 20 15 -5 2 14 14 2 5 13 5 2 -7 4 1 -15 -2 7 -3 -10 -9 -1 -7 -24 -13 0 -20 -24 -16 -1 -6 -20 -7 3
5127CmqML3j9j2JJ1rj5jK3qj6NK8j8j0J5NJ1j1jJ1ooJq%rNnlolJ5j4lL0Mj7MJ2
$$ 3 -1 -9 -5 28 9 -3 -2 9 0 -15 -16 7 -1 -17 -12 16 -2 -12 3 8 19 8 7 18 12 6 7 -1 -1 -10 -5 -10 -13 -19 -22 -7 -21 -24 6 10 -7 -3 9
5170IOqj8RJ2qj2pK3j5j6NPMKNJ1PMlLmJ1LKj2j4Oqpk0MJ0j0jJ0RrQRJ9j0j1J0
$$ 9 15 7 -11 -2 10 2 -10 -17 6 -9 -25 -20 -13 -9 -7 -2 9 16 20 17 20 16 27 30 32 20 6 12 4 -3 -23 -19 -9 -19 -20 -10 -1 -10 -2 7 26 16 5 15
5214A5Prj2rLkk0PJ0r%nJ1NKLK1Pj1J0J2qj2mJ2rj5%Lj0klJ0%nRNPkjNJ2nj3k
$$ 15 22 13 1 -8 -5 -7 -27 -20 -10 -19 -19 -24 -13 -8 -6 -3 18 25 14 24 36 28 16 12 24 15 0 0 3 -7 -9 -12 -2 -2 -7 2 7 14 12 11 16 28 23 10 8
5259Hj1mpLj0j3J4NnnJ1J5OjJNJ2j0oPplKpprkJ2KqMJ9lM%KKqlPqj7MJ1kj6pO
$$ 8 -3 -7 -14 -11 -21 -34 -20 -15 -20 -25 -14 1 7 6 7 12 24 14 8 15 8 5 7 0 -7 -16 -18 -6 -4 -12 -8 11 8 12 12 14 16 8 5 12 4 -13 -9 2 0 -16 -23 -17
5307a7JJ1j3J0LlkJ6mj7J1Mo%PQj0LnLM%pKJ4lj1J1KoLPnj3QmJ4k5J7Lqj7kK3
$$ -17 -16 -5 -18 -8 -5 -8 -10 6 2 -15 -4 0 -6 -6 1 9 -1 2 -3 0 4 4 -3 -1 13 10 -1 10 12 6 9 16 11 -2 6 2 16 -9 8 11 3 -14 -16 7
5351Glk3QPLj9j0J8PnqNJ0pMJOJ2rjPlpOorkNmkJ5loMJ3OqmOJ0jj5jNj5pkjnj5
$$ 7 4 -19 -11 -4 -1 -20 -30 -12 -5 -10 -18 -13 -3 -10 -6 -5 1 13 4 3 10 7 0 6 0 -9 -11 -6 -10 -12 3 0 -6 -2 11 17 9 5 11 21 20 5 4 9 -6 -13 -15 -16 -21 -36
5401c6J3J0Lj1RJ7%KJJ1j8J0j9J3mOj2jknKLpKJ7KkkJ6J8j0j5jJ4j0j3%J0k7k
$$ -36 -23 -13 -10 -21 -12 5 5 7 8 19 1 11 -8 5 1 7 -5 -6 -8 -13 -11 -8 -15 -13 4 6 4 2 18 36 26 11 10 24 14 1 1 11 -16 -18
5441a8JrQrPJ8klLJ5lnJlOnm%j2n%mkNNLMJ0ROrOJ6%j4jLNk1j3J3Oj2j7J7Mno
$$ -18 -17 -26 -18 -27 -20 -2 -4 -7 -4 11 8 3 4 1 7 2 -2 -2 -14 -19 -19 -23 -25 -20 -15 -12 -8 2 11 17 8 14 30 30 16 15 18 23 2 -11 2 8 -4 -21 -4 0 -5 -11
5489a1LJ3Nm%J0Mnj1%okj0LmKn%nJ3jNnQK4onKJ8%l2KK3ok4nK0mj4j2K0J8j8m
$$ -11 -8 5 10 6 6 16 20 15 4 4 -2 -4 -14 -11 -15 -13 -18 -18 -23 -10 -11 -6 -11 -3 21 15 10 12 30 30 -2 0 23 17 -7 -12 8 4 -10 -22 -2 16 -2 -6
5533fJ9Kj2kNMj4KoJ4j3lm%oKJ3j5KQJ9j7jjK0qj1J7J2j0j6MJ9j0k5K0R%j1j0
$$ -6 13 15 3 1 6 10 -4 -2 -8 6 -7 -10 -14 -14 -20 -18 -5 -20 -18 -10 9 -8 -9 -10 10 2 -9 8 20 10 -6 -2 17 7 -18 2 11 11 0 -10
5573a0K9nj1jJ0nonJ1Jj2nJ4jj0%jOj2J6lj4JJ6%r%OJ0j5j5RK4j2j2J5J8j5j4
$$ -10 19 14 3 2 12 7 1 -4 7 8 -4 -9 5 4 -6 -6 -7 -1 -13 3 0 -14 -13 3 3 -6 -6 0 10 -5 -20 -11 13 1 -11 4 22 7 -7
5612gJ8J5j7j1JJ0kopJ3jj2kJ2Qj4lJ4pKmJlnLRj3j1lNP%LNroJ7J6rj9J5J4rj1
$$ -7 11 26 9 -2 -1 9 7 1 -6 7 6 -6 -8 4 12 -2 -5 9 2 4 0 1 -2 -7 -4 5 -8 -19 -22 -17 -10 -10 -7 -2 -11 -17 0 16 7 -12 3 17 8 -3
5656cJ7Pj8j5PJ8j6oOROj1%J3LojJ2Qk3Lkjk4J8j4k2J3K%PKRJQoJ1Mj1jOjqqr
$$ -3 14 21 3 -12 -5 13 -3 -9 -3 6 12 1 1 14 17 11 10 22 30 7 10 8 7 -17 1 -13 -35 -22 -20 -20 -13 -11 -2 -1 7 1 12 16 5 4 10 9 1 -7 -16
5701a6J3j4nRJ0NpKJ0NlKJ7nk0J2JLj3rLoJj5J1KoJ3kJrJ2K%jPj3mnLQj0mQQj0
$$ -16 -3 -17 -22 -13 -3 2 -5 -3 7 12 9 11 28 23 3 15 16 19 6 -3 0 -6 -5 -20 -9 -7 -13 0 -2 -1 -10 2 4 4 3 10 -3 -7 -12 -9 -1 -11 -15 -7 1 -9
5747ilJ2QnJPO%j5%K3j0k0%J3lj6%JKKJJQMmMp%qM%lKJnoPjKrNJ1nj2J3J3%k1
$$ -9 -12 0 8 3 4 11 17 17 2 2 25 15 -5 -5 8 5 -11 -11 -10 -8 -6 -5 -4 4 8 4 8 1 1 -7 -3 -3 -6 -4 -3 -8 -14 -7 -8 -6 -15 -10 1 -4 -16 -3 10 10 -11
5796a1J6Qlj3MJ8nj3QOlKj7K0mqj0jJ5qk%OJoLjkqjOMlMnoKknjJ0LjMj0J5jrJ0
$$ -11 5 13 10 -3 1 19 14 1 9 15 12 14 -3 17 13 5 -5 -6 9 1 -1 -1 5 6 0 3 2 0 -8 -9 -3 1 -2 2 -3 -9 -7 -9 -14 -15 -5 -2 -3 1 -9 6 5 -4 6
5845FMnmlJ2Oj5mJ1Mj5mJ0LrqJ2Ool%KJ1mnjj5J0qJ3k0J0qMJJ0lmlRJ2pj4kJ6
$$ 6 10 5 1 -2 10 16 1 -3 8 12 -3 -7 3 6 -3 -11 1 7 1 -2 -2 0 11 7 2 1 -14 -4 -12 1 -19 -9 -17 -13 -12 -2 -5 -9 -12 -3 9 2 -12 -14 2
5890BKj1KJ3kj7LJ9mj1jOJ2pjQopkRKj3P%kqKJ0j2KloNoRLNj0LJ4j2pJ2KPk3N
$$ 2 4 -7 -5 8 6 -11 -8 11 7 -4 -5 1 13 6 5 13 7 0 -2 7 9 -4 3 3 1 -7 -5 5 -7 -5 -8 -14 -9 -15 -6 -3 2 -8 -5 9 -3 -10 2 4 11 -12 -7
5937gJ5rOKNomoRmKnJ2omM%MqPjLnjOppOkJk8J7KmmLJLJ2kLKj4MOlpLLklKQml
$$ -7 8 -1 5 7 12 6 2 -4 5 1 3 -2 10 4 0 4 4 8 0 7 6 9 4 3 9 2 -5 1 -1 0 -28 -11 -9 -13 -17 -14 -13 -10 2 0 3 5 -9 -5 1 -2 -9 -6 -3 -5 -8 -6 2 -2 -5
5992eNJ4pj0J4NnqOOj7Ml%Kj2K%MkNjmKjKj0LJ1LJj0RrNj1jMjJ2pMMkRqOJ2nq
$$ -5 0 14 7 -3 11 16 11 3 9 15 -2 2 -1 -1 1 -11 -9 -9 -5 -7 -2 -3 -7 -5 -6 -4 -14 -11 0 3 4 -6 3 -6 -1 -12 -13 -9 -10 2 -5 -1 3 1 10 2 8 20 15 7
6042GN%Nj1j1J0MRj2nLnJmJ1jrMjkKjqnNmJQkkLmNOkrJ4Mj1JKQonNJ1mnpPNOq
$$ 7 12 12 17 6 -5 5 9 18 6 1 4 -1 0 -4 7 6 -3 1 0 -2 0 -1 -9 -14 -9 -13 -12 -4 -6 -8 -5 -9 -4 2 0 -9 5 9 -2 -1 1 9 3 -2 3 14 10 5 -2 5 10 16 8
6095Hl%JnkLPk0MLJ5j3kn%KLnQMKqj0NKjmJ0mMoJ5%mLp%QmrJ3jNmJLqj0RLmoP
$$ 8 5 5 6 1 -1 2 9 -11 -7 -4 11 -2 -4 -9 -9 -7 -4 -9 -1 3 5 -3 -13 -8 -6 -7 -11 -1 -5 -1 -7 8 8 4 7 0 0 8 4 -5 8 7 12 8 9 12 4 -6 3 6 2 -4 3
6148CPjlm%KpJjOj5J1j0POqj0KMJ8j0qJOJ2j3OPkq%JJ4j0j4J4J0poNJ2j1Mj4J2
$$ 3 10 9 6 2 2 4 -3 -2 -3 3 -12 -1 -11 -4 2 -6 -16 -14 -10 8 -2 -10 -9 -3 9 -4 2 9 7 -1 -1 0 14 4 -10 4 14 7 1 6 18 7 11 -3 9
6193IkmJkJkolJnJ3j4MMjqOMlMj4NQMlrJ5%j4JJ2QqnONrpJ3Mnj1RPlq%OQj8j0
$$ 9 7 3 4 2 3 1 -5 -8 -7 -12 1 -13 -9 -5 -6 -14 -8 -4 -7 -3 -17 -12 -4 0 -3 -12 3 3 -11 -10 2 10 2 -3 3 8 -1 -8 5 9 4 -7 2 9 6 -2 -2 4 12 -6 -16
6244a6J1KnjnKPoOplJ6j0rJ4Kj1PoJ0MloJ1Qj2j2J1J1j8J0mQK%KRopoJ4j2MqJ2
$$ -16 -5 -3 -8 -9 -14 -12 -5 -11 -5 -12 -15 1 -9 -18 -4 -2 -13 -6 -12 -2 2 -1 -7 4 12 0 -12 -1 10 -8 2 -2 6 8 8 10 19 13 6 0 14 2 6 -2 10
6289A0pjj3OLj2QnQnOj3J1Jnj1K0rRkj5J4MrNmJ0j2Rj1RJ8j5j0J4KOj6RJ0oj1
$$ 10 3 2 -11 -5 -2 -14 -6 -11 -3 -8 -2 -15 -4 -3 -8 -19 1 -8 1 -1 -16 -2 2 -7 -2 -6 4 -8 1 -10 -1 17 2 -8 6 8 14 -2 7 17 11 0
6331@jjJ7lj6OKpOqOrRmoJ4j9QlNJkl%J1p%qQMLJLLonQMjolMjjlJ5Jj8ROlrlJ1
$$ 0 -1 -2 15 12 -4 2 4 -3 3 -5 1 -8 1 -3 -9 5 -14 -6 -9 -4 -3 -5 -8 -8 3 -4 -4 -12 -4 0 3 4 7 10 4 -1 7 11 10 4 1 5 4 3 0 15 16 -2 7 13 10 1 -2 9
6385ImlqmPqkJ6jk0K0Lljj0MkJ1j7J7Kj0MmQ%oJ2%mkJ0rkJLNmrJ7j0omLRj5KO
$$ 9 5 2 -6 -10 -3 -11 -13 3 2 -18 2 5 2 1 -9 -5 -7 4 -13 4 6 -4 0 -4 4 4 -2 10 10 6 4 14 5 3 4 7 12 8 -1 16 6 0 -4 -1 8 -7 -5 1
6433AJkpPKj0NOJj1LnLlRmoMNjoM%MJoMOmlMLJj0J1Oj2LrJ2nkLJlljQlj2J3%j0
$$ 1 2 0 -7 0 2 -8 -3 3 4 -7 -4 -9 -6 -9 0 -4 -10 -6 -1 -2 -8 -4 -4 0 1 -5 -1 5 1 -2 2 5 6 -4 7 13 1 4 -5 7 2 0 3 4 1 -2 -3 5 2 -10 3 3 -7
6486gKj0J9j2Mj1J0PqmPPj8J6NojQkPj4NPjj1Ql%oJ4jKj0QMnnJRj2qNJ5nrpkM
$$ -7 -5 -15 4 -8 -4 -15 -5 2 -6 -10 -3 4 -14 2 7 1 0 8 6 13 -1 4 11 10 -1 7 4 4 -2 12 11 13 3 11 15 10 5 6 15 3 -5 0 15 10 1 -6 -8 -4
6534dj3PNPqNM%NrLQj9MJ1jj4J3ROrj4RRj2RjMj2lJ3nJ0j7PoMMkJj1POj5jQQj2
$$ -4 -17 -10 -5 2 -6 -1 3 3 8 -1 2 10 -9 -5 6 5 -9 4 13 19 10 -4 5 14 2 11 10 14 2 -1 12 7 17 0 7 1 5 9 7 8 -3 4 10 -5 -6 2 10 -2
6582bj3J2mKj1%J3lmPJnMN%nMlJ2lnjNJMnJ4j1j0LPj0lQQj1KnNj1NJlK%j0kRj2
$$ -2 -15 -3 -7 -5 -16 -16 -3 -6 -10 -3 -2 -7 -3 2 2 -3 1 -2 10 7 2 1 6 7 11 6 20 9 -1 2 9 -1 -4 4 12 1 3 -2 3 -8 -3 -2 -5 -3 -3 -13 -15 -6 -18
6631a8J2Oj1kRmjOj0J5joRj4J1Q%j3QjlJ1Lqj%kPqKOKklj4J3lkJoRj1MPj8jJ2
$$ -18 -6 0 -11 -13 -4 -8 -9 -3 -13 2 1 -5 4 -10 1 9 9 -4 4 3 0 11 14 6 5 5 3 10 2 4 10 12 10 7 -7 6 3 1 2 -4 5 -6 -2 5 -13 -14 -2
6678blkkMj1J4oJNlRooRjKJlLRoMrLJOkj3NJ1j2KjJ4mj2MkJ6j9Kn%oMMLq%KOj
$$ -2 -5 -7 -9 -5 -16 -2 -8 -7 -2 -5 4 -2 -8 1 0 2 3 0 3 12 6 10 1 4 5 11 9 -4 1 12 0 2 1 15 11 -1 3 1 17 -2 0 -5 -5 -11 -7 -3 0 -8 -8 -6 0 -1
6730aqKQOpmOjk%pNONj4QQLjnPKj7NJ0j3PqKNoOj0OJ3j4%KlL%oLrkQKrQ%k%mR
$$ -1 -9 -7 1 7 0 -4 2 1 -1 -1 -8 -3 3 8 -6 2 10 13 12 7 14 16 -1 4 14 1 8 0 2 7 1 7 -3 3 16 2 2 4 1 4 4 -2 1 -8 -10 -2 0 -9 -1 -1 -3 -3 -7 2
6784Bj3QMO%qRMqj0R%j2QQOj0j3J2KkQ%KMj5Km%JnKjoQj3OjNJ1j3J3oRlrLj3Q
$$ 2 -11 -3 1 7 7 -1 8 12 4 -6 3 3 -9 -1 7 13 3 -10 2 4 2 10 10 12 16 1 3 -1 -1 0 -5 -3 -4 -10 -2 -15 -9 -10 -5 6 -7 6 0 9 6 -3 0 -13 -5
6833eMjjlRKj0J0JKJJ7k6J8jplLJLj1rJ1mljJ2k6PKMRorJ2oPJomjKjnOkMLnQJ4
$$ -5 -1 -2 -3 -6 3 5 -5 5 6 8 9 26 0 18 17 10 7 10 11 14 3 -6 5 1 -2 -3 9 -17 -10 -8 -4 5 -1 -10 2 -4 3 4 -2 -6 -7 -5 -6 -11 -5 -7 -3 0 -5 3 17
6884A7jlKjqQpJ2j2Nj1OOj8mJ1NqJ4kjj7J8rL%lPj8kLQqr%J0L%J0KrLnJ0mkPM
$$ 17 16 13 15 14 6 14 7 19 7 12 1 7 13 -5 -9 2 7 -1 13 11 10 -7 11 2 5 5 2 9 -9 -11 -8 0 -8 -17 -17 -7 -4 -4 6 8 -1 2 -3 7 3 1 8 12
6932A2j3j0J1PJlLjQj9MJ6JprPPj2MnJj1QMnJj2J2Kkj1MKkJ1m%LrONqJ2mnlMO
$$ 12 -1 -11 0 7 8 5 8 7 15 -4 0 16 17 10 1 8 15 3 7 2 3 -8 0 4 -1 0 -12 0 2 0 -11 -7 -5 -7 4 0 0 3 -6 0 5 -3 9 5 0 -3 1 7
6980GLoPpJLPKqklRnpPMpj0J5jjqlPkj0QNomMKnnMQlKpJ2ooJ5ljmkJ0npMJ7j0
$$ 7 10 4 11 4 5 8 15 17 9 7 4 13 8 1 8 12 5 -5 10 9 8 0 -3 4 2 -8 0 5 -1 -5 -1 1 -4 -9 -5 3 0 2 -5 7 1 -5 10 7 6 2 0 10 5 -2 2 19 9
7033IrJ2QkqJ1j3Rj3%NonKKjqmPNlJ1pOnmjMmmKNj0NjRj6J5mPoNPoLj1ORpJ1r
$$ 9 0 12 20 18 10 21 8 17 4 4 9 3 -2 0 2 1 -7 -11 -4 1 -2 9 2 8 3 -1 -2 2 -2 -6 -4 1 -9 -4 -5 4 -12 3 -1 6 0 5 12 6 9 -2 4 13 6 17 8
7084HLl%jkj%J%plPnOpRj0oOQ%j1mJ6o%mJ2jj2NkMj0nK5oj2LLRkJ0pJ0okNJkr
$$ 8 11 8 8 7 5 4 4 5 5 -2 -5 2 -3 3 -4 5 -5 -11 -5 3 3 -8 -12 4 -2 -2 -6 6 5 -7 -2 -4 0 -10 -15 10 4 -8 -5 -2 7 5 15 8 18 12 10 15 16 14 5
7135EJj1MllMoJOOj0RNlkNpJ0j7nLKj1kK1j4KNQN%jKJ0orO%lNj5Rj1OLrOMOqk
$$ 5 6 -5 -1 -4 -7 -3 -9 -8 -2 4 -6 3 8 5 3 8 1 11 -6 -11 -8 -6 -17 -19 2 -12 -10 -5 3 8 8 7 9 19 13 4 10 10 7 12 -3 6 -5 1 4 -5 1 5 11 3 1
7186AKRjoMmnkjLj2j1QLNj0KNLmJ1LLlKMnpRmoPj6J1J0%qjJ5koJLmJ4j5kJKjj8
$$ 1 3 12 11 5 9 5 0 -2 -3 0 -12 -23 -15 -12 -7 -17 -15 -10 -7 -11 0 3 6 3 5 9 4 -3 6 2 -4 3 -13 -2 8 8 0 -1 14 12 6 7 10 6 20 5 3 4 6 5 -13
7237a3R%LmpNPolMJ2j4OoJ6j6nKKRnRpKJjNKJMmojLrJMQjnJOjnPNj5Lj0J0mlp
$$ -13 -4 -4 -1 -5 -12 -7 0 -6 -9 -5 7 -7 -1 -7 9 -7 -12 -10 -8 1 -4 5 -2 0 1 0 5 7 8 12 8 2 1 4 -5 -4 0 8 7 2 3 9 8 3 10 15 0 3 -7 3 -1 -4 -11
7290a1kOnqMJ5p%%LJ4qOPj2MNroPmmmJ2k%MNMkjMQmoNkj1j2pK1j2j4PPklJjOM
$$ -11 -13 -7 -12 -20 -16 -1 -8 -8 -8 -5 9 1 7 14 2 6 11 2 -4 3 -1 -5 -9 3 1 1 5 10 14 12 11 15 23 19 13 18 16 5 -7 -14 7 -5 -19 -12 -5 -7 -10 -9 -10 -4 0
7341@mJ0MlnmJ8j8nnNJk%mKjJ4NjNKMnP%noM%j3jrJ1jj0OjKj2PJ7Nj2kJ5j1rl
$$ 0 -4 6 10 7 2 -2 16 -2 -7 -12 -7 -6 -8 -8 -12 -10 -11 3 8 7 12 14 18 13 20 20 15 9 13 13 0 -1 -10 1 0 -10 -4 -5 -3 -15 -8 9 14 2 0 15 4 -5 -8
7390hQkpKmOJmJOKOjRqL%kOpJ0j7RLrkj2MJ5Mk1J1J0j1pnK0j4KnRLj2JNkj0QP
$$ -8 0 -2 -9 -7 -11 -5 -4 -8 -7 -1 1 7 6 15 7 10 10 8 14 7 17 0 9 12 3 1 -11 -7 8 12 -9 2 12 1 -6 -11 9 -5 -3 -8 1 4 -8 -7 -2 -4 -14 -6 1
7439ApLqmJ3j0NOjPoNMKPqKknKrPkKnkJMlPj4QmnJ5Ljj5Nl%rjJ1nj0%PQj3NR%
$$ 1 -6 -3 -11 -15 -2 -12 -7 -1 -2 5 -1 4 8 10 17 9 11 9 4 6 -3 4 2 4 -1 -3 -2 2 -1 6 -8 0 -4 -9 6 9 8 -7 -2 -5 -5 -14 -15 -4 -9 -19 -19 -12 -4 -17 -12 -3 -3
7492cr%J4Mj1MJ1JoK%oMJlqpOQjlLQooRJ4k0LlKkj7MnJ2j9jQOk%Rnj2J6OJ3rK
$$ -3 -12 -12 2 6 -5 -1 10 11 5 7 7 1 5 6 3 -5 -12 -6 2 1 -2 1 9 3 -3 6 20 0 3 0 2 0 -17 -13 -18 -6 -25 -26 -18 -12 -14 -14 -5 -10 -22 -6 0 13 4 6
7542FPkmj0J1lpk%j0J1QLnrkK5nolJ4j3Qj4J5j3j2J1mokj0J3oJMPJjJJ7Jr%ll
$$ 6 13 11 7 -3 8 5 -2 -4 -4 -14 -3 5 8 3 -6 -8 17 12 6 3 17 4 12 -2 13 0 -12 -1 -5 -11 -13 -23 -10 -16 -15 -11 -4 -3 -4 -3 14 15 6 6 3 0
7588@nlJ7j5Mj2J5plNJ1nNJ9nkoJ0j1Nj2kkLj1qJ0oNljQj8J7KRkj7J4LnjJjrk
$$ 0 -5 -8 9 -6 -2 -14 1 -6 -9 -4 7 2 7 26 21 19 13 23 12 17 5 3 1 4 -7 -15 -5 -11 -6 -9 -10 -2 -20 -3 -1 8 6 -11 3 6 1 0 1 0 -9 -11
7634a1lPj6J0NOJPJ0j5J6rJ7mrj2QMqjNj2jmJ1KnoJ8j0j3J3jLrLNJj2mNqmJ2j
$$ -11 -14 -7 -23 -13 -8 -2 -1 6 16 1 17 8 25 21 12 0 8 12 4 3 8 -4 -5 -9 2 4 -1 -7 11 1 -12 1 0 3 -6 -3 2 3 -9 -13 -8 -16 -20 -8 -9
7679ilOj0J5j1J0kJJ3k0J8qLrJ3OmpKrJ4j4LOjmjMNj6K%RrlPjkMJJj0oJ3kp%Q
$$ -9 -12 -6 -16 -1 -12 -2 -4 -3 10 -10 8 0 3 -6 7 13 9 2 4 -5 9 -5 -2 4 3 -1 -2 2 7 -9 -7 -7 2 -7 -10 -3 -4 -6 -2 -1 0 -10 -16 -3 -5 -12 -12 -4
7727dmlrJ0NkjNQmPJJ%jj1J8j4nMjj9OPj0J3lnQQMJOnrJmkkrnjMNj4J0mJ1Rj0
$$ -4 -8 -11 -20 -10 -5 -7 -8 -3 5 1 8 9 10 10 9 -2 16 2 -3 1 0 -19 -13 -6 -16 -3 -6 -11 -3 5 9 10 16 11 2 3 -1 -3 -5 -14 -19 -20 -16 -11 -25 -15 -19 -8 1 -9
7777iJ3Rqn%J0Poj5J0%j3mNKjjlJ0MJlJRrOmjkj5nLRj0pLJMkQNNMkRj0kmkMLj3
$$ -9 4 13 5 0 0 10 17 11 -4 6 6 -7 -11 -6 -4 -5 -6 -9 1 5 6 3 4 13 4 10 6 5 3 -12 -17 -14 -5 -15 -22 -19 -18 -14 -16 -8 -3 2 6 4 13 3 1 -3 -5 -1 2 -11
7829a1OnOnoRJ5pMmJ6Oj5%O%nMj2mpllKRlk%l%JKMMjPr%%m%J3j1kMj1OoJ1MNL
$$ -11 -5 -10 -4 -9 -15 -6 9 2 6 2 18 24 9 9 15 15 10 14 2 -2 -9 -12 -15 -13 -4 -7 -9 -9 -12 -12 -11 -9 -5 -1 -2 5 -4 -4 -4 -8 -8 5 -6 -8 -4 -15 -9 -15 -4 0 5 8
7881Hj1KJ3Pqj2J1rLnPKnrMPrlnJ7qpMMmMloJ0kjJrJ0pQpRolJ2klQj0oJ6oNpO
$$ 8 -3 -1 12 19 11 -1 10 1 4 -1 6 8 3 -6 -2 5 -4 -7 -12 5 -3 -10 -6 -2 -6 -2 -5 -11 -1 -3 -4 -3 -12 -2 -9 -1 -8 1 -5 -8 4 2 -1 7 -3 -9 7 1 6 -1 5
7932EjJ0j6J3pJjpkJ1j3rJ0J6nj8KJ3j2nRMprPJ0%oMj0OQpJnLpJ1qOJ1%%%OnO
$$ 5 4 14 -2 11 4 5 4 -3 -5 6 -7 -16 -6 10 5 -13 -11 2 -10 -15 -6 -2 -9 -18 -11 -1 -1 -7 -3 -13 -7 1 -6 -5 -10 -7 -14 -3 -11 -5 6 6 6 6 12 7 13
7979A3LKj2jj2MJ4k2QJp%nJ4Kj3J1kNlmLlkmMjJMpQj0mKJ8j1PNJ1rmPjmmJOj1
$$ 13 16 18 6 5 -7 -3 11 -11 -3 -2 -9 -9 -14 0 2 -11 0 -2 3 0 -4 -1 -4 -6 -10 -6 -7 -6 -2 -9 -1 -11 -15 -13 5 -6 1 6 17 8 4 11 10 6 2 3 9 -2
8027bmpJ0jJRj1%%J0Qj3pJ1PlmpJ2j0qnlMQjjkkKNKLM%%mNoQpjmmRlLKJNMlml
$$ -2 -6 -13 -3 -4 -3 6 -5 -5 -5 5 13 0 -7 4 11 8 4 -3 9 -1 -9 -14 -17 -13 -5 -6 -7 -9 -11 -9 -4 -2 1 5 5 5 1 6 0 8 1 0 -4 -8 1 -2 1 3 4 9 13 10 6 3
8081CMKqpJ2kj0oJ0nmpJ5lkLLlMj2QNj%n%OOj0RnLnMLLLonNPnP%Mqj4PM%j4NK
$$ 3 7 9 1 -6 6 4 -6 -12 -2 -7 -11 -18 -3 -6 -8 -5 -2 -5 -1 -13 -5 0 -1 -1 -6 -6 0 6 -4 5 0 3 -2 2 5 8 11 5 0 5 12 7 14 14 18 10 -4 3 7 7 -7 -2 0
8134@mJjKjj2J8pMj2K%RlmNpQLKqM%J4lp%JnMkQpkJ5knj2J1PpoPlmMj4RKj7MQ
$$ 0 -4 -3 -4 -2 -3 -15 3 -4 0 -12 -10 -10 -1 -4 -8 -3 -10 -2 1 3 -5 -1 -1 13 10 3 3 4 -1 3 1 9 2 0 15 13 8 -4 7 14 7 1 8 5 1 5 -9 0 2 -15 -11 -3
8186ckqnJ2L
$$ -3 -5 -13 -18 -6 -3
8191c
$$ Imaginary data points
##PAGE= N=2
##DATA TABLE= (X++(I..I)), XYDATA
0@%%%%%%%%%%%%%%%%%%%mJ2j6J6j6J6j7K5l2L3l9M7n3O1p0P8r0J02j14J27j41
$$ 0 0 0 0 0 0 0 0 0 0 0 0 0 0 0 0 0 0 0 0 -4 8 -8 8 -8 8 -9 16 -16 17 -22 25 -28 33 -37 41 -49 53 -61 66 -75
40g5J61j80J97k21K45k70L01l32L67m06M43m86N37n91O50p16P92q75R69j075J195
$$ -75 86 -94 103 -118 127 -143 158 -174 193 -213 230 -256 281 -310 340 -376 416 -459 510 -565 630
61F30j334J496j685J905k154K401k475J300J6256K42155j02709l37788N1943K94367
$$ 630 -704 792 -893 1012 -1142 1259 -1216 84 16340 258495 155786 -182002 -130059 164308
75A64308J7736k54719n1837J80876M5616j52660l8597J17810K0454j20144k8852
$$ 164308 182044 -72675 -124512 56364 101980 -50680 -89277 28533 48987 -71157 -100009
86a00009R9886M0560o6458k6335M8911L3159p78P553j3179l3039L2857Q0664l1402
$$ -100009 -123 40437 -26021 -52356 -3445 29714 28936 36489 23310 -9729 23128 103792 72390
99G2390j32985q649J48746L4094j68157q0939J55157J10140j31398j20969J14968
$$ 72390 -60595 -69244 79502 113596 -54561 -135500 19657 129797 -1601 -122570 -7602
110g602J31409q6992j14141R1219J18884q5530j20176Q2967J23284q7185j48262
$$ -7602 123807 36815 -77326 13893 132777 47247 -72929 10038 133322 46137 -102125
121a02125O0240J48333m4307j56879Q318J39748J7460j10943k8470Q2514L4030
$$ -102125 -41885 106448 62141 -94738 -86420 53328 70788 -40155 -68625 13889 47919
132D7919m3639j1408K9540o001k1916K1267J7581l9974k9524L6743K3644m4700
$$ 47919 4280 -7128 22412 16411 -5505 15762 33343 -6631 -36155 588 24232 -20468
144b0468k5753M4563J8828n1157j0540O9497J7268p8969k0625R6418L9360j02630
$$ -20468 -46221 -1658 17170 -33987 -44527 24970 42238 -36731 -57356 39062 78422 -24208
156b4208o1686R7809Q1641q5070r9287N8739R7772m0396r2568K3962Q0827j3042
$$ -24208 -85894 11915 93556 8486 -90801 -32062 65710 25314 -67254 -43292 37535 24493
168B4493o2634J8169N8391j7986n3641J9891N4249j6918n5049P659M7770k107
$$ 24493 -38141 -19972 38419 20433 -33208 -13317 40932 24014 -31035 -23376 24394 22287
180B2287l9488m281K3586J613q418R480J078k0561M435L7635K637m6266j1416
$$ 22287 -17201 -21482 2104 3717 -4701 4779 5857 -14704 -10269 27366 30003 -16263 -27679
193b7679M9351J9020n0253k8384M2757K7919m0965k8902L8319K7457l8767k6934
$$ -27679 21672 40692 -9561 -37945 4812 32731 -8234 -37136 1183 28640 -10127 -37061
205c7061M2463L3065l9586l5361L9535M2981l2272m6940K1812M4789j4702m3879
$$ -37061 5402 38467 -1119 -36480 3055 46036 13764 -33176 -11364 33425 18723 -25156
217b5156K559L2359o01k4863j093J6051q92p697Q911Q838r545n609J4532Q669
$$ -25156 -22597 9762 9161 -15702 -16795 -744 -1636 -9333 -422 8416 -1129 -6738 7794 16463
231A6463j3020p625J1329L104j4604k886J3667l672k2224J278K6421J543k9843
$$ 16463 3443 -4182 7147 10251 -4353 -7239 6428 2756 -19468 -18190 8231 9774 -20069
244b0069n434L3570J4887k7495j5575K6915K0785k0273k0069J5786J7181j5401
$$ -20069 -25503 8067 22954 -4541 -20116 6799 27584 7311 -12758 3028 20209 4808
256D808j8173J0961J3805j3038j6110R531J4328q149j3305P273J4425j436q481
$$ 4808 -13365 -2404 11401 -1637 -17747 -8216 6112 -2037 -15342 -8069 6356 4920 -3561
269c561K554P555K74k015J574j197m485J799N022n320j0944J335R512k901j2245
$$ -3561 -1007 6548 6822 4807 6381 5184 699 2498 7520 2200 -8744 -7409 2103 -798 -13043
284a3043R77J2656Q42j0807J357J4262K571j1291l79J4133L231j3666n438J1470
$$ -13043 -12066 590 1432 -9375 -8018 6244 8815 -2476 -2855 11278 14509 843 -4595 6875
298F875M793j3082r632P268O673p916q429M821P588j903l919L841N859J05j156
$$ 6875 11668 -1414 -11046 -3778 2895 -5021 -13450 -8629 -1041 -2944 -6863 -3022 2837 2942 1786
313A786K966L015p38j078M32j454l331j543q46l636l130J949K387l091l041M503
$$ 1786 4752 7767 7029 5951 6383 4929 1598 55 -791 -4427 -7557 -5608 -3221 -6312 -9353 -4850
329d850O189j372l595M668Q301K4n497O91N418j196p370k443L362q68o416k648
$$ -4850 1339 -33 -3628 1040 9341 9365 3868 4559 9977 8781 1411 -1032 2330 1462 -4954 -7602
345g602L130Q49l720q95M587L775j87M89L654K966j14q40J60l13j283j333j911
$$ -7602 -4472 -3623 -7343 -8238 -3651 124 -63 426 4080 7046 6932 6092 6252 5939 4656 3323 1412
362A412l008k045j95q71k614q18K774K331n16N38M283L617n09p22K548J859k814
$$ 1412 -1596 -3641 -3836 -4707 -7321 -8139 -5365 -3034 -3550 -3012 1271 4888 4379 3657 6205 8064 5250
379E250l578R2N41l344l973RJ398j541k196J426L080P89O5K573L156M33o31Q23
$$ 5250 1672 1764 2305 -1039 -5012 -5003 -3605 -5146 -7342 -5916 -2836 -2047 -1982 591 3747 4180 3549 4372
397D372N70j620j647M7o92k863j831P21j41k378n26L094K290q26K22L502K123
$$ 4372 4942 3322 1675 1722 1030 -1833 -3664 -2943 -3084 -5462 -5988 -2894 -604 -1430 -1208 2294 4417
414D417j736j115K120Q97k890k144J438L14l567k378J860J388k310j228L191L019
$$ 4417 2681 1566 3686 4583 1693 -451 987 1301 -2266 -4644 -2784 -1396 -3706 -4934 -1743 1276
430A276q67o55K722J892j645j091J650M9l299j502J947l86m138j315L359J251
$$ 1276 409 -246 2476 4368 2723 1632 3282 3331 32 -1470 477 91 -4047 -5362 -2003 -752
446g52l039j57N010K537k899o23M516J681m143j892L517M36n796k924L733J083
$$ -752 -3791 -3948 1062 3599 700 77 4593 6274 2131 239 3756 4192 -1604 -4528 -795 288
462B88n757k848N315L984l507k383N115M824j880k089K983J936l342k342J943
$$ 288 -5469 -8317 -3002 982 -2525 -4908 207 5031 3151 1062 4045 5981 2639 297 2240
477B240m87n251k098L201P1n227j261N142K058l324P91O537J912m342M08O121
$$ 2240 1753 -3498 -5596 -2395 -2324 -7551 -8812 -3670 -1612 -4936 -4145 2392 4304 -38 370 6491
493F491m33p849j184P147j67j0430l851Q048L111q970m899Q197O801m398l443
$$ 6491 6058 -1791 -2975 4172 4005 -6425 -10276 -2228 883 -8087 -12986 -4789 2012 -2386 -5829
508e829O278N048l607j720N954K120o953l251O039J887q562n480N191L665n274
$$ -5829 449 5497 1890 170 6124 8244 1291 -1960 4079 5966 -2596 -8076 -2885 780 -4494
523d494l282N059L303l248N44P083J846n244O81Q086N48r054k354P701J246r636
$$ -4494 -7776 -2717 586 -2662 -2118 4965 6811 1567 2248 10334 10882 1828 -526 7175 8421 -1215
539a215m310O256J862p156j722P111J367o311K084J0927Q52j0649o48J3029L675
$$ -1215 -5525 731 2593 -4563 -6285 826 2193 -4118 -2034 8893 9745 -904 -1552 11477 15152
554A5152j2794o749R449N699r652p795N506M545o091l526O427K981o409j420Q806
$$ 15152 2358 -4391 5058 10757 1105 -6690 -1184 3361 -2730 -6256 171 3152 -3257 -4677 4129
569D129L598p356k792P920L461p158l712N128P56o921j219N852j648q633J510
$$ 4129 7727 371 -2421 5499 8960 1802 -1910 3218 3974 -2947 -4166 1686 38 -8595 -7085
584g085J0488m50j1165K20J3297K723j2062l562J1552M695j0063m849Q313L219
$$ -7085 3403 2953 -8212 -7992 5305 8028 -4034 -7596 3956 8651 -1412 -6261 2052 5271
598E271q747l201P951J398r742j730J0790K988j0664l673J0994N758q684n307
$$ 5271 -3476 -6677 1274 2672 -7070 -8800 1990 4978 -5686 -9359 1635 7393 -1291 -6598
612f598P603N020o058l561N379J304o654o24P497k5r085n57J0076J842r911k554
$$ -6598 1005 6025 -33 -3594 1785 3089 -3565 -4189 3308 3283 -5802 -6359 3717 5559 -4352 -6906
628f906R589L427q077k542P739J598p936o72Q776K4j0640j167J1462K704j1379
$$ -6906 2683 6110 -1967 -4509 3230 4828 -3108 -3780 4996 5020 -5620 -6787 4675 7379 -4000
643d000m180J0569N457q692n428P005M433o114l300N713J971o074j091O573L25
$$ -4000 -8180 2389 7846 -846 -6274 731 5164 -950 -4250 1463 3434 -2640 -3731 2842 3167
658C167p584k51Q744J195q889j990Q631K782p681k910O430K003n937o28O308o85
$$ 3167 -4417 -4668 4076 5271 -3618 -5608 3023 5805 -1876 -4786 1644 3647 -2290 -2918 3390 2705
674B705p917N92R524Q04r945k296R606L842p979m179O298L390n136j823N238M50
$$ 2705 -5212 -4620 4904 5708 -4237 -6533 3073 6915 -1064 -5243 1055 4445 -691 -2514 2724 3174
690C174o299qP527N13q417j737Q387K903p649l788O242L740m829k849M085J570
$$ 3174 -3125 -3133 4394 4907 -3510 -5247 3140 6043 -1606 -5394 848 4588 -241 -3090 995 2565
706B565m028l22M790k59n729J59O407K71o959j521O285J924n504j972M306Q16
$$ 2565 -1463 -1785 3005 2746 -2983 -2824 3583 3854 -3105 -4626 1659 3583 -1921 -3893 413 1229
722A229m334%M690p22n521R12O802J08p129j229O764K050o056k517M882K068m584
$$ 1229 -3105 -3105 1585 863 -4658 -3746 3056 3164 -3965 -5194 1570 3620 -2436 -4953 -71 1997 -2587
739b587j984L934J337m014j034M107R98m161q14M484J431m032j292M041J848l205
$$ -2587 -4571 -637 700 -3314 -4348 -241 757 -3404 -4218 266 1697 -2335 -3627 414 2262 -943
755i43j542K582Q91k413l30K315n67l001P31L586m48l662O22M434M42l735j22
$$ -943 -2485 97 988 -1425 -1755 560 -7 -3008 -2277 1309 861 -2801 -2179 2255 2697 -1038 -1160
772a160M028P09l426n31L126J68l309j79L164k56l836k01M029P64l771j104L710
$$ -1160 2868 3577 151 -380 2746 2914 -395 -574 2590 2334 -1502 -1703 2326 3090 -681 -1785 1925
789A925J998k337j358K186J279j619p67J405L3k044m10J577k06k154j16K092K72
$$ 1925 3923 1586 228 2414 3693 2074 1307 2712 2745 701 291 1868 1662 -492 -608 1484 1756
806A756j832q4J938K51j561R0J569k97j655N83J933p60k639Q5K339j88k762n62
$$ 1756 -76 -160 1778 2029 468 558 2127 1830 175 758 2691 1931 -708 -623 1716 1528 -1234 -1796
824a796K221M85k110n77J989P97j525m29J680O78j303n35J040M1j457l48J208
$$ -1796 425 910 -1200 -1777 212 1009 -516 -945 735 1413 110 -425 615 656 -801 -1149 59
841E9J31j418m54J016K86q93j15P76j4n73P08J316l27j201M36J373m68j743m8
$$ 59 190 -1228 -1682 -666 -380 -1273 -1388 -612 -626 -1199 -491 825 498 -703 -267 1106 638 -1105 -1153
860a153J408j81j675r5J664L82j426m02J376O16r97k54J254M90r96m47R65M07
$$ -1153 255 74 -1601 -1696 -32 350 -1076 -1478 -102 514 -483 -737 517 1007 11 -436 529 936
878I36j071o97O57N62m75m25K91J59l37J8M05l8k35M79N80n15q08M68R07n12j167
$$ 936 -135 -832 -175 387 -88 -513 -222 -63 -400 -382 23 -15 -250 229 809 294 -514 -46 861 349 -818
899h18L72J292j88j367q9J137k8j239LJ415L13j275l51J308N50j227p85J022Q89
$$ -818 -446 846 658 -709 -798 339 311 -928 -925 490 803 -472 -823 485 1035 -192 -977 45 934
918I34p33q94M52Q04l17q12o1N27J85j88j25Q9K43L17m9m31q4M84J40o67k83P53
$$ 934 201 -693 -241 563 246 -566 -627 -100 85 -103 -228 -139 104 421 372 -59 -143 341 481 -186 -469 284
940B84M41r47p80Q35R70q05j191P65J550l04j546R3J531M6j636m88J456P49j187
$$ 284 725 -222 -1002 -167 803 -2 -1193 -428 1122 818 -728 -635 896 942 -694 -1182 274 1023 -164
959a64r38R56J005p07j171L16J146J31q76l19P97O09n47r36N8R74L30r04o23Q81
$$ -164 -1102 -146 859 152 -1019 -703 443 574 -302 -621 176 785 238 -698 -640 334 664 -240 -863 18
979A8R71p53j266N43J558k38j745p0J962N13k025j126J737J544j341j746R41J911
$$ 18 989 236 -1030 -487 1071 833 -912 -982 980 1493 -532 -1658 79 1623 282 -1464 -523 1388
997A388l84j806l4J525K34j420n71J168Q82p29j003L52J136J16j247q00R94J411
$$ 1388 1004 -802 -836 689 923 -497 -1068 100 982 253 -750 -398 738 854 -393 -1193 -199 1212
1015A212n31j735M6K009M98k259j274K089J867j744k219J531K646j147k997O47
$$ 1212 681 -1054 -1008 1001 1499 -760 -2034 55 1922 178 -2041 -510 2136 989 -2008 -1361
1031a361L159j70l282l88L251J001l055j618K522J996j838k075J293K103o56j850
$$ -1361 1798 1628 -1654 -2042 1209 2210 -845 -2463 59 2055 217 -1858 -565 1538 882 -968
1047i68J56J513J72j229o71O89J025L2j156q21J063J671o33k348K5K882Q83k957
$$ -968 -812 701 873 -356 -1027 -338 687 719 -437 -1258 -195 1476 843 -1505 -1480 1402 2285 -672
1065f72j598K852K096k858k820K570L377k190l818J792M261j168m579M20M633
$$ -672 -2270 582 2678 -180 -3000 -430 2947 757 -3061 -1269 2992 1824 -2755 -2335 2298
1080B298M58m363j113L841J636l248k012K440J980j739j827J123J445o90r99M21
$$ 2298 2756 -1607 -2720 1121 2757 -491 -2503 -63 1917 178 -1649 -526 919 229 -770 -349
1096c49O30j14k31k16l57N23J170m79j983K01K783K70l587j291L857K363l596
$$ -349 281 167 -64 -280 -637 -114 1056 577 -1406 -1205 1578 1848 -1739 -3030 827 3190 -406
1113d06k982L319L433l180l995K889M611k364m899K049N469j226n878kN556R47
$$ -406 -3388 -69 3364 184 -3811 -922 3689 1325 -3574 -1525 3944 2718 -3160 -3162 2394 3341
1129C341m930j590M091J866l318j916K627J901j822j578J305J319o50q42Nl4L26
$$ 3341 -1589 -3179 912 2778 -540 -2456 171 2072 250 -1328 -23 1296 646 -196 -191 -225 101
1146A01R78l61k067j84K653O87l189j247L557J913l777k557L909L322l852m119
$$ 101 1079 718 -1349 -1533 1120 1807 -1382 -2629 928 2841 -936 -3493 416 3738 -114 -4233
1162d233L528M831l049n566J950N628j196n555N03N257R5m982o13M461J019l924
$$ -4233 -705 4126 1077 -4489 -2539 3089 1893 -3662 -3159 2098 2193 -2789 -3402 1059 2078 -1846
1178a846j255L349J508k645j516J768J115j245o99P76J97l62M55J10j230j45K013
$$ -1846 -3101 248 1756 -889 -2405 -637 478 -767 -1466 -690 -493 -855 -400 -290 -1520 -1665 348
1195C48M09k665p34L395J699l438k246L458K814l332l221L231L736k966m080K744
$$ 348 757 -1908 -2642 753 2452 -986 -3232 226 3040 -292 -3513 -282 3454 488 -3592 -848
1211h48M582k272m932J673N225o34m716L31M583L41l959n73L459Q16k812p76K290
$$ -848 3734 1462 -3470 -1797 3428 2794 -1922 -1591 2992 3333 -626 -1199 2260 3076 264 -512 1778
1228A778O36j750m41J311Q0q92M83Q65p17n40J327O07j791p18K243Q67k812j451
$$ 1778 2414 664 223 1534 1614 722 1205 2070 1353 813 2140 2747 956 238 2481 3348 536 -915
1246i15K947J775l153k385L040K695l064l302K740L695k350l977J816M042j374
$$ -915 2032 3807 654 -1731 1309 4004 940 -2362 378 4073 1723 -2254 -438 3604 2230
1261B230m136O77L707n01l597P1L136q5l081l46K497L30k145l53J751K87j345
$$ 2230 -1906 -1229 2478 1977 -1620 -1549 1587 1502 -1579 -1925 572 902 -1243 -1596 155 442 -903
1278i03j39Q26l46o03P36M07j304n35J692O72k207j201K154J427k155j492K336
$$ -903 -1042 -216 -562 -1165 -429 -22 -1326 -1861 -169 503 -1704 -2905 -751 676 -1479 -2971 -635
1295f35J911k246k000K290K361k188k718J871K912j485k904J147K799r36k747
$$ -635 1276 -970 -2970 -680 1681 -507 -3225 -1354 1558 73 -2831 -1684 1115 179 -2568
1310b568P30K747k71k382K26K276J45j718n5J313j63j088M76J051o30j045O54
$$ -2568 -1838 909 638 -1744 -1518 758 903 -815 -870 443 280 -808 -332 719 89 -956 -302
1327c02R12p87q03J068Q72j098p06J531R52j639j243J549J294j574j384J630J550
$$ -302 610 -177 -980 88 960 -138 -844 687 1639 0 -1243 306 1600 26 -1358 272 1822
1344A822j623j758J441J836j336j948J129J980q50j805P70J696p60j669O57J547
$$ 1822 199 -1559 -118 1718 382 -1566 -437 1543 693 -1112 -342 1354 594 -1075 -418 1129
1360A129o49j529N50J349n60j283N36J171n54j085N58R81n94q59O72P62q39p63
$$ 1129 480 -1049 -499 850 290 -993 -457 714 160 -925 -367 614 20 -839 -167 595 -244 -1007
1378a007J037Q46j063r04J119J012j157j143R95J078j040j047J173J255r95j204
$$ -1007 30 876 -187 -1091 28 1040 -117 -1260 -265 813 -227 -1274 -101 1154 159 -1045
1394a045R74J214r93j297R24J337p61j242P68J231p58j314N84J207m67r89N90
$$ -1045 -71 1143 150 -1147 -223 1114 353 -889 -121 1110 352 -962 -378 829 362 -627 -37
1411c7R72n47r38M97P98n81p29O38P40o46o93O48N75p89o09Q50O72q16n85Q66
$$ -37 935 388 -550 -53 745 164 -565 73 813 167 -526 122 697 -92 -701 149 821 5 -580 286
1431B86N52j000o20J021O25j112o84J168Q69j108r71J022R77r52j006Q68R84p85
$$ 286 838 -162 -782 239 864 -248 -932 236 1105 -3 -974 48 1025 73 -933 -65 919 134
1449A34r67P16R29p02r60N91Q78m93p29N62P09m99o32M53M55n56m01O07L72o11
$$ 134 -833 -117 812 110 -850 -259 619 126 -603 -41 668 169 -463 -10 445 -111 -512 95 467 -144
1469a44k33O94J38q98k01R76K73r66k11J151L08j197m65J123M72j133n18J150
$$ -144 -377 317 455 -443 -644 332 605 -361 -572 579 887 -310 -775 348 820 -313 -831 319
1487C19O32j031o50R32N49r41n78R21O04p83n52P47M92p28n02O23M02n31j73O20
$$ 319 951 -80 -730 202 751 -190 -768 153 757 -26 -578 169 661 -67 -569 54 456 -75 -248 372
1507C72Q8p38r1P19o8q81Q9J027pj051m9J091M2j093p7J119J86j050j44J054R4
$$ 372 460 -278 -369 350 282 -599 -510 517 510 -541 -590 501 543 -550 -627 492 678 -372 -516 538 632
1528F32j127k15J048K36r91k38R14K40p87j43P26L6o91J17P28k01p43L12P85m30
$$ 632 -495 -710 338 574 -417 -655 259 499 -288 -431 295 331 -360 -243 485 284 -459 -147 638 208
1548B08r12M20R00n59r92O66J244n69j337M83J384m56j489L22J525j13j389R5
$$ 208 -704 -284 616 57 -935 -269 975 406 -931 -448 936 480 -1009 -687 838 725 -664 -569
1566e69J313j69j361O3J320M4j190o2J117J04r89j45P03j6m80L23N14n32n68P09
$$ -569 744 575 -786 -723 597 641 -549 -611 506 610 -379 -524 179 163 -317 6 520 -12 -580 129
1586A29O74q32p90R09Q74r41r13J027R46j203j131J259J330j221j510J172J727
$$ 129 803 -29 -819 90 964 23 -890 137 1083 -120 -1251 8 1338 117 -1393 -221 1506
1603A506j004j796P79J772p01j786N56J760m12j648L05J502k38j398J42J223j49
$$ 1506 502 -1294 -515 1257 556 -1230 -674 1086 674 -974 -669 833 595 -803 -661 562 413
1620D13r58K27P85l72p10M52M81o76m01R47M58j114m80J332N78j486o68J617Q33
$$ 413 -545 -318 467 95 -615 -163 318 -358 -759 188 646 -468 -948 384 962 -524 -1192 425 1258
1639A258j694r54J797J093j902j425J839J635j677j753J541J907j262j840J130
$$ 1258 -436 -1390 407 1500 -402 -1827 12 1647 -30 -1783 -242 1665 403 -1437 -307
1654c07J778j009j678R81J708q55j602P08J470o33j342N29J069n57q07P40O71
$$ -307 1471 462 -1216 -235 1473 618 -984 -276 1194 561 -781 -252 817 260 -547 193 864
1671H64q76n11J066M46j227l32J505L92j641l95J895M11k177o91K252Q52k382
$$ 864 -12 -523 543 989 -238 -570 935 1327 -314 -709 1186 1597 -580 -1271 981 1833 -549
1688e49j104K389J328k388j596K297J874j996j951J869K099j555k113J224J908
$$ -549 -1653 736 2064 -324 -1920 377 2251 255 -1696 173 2272 717 -1396 -172 1736
1703A736j148j906Q64J680p85j580N16J238m90q98N44N80o48k05J060J09j373
$$ 1736 588 -1318 -454 1226 441 -1139 -623 615 125 -773 -229 351 -297 -502 558 667 -706
1720g06j69J553J10j811k80J873K02k127l10K275L72k597o51K766J074k633j299
$$ -706 -875 678 788 -1023 -1303 570 772 -1355 -1665 610 982 -1615 -2266 500 1574 -1059 -2358
1737b358K557J579k291j664K079J689j907j703J743J710j637j809J310J702j087
$$ -2358 199 1778 -513 -2177 -98 1591 -316 -2019 -276 1434 -203 -2012 -702 1000 -87
1752h7j508Q87J326o82r16P84P62p67m27R46L28j044j29J187l9j404O5J585j99
$$ -87 -1595 -708 618 -64 -980 -196 566 -201 -628 318 646 -398 -527 660 621 -783 -718 867 668
1771F68j902J49K185M9k309j20K545M11k597o45K682R54k525j147K409J289k312
$$ 668 -1234 -1085 1100 1149 -1160 -1280 1265 1676 -921 -1566 1116 2070 -455 -1602 807 2096 -216
1788b16j519J980J472j848j497J725J567j495j569J231J468r45j218P82R73o52
$$ -216 -1735 245 1717 -131 -1628 97 1664 169 -1400 -169 1299 354 -864 -82 891 239
1804B39o21O84K98q99j78J044N3j177qJ249j22j449J74J603k01j800J86K069J6
$$ 239 -382 302 600 -299 -477 567 620 -557 -565 684 562 -887 -713 890 689 -1111 -925 1144 1160
1823A160k174j68K262L53k318o18K253P89k144r55K029J072j862j209J630J200
$$ 1160 -1014 -1182 1080 1433 -885 -1503 750 1539 -605 -1560 469 1541 -321 -1530 100 1300
1839A300j443j159J298J134j101j044R44R08q49p30P81N74p14l55P72J73q45l5
$$ 1300 -143 -1302 -4 1130 29 -1015 -71 837 -12 -742 39 613 -101 -456 316 489 -356 -391
1857c91R56q2j069J38J191k24j422J11J462j60j603J24J788J21j739j53J809L24
$$ -391 565 483 -586 -448 743 519 -903 -792 670 510 -1093 -969 819 940 -799 -952 857 1181
1875A181j799m57J703N31j645o59J504O28j537q13J285P89j151p21J063P76q18
$$ 1181 -618 -1075 628 1159 -486 -1145 359 987 -550 -1363 -78 711 -440 -1161 -98 678 -140
1892a40n40Q39N24p13l29P44K67p58k33O68k9q75RQ52r3r43J80J130q3j075J79
$$ -140 -680 159 683 -30 -359 385 652 -106 -339 329 300 -575 -566 286 193 -750 -570 560 477 -598 -419
1913d19J285rj187J17J393O1j383j99J289J29j408l85J207L15j189l69J162M37
$$ -419 866 857 -330 -213 1180 1241 -142 -341 948 1077 -331 -716 491 806 -383 -752 410 847
1931H47j008l37J071N32p70l10Q74L44p65l29N80Q7p79k16N86j3p40l7O97n5p18
$$ 847 -161 -498 573 1105 335 25 899 1243 478 149 729 816 37 -179 407 394 -346 -383 314 259 -459
1952d59J22Q71Qo98K07Q92j15r04N0Q28j94j075m6Q77r3j049j27Q79N3r00o0R28
$$ -459 -337 534 542 -156 51 943 828 -76 -26 802 608 -467 -513 364 271 -778 -905 -26 27 -873 -933 -5
1974eK38p27o8Q43J51p38j11O84M1p65j18N95m4p49j12N47o1o07J25P13Kn46K07
$$ -5 233 -494 -562 281 432 -306 -417 267 308 -457 -575 20 -24 -773 -885 -338 -399 -1006 -881 -168 -166 -712 -505
1997e05P75l2o50J33P22r3p20M4O54j46p97m7O33m2o55N8P21R0n12P2O50K7m83
$$ -505 270 238 -412 -279 443 350 -370 -326 328 182 -615 -662 -29 -71 -726 -668 53 143 -369 -297 353 380 -103
2020a03O6N50m6m91P5M46k19n98O1M52j73m83K11N35j57m86K99N80k62o05K80
$$ -103 -37 513 467 -24 51 497 278 -320 -259 193 20 -463 -252 283 126 -360 -61 519 257 -348 -68
2041f8P23j72o90R6O26j73p15M9O11o3o07M6O08J2n69rM74K8m18L5M05ol51J9
$$ -68 655 483 -207 -111 515 342 -373 -324 287 224 -383 -337 271 283 -286 -295 179 207 -211 -176 229 223 -128 -109
2065a09K61j10k65J19K15j84j60L15K19l58k65L88K90m33l65M66L99m92n26M23
$$ -109 152 42 -223 -104 111 -73 -233 82 301 -57 -322 66 356 -77 -442 24 423 -69 -595 -172
2085a72M94m22n40M30O68k77n55L47O67k66o66J70O44j12o26JM26o2m79o5L26
$$ -172 322 -100 -640 -210 458 181 -374 -27 640 374 -292 -122 522 410 -216 -215 211 149 -330 -395 -69
2106f9lk29J20L00J5o2K23J51k19m8L01L0m48j65L76K7o13k60M99J44o14k09P61
$$ -69 -72 -301 -181 119 134 72 295 446 227 179 480 510 62 -103 273 300 -313 -573 -74 70 -544 -753 8
2129HM62n69l61P15N95n32n65M91O22m33o92K13M67l96p27R1N02j12m24J45M72
$$ 8 470 -99 -460 255 850 318 -247 244 866 433 -259 -46 421 25 -702 -611 -109 -221 -645 -500 -28
2150b8N3j87J51K85K7l4J49N6k07o0J23k09m75j1L54j59o13N0P11J10o50j1Q62
$$ -28 25 -162 -11 274 301 267 416 472 265 205 328 119 -356 -367 -13 -172 -785 -735 -24 86 -564 -575 287
2173B87L43o38j89Q12L75p20m88N51L43p47o83M31N12m37n87K99N64j46l88K41
$$ 287 630 -8 -197 615 990 270 -218 333 676 -71 -754 -323 189 -248 -835 -536 28 -118 -506 -265
2193b65N01N5j24J37J91r5r3Rj75k46N3J53k73m16J83M29k41n20K97P47p1o50
$$ -265 236 291 167 304 495 400 307 316 141 -105 -52 101 -172 -588 -405 24 -217 -737 -440 307 236 -414
2215d14K25R17K5q72j24Q66J61r32m02P41L40q19n38O24N16n64n43M76O61j74
$$ -414 -189 728 753 -119 -243 623 784 -148 -550 191 531 -288 -826 -202 314 -250 -793 -317 344 170
2235A70m06K13M40n0k45P4J07j09j03P4j10j70O8L1l10j98M35L66m39m65N36P74
$$ 170 -236 -23 417 367 122 196 303 194 91 165 55 -115 -47 -16 -326 -524 -89 277 -162 -627 -91 683
2257F83l67q18K69R17j09q95J0Q35pr27j41Q18J36q61k55Q05L72o76l96N98M66
$$ 683 316 -502 -233 684 575 -320 -310 525 518 -409 -550 268 404 -457 -712 93 465 -211 -607 -9 457
2278D57m26m01L29L97j46k40P3P7q5K2P7j94j92K71K79l02l51K71L71l15m07M05
$$ 457 31 -370 -41 356 210 -30 43 120 35 57 134 -60 -252 19 298 -4 -355 -84 287 -28 -435 -30
2300c0N11m17n59M80P13m53q52L45R38j99r78P2R33M2r17j56P83J71p13k07N95
$$ -30 481 64 -495 -15 698 245 -607 -262 676 477 -501 -429 504 546 -371 -527 256 427 -286 -493 102
2321A02K00n10j62M49J23m00o6M09Q6l29k8L10J4k21N7R9k51j42L63K06n70l87
$$ 102 302 -208 -370 79 202 -198 -264 145 231 -98 -126 184 198 -23 34 133 -118 -260 103 309 -261 -648
2343f48N75N36n61o83N21Q26k70p19L21P67k12o87K26O97k63p49J84P48k24q71
$$ -648 -73 463 -98 -781 -260 566 296 -423 -102 665 453 -234 -8 689 426 -323 -139 609 385 -486
2363d86L1P82N3o96q1O47K35l52l9L37J4j90K06K34l23l48L29L42m64n32K61M23
$$ -486 -455 327 380 -316 -397 250 485 133 94 431 445 255 461 695 372 24 353 695 231 -301 -40 383
2385C83l46m42L53M46l37l44N19M94m68m85N93O49n36p58L81P07m52r34J22O73
$$ 383 37 -405 -52 394 57 -287 232 726 258 -227 366 1015 479 -279 102 809 357 -577 -455 218
2405B18j87p19R0N58r1m36K62N13j71m15L45N74k42n80J19M27k22n53MK31k54
$$ 218 31 -688 -598 -40 -131 -567 -305 208 37 -378 -33 541 299 -281 -162 265 43 -510 -506 -275 -529
2426e29k89K83K30m13k33O06M79m76l90O17O40m18o00L49N16l90o21K56M10m27
$$ -529 -818 -535 -305 -718 -951 -345 134 -342 -732 -115 525 107 -493 -144 372 -18 -639 -383 27 -400
2446d00n14L57M78l99m84M83O96k52m93L74O87j42m96J35L86j97l69J55J92l50
$$ -400 -914 -557 -79 -478 -962 -479 217 -35 -528 -154 533 391 -105 30 416 219 -150 5 197 -153
2466a53l09L50K89m32l29M90M67k97k91M64M42k94l32L42K90m36l32L84K58n48
$$ -153 -462 -112 177 -255 -584 -94 373 76 -215 249 691 397 65 407 697 261 -71 313 571 23
2486B3m43M55M12m94n09M53O16k65m49L04M69k17l71K36K88l09l27L07K27m25
$$ 23 -420 35 447 -47 -556 -103 513 248 -201 103 572 355 -16 220 508 199 -128 179 406 -19
2506a9l77L21L04l18l16L03L31k27j98K84J86l25j44M20J34m86k11M97K40n61
$$ -19 -396 -75 229 -89 -405 -102 229 2 -196 88 274 -51 -195 225 359 -127 -338 159 399 -162
2526a62l47M95L61m32l58M27L98l63l28L46L25l72k97L65L11l87l39L58L56l11
$$ -162 -509 -14 347 -85 -443 -16 382 19 -309 37 362 -10 -307 58 369 -18 -357 1 357 46
2546D6l93K59L67j80k63J93K20j76j38K26P3l09r9L41P8l92j35L95J46l85j59
$$ 46 -347 -88 279 99 -164 29 249 73 -65 161 234 -75 -174 167 245 -147 -282 113 259 -126 -285
2567b85M20J89l58q8M30J34m41j59M31J47n30k49M73K65m73l57L82L12l15k82
$$ -285 135 324 -34 -122 308 442 1 -158 273 420 -110 -359 114 379 -94 -451 -69 243 -72 -354
2587c54L10L24j82k00K42J86k50j60K20J12k95j65K18Q7k81j42K17P3j84NK95
$$ -354 -44 280 98 -102 140 326 76 -84 136 248 -47 -212 6 93 -188 -330 -113 -40 -224 -219 76
2608G6K3k58N4L89nl99k2L53P2m09j18L28O6l50j37L03J04l11p8L59J50k73r4
$$ 76 99 -159 -105 284 279 -120 -142 211 283 -126 -244 84 150 -200 -337 -34 70 -241 -319 40 190 -83 -177
2631a77L17J58k83j38K49J26k43j36J88N9k52j06K05L1k00%K45M0k01OK64K7k40
$$ -177 140 298 15 -123 126 252 9 -127 61 120 -132 -238 -33 -2 -202 -202 43 83 -118 -112 152 179 -61
2654f1kK94Pk96l5K43j4l06n2K69K9k74l3L02Q2k74p2K89R9k07p2K28P0k17o7
$$ -61 -63 231 238 -58 -93 150 136 -170 -222 47 76 -198 -231 71 153 -121 -193 96 195 -12 -84 144 214 -3 -70
2679g0J76%k24l2J95K9k12j1J93lj80J5J96j3j67P1K34n2k63M8K58o0k88PK81
$$ -70 106 106 -118 -150 45 74 -138 -149 44 41 -139 -124 72 59 -108 -37 197 145 -118 -70 188 128 -160 -153 128
2704A28J1k60l6K30J7k26qK27J5k07J5K50J8k24m7K07N1j74l5J27kj19J8J04q7
$$ 128 139 -121 -157 73 90 -136 -144 83 98 -109 -94 156 174 -50 -97 110 161 -13 -48 79 77 -42 -24 80 -7
2729gj44R7J80q8j82J07K04r7k09R9K23j03k18J15K51j31k70R6K58r6k86N3L12
$$ -7 -151 -54 126 38 -144 -37 167 70 -139 -40 183 80 -138 -23 228 97 -173 -77 181 85 -201 -148 164
2752A64l1k97QK72K9k65k0K34M1j87j2J87K2j66m2J22qj06J6R8o2r9Q7J02j23
$$ 164 133 -164 -156 116 145 -120 -140 94 135 -52 -64 123 145 -21 -63 59 51 -55 -39 59 -3 -102 -15 87 -36
2777c6j23J36J64j25j33J73J50j89j76J94J97k20k72K01L00j63l31P7L21p0k74
$$ -36 -159 -23 141 16 -117 56 206 17 -159 35 232 12 -260 -59 241 78 -253 -176 145 75 -199
2798a99M6K99jk58K8K40%k29k1J77K9j49qR2l3r8L4Q3p0m9J03Q8j12l7J48N1j94
$$ -199 -153 146 145 -113 -85 155 155 -74 -95 82 111 -38 -46 46 13 -85 -51 32 -38 -87 16 104 -8 -45 103 154 -40
2825d0n7K48J02k97j40K63J80k89k53K40K53k05k79J96L03j53k63J46K87j15k72
$$ -40 -97 151 253 -44 -184 79 259 -30 -283 -43 210 5 -274 -78 225 72 -191 -45 242 127 -145
2846a45J15K53q3k84M7K27k7k52m3J56M5p6kL2k2K5J22j1j85j0K35O7k53j16K14
$$ -145 -30 223 140 -144 -97 130 103 -149 -192 -36 9 -67 -69 -37 -59 -34 88 77 -108 -118 117 184 -69 -185 29
2871B9Q3k52j36K47J05k62j08L07J64k99k06L34K78k91k75K37L36j83l42P2K79
$$ 29 112 -140 -276 -29 76 -186 -294 13 177 -122 -328 6 284 -7 -282 -45 291 108 -234 -162 117
2892A17n9k43K3J80m8j16Q9J19j05r4J45J46j03r7R8Q5r4k5P8l8j68M4K21l8l08
$$ 117 58 -185 -162 18 -30 -146 -57 62 -43 -137 8 154 51 -46 52 137 43 18 96 58 -110 -66 155 117 -191
2917a91PL45P6l59j12L77J87l02j86K79K07k49k05J94J65k16j88K23J75k23k02
$$ -191 -184 161 237 -122 -234 143 330 28 -158 121 328 79 -126 68 233 17 -171 52 227 4 -198
2938a98K06K26j61k18J25K17n1j38M8O8q8j8J01m0j73K8K22k1k52m0K65L2k48
$$ -198 8 234 73 -145 -20 197 146 8 56 124 36 18 119 79 -94 -66 156 135 -117 -157 108 140 -108
2961a08k3K33O4k41k4K35J1k91l8L11O3l50j14L48J62l08k04K37K04j78j61J40
$$ -108 -131 102 166 -75 -99 136 147 -144 -182 129 192 -158 -272 76 238 -70 -274 -37 167 -11 -172 -32
2983c2J36j35q4J49N5j88m7J96P4k12o3J94P2j63o0J62K1j30J8J78m7k14N1K35
$$ -32 104 -31 -115 34 89 -99 -146 50 124 -88 -151 43 115 -48 -108 54 75 -55 -37 141 94 -120 -69 166
3007A66m4l01JL04M9k98p5K71Q9k29p0K10N7j90k3K25ok30m0K35L0k43q4K25P2
$$ 166 122 -179 -178 126 175 -123 -198 73 162 -67 -137 73 130 -60 -83 142 136 -94 -134 101 131 -112 -196 29 101
3032A01j86n8J69K7j55L6J74k8j79N7K25m4k67K4K46ok47k9K26J6k12j6J91Rj94
$$ 101 -85 -143 26 53 -102 -66 108 80 -99 -42 183 139 -128 -104 142 136 -111 -140 86 102 -110 -126 65 74 -120
3057a20L4K18j0k09K5K45jk41qK06J3j89l3J61j4j72K6J47n6j78Q6K19n5k03O8
$$ -120 -86 132 122 -87 -62 183 182 -59 -67 139 152 -37 -70 91 77 -95 -69 78 22 -156 -70 149 94 -109 -41
3082d1K53l6k23L2K14l6k05K1J64o2k33M1J91p0k15N3K42qk24L4K23Mj66QJ73
$$ -41 212 176 -47 -15 199 163 -42 -21 143 81 -152 -111 80 10 -205 -152 90 82 -142 -108 115 119 -47 -39 134
3107A34j0j69J6J09q9j72L1J26p6j77O5J85l6j62P9J77j7j15Q5J52p7j60R0J55
$$ 134 124 -45 -29 80 -9 -181 -150 -24 -100 -277 -212 -27 -63 -225 -146 31 14 -101 -16 136 59 -101 -11 144
3131A44j52k25O6J80j00k11N0K02l3j46Q4K09l8j31J30J91p4j85P3J62r5k35J7
$$ 144 -8 -233 -167 13 -87 -298 -248 -46 -79 -225 -141 68 30 -101 29 220 146 -39 34 196 101 -134 -117
3154a17J37n5j63L4J31l7r9R6J71l5q3J21J66q6j32O0J12j20j59L8R2j25j22R6
$$ -117 20 -35 -198 -164 -33 -70 -169 -73 98 63 -20 101 267 181 49 109 221 101 -58 -20 72 -53 -175 -79
3178g9J06j10q9J76J80j02j13J63K01j12j97P9J58j30k02M2J26j12j79P7J60q0
$$ -79 27 -83 -172 4 184 82 -31 132 333 221 24 103 261 131 -71 -29 97 -15 -194 -117 43 -37
3200c7j43J13J92j8j16P4J53n0j26J5N8q3j05L5M1j17r1J14P0j03n7J65J35q7
$$ -37 -180 -67 125 107 -9 65 218 168 42 57 115 32 -73 -38 3 -114 -205 -91 -21 -124 -181 -16 119 32
3224C2p8J33J11j30j19J05Q3j58j42J27R5j55j54J44J83q4j32J05K01k5j35N4
$$ 32 -46 87 198 68 -51 54 137 -21 -163 -36 59 -96 -250 -106 77 -7 -139 -34 167 142 7 61
3246F1J12o2j11L0N6q8j09N2O0q5o4P8R5l5k3J04O5o8j3J02Lj63n8J29K2j90j19
$$ 61 173 111 0 30 86 -2 -111 -59 1 -84 -148 -70 25 -10 -33 71 136 68 55 157 160 -3 -61 68 90 -100 -219
3273b19J42J05j52r8J74J38p1q4J50J32j08j25Q6J22j19j64L6R5r0j40L9R7l1
$$ -219 -77 28 -124 -222 -48 90 19 -65 85 217 109 -16 70 192 73 -91 -55 40 -50 -190 -151 -54 -85
3296h5o1O8R5RqQ1M4m6k7N4jj36m2P2k8j57n9J28M0j23j7J87J07j06k1J69R7j43
$$ -85 -146 -78 17 26 18 99 143 97 70 124 123 -13 -55 17 -11 -168 -227 -99 -59 -182 -199 -12 95 -11 -32 137 234 91
3324I1r6J30Q4j74j46P0Q2j13j50O2J07l8o2J01J22pk7O2P0l6l9Pko7m8K5n5j00
$$ 91 -5 125 209 35 -111 -41 41 -72 -222 -160 -53 -91 -153 -52 70 63 36 98 168 132 93 100 98 31 -17 8 -47 -147
3352a47lQ7k7q5N3J58J6j12M0J78K4j45k6J39J7j68p7J15K1j78r1J35R8r5q0J10
$$ -147 -150 -63 -90 -175 -122 36 52 -60 -20 158 182 37 11 150 167 -1 -78 37 58 -120 -211 -76 22 -73 -153 -43
3378d3J15l1n6O7P4m9k4M6J0q5m4L4mq4qM6j1o7N4R8m0q3N7J49l0j25L0J30j9
$$ -43 72 41 -15 52 126 77 53 99 109 24 -20 14 10 -74 -82 -36 -47 -114 -60 38 -2 -85 -28 121 91 -34 -4 126 107
3407A07j51k4J32Jj52l4J36L2j19l4J11N7j03m4J19N4q5l6Q7L6p0l9M5J3n3kM6
$$ 107 -44 -68 64 65 -87 -121 15 47 -72 -106 5 62 -41 -85 34 88 3 -33 54 90 20 -19 26 39 -14 -16 30
3434C0j4o5K3O5m4q9M3J01k3j07M2J20l2j13K8J22k5j15J0J12j8j27kJ13oj33
$$ 30 16 -49 -26 39 -5 -94 -51 50 27 -80 -38 82 50 -63 -35 87 62 -53 -43 69 51 -76 -78 35 29 -104
3460a04l0J53L0j02k4J09M4q0j2P9%p0QO7l4q3OO1k4p9K6Q1k8n5N4P9m0q8O1J05
$$ -104 -134 19 49 -53 -77 32 76 -4 -16 63 63 -7 1 68 34 -49 -43 18 -6 -85 -59 22 -6 -61 -7 72 32 -56 5 110
3490A10l9j21K8J14n3j30QJ14kj32J0J26J1j02K3J04J0q3J8Q5j1q5nN6j6q7kN0
$$ 110 71 -50 -22 92 39 -91 -83 31 29 -103 -93 33 44 -58 -35 69 79 -4 14 99 88 3 -2 54 38 -49 -51 -1
3518ak3m8L6P4k1m5N8Q3l7o6M9Q1o5j04K3P5q6j05L6R3n3r5O9J20k5r1N4J35j6
$$ -1 -24 -72 -36 38 17 -28 30 113 76 10 59 140 75 -29 -6 69 -17 -122 -86 7 -46 -141 -72 48 23 -68 -14 121 105
3547A05j18J2Q9k5j20k8M9k7q6kP3po2N1Q6Kl1N3O1j6m7L0J4q0o3K1K6j13o4O1
$$ 105 -13 -1 88 63 -57 -85 -36 -63 -149 -151 -78 -85 -147 -96 -10 -8 -39 14 75 59 12 42 56 -24 -87 -66 -40 -153 -217 -156
3577a56P7o0n7J11J09m1n7R4J25n5r7K0Q4o1j48J8N6n0j00M1Q6Nn7O0R9K1j7M0
$$ -156 -79 -139 -196 -85 24 -17 -74 20 145 90 -7 13 97 36 -112 -94 -38 -88 -188 -147 -61 -56 -113 -53 46 67 50 90
3605I0O4kl3Mro3n4J1j0q2k5O9M0m1j2J04Q4l5k3J06N8p5p4O1L0j26j11L3N9q2
$$ 90 154 152 119 123 114 51 -3 8 -2 -84 -109 -40 0 -41 -53 51 135 100 77 183 241 166 92 153 183 57 -54 -21 38 -44
3635d4j00O2R6j6o0O6J07Om7M2O4k2p6j5J0n7o9j0Ql5k6M1K8k6J6P1M0j2PP8K3
$$ -44 -144 -82 14 -2 -62 4 111 117 70 112 176 154 78 63 73 16 -53 -63 -55 -90 -116 -75 -47 -73 -57 14 54 42 49 127 150
3666A50j09l2N1pj08o5O8K6q8n4P4P4n2k7P8R5j8o9O3O7n6q1NL2n3p2RL2j2l3
$$ 150 41 9 60 53 -55 -120 -52 -26 -114 -168 -94 -20 -72 -99 -21 74 56 -13 50 117 61 -20 -15 17 -36 -108 -99 -67 -79 -112
3696a12M5L8LPN1K8j3J7M1lp2j8L7j5q0k1N0Ro8j5R0M1n9j5J00O4o6m7P1L9r1
$$ -112 -67 -29 -26 -19 32 60 47 64 105 102 30 12 49 34 -46 -67 -17 -8 -76 -91 -1 40 -19 -34 66 130 64 17 88 127 36
3727C6p2L1L1p3n5K8N4l5m0L6O1qk7N1M3k0j6Mnl3k2J6j9m0j7M9Rn6PP7K9o2k
$$ 36 -36 -5 26 -47 -102 -74 -20 -55 -95 -59 2 -6 -33 18 61 41 25 29 24 -9 -31 -15 -34 -74 -91 -42 -33 -89 -82 -5 24 -38 -40
3760d0Q1L4p3l4P1J0q3m4O0L4o7n6N3N0m2l7N3N7k6k3L4M0k0l7QJ8l1j8K5nl0
$$ -40 41 75 2 -32 39 49 -34 -78 -18 16 -51 -107 -54 -4 -46 -83 -30 27 1 -22 12 52 32 -5 3 21 -10 -28 -3 -8 -38
3791c8NK9j0l5K0N2pl2K1O5j9p7K0O7lq4j1O8J5q1k3P3J9o3k9P2L3o0k7N7L8o5
$$ -38 -33 -4 -14 -49 -29 23 16 -16 5 70 51 -26 -6 61 58 -26 -37 31 46 -35 -58 15 34 -29 -58 14 47 -13 -40 17 55 -10
3823a0l2M9K3m1k0L9J2l2j9L0Ml0qM7rl6RM2j4n0K3O4j1o2J9P6k9o7LP5j6p4J2
$$ -10 -42 7 30 -11 -31 8 20 -12 -31 -1 3 -27 -35 12 3 -33 -24 18 4 -46 -23 41 30 -32 -13 63 34 -33 -30 45 29 -45 -33
3856c3N9Mq0rP7J4p0lO6J8l7qM3Ll9oK2Jn0qM3j9m1PM9k4k5K2N3kk5J9L8k5n6
$$ -33 26 30 -50 -59 18 32 -38 -41 25 43 6 -2 41 44 5 -1 21 22 -28 -36 7 -12 -53 -46 3 -21 -46 -24 29 27 2 21 59 34 -22
3891b2K4M9l9o4K1N2k6p0J6O3lm8L0N6Km6J7N6j9n9OL8j6o6KL3k2m8J8M7kl3L0
$$ -22 2 51 12 -52 -31 21 -5 -75 -59 4 1 -47 -17 39 41 -5 12 68 49 -10 -4 34 18 -48 -46 -13 -35 -83 -65 -18 -20 -53 -23
3924b3N4qk4L1K8l7l5K2L6o0m4L3L5m7n3L7O1j3l9O2N1k2m0K2O7m5o5K1K9k5o9
$$ -23 31 23 -1 30 58 21 -14 8 44 -16 -60 -27 8 -39 -92 -55 6 -7 -46 16 67 45 5 27 94 49 -16 5 34 9 -60
3955f0RM0k4m0K2N8qk4M0M3j9k6L1K1m0m2K1K3n6l6K7K4n4j1O4K8k6k0P0M9m5
$$ -60 -51 -11 -35 -75 -53 5 -3 -27 13 56 37 11 42 63 23 -19 2 25 -31 -67 -40 -16 -70 -81 -17 11 -15 -35 35 84 39
3986C9m9N7K6n7n1L7L6o7m7L5L8l9l4N1N6k3k6M1M6n3j9L6K9n9l9J8J7n4k9L7
$$ 39 -10 47 73 16 -35 2 38 -29 -76 -41 -3 -42 -76 -25 31 8 -18 23 69 16 -3 33 62 3 -36 -18 -1 -55 -84 -47
4016d7K4l9j6O0K8k4pN7K7o4j0M4J2o6k7L8J3o0l0N7K3m4pP2L6n2j9O4M2o2l0
$$ -47 -23 -62 -78 -18 10 -14 -21 36 63 -1 -11 33 45 -21 -48 -10 3 -57 -87 -30 -7 -51 -58 14 50 -2 -21 43 85 23 -7
4047gM4J5m9m3K6J8n1k6M7K7l9lO3K9l7j8N0K2n1k7M5J4n7k7K4J5n3MO0nl0JO2
$$ -7 37 52 3 -40 -14 4 -47 -73 -26 1 -38 -41 22 51 14 -4 46 68 17 -10 35 49 -8 -35 -11 4 -49 -45 15 10 -20 -19 43
4080D3J5m3jN6Qn6j6M5mn8j5M4%o2j6O9J3l8j1M9L0n0j0M5K2n9j8L9j1m1l0L7
$$ 43 58 15 14 70 78 22 6 51 47 -11 -26 18 18 -44 -60 9 22 -16 -27 22 52 2 -8 37 59 0 -18 21 10 -31 -61 -24
4112b4Ml7oM1J8m0RN3jl5nN4Qn4rL6nm4j8M3J1m2KM7Ml5lO0Rm6oM7Ll6k9M6Kn1
$$ -24 -20 -57 -63 -22 -4 -44 -35 18 17 -18 -23 31 39 -15 -24 12 7 -37 -55 -12 -1 -43 -41 6 10 -25 -28 32 41 -5 -11 36 39 3 -26 20 22 -29
4150b9j3L3J1l6jM4Ll5j2M2K1l8j3M0Rm5kK8Nl2j6M3Kl5OL8Nl7j2N4Ol6mK6Rm2
$$ -29 -42 -9 2 -34 -35 9 12 -23 -35 7 28 -10 -23 17 26 -19 -21 7 12 -20 -36 7 9 -26 -20 18 23 -14 -26 28 34 -2 -6 20 29 -13
4186a3oL5Qm6kL2Nl2JL3Lk6j8M1%l4rL3J3l5j5K4Ok7NK1Ok5kK3J5l7oL7J6k6j9
$$ -13 -19 16 24 -22 -24 8 13 -19 -18 15 18 -8 -26 15 15 -19 -28 5 18 -17 -32 -8 -2 -29 -24 -3 3 -22 -24 -1 14 -23 -29 8 24 -2 -21
4223b1L7Kk8pL9kk9nM2Qm1nK6J1m4OL1Ql8j1L3%m2ML4%l7qM9Jm6rN1ml0pJ9K6
$$ -21 16 18 -10 -17 22 20 -9 -14 28 36 -5 -10 16 27 -17 -11 20 28 -10 -21 12 12 -30 -26 8 8 -29 -37 12 13 -33 -42 9 5 -25 -32 -13 13
4261A3l3j5K9J0k3j2L3%j2k1K8J2k9j1L2Jk4OK9J2m6JM3nm8J8M4j7m0JM3J3o5
$$ 13 -20 -35 -6 4 -19 -31 2 2 -10 -31 -3 9 -20 -31 1 2 -22 -16 13 25 -21 -20 23 18 -30 -12 32 15 -25 -24 19 32 -33
4294c3rM9J1m2j3M4K6m1k0L6K5l9rK5K1k8j9L2Lj7j3K7Nj7LL0k4mRL4j6m0J3M4
$$ -33 -42 7 18 -24 -37 7 33 -8 -28 8 33 -6 -15 10 31 3 -16 16 19 2 -11 16 21 4 7 37 13 9 18 52 36 -4 9 53
4328E3k1m2J6L8j0n9PN6Pq0kP1Jn1k3O6J9m9j8M1J4m3j4J2J3j6j6K4JrlK0j3q
$$ 53 32 -10 6 44 34 -25 -18 38 45 -35 -37 34 35 -16 -39 27 46 -3 -21 20 34 -9 -23 -11 2 -14 -30 -6 -5 -14 -17 3 -10 -18
4362a8K1J9k0j8L6J7l9m0L5L5l1m3K9M4j4p6L8O0qo9NP4Jo3j9O9J1n3k3M0K0l0
$$ -18 3 22 2 -16 20 37 -2 -42 -7 28 -3 -46 -17 27 13 -63 -25 35 27 -42 -37 37 38 -25 -44 25 36 -17 -40 0 20 -10
4394a0l4L5K4k6j7J1K4rOlm%NJ0k7kM0J0m3j5M2K8o1k9N1M6m8l9M1M9j6p0J5O6
$$ -10 -44 -9 15 -11 -28 -17 7 -2 4 1 -3 -3 2 12 -15 -17 23 33 -10 -25 17 45 -16 -45 6 52 4 -35 6 55 39 -31 -16 50
4428E0k0o1LN3Pn2oL1J0k8j0J9J1j5%OjjLJk8J8K3ql7jM9Jn2nO0J7n3l0N5L7m6
$$ 50 30 -31 -28 25 32 -20 -26 5 15 -13 -23 -4 7 -8 -8 -2 -3 -4 -1 0 -28 -10 13 5 -32 -33 16 17 -35 -40 20 37 -16 -46 9 46 0
4465@n4M7M9k9o0K9O7l5m7J8N4j1m9LL2Rl1kJ6nqrQmMJ6lk7ML7ol1NM1qm9PM8
$$ 0 -54 -7 42 13 -47 -18 49 14 -33 -15 39 28 -21 -18 14 23 -8 -10 6 1 -7 -16 -8 -12 -8 8 5 -22 -18 19 13 -18 -13 28 20 -29 -22 26
4503B6J1o7rO2J2n3k2N6L2m7n3N0N5m4m4L5N0k0n0OL3ok2%J7oj4jJ2j2J2Pqj2
$$ 26 37 -30 -39 23 35 -18 -40 16 48 1 -52 -2 53 9 -35 0 50 30 -20 -14 19 13 -9 -9 8 2 -12 -13 -1 -13 -1 6 -2 -14
4537a4J6J1j1l5J7L4on2J3N1j0n3J0N4Lo4mO6J5n2k4N7L1n2l5M0L6l3l8K9K4j1
$$ -14 2 13 2 -33 -16 18 12 -40 -27 24 14 -39 -29 25 28 -36 -40 26 41 -11 -35 22 53 1 -34 6 42 9 -29 0 24 13
4569A3k7J1MMj9J6lqK3rpj1J4Jj1j8J5K5j5l6K0M3k4m5J6M8j3l5KN3Jn3lN2Pm3
$$ 13 -14 -3 1 5 -14 2 -1 -9 14 5 -2 -13 1 2 -9 -27 -12 13 -2 -38 -18 25 1 -44 -28 20 7 -28 -26 27 28 -25 -28 24 31 -12
4605a2j5M9J5m0k8K9L0k0j7J8J3k3lKRj4Qj0%nJ3Mk0KJ5J0l3j1K5K5k2j5J2L5
$$ -12 -27 22 37 -3 -31 -2 28 8 -9 9 22 -1 -4 -2 7 -7 1 -9 -9 -14 -1 3 -17 -15 0 10 -23 -34 -9 16 -6 -21 -9 26
4639B6k8l4J8M4j3m7QN1nm5LM5Ml4lJ8K4l3j4K6J3k7lPJ7j1j8J1RmkKkkrRplJ0
$$ 26 -2 -36 -18 26 13 -34 -26 25 20 -25 -22 23 27 -7 -10 8 32 -1 -15 11 24 -3 -6 1 18 7 -11 0 9 5 3 5 3 1 -8 1 -6 -9 1
4678AorkJ9Pk0j0J4L3k4l9K3L1j1k4LL8j4l6OK0Ql2mL3J2j8k6L0K4l5qK4JKl3
$$ 1 -5 -14 -16 3 10 -10 -20 -6 27 3 -36 -13 18 7 -17 -14 24 10 -26 -20 0 8 -24 -28 5 17 -1 -27 3 27 -8 -16 8 9 11 -22
4714b2RRpj0KJ2kJkJ0j6nJ0LjJ0J4k5nJ4Mmk3J0K7j9j8J0K1Jk8QL3Jk5mL0J2l5
$$ -22 -13 -4 -11 -21 -19 -7 -9 -8 -10 0 -16 -21 -11 -8 -9 1 15 -10 -15 -1 3 -1 -24 -14 13 -6 -24 -14 7 8 -20 -12 21 22 -3 -7 23 35 0
4753@oL1nj9klK1j8j3J0LOj3RJ0Mj2Ook%R%j9J1Nj1j1KJ8Kk2J2K7j4j7ML9ol9
$$ 0 -6 25 20 1 -1 -4 17 -1 -14 -4 -1 5 -8 1 11 15 3 9 3 1 1 10 10 -9 2 7 -4 -15 -13 5 7 -15 -3 24 10 -7 -3 36 30 -9
4793iJ1K4qj5j2K6Kj8k0K5Mj7oK2Mk3KJ3Ok3kPJ1k1oJ5lj5qJ7kq%J9mj2LK4qj2
$$ -9 2 26 18 3 -9 17 19 1 -19 6 10 -7 -13 9 13 -10 -8 5 11 -12 -14 -7 4 -17 -23 -8 -11 -26 -34 -17 -19 -27 -27 -8 -12 -24 -21 3 -5 -17
4833a7NJ9j3j2JJ7Ok4jL1mk4JL1oj7%J1Pk3jJ9J0k2kJ4Jj7nJ4Jj1KJ1Jk1J0J4
$$ -17 -12 7 -6 -18 -17 0 6 -18 -19 12 8 -16 -15 16 10 -7 -7 4 11 -12 -13 6 16 -6 -8 6 7 -10 -15 -1 0 -11 -9 2 3 -18 -8 6
4871Fj6j1OK4j2j9OK8j4j8NK2mj9MJ7jk8J0K5oj3JK2kk4J0J6j5j5J1K8k1j0RJ0
$$ 6 -10 -21 -15 9 -3 -22 -16 12 -2 -20 -15 7 3 -16 -12 5 4 -24 -14 11 5 -8 -7 15 13 -11 -1 15 0 -15 -4 24 3 -7 2 12
4907A2ml0K0J7k6j3RK3j5k2PK5qj7K1J2qj2J4K0k3j6J7J1j8j4KJ9qk0J4J6mj7
$$ 12 8 -22 -2 15 -11 -24 -15 8 -7 -29 -22 3 -5 -22 -1 11 3 -9 5 25 2 -14 3 14 -4 -18 -16 3 -5 -25 -11 5 1 -16
4941a6L3jkqK2J1k7nJ1J9l2j6MJ3j4k2J5J9j9mJ2J7j6jJK1lqLQj0j9J0npoJ1K
$$ -16 17 16 14 6 28 39 12 7 18 37 5 -11 -7 6 -8 -30 -15 4 -15 -19 -7 10 -6 -7 -6 15 12 4 7 15 5 -14 -4 -9 -16 -22 -11 -9
4979ij5NJ1J7oj4K8ojJJ6jrk4K6mk8pK3J0m0nJ8J0j7mL2PqrNJ3j5pJ0lj1nRj2
$$ -9 -24 -19 -8 9 3 -11 17 11 10 11 27 26 17 -7 19 15 -13 -20 3 13 -27 -32 -14 -4 -21 -25 7 14 6 -3 2 15 0 -7 3 0 -11 -16 -7 -19
5019a9j3J1QNk2J9K5jj6LJ4Mj7NK4k2j6RPlk6oK0Qk5jL1j1J0qJ6J0j9jJ3rj3J
$$ -19 -32 -21 -13 -8 -30 -11 14 13 -3 0 14 18 1 6 30 8 -8 1 8 5 -21 -27 -7 1 -24 -25 6 -5 5 -3 13 23 4 3 16 7 -6 -5
5057eJ0j1rqJ6j5%OK3j7rJ9J4kj9K2Nj1j1J2Rpl0J0K2nj8OJ9lk3RJ2kj5NK0Kk0
$$ -5 5 -6 -15 -23 -7 -22 -22 -16 7 -10 -19 0 14 12 -7 15 20 9 -2 10 19 12 -18 -8 14 9 -9 -3 16 13 -10 -1 11 9 -6 -1 19 21 1
5096AmQJj6jJ4Kj3lJ7j2kJNj2mJ5RpoQQj0j5J0J4lj7J9J0j8j0J9Mj3rJ0LrpQR
$$ 1 -3 5 6 -10 -11 3 5 -8 -11 6 -6 -8 -7 -2 -14 -18 -3 6 -1 -7 1 9 -1 -16 -6 8 5 -12 7 17 -1 -11 8 12 -1 -10 0 3 -6 -13 -5 4
5138DLj5MJ9lknOKk1PpKrKJ0rj8J2J4QqLJ4mj3K1J8j7k6K0Oj8j0KJ7j4j6kJ9n
$$ 4 7 -8 -4 15 12 10 5 11 13 -8 -1 -8 -6 -15 -13 -3 -12 -30 -18 -4 4 -4 -1 13 9 -4 17 35 18 -8 12 18 0 -10 -8 9 -5 -21 -23 -4 -9
5179ilNJ4Mj0J8L%rPJj0qrlpoJkqRRPnoK2J0qjJ4pJk2NJ0k3m%KPqQJ1LqlK7Jp
$$ -9 -12 -7 7 11 1 19 22 22 13 20 21 11 3 -6 -9 -16 -22 -21 -23 -31 -22 -13 -6 -11 -17 5 15 7 6 20 13 14 -8 -3 7 -16 -20 -20 -18 -11 -19 -11 0 3 -5 -8 19 20 13
5228A3J3Pj0j4mjrj2j3NPj2QQqQLK5j2LL%J6k8J0j5Pj9J1jj8KMKOnOK1kKJ0qP
$$ 13 26 33 23 9 5 4 -5 -17 -30 -25 -18 -30 -22 -14 -22 -14 -11 14 2 5 8 8 24 -4 6 -9 -2 -21 -10 -11 -29 -27 -23 -21 -15 -20 -14 7 5 7 17 9 16
5271A6MmqNj4kjrj1JJ3j3kMK1qj2J2J4%qKJ0j8%MRk2pMKkjjK2okOJ9j0kLJ1Mk1
$$ 16 20 16 8 13 -1 -3 -4 -13 -24 -23 -10 -23 -25 -21 0 -8 -20 -8 6 6 -2 0 10 -8 -8 -4 5 -17 -24 -20 -18 -20 -21 -22 0 -6 -8 -2 17 7 5 8 19 23 2
5316BlnOrJ0kMkML%j4QQj2lMOj3MJ%kj0J6%Lj9QOnpjJOpnJ6OkrJ4Ok0jJ7Rj2N
$$ 2 -1 -6 0 -9 1 -1 3 1 5 8 8 -6 2 10 -2 -5 -1 5 -8 -4 -3 -3 -5 -15 1 1 4 -15 -7 -1 -6 -13 -14 -13 -7 -14 -19 -3 3 1 -8 6 12 -8 -9 8 17 5 10
5365A0Omn%Jj0n%j2QnNPjlPJ3j4PjRj0pjMqj4lK1lj8NJ0p%OJ2Oq%J3KNj1k%j5
$$ 10 16 12 7 7 8 -2 -7 -7 -19 -11 -16 -11 -4 -5 -8 -1 12 -2 5 4 13 3 -4 -5 -1 -9 -23 -26 -5 -8 -26 -21 -11 -18 -18 -12 0 6 -2 -2 11 13 18 7 5 5 -10
5412a0lmlJKpJ0LJ2LkjJ6nppJ4%j3j7JJ1j8qMJMk1J3K4Oj4J5J0mJjJ0Kj4kj3M
$$ -10 -13 -17 -20 -19 -17 -24 -14 -11 1 4 2 1 17 12 5 -2 12 12 -1 -18 -17 -6 -24 -32 -28 -27 -23 -44 -31 -7 -1 -15 0 10 6 7 6 16 18 4 2 -11 -7
5455gj1qJ4KpJJ0jJ3KQj3QQ%kj6Okj8pJ1kj4oJ2QqrK6J4pqJ5Qj2KrOJj9LJnlo
$$ -7 -18 -26 -12 -10 -17 -16 -6 -7 6 8 16 3 11 19 19 17 1 7 5 -13 -20 -9 -11 -25 -31 -19 -11 -19 -28 -2 12 5 -3 12 20 8 10 1 7 8 -11 -8 -7 -12 -15 -21
5501b1Q%QLRpMPMj7JK4j1j3JMj0j6LJ6qj1nJ8Qj7NJ2J2j2qRQj5NpO%rPkj2PJn
$$ -21 -13 -13 -5 -2 7 0 4 11 15 -2 -1 23 12 -1 0 4 -6 -22 -19 -3 -11 -22 -27 -9 -1 -18 -13 -1 11 -1 -9 0 8 -7 -2 -9 -3 -3 -12 -5 -7 -19 -12 -11 -16
5546a6OKRkjMJ2mjqJ5kk6RJ3ok2OK7j6qJ3P%j9pK5Lj3rJ2lj9RmMmMLnk%LoMMR
$$ -16 -10 -8 1 -1 -2 2 14 10 9 1 16 14 -12 -3 10 4 -18 -12 15 -1 -9 4 11 11 -8 -15 10 13 0 -9 3 0 -19 -10 -14 -10 -14 -10 -7 -12 -14 -14 -11 -17 -13 -9 0
5593@mJjJ4k0jJ3jj3nJ8J9pl3RK1j4oJJ5Pk4lJ6pj1J2OLj3jJ7Kj9LQl%jnnj1O
$$ 0 -4 -3 -4 10 -10 -11 2 1 -12 -17 1 20 13 -20 -11 10 -4 -10 -9 6 13 -11 -14 2 -5 -16 -4 2 5 -8 -9 8 10 -9 -6 2 -1 -1 -2 -7 -12 -23 -17
5636a7OnnJ3PJnJ9r%mQJ9k0k3L0J2l0j5J2Ljj7MJ9Mj8J3Nnj2PJ6jj0rkJ1j8oK
$$ -17 -11 -16 -21 -8 -1 0 -5 14 5 5 1 9 28 8 -15 15 27 -3 -18 -6 -3 -4 -21 -17 2 6 -12 1 6 1 -11 -4 12 11 1 -8 -10 1 -17 -23 -21
5677b1Oj3J0JjNJ0JPkJJ3npJ5j2qj5J0MjrOpNpJ4K0k6QJ0LJj8LJ3j0j2mKjk2J4
$$ -21 -15 -28 -18 -17 -18 -13 -3 -2 5 3 4 17 12 5 20 8 0 -15 -5 -1 -2 -11 -5 -12 -7 -14 0 20 -6 2 12 15 16 -2 1 14 4 -8 -12 -10 -11 -33 -19
5720a9QL%m%J0J1JoJjnOroJ1mj2PkM%kJ3J1j7MMJ5j3%j0K8k3j4JJPrlOkj0J1J1
$$ -19 -11 -8 -8 -12 -12 -2 9 10 4 5 4 -1 5 -4 -10 1 -3 -15 -8 -10 -6 -6 -8 5 16 -1 3 7 22 9 9 -1 27 4 -10 -9 -8 -1 -10 -13 -7 -9 -19 -8 3
5765CnoKJJ2j8MLMNlMooLrLOkPqQoJ1kjLjNj5PKmj1J3J4mj7kJ4Mj7NmJj2MJ4l
$$ 3 -2 -8 -6 -5 7 -11 -7 -4 0 5 2 6 0 -6 -3 -12 -9 -3 -5 2 -6 2 -4 7 5 4 7 6 11 -4 3 5 1 -10 3 17 13 -4 -6 8 12 -5 0 -4 -3 -15 -11 3 0
5814@j5%QNj3J3J0mqknKOnlLnJ0Rj3RKJ3roNKpoQPPk6lRQj6mJ9oj7NMJ5j3qKJ2
$$ 0 -15 -15 -7 -2 -15 -2 8 4 -4 -6 -11 -9 -3 -8 -11 -8 -13 -3 6 -7 2 4 17 8 2 7 9 2 -4 4 11 18 -8 -11 -2 6 -10 -14 5 -1 -18 -13 -9 6 -7 -15 -13 -1
5862a%lpJ6j4KLKjj2J1plPMLj0KROj6J2JLomQRk2JQJ2j6JJJ2j1j0ROj0kJ0nol
$$ -1 -1 -4 -11 5 -9 -7 -4 -2 -3 -15 -4 -11 -14 -7 -3 0 -10 -8 1 7 -9 3 4 7 1 -3 5 14 -8 -7 1 13 -3 -2 -1 11 0 -10 -1 5 -5 -7 3 -2 -8 -11
5908a1%Mlj0J2Nj2RNkmJlkKRQqJ%MMnj3J8nqQJ1nj7NMlJ%MjoOjJj5MKPlqJ2j3
$$ -11 -11 -7 -10 -20 -8 -3 -15 -6 -1 -3 -7 -6 -9 -11 -9 0 8 0 1 1 5 9 4 -9 9 4 -4 4 15 10 -7 -2 2 -1 0 0 4 3 -3 3 2 3 -12 -8 -6 1 -2 -10 2 -11
5958a1NjMnqKKJ0pLMjJ0j3QonJ0PpqLLmnmPQj7RJJ1qoJ4rJ0j%kk3OKJrlQLJLJ0
$$ -11 -6 -7 -3 -8 -16 -14 -12 -2 -9 -6 -2 -3 7 -6 2 -4 -9 1 8 1 -7 -4 -1 -5 -10 -14 -7 1 -16 -7 -6 5 -3 -9 5 -4 6 5 5 3 -20 -14 -12 -11 -20 -23 -15 -12 -11 -8 2
6009Boj%RMqnRJroJ0Qj8RJQj2J1qP%lRJj3PloOnnoOMpqJ0lOo%MOrLN%j3LMkNo
$$ 2 -4 -5 -5 4 8 0 -5 4 5 -4 -10 0 8 -10 -1 0 8 -4 7 -1 6 6 3 12 13 0 7 4 -2 4 -1 -6 -12 -6 -2 -9 -17 -7 -10 -4 -10 -10 -6 0 -9 -6 -1 -1 -14 -11 -7 -9 -4 -10
6063a0NmJ7qMrJ7kj9K0jj3J0JlJm%nJ1lk0J8LoKj4J8Lj0KqMKJknLjnL%qJ0jQj7
$$ -10 -5 -9 8 0 4 -5 12 10 -9 11 10 -3 7 8 5 6 2 2 -3 8 5 -15 3 6 0 2 -12 6 9 -1 1 -7 -3 -1 0 -2 -7 -4 -5 -10 -7 -7 -15 -5 -6 2 -15
6110a5K1pNKn%roJ8qR%KJj3RlPoKKjprNJ5j8oJJ1mj3J1%LjjjOOj5QKoLrJ1KpJ2
$$ -15 6 -1 4 6 1 1 -8 -14 4 -4 5 5 7 8 -5 4 1 8 2 4 6 5 -2 -11 -6 9 -9 -15 -14 -3 -7 -20 -9 -9 -6 -7 -8 -9 -3 3 -12 -4 -2 -8 -5 -14 -3 -1 -8 4
6160Drj0J2QjoNJoKMpllJ7mj0J0pRqpJ6k%mpJ2pj0JOqmQlJKjONnjlNOlkmRKpJ
$$ 4 -5 -15 -3 5 4 -2 3 4 -2 0 4 -3 -6 -9 8 4 -6 4 -3 6 -2 -9 7 5 5 1 -6 6 -1 -11 -10 -4 -12 -16 -8 -11 -10 -8 -9 -3 2 -3 -4 -7 -2 4 1 -1 -5 4 6 -1 0
6213@jN%j5NRnMljJ2j4NjJ6j4j3OJ2k2NJ1jojKKp%J1%j4PnKJ3j2OJJ0qpJj3J6
$$ 0 -1 4 4 -11 -6 3 -2 2 -1 -2 10 -4 1 0 16 2 -11 -5 7 -15 -10 1 0 -6 -7 -5 -3 -10 -10 1 1 -13 -6 -11 -9 4 -8 -2 -1 9 1 -6 -5 -18 -2
6258bJ6qqjJ1qj%kRrnJ4lkLpOnj0OQp%mJ4j4%KjLj1jJ1mkPnOJ%kKjMoQjMqlOO
$$ -2 14 6 -2 -3 8 0 -1 -1 -3 6 -3 -8 6 3 1 4 -3 3 -2 -12 -6 2 -5 -5 -9 5 -9 -9 -7 -8 -5 -16 -17 -6 -10 -12 -5 -10 -4 -3 -3 -5 -3 -4 0 -6 2 1 5 -3 -6 0 6
6311FnRpMOrkQjmooJ3j4pJ0mkqQMMk0QRLoJPLlj3MLqLQmmKJJ0j4J5MrJkJ2pj3
$$ 6 1 10 3 7 13 4 2 10 9 5 -1 -7 6 -8 -15 -5 -9 -11 -19 -11 -7 -3 -23 -15 -6 -3 -9 -8 -1 2 -1 -14 -10 -7 -15 -12 -4 -8 -12 -10 -9 1 -13 2 6 -3 -2 -4 8 1 -12
6362a2J4oJ0qLOnmqOKrOO%j2QmkPnQj2Rj2J7opMQj0PLm%JNn%PnoNOj2KMnQRrj
$$ -12 2 -4 6 -2 1 7 2 -2 -10 -4 -2 -11 -5 1 1 -11 -3 -7 -9 -2 -7 1 -11 -2 -14 3 -3 -10 -6 2 -8 -1 2 -2 -2 -1 4 -1 -1 6 1 -5 0 6 -6 -4 0 -5 3 12 3 2
6414Bj1K0%j4J3noqNnLPlKqj4J2OkJjOnrJ2jjQj2KmQOMqlMmNj0KJ3Mj0j2OKoJ7
$$ 2 -9 11 11 -3 10 5 -1 -9 -4 -9 -6 1 -2 0 -8 -22 -10 -4 -6 -5 -6 0 -5 -14 -2 -3 -4 4 -8 -6 -10 -2 4 8 0 -3 1 -3 2 -8 -6 7 11 1 -11 -5 -3 -9 8
6463HnjrQJ7j6j3RJ2qj7MJ9qj1MkJ%POjj5MMmnOOKJPnJjjQqj1J4PmknRpmj%J4
$$ 8 3 2 -7 1 18 2 -11 -2 10 2 -15 -11 8 0 -11 -7 -9 -8 -8 -1 5 4 -11 -7 -3 -7 -12 -6 0 2 3 10 5 6 5 4 12 4 -7 7 14 10 8 3 12 5 1 0 0 14
6513A4j7jJ3poNj0LlQjJkoMLj1J0JMlrJ8j4jNmJ3p%MNmrJ3jj4MKKknNNLj0J1l
$$ 14 -3 -4 9 2 -4 1 -9 -6 -9 -1 -2 -1 -3 -9 -5 -2 -13 -3 -2 2 -1 -10 8 -6 -7 -2 -6 7 0 0 4 9 5 -4 9 8 -6 -2 0 2 0 -5 0 5 8 -2 9 6
6561FokMjqlQokP%KJoOjj1RKpOPLqoMLQj%JlPlmjJoJOpkjRj2nQ%MJjj6RPlKqj
$$ 6 0 -2 2 1 -7 -10 -2 -8 -10 -3 -3 -1 0 -6 0 -1 -12 -3 -1 -8 -2 5 8 0 -6 -2 1 9 8 8 9 6 13 10 6 5 6 0 1 7 0 -2 -3 6 -6 -11 -3 -3 1 2 1 -15 -6 1 -2 0 -8 -9
6619iMLjPllnNKmN%Rj2OJPr%oJ3pMj4LJ9j5LlkJ1j2J3j2OloQj3NjrRQj1QmKLo
$$ -9 -5 -2 -3 4 1 -2 -7 -2 0 -4 1 1 10 -2 4 5 12 3 3 -3 10 3 7 -7 -4 15 0 3 0 -2 9 -3 10 -2 4 1 -5 3 -10 -5 -6 -15 -6 2 -9 -1 -5 -3 0 -6
6669flQKj8J4llJ2pJjPlOlJmKJ7lnj2OKKlJjPj0n%J2lj1J3pOpkmNjoLj0jkmJ7
$$ -6 -9 -1 1 -17 -3 -6 -9 3 -4 -3 -4 3 0 6 3 4 0 2 19 16 11 -1 5 7 9 6 7 6 13 3 -2 -2 10 7 -4 9 2 8 1 -1 -5 0 -1 -7 -4 -14 -15 -17 -21 -4
6719dJjnjJ3jj%OJnnJJ0lnjPPrKnONj1J0mJqoKLrkJ1Mj7joJ1jLJ6pmkj0J5qMN
$$ -4 -3 -4 -9 -10 3 2 1 1 7 8 3 -2 -1 9 6 1 0 7 14 5 7 2 8 13 2 12 8 9 1 -5 -3 0 -9 -11 0 4 -13 -14 -20 -9 -10 -7 9 2 -2 -4 -14 1 -7 -3 2
6770Bj4JMM%jj%P%MlNjNlJrPmQj6OKj2LkPkNj2RjkLrQ%j0pJ4nmOMj0oJ3LJ1kq
$$ 2 -12 -11 -7 -3 -3 -4 -5 -5 2 2 6 3 8 7 12 9 10 1 8 4 12 -4 2 4 -8 -5 -7 0 -2 3 -9 0 -1 -3 0 -9 -1 -1 -11 -18 -4 -9 -13 -7 -3 -13 -19 -6 -3 8 6 -2
6822bJ6qJj0OpnJ1nMm%NnLkPj2RJ0omkmJ3j5oNPj0nlJ1nNJLlkKJ0jpJpJ0j3KJ
$$ -2 14 6 7 -3 3 -4 -9 2 -3 1 -3 -3 2 -3 0 -2 5 -7 2 12 6 2 0 -4 9 -6 -12 -7 0 -10 -15 -18 -7 -12 -7 -6 -3 -6 -8 -6 4 3 -4 -3 -10 0 -13 -11 -10
6871a0J0oljONJ4j2NrK0j4jJlLj0j0PJqQKKj0mKK5j4JMkjj0J2mMk0R%Mp%OJ2J
$$ -10 0 -6 -9 -10 -4 1 15 3 8 -1 19 5 4 5 2 5 -5 -15 -8 -7 -15 -7 -5 -3 -13 -17 -15 10 -4 -3 1 -1 -2 -12 0 -4 0 -20 -11 -11 -7 -14 -14 -8 4 5
6917Ej3J3lJ0j5J1nLlOqKlr%OmKRnJ1rlj5LJ6j1OlRj7nJ7lmoMNJJlj3J2LLnRk
$$ 5 -8 5 2 12 -3 8 3 6 3 9 1 3 0 -9 -9 -3 -7 -5 4 -1 10 1 -2 -17 -14 2 -9 -3 -6 3 -14 -19 -2 -5 -9 -15 -11 -6 -5 -4 -7 -20 -8 -5 -2 -7 2 0
$$ [...]
8191b
##END NTUPLES=NMR FID
##END=
