##TITLE=1H ikalashn
LY hexene-1 B1
16.4.2024
##JCAMPDX= 6.0         $$ Bruker NMR JCAMP-DX V2.0
##DATA TYPE= NMR FID
##DATA CLASS= NTUPLES
##ORIGIN= UXNMR, Bruker Analytische Messtechnik GmbH
##OWNER= root
$$ TOPSPIN		Version 1.3
$$ 2024-04-16 14:11:34.828 +0400  Irina@DPX200
$$ Compression mode = diff/dup
##.OBSERVE FREQUENCY= 200.13120078
##.OBSERVE NUCLEUS= ^1H
##.DELAY= (6, 6)
##.ACQUISITION MODE= SIMULTANEOUS
##.ACQUISITION SCHEME= undefined
##.AVERAGES= 8
##.DIGITISER RES= 18
##SPECTROMETER/DATA SYSTEM= spect
##.PULSE SEQUENCE= zg
##.SOLVENT NAME= CDCl3
##.SHIFT REFERENCE= INTERNAL, CDCl3, 1, 16.00952
##AUDIT TRAIL= $$ (NUMBER, WHEN, WHO, WHERE, WHAT)
$$ ##TITLE= Audit trail, TOPSPIN		Version 1.3
$$ ##JCAMPDX= 5.01
$$ ##ORIGIN= Bruker BioSpin GmbH
$$ ##OWNER= Irina
$$ $$ F:/spectra/data/iren/nmr/1H/4/audita.txt
$$ ##AUDIT TRAIL=  $$ (NUMBER, WHEN, WHO, WHERE, VERSION, WHAT)
(   1,<2024-04-16 14:11:14.203 +0400>,<Irina>,<DPX200>,<TOPSPIN 1.3>,
      <created by zg
	started at 2024-04-16 14:10:36.031 +0400,
	POWCHK disabled, PULCHK disabled
       configuration hash MD5:
       BE 6D 3F 07 2A EA 11 49 91 17 2B D3 AF B3 58 0D
       data hash MD5: 16K
       99 99 41 2B 5E 7F C8 54 03 9E 9B AE F6 03 90 AB>)
$$ ##END=
$$ 
$$ $$ hash MD5
$$ $$ 04 D7 D5 A8 36 38 6B FB 37 4E 11 08 AB 9C C4 30
##$RELAX= 
##$RELAX= 
##$RELAX= 
##$RELAX= 
##$RELAX= 
##$RELAX= 
##$RELAX= 
##$RELAX= 
$$ Bruker specific parameters
$$ --------------------------
##$DU= <F:/spectra>
##$EXPNO= 4
##$NAME= <1H>
##$PROCNO= 1
##$TYPE= <nmr>
##$USER= <iren>
##$AMP= (0..31)
100 100 100 100 100 100 100 100 100 100 100 100 100 100 100 100 100 100 
100 100 100 100 100 100 100 100 100 100 100 100 100 100 
##$ANAVPT= -1
##$AQSEQ= 0
##$AQ_mod= 1
##$AUNM= <au_zg>
##$AUTOPOS= <>
##$BF1= 200.13
##$BF2= 200.13
##$BF3= 200.13
##$BF4= 200.13
##$BF5= 200.13
##$BF6= 200.13
##$BF7= 200.13
##$BF8= 200.13
##$BYTORDA= 1
##$CFDGTYP= 0
##$CFRGTYP= 5
##$CHEMSTR= <none>
##$CNST= (0..63)
1 1 145 1 1 1 1 1 1 1 1 1 1 1 1 1 1 1 1 1 1 1 1 1 1 1 1 1 1 1 1 1 1 1 
1 1 1 1 1 1 1 1 1 1 1 1 1 1 1 1 1 1 1 1 1 1 1 1 1 1 1 1 1 1 
##$CPDPRG= <>
##$CPDPRG1= <>
##$CPDPRG2= <>
##$CPDPRG3= <>
##$CPDPRG4= <mlev>
##$CPDPRG5= <mlev>
##$CPDPRG6= <mlev>
##$CPDPRG7= <mlev>
##$CPDPRG8= <mlev>
##$CPDPRGB= <>
##$CPDPRGT= <>
##$D= (0..63)
0 2 0 0 0 0 0 0 0 0.06 0 0.03 0 0 0 0 0.0002 0 0 0 0 0 0 0 0 0 0 0 0 0 
0 0 0 0 0 0 0 0 0 0 0 0 0 0 0 0 0 0 0 0 0 0 0 0 0 0 0 0 0 0 0 0 0 0 
##$DATE= 1713262271
##$DBL= (0..7)
120 120 120 120 120 120 120 120 
##$DBP= (0..7)
150 150 150 150 150 150 150 150 
##$DBP07= 0
##$DBPNAM0= <>
##$DBPNAM1= <>
##$DBPNAM2= <>
##$DBPNAM3= <>
##$DBPNAM4= <>
##$DBPNAM5= <>
##$DBPNAM6= <>
##$DBPNAM7= <>
##$DBPOAL= (0..7)
0.5 0.5 0.5 0.5 0.5 0.5 0.5 0.5 
##$DBPOFFS= (0..7)
0 0 0 0 0 0 0 0 
##$DE= 6
##$DECBNUC= <off>
##$DECIM= 32
##$DECNUC= <off>
##$DECSTAT= 4
##$DIGMOD= 1
##$DIGTYP= 9
##$DL= (0..7)
0 120 120 120 120 120 120 120 
##$DP= (0..7)
150 150 150 150 150 150 150 150 
##$DP07= 0
##$DPNAME0= <>
$$ [...]
##$SW= 20.0189187932491
##$SWIBOX= (0..15)
0 0 2 0 0 0 0 0 0 0 0 0 0 0 0 0 
##$SW_h= 4006.41025641026
##$TD= 16384
##$TD0= 1
##$TE= 300
##$TE2= 300
##$TE3= 300
##$TEG= 300
##$TL= (0..7)
0 120 120 120 120 120 120 120 
##$TP= (0..7)
150 150 150 150 150 150 150 150 
##$TP07= 0
##$TPNAME0= <>
##$TPNAME1= <>
##$TPNAME2= <>
##$TPNAME3= <>
##$TPNAME4= <>
##$TPNAME5= <>
##$TPNAME6= <>
##$TPNAME7= <>
##$TPOAL= (0..7)
0.5 0.5 0.5 0.5 0.5 0.5 0.5 0.5 
##$TPOFFS= (0..7)
0 0 0 0 0 0 0 0 
##$TUNHIN= 0
##$TUNHOUT= 0
##$TUNXOUT= 0
##$USERA1= <user>
##$USERA2= <user>
##$USERA3= <user>
##$USERA4= <user>
##$USERA5= <user>
##$V9= 5
##$VALIST= <valist>
##$VCLIST= <CCCCCCCCCCCCCCC>
##$VD= 0
##$VDLIST= <DDDDDDDDDDDDDDD>
##$VPLIST= <PPPPPPPPPPPPPPP>
##$VTLIST= <TTTTTTTTTTTTTTT>
##$WBST= 1024
##$WBSW= 25
##$XGAIN= (0..3)
0 0 0 0 
##$XL= 0
##$YL= 0
##$YMAX_a= 363055
##$YMIN_a= -392025
##$ZGOPTNS= <>
##$ZL1= 120
##$ZL2= 120
##$ZL3= 120
##$ZL4= 120
##$ABSF1= 10
##$ABSF2= 0
##$ABSG= 5
##$ABSL= 3
##$ALPHA= 0
##$AQORDER= 0
##$ASSFAC= 0
##$ASSFACI= 0
##$ASSFACX= 0
##$ASSWID= 0
##$AUNMP= <proc_1d>
##$AXLEFT= 0
##$AXRIGHT= 0
##$AXTYPE= 0
##$AXUNIT= <>
##$AZFE= 0.1
##$AZFW= 0.1
##$BCFW= 1
##$BC_mod= 2
##$BYTORDP= 1
##$COROFFS= 0
##$CY= 7568.61572265625
##$DATMOD= 1
##$DC= 2
##$DFILT= <>
##$DTYPP= 0
##$F1P= 17.4489326093798
##$F2P= -7.48496080290002
##$FCOR= 0.5
##$FTSIZE= 32768
##$FT_mod= 4
##$GAMMA= 1
##$GB= 1
##$INTBC= 1
##$INTSCL= 1
##$ISEN= 128
##$LB= 0.15
##$LEV0= 0
##$LPBIN= 0
##$MAXI= 945.577
##$MC2= 0
##$MEAN= 0
##$ME_mod= 0
##$MI= -402.1523
##$NCOEF= 0
##$NC_proc= 0
##$NLEV= 6
##$NOISF1= 8.587773
##$NOISF2= 6.764455
##$NSP= 1
##$NTH_PI= 0
##$NZP= 0
##$OFFSET= 16.00952
##$PC= 1
##$PHC0= 187.1858
##$PHC1= 2.30072
##$PH_mod= 0
##$PKNL= yes
##$PPARMOD= 0
##$PPDIAG= 0
##$PPIPTYP= 0
##$PPMPNUM= 100
##$PPRESOL= 1
##$PSCAL= 0
##$PSIGN= 0
##$REVERSE= no
##$SF= 200.13
##$SI= 32768
##$SIGF1= 18.5376
##$SIGF2= -6.396296
##$SINO= 400
##$SIOLD= 32768
##$SREGLST= <1H.CDCl3>
##$SSB= 3
##$STSI= 0
##$STSR= 0
##$SW_p= 4006.41025641025
##$SYMM= 0
##$S_DEV= 0
##$TDeff= 0
##$TDoff= 0
##$TI= <>
##$TILT= no
##$TM1= 0
##$TM2= 0
##$TOPLEV= 0
##$USERP1= <user>
##$USERP2= <user>
##$USERP3= <user>
##$USERP4= <user>
##$USERP5= <user>
##$WDW= 1
##$XDIM= 8192
##$YMAX_p= 0
##$YMIN_p= 0
$$ End of Bruker specific parameters
$$ ---------------------------------
##NTUPLES= NMR FID
##VAR_NAME=  TIME,          FID/REAL,        FID/IMAG
##SYMBOL=    X,             R,               I
##VAR_TYPE=  INDEPENDENT,   DEPENDENT,       DEPENDENT
##VAR_FORM=  AFFN,          ASDF,            ASDF
##VAR_DIM=   8192,          8192,            8192
##UNITS=     SECONDS,       ARBITRARY UNITS, ARBITRARY UNITS
##FACTOR=    0.0002496,     1,               1
##FIRST=     0,             0,               0
##LAST=      2.0444736,     17,              -9
##MIN=       0,             -392025,         -392025
##MAX=       2.0444736,     363055,          363055
$$ Real data points
##PAGE= N=1
##DATA TABLE= (X++(R..R)), XYDATA
0@%%%%%%%%%jRj6J7k2L0l4M2n8O8p7R3j18J43j67J93k24K65l04L47m04M63n26
32b81O01o82P73q72R77j096J229j372J526j696J885k088K308k551K817l107L425
49A796l775M159m581N048n570O151o803P547q397R378j0532J1910j3585J5678
63H424j8377K2010k7195L5248m9557Q2567k95051r5673N69923r2115m18959j13270
75c92025M11021J95503k11619j99487J80322J75817q8682j47632R9184J24474
85A46876q4968j71511L0408J33780O545j39126q3384K3759P1441M8833j3643j14240
97a45230q1797J20233K20472j4415k52588p9218K78757K22096j82681k77013R4937
108i6447K91789j1070k77889n8809K22802O0862k31783j07122K07920J29507k15251
$$ y = [0, 0, 0, 0, 0, 0, 0, 0, 0, 0, -1, 8, -8, 9, -13, 17, -17, 25, -33, 35, -42, 51, -67, 76, -91, 102, -122, 143, -161, 186, -218, 245, -281, 320, -362, 411, -461, 516, -580, 649, -723, 803, -893, 992, -1096, 1212, -1339, 1478, -1629, 1796, -1979, 2180, -2401, 2647, -2923, 3228, -3575, 3972, -4425, 4953, -5579, 6331, -7254, 8424, -9953, 12057, -15138, 20110, -29447, 53120, -241931, -337604, 232319, 140204, -278755, -392025, 18996, 214499, 2880, -196607, -16285, 159532, 70850, -76782, 22402, 146876, 61908, -109603, -79195, 54585, 61130, -77996, -161380, -137621, -66180, -17347, -30990, -145230, -227027, -106794, 113678, 99263, -153325, -232543, 46214, 268310, 85629, -191384, -96447, 195342, 184272, -93617, -152426, 70376, 131238, -100545, -207667, 253, 129760, -85491]
119h5491j99808J73699K65443q4153k79998k642K74644J18355j75198j46057R2957
130d8249J47824j076q5182l6264Q679J3877K8609J2851n8002o9259K9096P8183
142B1087j6140q4163M664Q2702m213q4490K1433J27266M460j52579l7341J83587
154F6273J12715j63850j79510J08058K18328l5879k27443m8310J82097Q9037j35152
165a3636j09832Q2914R9056n2781p9851M7410P8796l5515p4062L2215Q6153n176
177E5691p7613j8624N4665L0422k4780k7906j1895q215J6272M1019m953p3440
189d9357l2351Q0995P6088n8882j00385L1812J17059R509j02704k8030R2070M2817
201G8641p9163n0292P0263N4411p2624p6910N5275Q7950m0692j06393M921J02119
$$ y = [-85491, -285299, -111600, 153843, 69690, -210308, -212950, 61694, 180049, 4851, -141206, -48249, 99575, 98499, 13317, -22947, -14268, -391, 28218, 41069, -16933, -86192, -57096, 21087, 4947, -79216, -74552, 8150, 3937, -80553, -59120, 68146, 72606, -79973, -117314, 66273, 178988, 15138, -164372, -56314, 162014, 126135, -101308, -149618, 32479, 121516, -13636, -123468, -40554, 58502, 5721, -74130, -26720, 52076, 16561, -57501, -25286, 60867, 55691, -21922, -40546, 14119, 44541, 19761, -8145, -20040, -28255, -11983, 29036, 24083, -49357, -81708, -713, 75375, 16493, -83892, -52080, 64979, 74488, -28216, -56246, 35824, 78641, -522, -50814, 19449, 73860, 1236, -75674, -20399, 67551, 26859, -79534, -74613, 27506]
213B7506K7491q1605m6565N7297N8968k0042m0351Q511K8476K768n916O749k681
226B0606j8681k76K1759j133l1579j0984K2934M179l0845r215L1930R138m0350
239c2517j6379N0314L7598m2522m8823L8848P1323j1514p0081n821O7990K5922
251F4338n5213l8775L5917L6443k9120m1445J3071L1145j4237l5277M297L0422
263A566K7k7415m725K4650J3597r923o550Q541Q513L735O416J794j1087n534J6067
278A9672J2938j8588k5845P740K4760p612l4290p078K6908P925k8738j5771K4946
291a3033K1043j8831k1467J9480L1796n500k6126N130L2349Q925k3505j1804J8468
304A6925J4528j3536j8286J704Q537n490j2859m254J638k548m068J41N82j495
$$ y = [27506, 54997, -26608, -73173, -15876, 43092, 23050, -17301, -8790, 19686, 22454, 16538, 23287, 20606, 1925, 1649, 23408, 22275, -9304, -20288, 2646, 6825, -24020, -33235, -1305, 7833, -32517, -48896, 1418, 39016, -3506, -52329, -13481, 57842, 46328, -23753, -29574, 38416, 64338, 9125, -29650, 6267, 42710, 13590, -27855, -14784, 16361, 2124, -33153, -28856, 1566, 1593, -25822, -30547, -5897, 7700, -2223, -8773, -232, 8281, 12016, 18432, 20226, 9139, 3605, 19672, 32610, 14022, -11823, -4083, 20677, 13065, -21225, -28303, -1395, 6530, -22208, -37979, -13033, 8010, -10821, -32288, -12808, 18988, 13488, -12638, -7508, 24841, 33766, 10261, -1543, 16925, 31453, 17917, -369, 1335, 9872, 4382, -8477, -12731, -11093, -13641, -17709, -17568, -16986, -18481]
318a8481K734P641L050k253M732J3179N598o832j235J3125Q287j0981j2531N770
332A1803J0181r153j9643l733J0289j477j6887q181R714P262p772o753Q850J2669
346b831R05l808N779J1741M360k750N01N003J654l510l564k336l910m694l295
361g55l980o538m584Q08Q82l951k859N299P840R58j919N887J1106L912l719J108
377I495Q502L602o616n744K594J843p436r219j363J620m715p447p82L883jk883
393a4667K068O455L254OL358O322K632j101J688M029p45n237j630K385k375q313
409a871m316K897L53p039m725M569N178k701l265N521Q048J11l284M140P881j09
425A1388o106k0N793p22q599m355L394K72p225m713L076J994m171j600O005M169
$$ y = [-18481, -15747, -8106, -5056, -7309, -2577, 10602, 16200, 9368, 8133, 21258, 29545, 18564, 6033, 11803, 21984, 12831, -6812, -10545, -256, -1733, -18620, -26801, -17087, -9825, -17597, -24350, -15500, -2831, -1926, -5734, 45, 11786, 16146, 13396, 13897, 18900, 20554, 17044, 13480, 11144, 7234, 2540, -755, -4735, -11273, -15857, -15049, -14167, -18118, -20977, -15678, -7838, -6880, -8799, -2912, 8194, 12106, 8387, 9495, 17997, 21599, 14983, 9239, 11833, 13676, 6240, -2979, -4342, -2722, -7437, -14884, -15666, -11783, -11784, -14667, -12599, -6144, -2890, -2884, 474, 6796, 9428, 8327, 10015, 14044, 13299, 8062, 6432, 8817, 6442, -1871, -6187, -3290, -2937, -9976, -14701, -10132, -4954, -7655, -10920, -5399, 2649, 2760, -524, 3616, 11497, 11388, 5282, 5262, 11055, 10333, 1734, -2621, 773, 1045, -6180, -10893, -7817, -5823, -9994, -11594, -5589, -1420]
441a420l274p24Q674O967m395n054O378Q306m651j0221P88P090l835j2207k386
456i964P311j325j1721k756J0969M883r478m733J2345J2001m560p777O966J2436
470A4597o14q620K29O258k345q553j386K926n805j0548k97O727k943j0677j20
485b1171J1075L592o952O52J2280N534o432N64J3626N043j2867p091J3293R548
499B0694j5688j9103O008J5458p645k2471l085J5955K890j5194m339J4689P511
512d320r696k504J6152J0644r615p427J2945J3604p588j3900K511R524m158j1611
526e439j924K211p165p571N570N991j0430j1600J0555J8525l569j6982L811K2889
540D872O490j5355m088J7209P504j5024p904J4516P118j9535j5697J4220J5883
$$ y = [-1420, -4694, -5418, 3256, 10223, 5828, 774, 7152, 15458, 10807, 586, 1374, 8464, 4629, -7578, -9964, -2653, -3978, -15699, -18455, -7486, -2603, -12081, -16814, -4469, 7532, 2972, -4805, 2161, 14597, 13983, 5363, 5592, 11850, 9505, 952, -434, 2492, -3313, -13861, -14158, -7431, -10374, -21051, -21171, -10096, -6504, -13456, -12804, -524, 5010, -1422, -858, 12768, 17811, 4944, -2147, 11146, 20694, 5006, -14097, -8089, 7369, -276, -22747, -25832, -9877, -6987, -22181, -26520, -11831, -4320, -14016, -16520, -368, 10276, 661, -6766, 6179, 19783, 12195, -1705, 806, 10330, 6172, -5439, -7363, -5152, -12317, -19888, -14318, -8327, -18757, -30357, -19802, -1277, -4846, -21828, -18017, 4872, 11362, -3993, -8081, 9128, 16632, 1608, -6296, 8220, 15338, -4197, -19894, -5674, 10209]
553A0209j5915k5190N806K3940k80k2101m325J9350R335j0661l811J2518N547
566D422q830l74J4191L292j5678o962J4617Q946j4668j4183P625J0128q470j0772
580a6716O475P358j0233q526J4337J4686j2928j8664J2556K7165k766k6368k871
593a6495K5722R803k0414j2330J4856J0380j4080j0636J2745R061j5971j3626
605b0985J4953J7553j2106k1161P007K2719K37j8449k591J5242M164j0036j74
618c627J0358k579j3215L273J7504r69k1591n340K1104J0584j8449j4736J3460
631d223J5077r652j3143R063J2194j0068j2974J1991J7275j0798k1929O812K5604
644A5229J94k5311p109K1266J1179j5577j1556J0966R026r494o414J1089O087
$$ y = [10209, -5706, -30896, -25090, -1150, -1430, -23531, -27856, -8506, 829, -9832, -13643, -1125, 4422, -4408, -4782, 9409, 12701, -2977, -9939, 4678, 13624, -1044, -15227, -7602, 2526, -5944, -16716, -10241, -2883, -13116, -21642, -7305, 7381, -5547, -24211, -11655, 15510, 12744, -13624, -16495, 9227, 19030, -1384, -13714, 1142, 11522, -2558, -13194, -449, 8612, -7359, -20985, -6032, 11521, -585, -21746, -14739, 7980, 8217, -10232, -12823, 2419, 6583, -3453, -3627, 6731, 4152, -9063, -5790, 11714, 10745, -10846, -16186, 4918, 15502, -2947, -17683, -4223, 10854, 1202, -11941, -2878, 9316, -752, -13726, -1735, 15540, 4742, -17187, -10375, 15229, 15423, -9888, -16997, 4269, 15448, -129, -11685, -719, 8307, -1187, -7601, 3488, 9575]
657I575j3489q478J4837J2931j2988j6701Q608J7706m113j6154J172J3007j444
670D469j1316L313J2153m894j5486M156J9721Rk1928o021K1021J1780j6903j4819
684a4745J1899J4964q032j3237O468J1569p021j1945P577J3973o997j7168L448
697i247J8491R70j7591n156J4328O982j0497o249Q115M172p944k171J0254K658
711G115j2594n165J3796R175j2331j2364R242J3715o015j3552L237J1673l129
724B803j1462L005J1793l330j4182J430J6087K145j6226n952J5082R995j1058
737A30j1000P900J1135m683r199L820P881m220q075M048Q285m419j0497K027J0346
752C479n80j0422j657Q879K611o893j557P057J621o688l55Q955K170r531l788
$$ y = [9575, -3914, -12392, 2445, 15376, 2388, -14313, -5705, 12001, 7888, -8266, -7094, 5913, 4469, -6847, -3534, 8619, 3725, -11761, -7605, 12116, 12125, -9803, -15824, 5197, 16977, 74, -14745, -2846, 12118, 4086, -9151, -2683, 8886, 1865, -10080, -2503, 11470, 4473, -12695, -9247, 9244, 10214, -7377, -12533, 1795, 8777, -1720, -7969, 146, 4318, -3626, -5797, 4457, 7115, -5479, -10644, 3152, 12327, -4, -12368, -3126, 10589, 4574, -8978, -5741, 5932, 2803, -8659, -5654, 6139, 2809, -11373, -9943, 6144, 8289, -7937, -13889, 1193, 11188, 130, -10870, -2970, 8165, 3482, -5717, -1897, 5984, 1764, -6311, -2263, 6022, 1603, -8894, -6867, 3479, 2899, -7523, -9180, -301, 2310, -4583, -6140, 917, 2538, -4150, -4505, 4450, 6620, -2911, -6699]
767f699J0046O459r189r120O340R400m879j0356J961Q802j774q983O74Q787K09
782A678q540n82R684L402p949l899P774O165n129n889L657N272k932n064J726
797f26L458l049m364K349L987l114n323K156N887j019n586Q22O367R96n015l71
813b445N877J741n122j793N418K555n684m321M264M352m285o075J991N523j318
828F78n654Q6N113R82l912n28M214J578k996p84L601J632k927j559K788J595k967
845I40k350J987J643k700k564J838K161k338k769K051L456j371l435J417M499
860B465J03m012m38M336J717l587k337K830K505k476l190J213K588j176k922K27
876b154K299j36k149p4K003N21j261K4J521K83r76L02J305l61j547M10J823n59
$$ y = [-6699, 3347, 9806, 617, -8503, -2163, 7237, 2358, -7998, -6037, 2765, 991, -7992, -7318, 1469, 1678, -6862, -7444, 2240, 5642, -2307, -6206, 1568, 7733, 2604, -3285, 372, 5644, 2712, -2352, -626, 2832, -217, -4581, -2232, 1755, -1359, -6682, -4526, 1361, 342, -5244, -4422, 1945, 2941, -2074, -2445, 3432, 5173, 51, -1742, 3676, 6231, 547, -3774, 490, 4842, 557, -5518, -3527, 1996, 678, -4976, -4890, 223, 1205, -2707, -3235, 979, 2557, -439, -1223, 2378, 4010, 1083, -476, 2312, 3907, 940, -1410, 577, 2220, -480, -3044, -1206, 955, -1383, -4152, -2101, 1355, -16, -3451, -2034, 2465, 2568, -1444, -1882, 2454, 4171, 584, -1753, 1077, 3582, 1106, -2084, -871, 1717, 541, -2381, -2154, 145, 9, -2140, -2214, -211, 310, -951, -927, 594, 877, -99, 203, 1508, 1147, -400, 10, 1833, 1274]
894A274k675k57K707N66l167j607K842K289k456k903J885L530q41l435L38L696
910A786P19l213j285K870J906k242k391J325K234q26k287j36J638M17j093n51
926a129M40M40K09K04l29o45N13J476m7j943m85K298J254k393k152K089K871j689
944I82l762P00M127L03m303j490M025K672l197l433K314M064r67m004j31L655
960A555J127k909j887J854K057q54j964k15J282Q65l93j208o88J052J799l45k588
977a460o76L089K083k930l417K313M676j144n528m53N746K082n536l793M540N114
993D706l236o021J507O360K92n933j889N033L222l636l856K059L911n19l325p80
1009b105K188J511p99j697p77J082K073P4k953j735L133L642k483n302J155O639
$$ y = [1274, -1401, -1658, 1049, 1615, -1552, -3159, -317, 1972, -484, -3387, -1502, 2028, 1187, -2248, -1910, 1786, 2505, -708, -1993, 877, 2783, 541, -1850, -525, 1709, 883, -1404, -1540, 98, 515, -578, -1129, -689, -249, -40, 164, -165, -810, -297, 1179, 1132, -811, -1296, 1002, 2256, -137, -2289, -200, 2671, 982, -2780, -2080, 2047, 2350, -1953, -3443, 582, 3254, 57, -3376, -1062, 3002, 2035, -1969, -2100, 1555, 2682, -227, -2114, -260, 1797, 943, -1021, -1236, 46, 911, 518, -690, -1378, -326, 1473, 1128, -1460, -2136, 953, 3036, 106, -3311, -998, 3678, 2534, -2994, -3447, 2299, 4381, -1155, -4948, -408, 4706, 1470, -4551, -3044, 3316, 3608, -2325, -4214, 819, 4041, 405, -3451, -1392, 2519, 2000, -1325, -2105, 83, 1594, 795, -902, -1679, -597, 1476, 1550, -1403, -3138, -5, 3637, 1154, -4148, -2993, 3646]
1025C646Q78p185l140O969N456n900p475M035Q860j780r517q49R260L283q189
1040a648n427O381O897m052p433J623P111O71n815k279L976L084j796k815k00
1055a722J650J544R8k123k225J682M165m00n652j558O442M033o306o533N340R024
1071G459l284j0800N15J1791K807j1549o153J0113R034p661j1073M396J1781j063
1085F313j1341j982R848M276p601n585N170O037k673n401O54M144Q30k257j474
1100a042K9J036K026L42l618k732M042N408l348q087J323J0078J672j0858n093
1115h822J0426Q529q615j1227N998J3165k706j4009r04J3679M223j2484p348J0076
1129a9R496p203j0825L734J0711n17r356k013P169L466m378l541J884K539Pn89
$$ y = [3646, 4524, -2661, -5801, 1168, 6624, 724, -6751, -2716, 6144, 4364, -5153, -6002, 3258, 6541, -1648, -7075, -694, 6203, 2151, -5282, -3659, 3452, 4123, -1692, -3971, 5, 3089, 1293, -1522, -1722, -72, 1472, 1570, -553, -2778, -1096, 3069, 2669, -2983, -4541, 1901, 5934, -372, -6905, -1565, 7459, 4175, -6625, -6110, 5681, 8488, -3061, -9214, 899, 9933, 2272, -8801, -4405, 7376, 6313, -5028, -7010, 2838, 7114, -487, -6072, -902, 5135, 2462, -2939, -2285, 1859, 2689, 432, -1042, -1013, 23, 2049, 2391, -1227, -3959, 83, 5491, 2143, -5944, -4621, 5457, 7129, -3729, -8822, 1604, 10133, 1518, -9709, -3711, 9454, 6748, -7261, -8165, 5514, 9737, -2747, -10095, -19, 9477, 2274, -8551, -4817, 5894, 5377, -3979, -5992, 1177, 4643, 265, -3276, -1392, 1147, 1154, 565]
1145E65q35j750L98L659O95n340k870N914N063n982p791M821J0123k901j2027
1160h258J08J3278L442j3125p049J1823J0418r145j2799N638J3850k017j3765
1173g601j703J2102M170j0111o157P376O733n012o726K679N904r03m345lK665
1188i32L51p12M70p31k002J472M099j339o449l31P894K390q951n490Q463Q201
1204F403p141j0748M809J2443j852j3043j068J3123M249j1873o872J0223R065
1217G718p671j0464M748J0724k032j0337q03Q591K350o702l275M431L042k650
1231b330k018J654Q11j111P98J811j747k672K493M228k534n788J885P282p72q736
1247f746j299R226L468r351o083Q431Q408o612j0192M348J1418j332j1199j088
$$ y = [565, -270, -2020, -1622, 2037, 2732, -2608, -5478, 436, 5499, -483, -8274, -3453, 6670, 3769, -8258, -8150, 5128, 8570, -4555, -11604, 219, 10637, 1492, -11307, -5669, 8181, 6164, -7601, -9304, 2798, 6968, -3143, -9300, -1924, 4809, -203, -6929, -4250, 1654, 751, -3594, -3597, -932, -581, -1293, -823, -1554, -3556, -2084, 2015, 676, -5773, -6104, 1790, 4180, -4771, -10261, -1798, 6403, -738, -11486, -6677, 5766, 3914, -9129, -10197, 2926, 7175, -4698, -11570, -1347, 7718, 47, -10417, -5669, 5055, 3023, -7314, -8117, 474, 2824, -3878, -7153, -2722, 320, -2330, -4348, -2694, -1883, -2994, -2196, -385, -2132, -4804, -2311, 1917, -617, -6405, -4520, 2762, 1990, -6746, -8045, 1181, 4649, -4702, -10785, -2354, 6054, -558, -10750, -6402, 5016, 3684, -7515, -8603]
1261h603J0712L611r101n217P287O269n343o588L349O235j946n626O49M453q1
1276F0l304R5K306m91j511J529J546k300j748L414K967l739m179L645N658k984
1292I64p028J632P840q2q442j880Q213L666p482n251O446O706m768p387L178P927
1308D252j216p505k25O985J599n952k413M779K779l809k812K809K417k420k072
1323b804K136J654k146j312K558J426k822j508L301K151l403k721L497L615l277
1338C45m481K612N191j869n781P41O010L14o067j502N647K595n022l295M325M027
1354C790l375m250K551M457j638m285J000M036n05l815L3L404J21l223k86L003
1370A018L40k978m39K997O07l045p19L183J145l237j497L268K024l110k497K880
$$ y = [-8603, 2109, 5720, -3381, -8598, -1311, 4958, -385, -6973, -3624, 2611, 665, -4961, -4312, 141, 60, -3244, -3149, -843, -1334, -2845, -1316, 230, -2070, -3818, -404, 2563, -1176, -5355, -1710, 3948, 964, -6064, -4432, 3408, 3326, -5116, -6996, 1217, 4883, -2599, -7850, -1404, 5302, 534, -6853, -3675, 4252, 3036, -4469, -4694, 2291, 3890, -2062, -4475, 304, 3083, -726, -3538, -729, 1688, -732, -2804, -668, 986, -1160, -2472, 86, 1512, -1310, -2818, 483, 2634, -769, -3490, 7, 3622, 345, -4136, -1524, 3667, 1798, -3983, -3242, 2768, 3082, -2985, -4487, 1160, 3755, -1267, -4562, -237, 3790, 415, -3835, -1284, 3173, 1535, -2750, -1750, 2286, 1781, -2034, -2001, 1403, 1524, -1699, -1985, 1018, 1358, -1620, -2059, 938, 1545, -1500, -2219, 964, 2109, -1128, -2625, 643, 2667, -443, -2940, -60]
1386f0L008k562l521K002L807j473m100Q00M185j78m144m79M015J122l694j530
1402b802L401J972k969k257K543K498k125k583J735K623j426k634J080K572q63
1417G65k520O85K466n67k493M28K570k74k592J50K797J17k923m17L024Q07l033
1434a010j237K998J726k877k238K566K703k152l056J661L331j088l449M57L406
1449A741J15l208n54K942R65k595j182K244J340j905j310J668J255j492j207J438
1465B55J135j466j141J551J230j678j458J693J732j683k092J555K486j275k821
1480a977R15L093l66l194j32L235O94l090j216K794J621k442j911J971K044j615
1496D24k110J217K013r32j902P66J799o89j689P16J710o85j729P71J957p05k189
$$ y = [-60, 2948, 386, -3135, -1133, 2674, 1201, -2899, -2099, 2086, 1908, -2236, -2715, 1300, 2422, -1272, -2802, 599, 2571, -398, -2655, -112, 2386, 261, -2322, -587, 2036, 610, -2024, -944, 1628, 765, -1755, -1070, 1396, 829, -1664, -1236, 1334, 1060, -1532, -1382, 1415, 1532, -1391, -1808, 1216, 2023, -1010, -2247, 751, 2477, -400, -2638, -72, 2631, 479, -2577, -916, 2415, 1327, -2122, -1665, 1741, 1856, -1352, -1906, 1036, 2001, -594, -1776, 468, 1808, -97, -1407, 261, 1516, 24, -1183, 255, 1390, -76, -1217, 334, 1564, -114, -1572, 121, 1853, 170, -1922, -367, 2119, 844, -1977, -1062, 2031, 1665, -1529, -1661, 1574, 2268, -822, -2038, 756, 2377, -65, -1976, -5, 2039, 424, -1686, -469, 1544, 612, -1290, -524, 1275, 586, -1103, -387, 1323, 638, -1091, -320, 1637, 932, -1257]
1513a257N44K410l20k678j01K767M44k869r90K719J406k523j818K210K149j778
1529C15k321J404K402r44k279O82K189m39j995L23J879l92j833L98J839n21k085
1546a378M47K261l70k597J51K903K72l114p37L281J380l135j988K944K609k479
1562D50l102J866L401j209l539M92L394O9l160n99K742Q51k309r65J909R18j624
1579d15o82J515M76j547k28J820J74k199k63K586N76k991j127L244J802l294k628
1596c181L102L435k615m139J908M712r98m982J3M951R94m665j880M094K550l423
1612a24l024K597L155j868l063J200K765p55k320N84J934o11j585Q83J459j244
1628a7j563J595J877j902k496J907L161j817l960J260M612n39n144m96N394J667
$$ y = [-1257, -713, 1697, 1377, -1301, -1402, 1365, 1809, -1060, -2050, 669, 2075, -448, -2266, -56, 2093, 315, -2006, -602, 1800, 856, -1423, -741, 1448, 1009, -986, -663, 1216, 824, -1009, -611, 1228, 707, -1378, -931, 1330, 960, -1637, -1486, 1417, 1689, -1425, -2162, 1119, 2499, -636, -2624, 320, 2929, 450, -2652, -786, 2615, 1406, -2133, -1641, 1753, 1822, -1338, -1937, 805, 1656, -653, -1618, 291, 1209, -415, -1097, 418, 894, -653, -881, 939, 1113, -1086, -1349, 1237, 1813, -1178, -2305, 939, 2741, -553, -3181, -79, 3356, 741, -3398, -1490, 3222, 2224, -2758, -2745, 2206, 3200, -1465, -3345, 749, 3299, -124, -3148, -551, 2604, 736, -2327, -1127, 1638, 883, -1437, -853, 1081, 470, -1115, -232, 1227, -17, -1580, 15, 1892, -10, -2506, -599, 2562, 745, -3215, -1955, 2657, 2118, -3026, -3522, 1872, 3539]
1644C539n282k757M869L914m043m645L052N234j920n396P47N188J63m852j086
1659c275M090J473l520j801K698J692k257j426J905J078j792o27K113M82k438
1674a605l52L102P12l590j253L987K060m247l166L915M109l634n235K588N906
1689C297j585o507K03O606J216o273k370N721L655m663m207L634M776k419m661
1704c577J358M351o09l900o4L067P1k642j26K007l76j968P14K059j149k432J529
1721a687L260j361l883J222M888l57n375n22N868J834n955l224N455M409m857
1736b85n668L501O326k327o836P15O710P09o178j789N456K878m279l122L378L430
1752B619k240l014J628K609j174k052J014J423j360j191J630R49k378j322K798
$$ y = [3539, -1743, -4500, 369, 4283, 240, -4405, -1353, 3881, 1961, -3435, -2688, 2500, 2663, -2189, -3275, 815, 2288, -1232, -3033, -335, 1357, -900, -2326, -421, 657, -1135, -1762, 351, 833, -1605, -1957, 1145, 1857, -1733, -2986, 1001, 3061, -1186, -4352, -437, 3672, 38, -5197, -2609, 3297, 1712, -4795, -4592, 2014, 3230, -3043, -5413, 308, 3963, -700, -4907, -1273, 3503, 1084, -3577, -2219, 2132, 1523, -2377, -2441, 626, 697, -1945, -2071, -64, -440, -2408, -1694, 365, -784, -3216, -1687, 1573, 212, -3671, -2449, 2439, 2082, -3293, -3815, 2053, 3887, -2068, -5292, 163, 4572, -285, -5953, -2452, 3874, 1547, -5289, -4574, 2136, 2845, -3333, -5122, 334, 3212, -1067, -4189, -811, 2619, 379, -2635, -1007, 1602, 428, -1624, -610, 813, -547, -1738, -108, 841, -1537, -2859, -61]
1767f1J812l243k630L389L797l015m688K475N832j230o314O5O709J495o437k909
1783d953N802M108m927n096L613N564k456n802J036N537M7n011r23M288J549l353
1799i77j616K605J572j884j021J688N85j701q6K047j67k616Q9L209K43l796r28
1816b754M115J758m274k730M084L775l602m711K785N502j713n948M74O108Q76
1831C745n814k107N174L123m222l711L214M047k169l929J344L661o57l195K89
1846a207K739j55k378P5J977l35j908M72J876q28k185R54K611r38l108P62L802
1863B226p2m088n81M446J637m209k445L904L313l305l996K410M300j730m666O32
1879b224M485J7m437r47L947J579l367j886K863K313k020k041J773K115j178j625
$$ y = [-61, 1751, -1492, -4122, -733, 3064, 49, -4639, -2164, 3668, 2438, -3876, -3811, 2898, 4393, -2044, -4953, 849, 4957, 30, -5066, -1453, 4111, 1655, -4147, -3111, 2426, 2473, -2538, -3461, 827, 2376, -977, -2593, 12, 1584, -300, -1321, 367, 952, -749, -835, 1212, 1045, -1571, -1482, 1727, 1970, -1826, -2754, 1361, 3119, -1155, -3885, 199, 3974, 372, -4339, -1554, 3948, 2235, -3713, -3239, 2869, 3745, -2069, -4176, 998, 4121, -101, -3812, -598, 3449, 1280, -2649, -1305, 2356, 1699, -1496, -1207, 1532, 1377, -1001, -926, 1051, 716, -1192, -720, 1156, 328, -1857, -903, 1708, 770, -2338, -1576, 2226, 2154, -1934, -2515, 1931, 3568, -641, -3086, 818, 4131, 826, -3170, -760, 3540, 1810, -2856, -2224, 2261, 2278, -2159, -3106, 841, 2420, -947, -2833, 30, 2343, 323, -1718, 55, 2170, 992, -633]
1895f33J225J556j234j489J243J366j593j801J380J788j651k419J277K594j147
1910D62k969Q66L407j50l399j08L836J132l396j473L445K325k828k769K209K956
1926C546j764l318Q31K935p14l157p7K648J88k548m33K378P67j915n44K107J009
1943A939j523n97J846R34j618q44J674Q97j889j373J606J256j962k058J364K019
1959A671j400k490R14K670m01k565K37K897N88k348n08K646J214k117j323J959
1975A644J530j736j899J162J599j282k075N77J601p55j817M18J692l06j612M13
1991h46J912O4j557K09K026L63j734l64J837O32j809j002J461R12j690j507J117
2008B4J275j264j676Q45J624o33j624N14J804l5j453J92J697K28j391j36J457
$$ y = [-633, 592, 2148, 914, -575, 668, 2034, 441, -1360, 20, 1808, 157, -2262, -985, 1609, 462, -2507, -1641, 1766, 1616, -1783, -1891, 1945, 3077, -319, -1792, 1653, 3978, 1150, -1619, 590, 3546, 1782, -1536, -705, 2230, 1516, -1641, -1718, 930, 1118, -1430, -1863, 515, 1282, -633, -1177, 930, 1939, 416, -181, 1665, 2599, 981, 137, 1811, 2708, 819, -554, 1052, 2308, 346, -1712, -348, 1671, 271, -2219, -1305, 1365, 964, -1601, -1364, 1533, 2121, -227, -735, 1911, 3125, 1008, -315, 1644, 3174, 1438, -461, 701, 2300, 1018, -1057, -480, 1121, 366, -1451, -1033, 659, 353, -1259, -846, 1066, 1130, -427, -218, 1808, 2171, 437, 73, 1910, 2542, 733, -269, 1192, 2104, 414, -1093, 24, 1299, 35, -1641, -796, 828, 195, -1429, -915, 889, 854, -599, -407, 1290, 1518, 127, -9, 1448]
2025A448K58j442m58J308L71j566q31J281P34j450j130J206J244j124j383R74
2041e60J649o14j587N42J807j21j714j08J685L65j574o54J309O96j218r00Q78
2058a19Q13p69p78O66P37n62o29O08O54o05n88O85O46p93q44P31R07q40j206O73
2078f13J365n29j580L12J796J23j734k84J868Q34j576j040J413J346j136j589
2094a024O51J487n40j689p6J269P3j243l81R21M38o26j99O79L75k74J90O40L3
2113G04m64L09P68k79j044J01J033k60j628m49J341L63j762j071J436J363j227
2130g66j592J093K138k57j756K78K222O39j613o56J532J017j208j286N93Q67p32
2147E13j294o6N48k88p17o5L01j13m7N05L07l30J75J179O10p99m58J297J121j054
$$ y = [1448, 1706, 264, -194, 1114, 1485, -81, -912, 369, 1103, -347, -1477, -271, 973, -151, -1534, -560, 1089, 475, -1112, -570, 1237, 1116, -598, -706, 979, 1344, -230, -884, 425, 1121, -97, -997, -119, 694, -75, -853, -187, 550, -12, -641, -33, 621, 16, -572, 113, 759, -34, -878, -147, 760, -80, -1286, -613, 752, 223, -1357, -1045, 751, 874, -860, -1144, 724, 1558, -18, -1058, 355, 1701, 565, -1024, -373, 1114, 574, -1115, -1191, 78, 151, -1092, -1473, -552, -114, -740, -939, -260, 115, -159, 31, 671, 704, 240, 549, 1317, 1038, -6, 95, 1128, 868, -760, -1209, 132, 495, -1267, -2338, -902, 461, -766, -2358, -1265, 873, 616, -1140, -862, 1360, 1999, 386, -270, 1262, 2279, 1071, -215, 378, 1245, 513, -781, -847, -299, -587, -1304, -1369, -1068, -1181, -1228, -723, -416, -746, -571, 608, 1218, 419, -39, 1258, 2379, 1325]
2167A325j496P35J601p48k334k45J873J80k342j147J754J317j550j618J233K071
2183F09l91j610M50K024M95j270l33J262O87p81o73L15K31m65m41j27l98m79K11
2202f84L42o93q78N97J351k61j437K67K114O67j710p36K032J574j502j862J184
2219C65K133q36k582o3K248K35k509j163J786J321j524j681Q85J725k37j291J34
2236a054J232M03n14OM58P8o0L35P0o41k50P22K21j195p59J027Q53j333j510J042
2256h69J916p74k347L20K739N84k541j115K464J975j709k198J178K410n11k293
2272g71n6J976K88j832p13J420P06j268r55Q16R07n21p66K20M89j7K6K64l05n54
2292f46N61J190l19j649r0J959O99j959j344J692J753j350k085R12K218n49k382
$$ y = [1325, -171, 564, 2165, 1417, -917, -1162, 711, 891, -1451, -2598, -844, 473, -1077, -2695, -1462, 609, 218, -1392, -942, 1082, 1577, 307, -26, 1236, 1923, 1142, 469, 784, 1015, 550, 109, -18, -416, -895, -684, -342, -1035, -1913, -1316, 35, -226, -1663, -1396, 718, 1385, -325, -1061, 971, 2545, 1043, -819, 365, 2498, 1662, -920, -983, 1265, 1500, -1009, -2172, -386, 935, -589, -2270, -1385, 340, 103, -1188, -1054, 178, 581, 67, 73, 531, 609, 549, 884, 954, 313, 63, 785, 1006, -189, -948, 79, 932, -401, -1911, -869, 1047, 273, -2074, -1754, 985, 1569, -972, -2087, 377, 2352, 643, -1555, -377, 2033, 1522, -771, -827, 1149, 1437, -395, -1108, 312, 1018, -250, -1205, -389, 518, -3, -769, -549, -60, -77, -51, 213, -92, -646, -85, 1105, 786, -863, -953, 1006, 1705, -254, -1598, 94, 1847, 497, -1588, -676, 1542, 993, -1389]
2309a389J57K461K80k508q64K363J421k004j923J352K106o61j989P4J592K74j052
2326c10j94P26K9m76L64O55m75q07N19R89m53j125K71J088m38j339L03J421m19
2345C29j947J7K261N15k403j154K330K047j608k263J161K633k42k233r6K012L35
2362A694j761n18J458L18j701q10J326P25j407j159R02J070n50q17N12P26l09
2379c01q3J012M66j056l93J568J108j461j618J057J835q81k279%J779j35k063
2396a445l71J721L44j884n32K081J210j664j238J800K143p87j845N88J955K3j512
2413E87k67R72j30j181j36P42n25j409M6J288n4j488k38J538O95j038l09J416
2431E09Q01r38l24J484P80j427j048J412J346j460k109N71J834n59k226k88J634
$$ y = [-1389, -1232, 1229, 1509, -999, -1863, 500, 1921, -83, -2006, -654, 1452, 791, -1198, -1124, 468, 742, -310, -504, 222, 251, -225, 139, 794, 319, -488, 31, 1020, 567, -558, -287, 801, 363, -976, -673, 748, 329, -1618, -1601, 660, 1175, -1228, -2382, -52, 1995, 387, -1876, -715, 1918, 1676, -557, -653, 1359, 1694, -67, -585, 873, 1191, -510, -1320, 6, 731, -676, -1835, -933, 137, -413, -1230, -718, 8, -301, -384, 628, 1094, 38, -355, 1213, 2321, 860, -758, 299, 2134, 1253, -1026, -1026, 753, 618, -1445, -1816, -95, 249, -1635, -2167, -86, 1124, -540, -1778, 22, 2165, 1378, -467, 121, 2076, 2099, 587, 320, 1292, 1162, -19, -155, 587, 62, -1347, -1301, -13, -67, -1555, -1793, -255, 440, -598, -907, 509, 1310, 372, 48, 1532, 2312, 885, -163, 1249, 2595, 1135, -974, -403, 1431, 872, -1354, -1642, -8]
2448hK90j513l83J459N70j129k15J618Q76j166p17J399J222r44j261O14J055o30
2466A137j226J84O70p07j053M88R27p41j317N67J673j26j544N2J832O20j330m87
2484c81J388P55j145p73J098P39j286j181R46J135j056j615N18J537k96j503j5
2501a135J383K71j022o0J098K08r18k1J129J65j220l54J186M79j264q33R32P73
2519G97r22r22P59Q72p44r29P90J162o63j277O10J558k43j613j27J564L84j435
2537c79o67J113O78j001p70Q15P20p90p29Q11R13o45r11N80J055l09r83K02Q78
2556E81j85q47R9O87l36r04K23R63k58j215K3J358L07j273m40J321Q34r75q04
2575h41R35R87p42j000O30J045o16j312K76J195j98j390k24J158L34r97m71Q43
$$ y = [-8, 282, -1231, -1614, -155, 415, -714, -929, 689, 1565, 399, -318, 1081, 2303, 1359, 98, 712, 1767, 1137, -89, 95, 765, 58, -995, -507, 420, -321, -1638, -1071, 602, 476, -1068, -1016, 816, 1436, 106, -381, 1007, 1762, 617, -156, 942, 1681, 395, -786, 160, 1295, 239, -1376, -858, 679, 383, -1120, -1135, 248, 519, -503, -563, 535, 743, -175, -196, 933, 1098, -122, -476, 710, 1189, -75, -908, 24, 797, -125, -1047, -288, 584, -160, -1089, -299, 863, 200, -1077, -467, 1091, 848, -765, -892, 672, 1056, -379, -1046, 67, 745, -256, -1026, -211, 509, -281, -1010, -199, 714, 69, -842, -262, 793, 484, -499, -297, 581, 396, -451, -352, 335, -1, -905, -682, 281, 23, -1192, -1169, 189, 496, -777, -1217, 104, 938, -37, -841, 94, 1081, 339, -661, -31, 1014, 398, -914, -638, 557, 359, -1031, -1255, -97, 237, -760, -1231, -388]
2593c88N56n27l03P04M43n22k39P46M40o89n24O38N74o98p94M14O28n81q40L72
2613e90P71m51r68L69J152j14j124L4J375M39j067m81J074P63p74p58O20P25o15
2632C80q52L63P01m95r09K21Q06j87q63L7Q13J00o28L4P47J09n69O5Q07R6p93
2653a7j54Q88K95r19n72P18N58p47p85M70P15m99q26L23Q79k44q74J80J021J05
2673E15q65j32R16L78o93l45O36L66n68l89M95L02o19m43N31M24o13o14M72O35
2693C89m16p02L80P79k46p39K70Q82j01q56N2R81J70r68l56Q73M99p94o66N28
2713d1O39m87p13K75O21k96n93K05O15j43n53J29O40j9n20O8N77on35N7N88n4
2735D54o85l8P55Q1q68l26Q18M47q40o71O99P91n63q83M12R77k10r30J07R88J22
$$ y = [-388, 168, -359, -662, 42, 485, -37, -276, 470, 910, 221, -303, 335, 909, 211, -583, -169, 459, -122, -962, -590, 181, -270, -1238, -869, 283, 169, -955, -921, 454, 893, -174, -655, 419, 1182, 408, -350, 270, 995, 380, -472, -109, 592, 97, -812, -591, 215, 28, -835, -798, 15, 115, -513, -479, 268, 377, -192, -127, 680, 776, -17, -171, 717, 1012, 93, -479, 239, 797, 50, -735, -265, 450, -49, -875, -552, 327, 83, -791, -611, 410, 515, -350, -482, 434, 812, 119, -226, 410, 776, 208, -181, 314, 616, -3, -446, 85, 509, -104, -718, -246, 389, -27, -729, -349, 430, 184, -555, -285, 597, 496, -360, -308, 673, 843, -125, -481, 392, 891, 97, -569, -41, 598, 111, -602, -327, 294, -2, -595, -390, 225, 82, -471, -342, 298, 279, -241, -173, 404, 398, -137, -80, 508, 454, -231, -269, 486, 567, -301, -627, 191, 638, -202, -873, -174, 617, 54, -829, -417, 560, 350, -580, -473, 515, 637]
2756F37q85k44Q35L84o92m73N27M50m44m76K91L53l09l28K61K62l08k50L70K83
2776B44l88l06N12M37m71n29N18P37m24q69K82J010j03j097j81J051L71j028o10
2795h44Q23P41p11q62N06R29l07r17J25R38J02p93j92O47L20m49k57K75J58k19
2815A3l0K05j23l79J45M85j55o44J8P41Q7p68k37Q37L99q06n15Q47P43p20r45
2836h02N87J180l14j294n0J236L54j113o62P94P17n58p46L14O32k01m99J57M77
2855B09j03l94J11L88j4k80N9J87j41p8K51R7n14k79O03N39o62q90M39J119j50
2876D97j213j91J187N20j002o50Q53Q01o36q22N42R27m08j013J66J064L6j041
2894c83l69P95N15n53n64K12M23j2j79K9m2j30K25L81j57n40Q4O57J01o62k45
$$ y = [637, -248, -492, 343, 727, 35, -438, 89, 539, 95, -381, -90, 263, -46, -374, -113, 149, -159, -409, -39, 244, -144, -450, 62, 499, 28, -501, 17, 754, 330, -539, -257, 753, 650, -447, -628, 423, 794, -234, -844, -21, 720, 9, -853, -347, 582, 275, -642, -517, 421, 523, -270, -462, 185, 505, 56, -201, 74, 232, 13, -17, 188, 65, -314, -169, 316, 161, -483, -465, 276, 363, -405, -642, 195, 594, -212, -727, 120, 863, 143, -802, -215, 965, 651, -643, -693, 543, 897, -216, -878, -84, 633, 75, -671, -357, 275, 74, -425, -268, 209, 106, -288, -177, 211, 197, -83, -24, 163, 22, -56, 195, 292, -222, -501, 102, 641, -21, -911, -472, 647, 497, -716, -907, 280, 800, -202, -852, 1, 802, 166, -656, -114, 813, 405, -608, -442, 622, 658, -383, -752, 43, 558, 5, -559, -347, 76, 64, -115, -86, -128, -258, -33, 348, 191, -349, -265, 392, 493, -169, -414]
2915d14O43K94o66m05O64N02p38p55O73J016m82j222J32J359K72j208n82R79Q03
2934H65o15q02L45P05k07n81J59M83k13m92J58M84j09m77K2L85J0k32N6J57k09
2955a08j68M19L55n30o10M63Q85k46j073p0J087L60r56n75P59O70o03o77N11P13
2975F06m16p80L39Q97k02r30n1R00K68p71m25M97M30l19l28J95J45k16k1L58L
2996A79m73q5O05K60n67l97N17M70m28n00L71M73l81n55L72O49l64q39K17R53
3016D77Rr66k58Q89M83o92n20N20N65l60m36L33M10l32m28L73M68l80n82K26N99
3037C98j59o11MN19Km79L3M67o2n00R6O66L0o81j33P48L72o25m77N32N38l87n53
3060b62K81M68l10n12K55M85k90o19J79O87q7o99k2P22K08n45j74N60K83m31j86
$$ y = [-414, 229, 523, -143, -548, 116, 618, -120, -875, -202, 814, 332, -890, -758, 601, 873, -335, -917, 62, 865, 250, -552, -207, 498, 291, -290, -131, 352, 139, -353, -195, 289, 180, -297, -275, 110, 120, -112, -56, 101, -108, -276, 143, 498, -32, -642, -179, 706, 460, -613, -683, 404, 764, -192, -767, -8, 662, 59, -618, -107, 606, 190, -590, -251, 646, 444, -486, -537, 363, 631, -140, -565, -68, 362, 43, -285, -90, 55, -161, -182, 176, 179, -294, -379, 226, 486, -81, -478, 39, 509, 81, -419, -48, 425, 44, -511, -139, 510, 146, -693, -476, 477, 486, -480, -738, 151, 634, -58, -578, -58, 507, 147, -289, 44, 454, 122, -306, 67, 535, 155, -427, -201, 398, 239, -372, -368, 151, 153, -326, -293, 174, 112, -388, -292, 374, 404, -277, -410, 338, 710, 85, -392, 140, 678, 291, -262, 19, 487, 177, -335, -80, 405, 115, -504, -325, 362, 275, -424, -446, 276, 484, -61, -235, 325, 608, 177, -9]
3081iN17K23n30l08N26L66n66n90L55N67l40o70J16N72q9n23R1N55j4m47J15O49
3103E66J10n52o1O50K59n41l29M41K94m69m07K75K47m56m15L28L77l90m96L48
3123b21O48j33n50J79P05J11m81K1N74J05n22j08M91O0o52l18M61K25o15n20L61
3144a79M30l42m77K76N43j12l54K83N64k5m23J84N99%n46r7M54N6n65k89K89O7
3166C36m66k59L10J41m11k01M90L71l31k85M75N66k04m17K82N29j54n29N8M49
3186G50j83o50j07M92no91k91N27L21m64l45M29N05j79l01L00M68j16l06K08L85
3207G47j94m41M4L20j71m93n1K84r7l91KL63l0l70J01N76J15m50o1O20L15m93
3229B45l66M06M29l86n78J46M07k40n86L1M73m5n32l2N44K16l71j43M57L60k02
$$ y = [-9, 508, 731, 201, -107, 419, 785, 219, -371, -16, 551, 211, -459, -343, 229, 140, -383, -292, 263, 249, -198, -83, 566, 676, 124, 63, 713, 972, 431, 102, 543, 837, 368, -39, 236, 483, 27, -388, -60, 317, -73, -569, -221, 427, 294, -256, -77, 628, 739, 258, 279, 853, 958, 436, 328, 819, 879, 227, -91, 370, 595, -20, -540, -179, 251, -91, -568, -292, 251, 139, -215, 68, 632, 607, 184, 368, 967, 967, 421, 324, 778, 834, 269, -20, 269, 336, -130, -389, -79, 62, -349, -550, -60, 311, -20, -305, 170, 736, 532, 115, 397, 926, 772, 243, 301, 750, 567, -83, -190, 302, 297, -394, -685, -158, 163, -301, -646, -217, 288, 109, -192, 108, 576, 460, 154, 362, 747, 553, 112, 156, 476, 305, -188, -239, 45, -52, -443, -441, -78, -108, -478, -377, 199, 314, -136, -197, 423, 738, 245, -121, 285, 714, 328, -250, -104, 303, 63, -523, -492, -19, -64, -596, -628, -84, 132, -239, -382, 75, 435, 233]
3250B33j92K41J99j81j78J34L5l21k27J91R9m04l20K89L28k44l44K99N01q1l38
3271b81K33N90j4m95J3N72J13o54l41M12K80n21n38J84L76k16m39Q8M02J4k33
3292d55J32L95J07j60J18L55N6k23oJ93r2l01n5J51j92m35m9L08o4m90j12N35
3314b84K96l79k72N24N79j82m12K76O04n3n41l1M59Mn70k79K94J44m51l66J71
3335d69K60j79k38J60K70J6m8J98K06k0nK57J50k13j49K29J50l50l55J50K55l02
3357b7n13O7M52o6n38m1N76K72m51k16N19M65k71l80K78M72j18m41j8L76l0m17
3379e0j49K18N7k78j59J57P3j43k0J67K8j23R0K64K7k44L8L63J00l63j52L49J99
3402D49l73l34K79L36k95m71J70M59j02n25j4N20J40m30k10L82L02k41k76K04
$$ y = [233, 41, 282, 481, 300, 122, 256, 291, -30, -257, -66, 33, -371, -691, -402, -74, -318, -662, -363, 138, 57, -281, -48, 542, 528, 33, 46, 618, 731, 77, -264, 148, 428, -93, -631, -447, -71, -287, -726, -638, -236, -222, -455, -323, 72, 179, 19, 137, 492, 548, 325, 319, 512, 420, 119, 64, 215, 23, -412, -461, -153, -217, -707, -819, -284, 12, -367, -639, -115, 464, 282, -130, 146, 750, 697, 156, 125, 584, 588, 18, -261, 33, 177, -274, -640, -469, -209, -388, -626, -466, -196, -180, -228, -30, 176, 156, 151, 408, 558, 345, 196, 425, 575, 225, -130, 20, 275, -27, -540, -473, -21, -87, -625, -666, -90, 182, -269, -485, 34, 499, 228, -152, 126, 598, 480, 39, 21, 397, 367, -50, -199, 19, 76, -202, -361, -204, -131, -274, -294, -127, -99, -222, -132, 132, 159, -85, -47, 316, 416, 53, -99, 250, 449, 76, -258, 21, 357, 62, -409, -239, 220, 118, -407, -421, 99, 239, -191, -401, -19, 283, 42, -234, -30]
3422c0K82j30k04R1K16j10j91Q5J82j07k16Q0J64j11k07R4J94j21k50J26L06q4
3444E9l43N1M43P2m18j25M37K62l35l13K72L23k05l60J05L11j11l79L5L19k9l33
3466b62n2L13J00k44q7K26J50j35n7J95O5j91m0K37N5k98j50K47J48k84k91J91
3488a64K88j71l16J40L42n4k80R3L83K5l19j7L68J38l54k17K62J87k54k97J08
3509a09J91j56k33R9J82r4j62J60K69o8j76J41L10k7k25M9K41k9k84n4K05n4l58
3532a82r6K67N7l57j62L19K63k02k10K58L88n0k34J49L24j1k70J1K31n2l36j19
3554a4J72j2l02j67J51Q4j85q6K08J41p1RK71J98j19m6K75J90j90k41J42J90k14
3577C84l88KJ81j27l81l9K68M4k98l5L88K21j74p2L46L23j01j82J53K46j03k62
$$ y = [-30, 252, 122, -82, 9, 225, 115, -76, 9, 191, 84, -132, -52, 112, 1, -206, -112, 82, -39, -289, -163, 143, 59, -284, -233, 210, 282, -136, -261, 176, 438, 103, -210, 62, 385, 180, -180, -75, 236, 125, -254, -219, 100, 71, -262, -314, -1, 99, -145, -232, -6, 144, 9, -48, 147, 212, 21, -19, 218, 273, -25, -175, 72, 220, -64, -355, -164, 124, -47, -363, -223, 119, 65, -215, -122, 261, 286, -33, -50, 318, 456, 102, -115, 147, 334, 80, -217, -109, 82, -74, -307, -208, -26, -120, -282, -122, 147, 79, -97, 44, 354, 327, 102, 151, 392, 363, 79, 25, 230, 176, -182, -278, -11, 46, -311, -473, -154, 109, -93, -303, -45, 343, 293, 59, 208, 532, 521, 251, 262, 493, 441, 105, -14, 158, 146, -156, -323, -172, -88, -273, -359, -151, -10, -81, -72, 199, 397, 278, 232, 507, 697, 507, 266, 408, 598, 384, -4, -2, 179, 52, -329, -368, -100, -56, -354, -389, -1, 220, 46, -26, 320, 643, 542, 360, 513, 759, 656, 394]
3599C94k0J01j39k85p8N6j08k24KJ48j0j19R8K69P0p9J29L24Q3j97K3K61N3l34
3623D18j93J84R1l57l42Q5K00j81l44O3L37L1k22N1L74J84j56k1K84J96j39j41
3645D02Q0J00j66k07k7mj66j68J4Mj32q0J52J40p3m8K12K64m6j24J73K87n8k89
3669B40L0K33n6l82j59K02N5l45k45J78K06j64k28J72K98L6j61P5K96Q8j45j9
3691B05J59N0j70j07M2l0j76q6K0n0j56l1J35mj41M2K50J27j61n1K77K08j61k06
3715a5J74K42j45l35J7K20o7l53j07K29P6k59j58K29K16j18j37J67K31mr8O2J43
3738B10j3j01J5L9q5j24L9J6j31j58P1J10j02j59R6K27k6k03O4L08Q4k45o9K86
3762A49J66k62k20J69K49j84l14K0K54k8k77o1K13R4j61p7J74J28q1n6J28Q8n5
$$ y = [394, 374, 475, 336, 51, -27, 29, -79, -303, -301, -153, -163, -282, -184, 85, 155, 76, 205, 529, 612, 415, 438, 699, 752, 418, 225, 409, 500, 143, -199, -114, 86, -95, -439, -376, -39, -8, -230, -179, 195, 379, 223, 202, 486, 682, 543, 402, 482, 582, 416, 209, 182, 178, 12, -156, -142, -138, -270, -350, -198, -58, -131, -179, 33, 297, 251, 127, 300, 587, 529, 240, 270, 503, 447, 65, -94, 108, 163, -182, -427, -249, -43, -207, -435, -263, 35, 71, -90, -15, 281, 369, 224, 205, 364, 414, 244, 137, 179, 149, -27, -113, -93, -143, -299, -330, -195, -199, -340, -298, -48, 79, -82, -133, 144, 352, 191, -15, 159, 401, 256, -79, -62, 158, 91, -262, -369, -140, -64, -323, -481, -252, -36, -154, -291, -124, 107, 103, 5, 67, 210, 197, 96, 111, 150, 65, -59, -20, -4, -135, -293, -222, -112, -214, -373, -277, -50, -76, -279, -215, 93, 177, -68, -137, 149, 315, 53, -167, 2, 251, 67, -247, -227, 27, -1, -278, -339, -126, -32, -193, -270, -96, 32, -49, -105, 23, 111, 56]
3785E6k9N9L7j09k4J04j8j79o1J81M5k19j32K12J87j88k24J75K74q9k72N4L12
3808A52K6k83p5K70J27k38j78J94K03j54k15P5K09m4j92LJ67J4j33J2R6qr3M6
3832a9R5m8j18O2J55n8j78M9K22k1k31jK46N8k65j19K40J66k48k30J78K37j48
3855B4k87P7K88qk57k4K60R2k11n4K01J17j46r9J35Q0j29r8P9N7j26r7R3N7j38
3880a14r3J46J28j41j18J68K00r4j92J43K53n9k60RK58J6k99j14K26R4k63j94
3902c00J85J65j67k09J50K28m5j73R7K17lj27M1J75pj65J2J11n0j98JJ10m4k21
3926b17j7J87Oj99j6K51J05j78q5K57K00j70j79J76K32j41k70M0K25p1l21m0K10
3949a5J2k57q9K08J08j54n9J91J59q9n4J52J44q7r4J07P7j35j41P0P6j58j86R4
$$ y = [56, 27, 86, 123, 14, -10, 94, 76, -103, -164, 17, 62, -157, -289, -77, 110, -78, -302, -127, 147, 58, -214, -160, 152, 178, -105, -180, 90, 217, -21, -199, -5, 198, 44, -171, -96, 113, 69, -123, -120, 47, 61, -72, -60, 36, 28, -65, -19, 76, 28, -90, -28, 127, 69, -109, -60, 162, 141, -90, -91, 155, 213, -52, -171, 69, 235, -13, -243, -65, 172, 24, -263, -186, 102, 94, -163, -187, 73, 165, -46, -100, 101, 218, 72, -27, 108, 188, 59, -39, 40, 97, -29, -126, -33, 24, -114, -207, -61, 67, -74, -192, -24, 176, 82, -110, 33, 286, 227, -33, -24, 234, 250, -49, -163, 63, 157, -106, -300, -115, 50, -117, -326, -176, 52, 7, -166, -69, 148, 145, 18, 59, 234, 227, 62, 74, 185, 135, -63, -62, 48, 4, -217, -234, -47, -41, -240, -256, -5, 100, -78, -163, 94, 294, 124, -55, 121, 353, 212, -58, -18, 207, 136, -185, -225, -15, -3, -260, -349, -141, -33, -187, -246, -55, 104, 15, -39, 113, 257, 170, 76, 183, 260, 125, -16, 54, 130, -28, -214, -120]
3973a20J20j31j99J08K27m6k07Q3L07M3k04j2K76R6k38j28K20J15k22k24J09J35
3995A08j55k43O3J85n3j95M3K13L1j21M5K18N3j36K8J64J4j61m8J22J3k02j02
4018a16J15L0j96j28J73J22j56j16J90K01r6j47J52K62o2k09N9K23j7k58n9J83
4040A50J1k50j12J44P6j92j24J62J29j09j14J71J78m7j06J18J82n5j44N6J47q7
4062A84j77jJ15m6k09j7J37Kj64m3J95O8j26n1J89J36j15q7J50J54j17j61Q2J65
4086B63j33k00J6J50o3k02j7J76Qj63k7J99P1j11o2J80J25j05q2J10J22r1j44
4109B0O9Q9r1j45L3Q7o3j42M0J33l5j08PJ72L1j27j4J67M5j21m8J30P4j50j12
4134e9J13R2j40j55P8J40q7j55L1J84k1j47K6J51N0j33j5J43O4j35n8J03P5r8
$$ y = [-120, 0, -131, -330, -222, 5, -41, -248, -165, 142, 185, -19, -31, 245, 341, 103, -25, 195, 310, 88, -136, -27, 108, -47, -290, -227, -42, -95, -290, -247, -34, -3, -124, -79, 139, 192, 56, 84, 248, 262, 101, 53, 175, 188, -14, -116, -1, 29, -167, -295, -122, 0, -156, -272, -82, 119, 23, -124, 28, 290, 228, 19, 78, 301, 284, 26, -33, 150, 161, -89, -201, -57, 19, -173, -297, -135, -6, -115, -229, -58, 120, 73, -33, 85, 267, 212, 68, 124, 271, 184, 7, 6, 121, 75, -134, -151, -14, -12, -176, -219, -24, 44, -82, -133, 56, 192, 77, -10, 140, 294, 177, 16, 98, 263, 130, -70, -54, 96, 33, -169, -186, -10, -2, -165, -192, 7, 78, -33, -95, 85, 210, 105, 23, 133, 255, 164, 20, 89, 178, 87, -58, -25, 62, -1, -143, -103, 30, -5, -113, -106, 66, 97, -30, -44, 123, 168, 47, -1, 129, 203, 53, -59, 54, 146, 6, -149, -71, 69, -18, -173, -142, 42, 21, -126, -100, 51, 101, -32, -47, 96, 160, 25, -33, 70, 145, 47]
4158D7j11O5R4q3j33P3R4n7j04N8J08l9j03M7J46l5j33J3J39J7j37m6J29M2j40
4183d9o6J15O3j24q9R6J22j01j17P8J38l2j38L1J57nj42OJ34J6j27m5J29N5j37
4208c2q2J07R4r7r8P7R9m6j08N8J06m3r8M0J10l3j14J3J24oj28k0J23K7j21m1
4234h9J08O0j21o4J23Q4j16j06J19J30q0j52P3J65l8j45K0J49Rj47l7J48N2j45
4258@o0J24P8j06r6P7J07p7r8M3J04n1q0M5R4m2q5N8J13m0j32M5J37k4j54j2J70
4285A38K5j95m9J54Q6j73j13J55J55j32j66J12J89l6j82K7K05J2j60k7J40L6j31
4308G0l7P8L4r8n4Q5K7j12m2J00L9j18j8J20P7j35o4J67J28j47j50J28J88j01
4332A65k34M1K33k3k46o1K10Q1k04j37J78J61j32j38R6J93n8j38L1J65mj15lQ1
$$ y = [47, -64, 1, 95, 12, -121, -48, 46, -11, -115, -57, 51, 12, -91, -44, 102, 67, -66, -53, 86, 103, -34, -80, 49, 91, -49, -115, 0, 63, -61, -150, -54, 68, -33, -150, -72, 66, 34, -104, -73, 84, 79, -63, -57, 77, 93, -34, -79, 50, 105, -32, -114, -7, 87, -10, -108, -31, 68, 22, -86, -28, 78, 35, -63, -23, 87, 54, -60, -47, 77, 71, -57, -77, 46, 73, -48, -89, 19, 79, -42, -106, 17, 101, -15, -121, -2, 128, 48, -104, -31, 134, 96, -49, -29, 120, 129, -18, -55, 93, 145, 0, -60, 64, 142, 36, -60, 17, 124, 47, -51, -8, 96, 45, -35, 10, 104, 62, -23, 35, 148, 108, -24, 21, 158, 134, -20, -32, 138, 163, -32, -81, 73, 159, -14, -127, 28, 183, 51, -115, -3, 186, 150, -32, -5, 200, 212, 52, 25, 165, 201, 70, 33, 111, 145, 47, -7, 78, 105, -7, -49, 51, 90, -28, -46, 74, 151, 16, -48, 119, 247, 100, -50, 78, 266, 165, -69, -28, 205, 182, -64, -125, 85, 166, -38, -175, 3, 164, 32, -106, -10, 183, 125, -13, 18, 183, 179, 64, 61, 142]
4356A42j9o8RL7n7q7N9R2j08j32Q2J76o3k14L4K40M0k30p8K49J52k16j75J69K26
4381B60j40k64O8K50k0k70m3K12Q3j71j09J20J17p2q0N3O8k8k6M7K0o6MQ9j6j35
4407d9oJ53J5j83p4J78J20k05j63J61K46j15k90P3K97K1k99o5K61J37k22j80J61
4430b8J84j11k05N9J84l2j32rJ09K8o6kM5j1j6O0Rq7m1J12P6j36j28J04J82r7
4456E1k48N7K77%k58q6K57J50k24j85J88K30j19k55O3K48Jk48o5K02Q9j58j21
4479a54R4R5n8p6M6L6nKN3k3n2O1R7l6j26L4J46J8k08o8K05R7k05j80J67K06j42
4506B4k53Q5K70jk72n0K44J28j95j37J57J63q1j67L7J38jj19k5P4Qn8pLj7QM2
4533bK0q2k2J24N7j18r1J51J47j11j82O4K29k1k56m1K27J01k20j68J67J90j38
$$ y = [142, 123, 55, 64, 101, 44, -43, 16, 108, 0, -132, -50, 126, 63, -151, -117, 123, 163, -67, -145, 104, 256, 40, -135, 34, 260, 120, -144, -76, 174, 154, -116, -159, 53, 136, -35, -144, -24, 93, 21, -59, -6, 62, 34, 8, 55, 75, 9, 13, 102, 86, -49, -55, 98, 113, -70, -144, 34, 154, -51, -214, -53, 193, 78, -212, -139, 158, 179, -120, -185, 76, 213, -9, -189, -28, 156, 45, -160, -101, 83, 51, -81, -90, 19, 47, -19, -21, 24, 13, -3, 57, 66, -21, -62, 50, 126, -10, -138, -34, 148, 51, -197, -140, 137, 137, -121, -207, 50, 200, -24, -209, -21, 209, 90, -165, -102, 146, 147, -101, -166, 36, 125, -33, -154, -60, 35, -23, -99, -53, -17, -22, -20, 33, 10, -42, 19, 116, 80, -46, -12, 134, 152, -56, -124, 81, 178, -27, -207, -40, 166, 24, -229, -144, 126, 125, -147, -197, 47, 175, -20, -157, 0, 163, 82, -85, -48, 90, 89, -30, -55, 19, 27, -31, -38, -35, -52, -44, -2, 18, -64, -86, 38, 95, -23, -114, 37, 184, 73, -109, -45, 184, 163, -93, -134, 93, 194, -26, -194, -27, 163, 25]
4556B5k36Q2K29kk09l3J83O9j24p9Q2R1m1o0J8L2lpQl1j8K2N5o4q6M7J35k8j56
4585i9oJ86O7j93j00J77J51j44j83Q8K29m2k25k6K11O4j89j23J39J65j29j60O9
4608g3J55l3j29j7J27K3o5l8L5L3j0nok5PN7J5p6m6R4P2p5j23P6J39l9j71J6J82
4637A00K0j73q2J80R5j25j43P8J84m7j88MJ66M7j51o6J21Q4r0q9M5R8k7r8NN6
4663DJ7l7k6K7J0MJj0k6J6M3J2o2k6R9N3q0q2P7J17n9j33K3J50jj63m0J39P5j37
4693a5j09J04J33o5j42L9J52J1j45m2J13O9r3o3N1Q1l1p5J0N7lm0j4K0J6j4Pk
4721A0qJ1K7J5m3OO8M0q5o1Q4R2o5j21K5J24J0j56l5J27O9j27r7J07J21p7j28
4748f7N3J40qj23k5J17P0j12o8Q2O0n1o8RO1j4m6JK3k0pK4Qj3mN0J8l5k3Q2M0
$$ y = [25, -211, -129, 100, 98, -111, -144, 39, 108, -16, -95, -13, 78, 37, -23, -5, 27, 24, 17, 25, -6, -24, -2, 53, -11, -97, -50, 85, 57, -99, -105, 81, 148, -45, -145, 32, 183, 39, -144, -56, 173, 131, -94, -120, 91, 155, -34, -157, -18, 147, 18, -142, -73, 82, 49, -80, -97, 30, 53, -12, -50, -15, 18, 8, 3, -3, -28, -21, 36, 51, -25, -71, 23, 95, 20, -103, -27, 112, 73, -98, -82, 100, 120, -53, -135, 45, 140, 15, -128, -50, 134, 87, -101, -97, 69, 116, -35, -101, 20, 104, 14, -75, -30, 68, 41, -57, -52, 4, 21, -16, -42, -15, -5, -1, 0, -10, -36, -20, 23, 35, -27, -53, 46, 99, 19, -63, 14, 131, 72, -61, -38, 112, 111, -52, -92, 47, 122, -15, -124, -20, 113, 48, -94, -55, 97, 108, -37, -79, 34, 103, 10, -53, -2, 79, 48, -27, -17, 40, 37, -3, -17, 3, 19, 5, 12, 10, 2, 13, 40, 55, 12, 18, 86, 126, 41, -20, 64, 156, 91, -30, -5, 119, 129, -27, -62, 65, 134, 7, -90, 17, 138, 61, -67, -14, 126, 118, -5, -30, 87, 157, 45, -23, 59, 119, 68, 0, 9, 70, 56, 10, 11, 34, 14, 7, 31, 39, 26, 22, 72, 90, 55, 32, 114, 154]
4779A54p1o9P0R7p0j31L8J28j6j54l7J29P1j29r6R3J36q7j23O8J23j2j10nJ15
4804A12K3j08k6P8K9n7n2N2K4m9k6L1J5n7kP4Op1rQ8M3r6m1J03P5r6r1P7J08p5
4834H2j25L7J24k0j34k7J25L8j30o1J11O6q5p2O2P8n7o7M9Q1m4p8M6P8l9q2L7
4861gO6j6q7L1P4j5r4J7R3Mj10j0J18K9j16n6J22M6r6q0Q4Q6p2r8O2J01m6r3J2
4890e1J20rj17KJ15rr8j9Q6J4r0j8P8J9q5m4Q8M6q5n6J02P5q0p2P7J01n9q5M5
4919iJ16l8j05J2R8rj18k8J05J5j16m4Q8M4q9l6O6O8o1l6P8O3n5o3Q1O9o1p1M3
4948GQ4o4j04K6R2l4j30PJ01kr5k5J08N0q2l1J03P7o1l9P0P4m8o3L7O1o0q2K6
4977CN8o3q7J6O1m2q9L6R8k3q9K5J10L1r4jJ19N1q5n6R5N9r0r0N7O1n2j12K0P8
$$ y = [154, 83, 14, 84, 181, 111, -20, 18, 146, 130, -24, -61, 68, 139, 10, -86, 7, 143, 56, -67, 1, 124, 112, 2, -3, 112, 135, 27, 1, 79, 108, 51, -1, 51, 75, 26, 0, 31, 46, -11, -13, 61, 67, -4, -13, 75, 118, 22, -19, 84, 159, 63, -28, 49, 157, 82, -43, -6, 118, 98, -36, -63, 62, 100, -30, -91, 20, 86, 1, -71, -9, 69, 12, -55, -6, 75, 31, -47, -1, 77, 38, -44, -7, 59, 43, -44, -13, 61, 46, -48, -31, 62, 66, -44, -54, 64, 93, -23, -79, 43, 89, -7, -87, -3, 83, 11, -87, -25, 76, 30, -63, -51, 69, 60, -57, -55, 60, 51, -47, -66, 20, 34, -56, -74, 4, 23, -62, -106, -18, 28, -57, -113, -11, 64, -16, -88, -11, 90, 31, -54, -9, 107, 69, -36, -24, 74, 65, -53, -81, 24, 39, -77, -121, -33, 11, -78, -114, -48, 20, -41, -77, 1, 64, 9, -54, 27, 96, 35, -36, 7, 91, 27, -77, -51, 41, 7, -123, -116, -15, -17, -112, -137, -29, 21, -61, -92, 11, 88, 27, -12, 58, 132, 84, 21, 58, 119, 59, -23, 3, 61, -2, -89, -73, -12, -54, -143, -107, -9, -32, -121, -96, 14, 45, -49, -50, 69, 120, 35, -21, 74, 133, 43, -47, 10, 71, 19, -93, -73, 5]
5007En3q5K3P1%n3J9P4J6m1L3P3Nm6J0P4j0q9j2Q2j6j02n4P0K6j06o3O9Q7p8q7
5038a58P2J13k5r3L8J22Qp7oR8J3p6k9N9L1p1m0K6Pn6k9L6K2m5k1N9K5l2k1O1
5068A1N5m8m4N4Q2o5p3M2Q7l9j05LQ6%j10k2P9M4r0m2O1O4o9m8M2P0j2p4M9M7
5098C5j2l9J1M9om5NN1l5l5J3O2k0o0J9O1Jq5kO7J3p4l9P4L3o8n6O4N5l6o4K8
5130c5Q0pp4J5O9J0n3j1M4Nl8k2K3J9m7j3ROl8j9L8J4l9lN0M4k9j7P0N2k6m5L2
5163F4O3k3p5J0L6j4p5l1K5K1q4l9M1L6l3l0L2M9J3k0K6O5Rj5J8L5lk6rLkm5j2
5196A0j8k0n3kJ1ol6pN6J8j3J5O6O0pj8M8M7k1l6JL1k4o4l4J1k2n6l3%J3k3l9
5229a45K0N1Oj6N6M4K4jL5M5kj1KK2j5n3j1ok9m6k6Jj4k9j3L0K0mOM0M4QKL4M7
$$ y = [5, -48, -133, -110, -39, -39, -92, -73, 1, 17, -24, 9, 82, 87, 41, 51, 125, 115, 26, 14, 96, 80, -22, -76, -6, 20, -86, -149, -80, 7, -71, -158, -86, 27, 2, -91, -53, 69, 77, 0, -6, 92, 105, 29, 0, 59, 90, 19, -21, 5, 12, -44, -73, -37, -15, -60, -81, -22, 3, -29, -50, 11, 66, 18, -26, 28, 110, 45, -28, 14, 101, 62, -43, -40, 46, 46, -64, -86, -7, 37, -53, -95, -34, 30, -39, -87, -45, 25, 13, -61, -12, 35, 23, -16, -5, 44, 38, -7, -2, 49, 14, -21, -8, 54, 34, -26, -7, 54, 55, -30, -32, 35, 48, -26, -65, 9, 42, -26, -82, -18, 37, 1, -63, -35, 45, 38, -36, -21, 48, 58, 5, -6, 38, 43, 5, -17, 6, 25, -22, -35, -26, -20, -58, -77, -39, -25, -64, -67, -17, 27, -2, -19, 51, 103, 77, 32, 64, 127, 104, 29, 39, 75, 61, -14, -45, -20, 1, -83, -122, -81, -45, -78, -108, -76, -27, -14, -34, -8, 57, 66, 51, 69, 104, 101, 75, 66, 69, 67, 22, 10, -8, -28, -81, -83, -72, -78, -114, -121, -65, -47, -60, -45, 21, 81, 74, 56, 104, 151, 130, 94, 95, 126, 102, 38, 4, 15, -7, -63, -96, -96, -83, -106, -145, -125, -74, -68, -84, -28, 16, 40, 39, 74, 119, 117, 106, 108, 130, 115, 62, 51, 45, 16, -30, -56, -55, -69, -98, -111, -81, -61, -65, -59, -19, 25, 33, 35, 69, 116]
5264A16J1k5rK4Nm0m0mj4l7k7mrk8l4K1L9k6%L2M8Rj7L9L9J3j8J1K6Nm4j5J9n
5298F1o5l0J3K4k5l8J1K8Kl6K4L9Nj8J2K5K6l9nM8pk6k0OJ1k6j1J3kl0kJ6Pl8
5332d7kM6J5l6k6M5M7l2m0J9M1Qo2JN7Qn2k6N0N7m7m9M4O0m0n1J5L6j0m7j1Jl
5365c1j3qNnj9J6K6mj4L0L9j3j5J9N1lm7KO4np2m4N2L3p4p0L0O3l1p4PQ5J6m6
5399e0mP8L7l5k0O7L5k5l8J1L0j7m7rj5k4k1rj8m0pN2Pn1%O5N8k8j8O2Q7k6m8
5432C9K2Q6j6q4l1P0J5j06p3M4M3o6r4L0O5Qn3PP2K4nK1L8J7rL7J1j8l4K9km6
5464D1m9J2Pn8o0%N5j4r4NJ07M1o4l3R4J10l7o7O7R0j2p3lN9%p5n4L2Qo4m7J7
5496e9Mrl0J1J1J1L3K3jj9M8P9j5m8qQ0J5q3n7P0L0p8r6L9N7m4j13K0R9Op2k6
$$ y = [116, 127, 102, 93, 117, 122, 82, 42, 38, 24, -13, -40, -44, -53, -81, -115, -94, -55, -81, -81, -49, -1, 8, -9, 30, 69, 82, 64, 75, 101, 106, 62, 47, 66, 61, -4, -34, -21, 3, -22, -60, -49, -21, -19, -55, -31, 8, 13, -5, 7, 32, 58, 19, 14, 62, 55, 29, 9, 15, 26, 0, -11, 2, 0, -30, -32, -16, -9, -47, -49, -3, 12, -24, -50, -5, 42, 10, -30, -11, 30, 38, -24, -23, 34, 42, -10, -36, 14, 71, 24, -25, 19, 79, 39, -12, 3, 39, 29, -18, -29, -28, -31, -44, -52, -47, -52, -71, -55, -29, -33, -47, -17, 22, 9, -6, 13, 64, 61, 14, 16, 80, 75, 3, -41, 11, 44, -30, -100, -70, -7, -38, -112, -105, -20, -4, -50, -54, 24, 61, 26, 6, 73, 108, 83, 45, 56, 86, 69, 22, 13, -2, -26, -47, -56, -74, -114, -121, -69, -62, -113, -113, -48, 10, -18, -36, 26, 113, 87, 39, 61, 147, 131, 47, 16, 86, 101, -5, -78, -34, 9, -57, -151, -121, -56, -48, -101, -94, -22, 2, -3, 18, 56, 73, 64, 101, 112, 94, 60, 89, 87, 41, -8, 4, 11, -47, -107, -107, -52, -66, -160, -155, -48, -7, -71, -104, -10, 100, 63, -4, 63, 153, 141, 68, 65, 124, 124, 49, -5, 27, 35, -29, -76, -59, -55, -64, -94, -83, -72, -61, -28, -5, -6, -25, 23, 102, 87, 39, 31, 111, 126, 43, -14, 56, 86, 8, -88, -49, 8, -36, -149, -129, -30, -24, -96, -122]
5528a22J06O1l2l8M0P5Om2jL4lj9j3Kl6oj5rl7j4L1Qm2j6L5N7m7l5O8P8l0r0M2
5561dR6Pj06m7R4M4q7p2M5O4m2o8K2Q1np7PP1J2m1j1L6L1j6k3J1NrQPm1k0J9N9
5595E0l5n6J5P1lp0j4Q0M1q6n0O3P2o9q7L5Q7k8r1j6Q5K8p3k9O2N7k5m6M6O0J
5626G5n5K1K9rk4L%l5kj2%l1k5L8J1m8k6O5M7k6m5M8J01k3p5MJ02Np7m4O5M1q0
5659A8r8L3M4l5p5lO5On4pO1N5%kM0L3J9j2J1kopJ0k7m7j9J3m2m6rL9jm6l2O8
5694e5N8l1l4N1Q5j1m9K0Q0K0q3m7O0K5p9o3J3L0l5n4rM4jl0J3L1K8J8RK0L1j
5726E4K5lNj6K2Jm7l7J4J1l5n0j0L5Mn2j6O2L4k7m5M1O9pm4J6N5K0n1l0L4L0m5
5759A7n1K0K8j3m2%J7J5j9j6K4J9J1j5K1pK2J4nk3NK0J4l1k9JM0j2m8oM5Jn2k7
$$ y = [-122, -16, 45, 13, -25, 15, 90, 96, 54, 53, 87, 84, 65, 52, 54, 18, 12, -3, -12, -49, -63, -32, -24, -66, -82, -47, 10, -37, -72, -4, 74, 44, -46, -4, 92, 99, -7, -54, 40, 84, -3, -75, -30, 34, -8, -76, -54, 27, 22, -55, -48, 23, 35, -6, -17, 19, 50, 34, 11, 22, 27, 18, 26, 33, -8, -28, -9, 50, 15, -41, -26, 45, 42, -28, -42, 38, 79, -7, -57, 6, 78, 9, -78, -43, 44, 16, -75, -91, -6, 22, -51, -80, -18, 39, 14, -32, 14, 74, 75, 20, 41, 70, 61, 37, 40, 40, 5, 3, -9, -9, -40, -65, -27, -16, -64, -90, -25, 22, -4, -49, -1, 100, 77, 2, 6, 108, 113, 36, -8, 57, 98, 18, -80, -47, -3, -38, -113, -116, -51, -45, -99, -106, -45, 10, 10, 8, 48, 81, 100, 88, 99, 97, 91, 84, 94, 67, 20, 1, 14, -28, -74, -83, -44, -45, -91, -123, -55, 3, -28, -62, -11, 74, 63, 14, 34, 114, 134, 51, 4, 64, 89, 10, -53, -40, -10, -45, -99, -108, -64, -65, -95, -82, -51, -23, -5, 4, 24, 55, 54, 79, 76, 81, 65, 87, 88, 41, 4, 18, 29, -6, -56, -66, -31, -27, -79, -95, -33, 1, -26, -71, -30, 39, 32, -12, 4, 59, 79, 28, -2, 32, 62, 17, -34, -14, 14, 1, -41, -41, -24, -9, -28, -44, -20, -1, 10, -5, 16, 9, 31, 45, 40, 17, 22, 42, 56, 25, -4, -3, 37, 25, -23, -29, 16, 17, -35, -62]
5793f2M1L4j8m8J1N2Rn9rN7K5l0m1L2L4rl3oM7qj7lJ2J0qj0MNpKLj3lJ0J3j8j8
5830a9K1J9j2l9J4N2%m5k2M8K3l1m5J4O0k3o1JN8Nn7lL1L5l8l3K6L8k3k1J6K2
5862A1JnqMJ1LMJ0j8oK6J2m0l0L8K5l0j0j9L8Jn2%M2J5n0j9L8K9l1m8L6N9on6
5897b5NN5Nm5qK7J0k2rPQj7oJ1mj4J0J6pJ1j6L3KrnL7Rl0k3L3K1j7m8lM0k1m9
5934c8j0M5jm0k4L5K3j9k4L0M6jl0J5M7mk2PJ7ml1Mok0j0KJ0ol7K1K4J5k8jM1
5969B6Rk0NL5J1j4l3J8K9k2m7NK2l3l2oK0jj7j3K0J0oJ2K2K0j6QM0Kk3qK2lj0
6004C2k1LJ4m1qJ0K8m1q%L5J0k8ML9J5j5kJ0J0kk0Rj0pj0j4Kk3j0Mkj3J3J2J3
6040a2pqL4J7j9j0L0K0j7k4jK7Mm7qK6Qk4k0K9LMl4K0K6Oj6mJ9J2%j9LnMKj6j6
$$ y = [-62, -21, 13, -5, -53, -42, 10, 19, -40, -49, 8, 33, 3, -38, -6, 28, 19, -14, -20, 27, 19, 2, -1, 11, 21, 13, 3, 7, 12, 5, 7, 10, -3, -6, 4, 17, -1, -19, 2, 21, 9, -30, -16, 36, 36, -9, -31, 17, 40, 9, -36, -22, 38, 15, -46, -45, 13, 18, -39, -42, -11, 24, -14, -47, -21, 17, -6, -27, -11, 11, 12, 7, -1, 3, 14, 17, 21, 31, 13, 7, 33, 45, 5, -25, 13, 38, 8, -2, -21, 17, 18, -34, -34, 8, 23, -27, -46, -8, 21, -10, -58, -22, 37, 31, -25, -20, 35, 40, -5, -13, 14, 24, 2, -7, 0, 8, -9, -15, -4, -8, -22, -12, 4, -3, 8, -8, 25, 27, 18, 13, 50, 59, 29, 6, 39, 60, 43, -5, -8, 32, 11, -38, -48, -3, -4, -44, -68, -33, -10, -29, -53, -23, 23, 22, -8, 7, 54, 50, 28, 35, 52, 48, 17, 21, 15, -5, -15, -13, -3, -9, -46, -25, -1, 14, -14, -15, 26, 35, 15, 20, 55, 66, 52, 19, 37, 66, 44, -3, 2, 24, -9, -41, -47, -27, -28, -45, -58, -38, -28, -34, -22, 0, 20, 4, 12, 52, 54, 31, 23, 45, 42, 32, 11, 14, 28, -13, -21, -11, 17, -24, -32, -32, 3, 13, -15, -11, 28, 43, 28, 26, 36, 46, 44, 24, 33, 23, 16, 6, -8, -6, -29, -39, -35, -37, -50, -37, -25, -12, -19, -27, 7, 24, 5, -5, 25, 45, 28, 4, 3, 30, 34, -13, -21, 5, 13, -11, -31, -2, 1, 5, -29, -9, 17, 23, 7, 3, 22, 34, 34, 15, 18, 13, 17, 19, 3, -13]
6078a3JKlj7nJ9Pk8LK0L0mk9K1L3Rm1j5L3J5k7k8J3K7j0l4MK0LlrkK5OJj2J0J
6116B3QrrLJ3pj7k1K0J4l3k9J1M0rl9%L3J3k7qK9M1j5k9JK5%j2k0L5qj3mlKoK
6154eKMLM%jjRJ4j3j3J9Qk0l8J0M0Jm1j4K4K0j9l0QL6km8J2L2K1k7j4J3K2j4l
6191aRJ%kj3jJ3KnJkOQqj0J0K3j6j7kLK3j7l2L1K0ml3nK9Lk6j7K7L2k5l6J1L3
6230A3j0k8%K7Oj2joJ0Oj8JJ4MJj4J0RLJ4kl2J9Nqmj1J5nj9k2K7K2j9k4J3K1J2
6268A7l9lL0J5k1j6QK0j2k3PL0ml8KQJ0lLRQopJ0K%J2j0Q%QMmj4mJ4Jj7k3K7M
6309A3k2j6K0K2k0j2mL1nj9j4M1Nk5j2NJ5kk5J3J5Nk8NK1jj3JJ6J6j3PNknQj0
6346A6KNj3J6j4mj2J7Lk2j4J2jppK1Qnj0jK1J1l1kJ5J0k0j6J5Mll2J4K5lk0J4
$$ y = [-13, -12, -10, -13, -30, -35, -16, -9, -37, -34, -14, 16, 12, -17, 4, 37, 46, 5, -10, 23, 38, 11, -17, -4, 23, 13, -21, -17, 3, 6, 3, -6, -8, 17, 23, 24, 12, 22, 23, 31, 22, 13, 16, 29, 22, 5, -16, 4, 18, -15, -44, -33, 7, -2, -41, -41, -8, 5, -22, -30, -1, 40, 25, -4, -3, 22, 22, 10, -10, 25, 17, 4, 0, -3, -1, -7, -5, -3, 1, 4, 8, 8, 7, 6, 15, 29, 16, 3, 22, 30, 10, -28, -18, 22, 23, -18, -32, -8, 12, -7, -37, -29, 7, 5, -43, -31, 1, 22, -5, -19, -6, 16, 2, -1, 8, 9, 9, 7, -6, -7, 6, 8, 3, 4, 2, 8, 16, 8, -2, 8, 31, 15, -2, -4, -1, 22, 5, -27, 4, 24, 20, -13, -18, 11, 14, -12, -29, -2, 30, 5, -31, -20, 13, 3, -25, -25, 2, 8, -4, -5, -11, -1, 5, -13, -12, 2, 6, 7, -7, 3, 12, 15, 29, 27, -5, 14, 19, 11, 7, -4, 11, 6, -13, -35, -8, 14, -5, -29, -16, 5, 17, -22, -25, 5, 20, -1, -17, -9, 11, -1, -24, -17, 13, 9, -29, -27, -19, -9, -12, -9, 0, 8, 2, -5, 5, 7, 7, 19, 9, 17, 17, 25, 29, 25, 11, 7, 21, 22, 5, -18, 9, 13, -9, -25, -5, 17, -3, -15, -19, 12, 7, -12, -26, 15, 20, -5, -17, -12, 3, 1, -24, -11, 4, 9, -19, -14, 7, 6, -7, -6, 10, 26, 13, 20, 25, 23, 18, 26, 16, 18, 23, 10, 26, 12, 8, -4, 13, 16, -6, -20, -8, -9, -16, -23, -2, 6, 1, -9, -10, 11, 22, -9, -11, 4, 14, -6, -22, -7, -3, -6, -38, -24, 1, -2, -22, -8]
6383hJ6%j4J2J4jj1pJ6J4j2qJ1Mj6JPoj3nPjjl5K5J3j1j7J8K6j1j6KJ7nj3lJ4
6421CNrk0OK2j3JqK5oj0J3kOj6QJ1PpNMkj8KJ7orj0Q%k3OPNk1%PRlk7K4NRk4O
6466a3J7Qk3%QPj7qJ9JJ3j5J1J1mk5J7J2lj8QJ8j6nJ6J1j1rlJ9j8kj0J1Mj8%J0
6504Coj3pOK4j1j4J7J3j1j7J0jQj3j0K3KnpK5lJ1j6MJ3j8oKK0Jk6OK6k0oLJ1n
6543A3Jk0PJ3j9kJJ1JoJJ1j3jKKopNmkqJ9kKoMJ6j4N%J9jj4rK3rMj1JJ5poMmO
6589A5j0lQNj7Rj9J0loJ3kj3kRJ0j3J5qj2J1lKKoj2K3Jj0jJ0J8rj0R%J0j1RJO
6630B6poJ%%j3J2Rj1j0%Lj0lKRj4J5j2jN%Pom%jJ5j5j1QMOKj1PK0j8oK1Jj1Kk
6674CJ5mj0KQJpolOJ1k2PjjjkJNomoJJ4pjnRMKk0MjJ8j5LNJJoNJ3lJpJ0MJmnK
$$ y = [-8, 8, 8, -6, 6, 20, 19, 8, 1, 17, 31, 19, 11, 22, 26, 10, 11, 18, 12, -1, -6, 1, 0, -1, -36, -11, 2, -9, -26, -8, 18, 7, -9, -7, 10, 5, -8, -11, 3, 8, -1, -21, -15, 7, -6, -5, -13, 12, 6, -4, 9, 7, 13, -3, 5, 16, 23, 16, 21, 25, 23, 5, 7, 24, 18, 9, -1, 7, 7, -16, -10, -3, 2, -19, -19, -12, -3, -6, -33, -9, -4, 5, -19, -13, 4, 12, -11, -11, -3, 4, -13, -21, -2, -1, 12, -3, 8, 19, 15, -10, 7, 19, 16, -2, 6, 24, 8, 3, 19, 30, 19, 10, 7, 26, 8, 6, -4, 7, 11, -7, -7, 3, -3, -16, -23, -17, 7, -4, -18, -1, 12, 1, -16, -6, -7, 1, -12, -22, 1, 3, -2, -9, 16, 13, 24, 8, 12, 25, 7, 1, 3, 23, 24, -2, 4, 30, 10, 4, 7, 18, 13, 14, -6, 1, 14, -5, -7, -6, 5, 6, 0, 1, 12, -1, -2, 0, 2, -4, -11, -6, -10, -12, -20, -1, -3, -1, -7, -3, 13, -1, 4, 4, 23, 22, 8, -1, 22, 13, 17, 6, 7, 22, 15, 9, 13, 9, 15, 5, 2, 10, 15, -2, 7, -12, -2, -5, -11, 2, 0, -13, -15, -6, 4, -9, 6, -2, -14, -3, -6, -4, -2, -8, -20, 3, 4, -6, -7, 3, 21, 12, 2, 11, 11, 21, 10, 19, 20, 26, 19, 13, 14, 14, 14, 1, 13, 22, 11, 1, 1, 4, -6, -9, -7, 2, -12, 3, -9, -10, -5, -5, 2, -4, -8, -8, -9, 6, -9, -20, -12, -8, -2, 0, -11, -4, 16, -2, -8, 13, 14, 3, 5, 3, 18, 14, 4, 6, 14, 15, 8, 2, -1, 5, 16, -6, 1, 0, -1, -2, -4, -3, 2, -4, -8, -14, -13, 1, -6, -7, -12, -3, 1, 3, -17, -13, -14, 4, -11, -8, -3, -2, -1, -7, -2, 11, 8, 9, 2, 12, 16, 17, 13, 8, 10]
6725A0JkrKnJ3jj9J2QrmnJ1lkqmJ6jnNjRj1nKRlj0j2J0MKnRmK0k4K0LRoloJ4o
6772A6oQqJ3rrJ%njq%J2j2JpJ2Plj8LRRj1kQj3J0j1MJ3qrQqK0j0LlJ9loJJ4Kj2
6818A1J4nOppL%jjj2opJ2orKQnMolK0Ok5RJPnj2J9j9J2omKQlj1LJ7j4NLJ8oJJ0
6865B1kkK%Pj4Nkj2LjmKpj2MkloJ8KlkmRJ1j9KOkRj7PJ8j7j0PJ3jlnKRj3J3QP
6912B2j1J2j4J3Kj7OKKj2MMj3%Nmj0J3j4OJj0pJ4%j4J0jJ5k1J3%J1j0j1MJ3Kj5
6951a0JK1nKlPK0j7pMJ0j0rOmnPrMkn%J1j6LK4j3j0lpJ5j2rOQJ2j5j0PJ3Mj7J
6994a2J4kj4MK1Mj3KOJ3j1j1J2JmnJ6jnj4J5pj2%NKj2NrJ7rqQjJj1kJ3Jj2J1J2
7036Hoj1rJ9Lj1kMJ5j4J%OlJ0j1J1Rj1nJ7nj8MJ1Pj5NKJ3j8jmKpj4J3%qmj0mJ8
$$ y = [10, 11, 9, 0, 2, -3, 10, 9, -10, 2, 10, 1, -3, -8, 3, 0, -2, -10, -14, 2, 1, -4, 1, 0, 9, -2, -7, -5, 4, 1, -9, -21, -11, -7, -5, -10, -1, -5, 15, -9, 11, 14, 23, 17, 14, 8, 22, 16, 10, 18, 10, 23, 14, 5, 6, 6, 1, 0, -8, -8, 4, -8, -7, -14, -2, 5, 2, -16, -13, -4, 5, -6, -8, 0, -13, -3, -14, -10, 3, -5, -14, -6, -14, 6, -4, -1, -4, 15, 12, 6, 7, 21, 23, 11, 25, 20, 26, 19, 12, 15, 15, 14, 13, 1, -5, -12, 0, -6, -15, -13, -5, -10, -6, -12, -15, 5, 11, -14, -5, -4, 3, -2, -14, 5, -14, -2, -8, -12, -10, -2, -5, -16, -13, 4, -10, -5, -2, 16, 10, 11, 21, 19, 17, 19, 19, 26, 12, 17, 15, 3, 6, 5, 1, 3, -4, -16, -12, -14, -17, -23, -5, -3, -6, -8, -12, -3, 8, -11, -9, -3, -5, 4, -13, -6, 12, -5, -15, -8, 5, 4, 1, -4, -2, 7, -6, 7, 15, 22, 11, 23, 9, 22, 24, 7, 13, 15, 17, 5, 9, 13, 0, 0, 5, 1, -9, 4, -10, -4, -3, -13, -20, -6, -6, -20, -10, -11, 4, -17, -4, -4, 7, -3, -14, -10, 3, 5, -10, -9, 12, 7, 9, 6, 13, 33, 16, 9, 13, 23, 13, 4, 10, 6, 1, 8, -1, 3, 1, -4, -4, 7, -9, -6, 18, 5, -5, -8, -15, 0, -12, -21, -15, -7, 5, -10, -20, -13, 0, 4, -13, -12, 2, 0, -14, -10, 11, 15, 2, 4, 10, 23, 12, 1, 13, 14, 10, 5, 21, 20, 15, 1, 16, 9, -3, -3, 2, 4, -8, -3, -12, 5, -4, -12, -4, -5, -4, -15, -17, -4, -3, -15, -4, 8, 2, -9, -18, 1, 4, -7, -9, -5, 10, -4, -3, -3, 3, 0, 10, -1, 10, 19, 8, 3, 20, 15, -3, 1, 12, 19, 4, 9, 11, 24, 6, 5, 1, 3, -4, -18, -5, -5, -13, -17, -27, -31, -13]
7079a3j3%J8Nj4KK3qjqJ0J0lkJjj1NkKKj3J0J3j0j8J2J0Pj5jJ5nNj9K3J0j4j7
7118eJ3oJk0kNonj6J0nJLLJ2RjNJ3rJ2J0j0OjNnqqkNrj0J1lmj1QJ2Kk2RK6J7j3
7163A7j1MK4k8%nJ1nj7kj4oKnOj1J3jMJ6%LRmMK3%j6OOJkj6J1m%j7j1jL2k7kQ
7206eJ3mknJK2j4j0NJ3rj2lLKj1%j1PMjpKK1j3J2j3J1K0rj1OJ0l%j7J6Klj4J1
7247DPjj1j0K2lnJpK0orjJ0j6Mn%qrj0PqJ5%N%oK0kkmK5Mj6%LK4j9jrQjj7j5J4
7293hJ3j1rkRmK0j7J5NJ9j3%NLj1j3Rj6Qj1j3Kj0Jj0oJ9kmOJ1K7j7J2%QJ9qpM
7334B3QRk9jOqj3mnPk2MRQ%M%KNJ2QrM%Qk9PjNj6k0MLmj0mRJ3mj5J1K4J5k0OK1
7380B1J3j5rKJ6j0Lj2JJ0j9OrJj1oMmj4K4q%OJLkjJ9J0j7j5MKQj3oK2j3jj0nK3
$$ y = [-13, -26, -26, -8, -3, -17, -15, 8, 0, -1, -9, 1, 11, 8, 6, 7, 6, -5, 0, -2, 0, 2, -11, -1, 12, 2, -16, -4, 6, 13, -2, -3, 12, 7, 12, -7, 16, 26, 12, -5, 8, 2, 3, -17, -19, -14, -20, -25, -41, -31, -36, -35, -32, -29, -17, -8, -9, -4, 9, 0, 12, 22, 12, 18, 17, 22, 17, 9, 1, -1, 4, -5, -15, -4, -7, -11, -22, -14, -2, 0, -22, -13, 13, 30, 17, 6, 10, 34, 6, 6, 1, 12, 7, -10, -12, -26, -32, -30, -35, -29, -40, -27, -28, -24, -8, -8, -5, 4, 0, 4, 27, 27, 11, 17, 23, 24, 22, 6, 17, 13, 13, -4, -15, -16, 16, -11, -13, -5, 8, 4, 2, -3, -2, 20, 6, -4, 1, 14, 5, -7, -10, -7, -5, -16, -16, -27, -20, -16, -17, -24, -22, -1, -14, -2, -15, -4, 16, 7, -4, 2, 12, 9, 9, -8, 8, 10, 7, -7, 4, 11, 10, -1, -11, 11, 8, 3, 4, -3, 17, 11, 2, 1, 11, -5, -1, -6, -6, -14, -23, -33, -26, -34, -19, -19, -14, -14, -20, 0, -2, -4, -8, 17, 21, 5, 5, 8, 32, 13, 12, 3, 11, 10, -7, -22, -8, 5, -6, -15, -17, -8, -12, 8, -9, 6, 11, 30, 17, 17, 22, 25, 14, 1, 10, -6, 2, -9, -22, -20, -30, -29, -39, -45, -26, -28, -32, -26, -15, 12, -5, 7, 7, 15, 34, 26, 19, 23, 31, 40, 11, 10, 16, 8, -5, -9, -14, -7, -29, -25, -16, -8, -8, -4, -4, -2, 3, 15, 23, 14, 18, 18, 26, -3, 4, 3, 8, -8, -28, -24, -21, -25, -35, -39, -30, -17, -21, -36, -25, -1, 14, -6, 0, 21, 34, 19, 10, 12, 28, 18, 21, 9, 10, 20, 1, 7, -2, -1, -12, -18, -14, -18, -32, -8, -16, -16, -10, -9, -6, -8, -9, 10, 20, 3, -12, -8, -6, 2, -11, -17, 5, -8, -9, -19, -24, -1]
7422aj0k1J7ORj1kK5Pk2J4JJ6pkJ1J2j2j5j2J2j0qLlkj3NJ0Jj6qK2j2nJK1j2k0
7461c1K5Pkj2rL0J2l2qK1J6Qm3J2J5npoJ4JLj4%J3Nj3MMj5%J3kp%Mjoj1J4l%r
7503a5QMqj6JK2nk2mJ4Pj4MK2Rj4j2K0J6Lj5QJ7Kk1RjJ7k8j2J0pojmnjk4K2mJ4
7544a0j2J9%JoJ6OoJkQpj3j1Oj0k8MJ1K3k5rJ4K1mrJ9K8lj4K0J6Oj8mJ2%j4j2
7583A4Krj1nj2Nj9pJ7kLLJ1J5r%J1J5%j2MJ7pk6oJ1pk9J7mnnoJ1RjlJL4mJ0OR
7626C6rkQJ7j0k2Okj5npNk2j4JJ1%j1LJ2QnOOJ4%okJ4j2j4K0mjjj7J5j1NrOJK
7669eNj0J6kRjNkjJ4Lj1k1KJ1rj6J8n%j6qJ3KlQlOnoRLrJmMlkJJL%NJ5%JJ4ok
7718A9kNJpnmoRj9NOoj4j5J9mNoKJ7Kj1QPJ3qlkJ1jj9kjqKlmmnJJ9%MMRoJ7NR
$$ y = [-1, -11, -32, -15, -9, 0, -11, -13, 12, 19, -3, 11, 12, 28, 21, 19, 30, 42, 30, 15, 3, 15, 5, -3, 0, -3, -5, -18, -13, -3, -2, -18, -26, -4, -16, -21, -20, 1, -11, -31, -6, 1, -1, -13, -22, 8, 20, -12, -20, 1, 17, 25, -18, -6, 9, 4, -3, -9, 5, 6, 9, -5, -5, 8, 13, 0, 4, 8, -7, -7, 6, 4, -3, -3, 1, 0, -6, -17, -3, -6, -6, -15, -7, -3, -11, -27, -26, -4, -9, -31, -35, -21, -14, -28, -24, -2, 7, -7, -19, 1, 17, 20, 5, 13, 30, 32, 11, 20, 19, 36, 8, -4, 6, -1, -7, -8, -12, -17, -18, -42, -20, -24, -10, -22, -3, -3, -2, -8, 8, 14, 8, 9, 7, 15, 8, -5, -16, -10, -20, -48, -44, -33, -10, -35, -44, -30, -9, -13, -22, -3, 25, 22, 8, 28, 44, 50, 32, 28, 40, 40, 26, 14, 16, 7, -4, -9, -21, -16, -35, -42, -25, -27, -24, -21, -10, 5, -4, -4, 7, 22, 22, 10, 14, 31, 24, -2, -8, 3, -4, -33, -16, -20, -25, -30, -36, -25, -16, -17, -20, -19, 15, 11, 21, 27, 36, 27, 25, 33, 50, 40, 18, 24, 22, 7, 2, -5, 0, -22, -36, -35, -24, -24, -35, -32, -20, -12, -17, -11, -5, 9, 9, 3, 1, 15, 3, -11, 9, 5, 4, 3, -14, 1, -10, -5, -14, -8, -7, -5, 0, -10, 6, 4, 13, 12, 17, 15, 14, 28, 31, 20, -1, 1, 12, 3, -13, 5, 0, 0, -16, -24, -11, -9, -12, -4, -7, -1, -6, -12, -3, 0, -9, -8, -12, -8, -11, -13, -12, -11, -8, -8, -3, 12, 12, 13, 27, 21, 19, 17, 22, 23, 16, 11, 7, 1, 10, -9, -4, 2, -4, -18, -33, -14, -18, -13, -19, -17, 0, 2, -9, -1, 6, 19, 11, 8, 6, 17, 16, -3, -5, -6, -14, -12, -15, -19, -23, -28, -27, -8, -8, -4, 0, 9, 3, 20, 25, 34]
7767C4j3QOjjkj3Lrj1jj5%nj8M%RjJJ3MNJ2NNJmJ3j5%jmj5JPlj5mJ3%j2lRJ1J0
7813Hj1KJ2J%KMjQp%%Lj2rp%j4jj2J0JMk0RLK5roJ5RLj1QJ1qmj8K6%j0jrJ2qj2
7859a4N%J5nlmLJ0LOj4J0nn%POj0j2KNj1Jj1pJ6Nj0oQJJ2j0KJ9pn%QJ0jkpJ7l
7904A9ojJLqJpJ5k0mMJ6mLj3PoPkp%Mj5J0M%ponQkJ7j2nJ2lMj8NPJ1j0j1K6%o
7950FqOJ4j0mj0K8j2lKR%Nk0J4j1jJ5j1j2qqLrOrJ2JpnJ9%k1J4J0J8j1j0NK2q
7991A1j0pK7rj4LJ0Jj1lmJ4okjJ0njJJ3Nj7J4kJj1Lollkjoj4lJ1mrLJ2Nj%KNK
8037bnLJ5J5rlNrJ3j3%M%j8MMmLj2J9nkJJ5nkrJ7jk1J3Lj6lnKPk4KjJ0kkJ8oq
8083a4pJ3K1rmMPQorK4j0Qj4J0mj5kMOoLqKokQJ1j9J0oRj6nLNRk0NJ0Mk3nK7L
$$ y = [34, 21, 29, 35, 34, 33, 31, 18, 21, 12, 1, 0, -15, -15, -20, -38, -34, -34, -25, -26, -25, -12, -8, -3, 9, 14, 19, 20, 16, 29, 14, 14, 13, 9, -6, -5, 2, -1, -16, -20, -7, -7, -19, -22, -13, -2, 8, -3, -1, 11, 12, 12, 14, 18, 17, 25, 18, 18, 18, 21, 9, 0, -7, -7, -21, -22, -34, -24, -23, -19, -39, -30, -27, -2, -11, -17, -2, 7, 10, -1, 7, 18, 10, 6, -12, 14, 14, 4, 3, -6, 6, -2, -14, -9, -9, 6, 1, -2, -6, -3, 7, 10, 16, 2, 12, 7, 2, 2, 9, 15, 5, -7, -5, 0, -11, -10, -21, -28, -12, -7, -17, -23, -15, -14, -2, -12, -10, 9, 2, -3, -3, 5, 15, 14, 12, 5, 22, 19, 13, 12, 13, 16, 8, 9, 2, 17, -3, -7, -3, 13, 9, 12, -1, 6, 0, 7, 5, -2, -2, 2, -13, -3, 1, 1, -6, -12, -17, -9, -11, 6, -6, -11, 1, -2, 2, -16, -11, -4, 7, -3, -14, 12, 12, 6, -2, 4, 18, 8, 4, -6, 22, 10, 7, 9, 18, 18, 23, 3, 17, 6, 5, 20, 9, -3, -11, -19, -16, -25, -19, -28, -16, -15, -22, -27, -8, -8, -29, -15, -5, 13, 2, -8, -3, 19, 11, 1, -6, 21, 12, -2, 1, 11, 12, 1, -2, -6, 8, 2, 0, -1, 9, 4, 3, 4, 17, 22, 5, 19, 17, 18, 7, 10, 4, 1, -2, -4, -5, -11, -25, -28, -17, -21, -30, -27, -15, -10, -11, -11, -9, -4, -2, -7, -4, 11, 26, 17, 14, 19, 10, 23, 10, 10, 14, 14, -4, 0, 4, 0, 3, -9, 10, 5, 3, 4, 19, 14, 12, 3, 20, 19, -2, 11, 14, -2, -5, -10, -8, -1, -25, -23, -24, -14, -16, -18, 0, -6, -14, -21, -8, 13, 4, 0, 4, 11, 19, 13, 4, 28, 18, 26, 12, 22, 18, 3, 1, 5, 11, 5, 8, 0, 2, -4, -6, 2, 13, -6, 4, -2, 7, -9, -14, -11, -6, 3, -17, -12, -2, 2, -21, -26, 1, 4]
8128Dj1pJ0Poj4KJ9Pj4NOmKkJ1%lJLJpKJ0nj3JJ6qk0J1JKj1j6KK7j2j7LJ6rKj8
8172b6J6OlkJ0J0j4qJ1LM%j7K6omLlJ1
$$ y = [4, -7, -14, -4, 3, -3, -17, -15, 4, 11, -3, 2, 8, 4, 6, 4, 15, 15, 12, 13, 16, 17, 10, 12, 22, 17, 4, 5, 21, 13, -7, 4, 5, 7, -4, -20, -18, 9, -3, -20, -17, -1, -10, -8, -26, -10, -4, -7, -9, 1, 11, -3, -11, 0, 3, 7, 7, -10, 16, 10, 6, 9, 6, 17]
8191A7
$$ Imaginary data points
##PAGE= N=2
##DATA TABLE= (X++(I..I)), XYDATA
0@%%%%%%%%%%%%%%%jJjRj6J6j6J7k5L3l4M2n0N4o3P2q0R3j10J25j42J60j80K01
39A05k26K52k78L10l45L84m24M69n20N73o31O96p67Q44r30J024j130J248j379
58g25J528j698J895k123K390k711L098l559M091m542L749J5355L37651j01052
72B53347m85124o173M30154J70851l11089k07152J82629J82076j41623j71830
82a03934P6308J18788j08854j58403N1415J50570j6676j41436m5428R2904R4106
93I360K5187l8206p5268j8304J38362J62933o8512k41263k9275K72516J49347
104B86877k44551k66147J28961K79994o0390k97501l6515K43317N8302k25830
114a33483q1295K22826J21108k06577j54256K08884K43838j25197k71456M7508
$$ y = [0, 0, 0, 0, 0, 0, 0, 0, 0, 0, 0, 0, 0, 0, 0, 0, -1, 0, -1, 8, -8, 8, -8, 9, -16, 17, -17, 25, -25, 29, -34, 38, -42, 51, -59, 66, -76, 84, -96, 105, -121, 131, -147, 163, -182, 202, -222, 247, -273, 300, -331, 365, -402, 442, -488, 536, -594, 654, -725, 803, -895, 1000, -1123, 1267, -1444, 1654, -1905, 2186, -2356, 1393, 16748, 354399, 253347, -231777, -237950, 192204, 363055, 51966, -155186, 27443, 209519, 67896, -103934, -27626, 91162, -17692, -176095, -124680, 25890, 9214, -132222, -177650, -84746, 9360, 34547, -3659, -78927, -97231, 41131, 204064, 135552, -105711, -134986, 137530, 286877, 42326, -223821, -94860, 185134, 124744, -172757, -209272, 34045, 92347, -133483, -214778, 8048, 129156, -77421, -231677, -22793, 221045, 95848, -175608, -128100]
124a28100K88407O6012k30401j41864J30203J48633m9175j27486l1278L9607K4818
135a0624R832m951m8904m2158M8088Q0182j7476p7634J3878Q8209J967p6673J7381
148a8883J05976j1112j40716j8440J69276P0093j82647j51732J36512K00088p6180
159H2235k30261r323K08474P3809j57547j00942J10132J09639o1908q6117N0960
170a0849P9726m0491p5096L4735P9452k1695q6140r635O5755K4524m2230l3574
182c5518M141J2045J7980K6008j1877n7078r390Q3126N7226p0538q8780M7450
194b5205J11716j0709j12525k2006R5391L4120q7591m9412P1557M9509p3252o5807
206h4214O5076Q3175m8195r6532K6196J09321J4915r0812l6131P2432N6730l6990
$$ y = [-128100, 160307, 226319, -4082, -145946, -15743, 132890, 83715, -43771, -75049, -35442, -10624, -792, -5743, -54647, -96805, -48717, 31465, 13989, -63645, -49767, 38442, 40409, -36264, -18883, 87093, 75981, -64735, -83175, 86101, 156194, -26453, -178185, -41673, 158415, 82235, -148026, -157349, 51125, 124934, -32613, -133555, -23423, 86216, 24308, -61809, -10849, 68877, 28386, -46710, -11975, 67477, 45782, -40358, -49993, 15762, 40286, -1944, -35518, -31377, -19332, -1352, 24656, 12779, -44299, -53689, 29437, 86663, 16125, -72655, -25205, 86511, 75802, -36723, -58729, 36662, 70782, -16809, -66221, 5336, 54845, -18407, -84214, -19138, 64037, 15842, -80690, -54494, 54827, 69742, -21070, -57201, 15231, 71961, 34971]
218C4971n1112J1951L3525l137j9074k027k768j5820p65J8287k681k8644n904
231c3198K7538Q870k4859m414L3551J1490l2871q742M8732K8650m5909m2172M2284
244H950O0592k7089p3896L65O7467J3675o5272l6338M2889L6273l3655m0300K0271
257b6068L6565j2409l1453J1476L5431M76k6399K87K8956J1799j5856r711R426
270A2520P849k763k864l913j1556n909J1214O180k0622k1997J1778K4477q431
283d037k9902R33L2282R634k5501r222K9816K1324j9229j8790K1404K8290j1879
296B5123k9147M843K8367J02l0738j3458J8102J0455j8938j9475N114J2016m289
309a1923j1018R28Q509L023j56M260N428K560M360P430K533l131K053P978l32
$$ y = [34971, -16141, -4190, 29335, 26198, 7124, 5097, 2329, -13491, -14256, 4031, 1350, -27294, -33198, -5660, 3210, -21649, -26063, 7488, 18978, -13893, -22635, 26097, 54747, 8838, -33334, 8950, 69542, 42453, -31443, -31078, 36389, 50064, -15208, -51546, -8657, 27616, -6039, -46339, -26068, 10497, -1912, -33365, -21889, 13542, 14018, -12381, -12094, 16862, 28661, 12805, 3094, 12520, 20369, 17606, 14742, 10829, -727, -6636, 4578, 10758, -9864, -31861, -20083, 4394, -4037, -33939, -33006, -724, 8910, -16591, -25813, 4003, 25327, 6098, -12692, 8712, 37002, 25123, -4024, 819, 29186, 29288, -1450, -14908, 3194, 13649, -5289, -24764, -19650, -7634, -11923, -22941, -22013, -13504, -10481, -10637, -6377, -949, 1611, 5971, 13401, 15934, 12803, 14856, 22834, 22502]
324B2502j1542n475P354J465j5703j3948N184Q496r949j6802J863J5242K126j2019
338b1206j006J6387J1174n185l577J1521J2588j764o977K925P546j838r286m628
352F674P97k701p641n996k456k574k839o59J60q97J368O007N539P66J503P973
368E024Q392L55k952L709O959j485q763l354L659j654j0694p785J741J363o953
383a2438o904K492N723o82k931M092Q173L132o56L559O847K380k073M94K973j154
399A3027n086k320L47l561o910k541J960j858o280j268N966L189l739q78P803
414b149O997j628k412N534O701k162n659J512M571l557q668j743M150k079q691
429i283k934N423K285m944j736O353M923j807N5O752M293l431j603O372L603p354
$$ y = [22502, 10960, 5485, 12839, 14304, -1399, -15347, -10163, -1667, -11616, -28418, -26555, -11313, -9187, -21206, -22212, -5825, 5349, 164, -3413, 8108, 20696, 18932, 11955, 14880, 22426, 20588, 11302, 6674, 7471, 4770, -2871, -8867, -11323, -13897, -16736, -17395, -17235, -18132, -16764, -10757, -5218, -4452, -2949, 5024, 13416, 13771, 10819, 14528, 21487, 20002, 11239, 7885, 11544, 9890, -804, -8589, -6848, -5485, -12438, -19342, -16850, -11127, -11809, -14740, -10648, -2475, 657, 1, 3560, 10407, 12787, 10714, 11208, 14181, 13027, 7941, 5621, 5968, 2407, -4503, -7044, -5084, -6942, -13222, -14490, -8524, -5335, -9074, -9952, -2149, 4848, 3220, 808, 6342, 13043, 10881, 5222, 6734, 11305, 7748, -920, -2663, 1487, -592, -9283, -12217, -6794, -4509, -9453, -11189, -4836, 87, -1720, -1665, 5087, 9380, 5949, 4346, 10718, 14321, 6967]
445F967p164M027N002p377j1178J031P302l253j0185O84J0234J534p982J181J3361
460D184N788q324k984J2535R481q134j0218N082R107n367j2647j971N126l279
474a621r160j087M555k696o468L786J0027M35o526L861J3461M307o946P1J0654
489A6653K982r374l217Q515P7j5567q320J0756N751j6920j6212R918J7000o863
503d821j8625L468K1232N415j3017j268J7179Q207j0136l501J3664O570j3573
516A0794j0104R840Q534j2885j6567K492R661n035j2184k19O444k059l582P859
530g011Q297o056o217J3223J7370n453j6578M753K0749J446j9987o760J4563M012
544A6351j8029r775J2495N325j8671j2291J6551J5551j5123j9997J2424K6578
$$ y = [6967, -197, 3830, 8832, 1455, -9723, -8692, -1390, -4643, -14828, -14144, -3910, -2376, -10358, -9177, 4184, 9972, 1648, -1336, 11199, 20680, 12546, 2328, 7410, 16517, 11150, -1497, -3468, 1658, -1621, -10781, -11868, -7313, -10009, -16477, -12691, -2664, -2229, -8755, -4894, 8567, 12874, 5928, 5999, 16653, 19635, 10261, 7044, 15559, 15636, 69, -8251, 2505, 8256, -8664, -24876, -14958, 2042, -4821, -23446, -19978, 1254, 6669, -6348, -7616, 9563, 17770, 7634, 4133, 17797, 24367, 10794, 690, 10530, 19064, 6179, -10388, -7896, 1765, -3270, -15454, -15673, -9229, -11288, -14870, -7011, 1286, -4770, -10987, 2236, 19606, 14153, -2425, 2328, 23077, 24523, 4536, -2224, 12339, 16351, -1678, -11453, 1042, 6367, -12304, -24595, -8044, 7507, -7616, -27613, -15189, 11389]
556A1389j208k1558n56K2542Q715j3756o232J1427M518j0913l631J0135J9j6711
570e820o474J4069O772j5929j2639J0775J2448p454r917P986R889o903o200J3609
584D212J2289j3214j5935J3661K3366q150k7752p61K5699N825k4170j2456J6575
597h11J0939j4610j0795J2965R543j4162j0651J6329J6137j3307j8984J0417K2945
610A5955k799k0647j646J6982L790j2552k696R323j787j1857L001J4990k863k0063
624a2869k069K1815Q169k0026j2881J6213J5536j1040j4040R164J2577r274j2110
637a0835J1227J4850j1802j9673R210K4073l586k6096l912K3620R590j8473j1839
650a3646J2963J0497r776p530J0041N886j2312o950J4446J0556j4389j5137J0944
$$ y = [11389, 10181, -11377, -11933, 10609, 19324, 5568, -664, 10763, 15281, 4368, 737, 10872, 10891, -5820, -12294, 1775, 8547, -7382, -20021, -9246, 3202, -4252, -14169, -6183, 3706, -3197, -9397, 4212, 16501, 3287, -12648, 1013, 24379, 16229, -11523, -12284, 13415, 19240, -4930, -17386, -811, 10128, -4482, -15277, -2312, 7231, -6931, -17582, -1253, 14884, 1577, -17407, -6990, 15955, 13156, -7491, -9137, 7845, 11635, -917, -3613, 5710, 3923, -7934, -4933, 10057, 7194, -12869, -14938, 6877, 15046, -4980, -17861, -1648, 13888, 2848, -11192, -2028, 10549, 1275, -10835, 392, 15242, 3440, -16233, -7023, 17050, 13464, -12632, -16544, 7076, 16666, -1807, -13646, -683, 9814, 38, -7492, 2549, 8435, -3877, -10827, 3619, 14175, -214, -15351, -4407]
663d407J7555o302j7266K282J4579r31j1833K326J1394m251j3557M974J7690k450
677I803k1222k930K1885R058j9280j3797J4295J5140r804j4298O843J2129o680
690A142j1583P328J2662p645j5657N487J8116j282j8350l228J6191O435j2317
703b701o908R078N293p723l004Q858K013j1611l777J3357O974j3528j1164J0759
717d084J3060p770j4046M270J2506l059j1435L036J1499l207j2767K808J5431
730F242L56j6250l925J6033Q178j3228j0882R301J1097o330j0534L714Q119m290
744b399q146L920P894m524r506L400J0677j120j0303l34J0100K650p515j921P018
759a09J673o692r24P631Q65r654l224R593M728j0202q273P582R222n718j0066
$$ y = [-4407, 13148, 6846, -10420, -8138, 6441, 5510, -6323, -3997, 7397, 3146, -10411, -5437, 12253, 9803, -11419, -14349, 7536, 16594, -2686, -16483, -2188, 12952, 3148, -11150, -4307, 7822, 1142, -10441, -3113, 9549, 1904, -13753, -8266, 9850, 8568, -9782, -13010, 3181, 9616, -2701, -9609, -531, 4762, -2961, -5965, 2893, 4906, -6705, -10482, 2875, 9849, -3679, -14843, -4084, 8976, 1206, -12840, -8570, 3936, 877, -10558, -7522, 3977, 770, -11997, -9189, 6242, 6598, -9652, -13577, 2456, 10634, -2594, -13476, -4175, 6922, 592, -9942, -6228, 1891, -2399, -10545, -6625, 1269, -3255, -12761, -9361, 1316, 196, -10107, -10441, -341, 2309, -5206, -7127, -109, 1564, -5128, -6052, 1579, 2444, -7210, -10434, -841, 3887, -6315, -14588, -7006, 2216, -3502, -13568]
774a3568L422R772j504q475J614R312K06q185O2R466K140q829l711P844M891o823
790b366o546L898N228l584n527J967M022k391l768K839M354k474m255L150O132
805F79j182n347J283O319L25n596o99N297Q53n789k052M855J768n950l722M814
821d144M247m328n190L368O167j304n207J083N855R18m137m85M263J196l535j204
837b437L166J039l535j861K544J291l137k158K300J919k293j958K419K555j768
852a914k110K551L490j418l199J618M130o26m311l21M088R35m197k257L007K267
868A733k831k962J755K914j129k663Q22K802N1k019K60K314N06j454j68J400J65
885A496j294j03J016m81j569K52J548o29k324J46K705M29k915r84L164K079k560
$$ y = [-13568, -10146, -374, -1878, -10353, -8739, 573, 779, -7406, -7344, 2122, 4262, -4567, -8278, -434, 4457, -2366, -8912, -5014, 214, -3370, -8897, -6930, -2908, -5299, -9067, -6228, -1874, -4348, -8603, -5453, 679, -503, -5850, -4567, 1752, 2077, -3519, -4218, 1079, 1932, -3857, -5909, -1054, 714, -5236, -8958, -4144, 103, -4225, -9415, -6047, 120, -1184, -6391, -5308, 547, 1465, -2672, -3157, 1106, 2302, -1233, -2437, 729, 1768, -1767, -3628, -1084, 207, -2930, -5088, -2788, -869, -3162, -5120, -2701, -146, -1914, -4024, -1473, 2017, 599, -2600, -982, 3148, 2522, -1789, -2110, 1978, 2913, -1284, -3541, -534, 1733, -1098, -4060, -2305, 609, -520, -3183, -2361, 441, 492, -1527, -1267, 1047, 1553, 99, -69, 1331, 1496, 202, 99, 1115, 634, -935, -683, 865, 236, -2088, -1942, 763, 1192, -1723, -2707, 457, 2536, -24]
902b4k496K306L362j298l476O13L574J69l557j102K964J500k679k273J705K296
918A584j092k322L52K061L76j327m43Q44O26m1j02k74m09M58J039l63j784k47
936a064K117P82k440j739K239K493j952l334J240M007j79m212q40M275K147l646
952a06l056K803L798j675m117L69L825O19l378j596K381K020j376k078K93J693
968D19O17q55j056j11J214J289p31k219j24K901J360l079k767K659M065j826n193
985c437L61N705J250n746k959N121M546l919n626K437O294n60o204j142N565K616
1001D302m379l624K838L935j279l704j91K790J204j530j684J0J502J460n54k564
1017a468q37L164K695k899m513J920O049k00p024k003P164M299o563o547N040
$$ y = [-24, -2520, -214, 3148, 1850, -1626, -1013, 2561, 2730, -827, -1929, 1035, 2535, -144, -2417, -712, 1584, 492, -1830, -1478, 583, 959, -368, -811, 33, 659, 618, 516, 242, -167, 291, 1330, 967, -817, -1064, 1053, 1835, -605, -2344, -105, 2388, 436, -2898, -1658, 2349, 2170, -2042, -2882, 1393, 3540, -106, -3162, -359, 3439, 1764, -2353, -1984, 1841, 2460, -918, -2514, -133, 1887, 511, -1567, -1274, 419, 1036, 181, -875, -986, 228, 1517, 786, -1433, -1557, 1344, 2704, -375, -3142, -483, 3582, 1756, -3437, -3076, 2629, 3879, -1867, -4826, 295, 4841, 922, -4704, -2267, 4027, 3467, -2737, -3879, 1686, 4302, -77, -3701, -863, 3072, 1793, -1911, -2102, 688, 1892, 362, -1322, -1312, 190, 1650, 1096, -1468, -2305, 859, 3554, 655, -3858, -1938, 4111, 3911, -3113, -5116, 2048, 6347, -216, -6763, -1723]
1032a723Q228k946r301M71R502K113q811m415P403O257n235p273K867P386m38
1047D085o560j586M946K809k915l127P32K325R52q32j963j148K041L256j135m960
1063c080m93O160K780o474n268N937P817m425j0021J993J1399J069j1859m496
1077h961J0964P653r008j0216O090J1591k701j1691n09J0718L273q758n068O430
1091a93N928l891n826J566M845J53l299j288J138J373J019m92k924j445L979M065
1107D708l845o754K523R212Q5j0594l349J0821O866r679j0003P396J2276m451
1121E212j3781Q81J3942K560j3234n863J1365Q534q700j0261N529J0942k040j0157
1135e071q24Q361K882n790l707L066L125q75j695o37o52O72K696%m637j718N717
$$ y = [-1723, 6505, 3559, -5742, -5271, 4231, 6344, -2467, -6882, 521, 6778, 1543, -5730, -2863, 4523, 4085, -2475, -4061, 885, 3694, 779, -2348, -1616, 709, 1661, 829, -1134, -2282, -241, 3015, 1880, -3080, -3573, 2587, 5367, -1107, -6375, -438, 7379, 2954, -7067, -5074, 6325, 7394, -4465, -8961, 2003, 9656, 648, -9568, -3478, 8113, 5412, -6279, -6788, 3930, 7203, -1555, -6623, -193, 5735, 1844, -3982, -2416, 2429, 2582, -717, -2005, -867, 506, 1525, 1033, -1891, -3336, 643, 4708, 863, -5891, -3368, 5844, 5929, -4665, -8014, 2807, 9673, -6, -10009, -2613, 9663, 5212, -8569, -7688, 6254, 8814, -4420, -10283, 1082, 9616, 916, -9345, -3816, 7126, 5086, -5071, -5895, 2466, 5348, -442, -4149, -1083, 2042, 1167, -528, -1165, -1817, -1145, 1551, 1551, -3086, -4804, 913]
1152I13L919o028o424N561R022l919j1121J631J2790J591j3380n284J2612Q725
1166A0608j0690j1845P402J3366l914j4074M1J3002L001j1188n326Q786O582o126
1180c75o802L846O451j693n184L54L523K33j789j16j97j239J093K906j692n372
1196f053N44P209J223q602l921Q891O868p869r539O137J1728l325j2851M09J3186
1211D035K632j2651n713J1072P922r098j0027O151J0595l454j0742N00R572J691
1225B485p676k899N603L360l445k553K105J474j276j4J357j401k233K115L335
1240C37k703n073K199O469j485q115k28R070K371r377m708R084P349p538r318
1255a1666N642J0963k807j1407R7J1043K362j0030m583Q193N792o378o568M289
$$ y = [913, 4832, -1196, -7620, -2059, 6963, 3044, -8077, -6446, 6344, 7935, -5445, -10729, 1883, 10608, -82, -11927, -4525, 8841, 4927, -9147, -9106, 3896, 6897, -4291, -9617, -831, 5751, -375, -7177, -3331, 3120, 1427, -3757, -3403, 120, 353, -1436, -1552, -1749, -2988, -1895, 1011, -681, -6053, -5509, 1700, 2923, -5679, -9600, -709, 6159, -1710, -11249, -5112, 6616, 3291, -9560, -9151, 4035, 6667, -5984, -11697, -625, 7297, -1801, -11828, -5677, 4918, 1464, -9278, -8778, 794, 2485, -5191, -8090, -2487, 873, -2572, -5125, -3020, -1546, -2822, -2836, -1479, -2880, -5113, -2998, 337, -2366, -7439, -5240, 1229, -256, -8371, -8599, 471, 2842, -6535, -11243, -2159, 5190, -2348, -11666, -6024, 4939, 2132, -9275, -9178, 1865, 4227, -5803, -10386, -2193, 3599, -2779, -9347, -5058]
1269e058O487k621n939J291N116k33l784J30K827j57j777J045J504j862j514K883
1285a662K263l668l559L703M909l428o379K359P513q69q196p96Q494K906p838
1300d248m392P133O110n555p049M058P783k165p759M65P307R52o522k076N355
1315f03K695m290k788L279K687k516k145K315J973k023j367K427J409k621j387
1330b955L101J852l378k391L465L153l445m030K971M875k264n490J364N975j64
1345B639o015q47N962K153n303k890M759L731l822m137K973M399k098m405J289
1360a612M156p45l942K41L628P5l272j85L149L46k956l36L039N57k972o41L148
1377A678R19l207j299L257J749l216k276L001K712k756l285K303L672j745l977
$$ y = [-5058, 1429, -1192, -7131, -5840, -724, -957, -4741, -4611, -1784, -1941, -3718, -2673, -1169, -3031, -4545, -1662, 601, -3067, -6626, -2923, 1986, -1442, -7821, -5462, 2051, 1182, -7014, -7810, 684, 3590, -4248, -8640, -1507, 4603, -952, -8001, -3943, 3840, 1675, -6084, -5619, 1688, 2640, -3882, -5958, -603, 2092, -2198, -4986, -1707, 980, -1536, -3681, -1366, 607, -1416, -2783, -356, 1053, -1568, -2955, 146, 1998, -1380, -3771, -306, 2847, -598, -4628, -1657, 3218, 954, -4536, -3172, 2803, 2639, -3376, -4223, 1739, 3892, -1411, -4301, 458, 4189, 367, -3770, -797, 3602, 1504, -2901, -1612, 2544, 1799, -2143, -1902, 1726, 1801, -1471, -1656, 1493, 1839, -1117, -1453, 1586, 2143, -829, -1470, 1678, 2597, -610, -1909, 1348, 3097, -119, -2395, 606, 3318, 562, -2723, -420, 3252, 1507, -2470]
1392b470J182M178m70m171j37M133Q24l857j338L544J759l198k165K767K375k345
1408F11k581J903K590j575k649J223K613r62k551P56K479o06k467N02K516l36
1424A466k582K20K686o0k868k72K961N96l053j046L012J468k973j995K732K471
1440B763k402k886J917L200j382l423P73L436j43l327l53L083P85k789j109K428
1456E71J265k068j348J753J273j571j251J445J157j455j130J492J164j612j332
1471a647J691J593j716j876J635K303j435k642J118K971o48l176J21L226M06l205
1487a281r76K940J422k628j791K183J999j772k097J412K099j030j970Q62J873
1502A245p13j729P16J718p02j722P24J824p79k094O19K284m81k568J36K716K57
$$ y = [-2470, -1288, 2890, 2420, -1751, -1888, 2245, 3069, -788, -2126, 1418, 3177, -21, -2186, 581, 2956, 611, -1970, -67, 2523, 948, -1701, -478, 2135, 1173, -1378, -622, 1857, 1251, -1216, -714, 1802, 1466, -1116, -896, 1790, 1730, -1138, -1410, 1551, 2147, -906, -1952, 1060, 2528, -445, -2440, 292, 2763, 361, -2525, -608, 2592, 1210, -2213, -1440, 1996, 1853, -1474, -1827, 1256, 2041, -748, -1857, 571, 1836, -232, -1580, 173, 1446, -125, -1376, 69, 1226, -229, -1359, 133, 1297, -315, -1647, 44, 1637, -79, -1955, -320, 1983, 548, -2094, -976, 1995, 1347, -1829, -1708, 1518, 1924, -1281, -2257, 683, 2105, -523, -2314, -131, 1868, 96, -2001, -589, 1510, 480, -1490, -628, 1245, 532, -1197, -481, 1237, 535, -1187, -463, 1361, 582, -1512, -893, 1391, 910, -1658, -1522, 1194, 1451]
1519A451k833p01K827J239k617j602K396K025j984k219J597K389j165k368P93
1534g72K234n74k111L50J917l78j859L71J821m70j950M99K195m15k395L08K776
1551A547P0l004m67L206J060l226j702L060K292k741k895K166L250j559l503Q42
1567a604L470k02l296l45K978P68k521r24K117R78j728q10J546N82j496l47J654
1584H20J66k006j98K387L92k806q24L138J448l296k194L229L044k888l787K280
1600a095M453j477m870M98M999M93m867j456M401K254l788k820L005L128k204
1615F54l125J513K934r17k557O53K115n84j748P18J492j090j493J396J677j780
1631a42k180J922K809j901l546J595M318r23m894P8N358J081n375k204N141L355
$$ y = [1451, -1382, -2083, 744, 1983, -634, -2236, 160, 2185, 201, -2018, -421, 1968, 803, -1565, -772, 1462, 888, -1223, -873, 1044, 666, -1193, -822, 999, 529, -1421, -922, 1273, 858, -1537, -1229, 1547, 1617, -1387, -1854, 1352, 2412, -814, -2516, 544, 2836, 95, -2800, -634, 2616, 1057, -2446, -1604, 1866, 1664, -1632, -1977, 1001, 1769, -752, -1676, 441, 1419, -309, -1119, 427, 1009, -487, -834, 820, 986, -1020, -1218, 1169, 1561, -1245, -2069, 1069, 2517, -779, -2973, 256, 3300, 412, -3375, -1095, 3358, 1881, -2989, -2491, 2508, 3001, -1866, -3322, 1079, 3333, -455, -3275, -270, 2858, 654, -2471, -958, 1976, 1059, -1498, -845, 1270, 686, -1062, -344, 1148, 58, -1435, -39, 1638, -142, -2322, -400, 2409, 508, -3038, -1443, 2875, 1952, -2942, -2864, 2494, 3575, -1800, -4004, 1137, 4492]
1647D492m500m348L527M964k530n408J269N312l12n104o62M454J326l814j647
1662b981L130J806k413j553K082J323j793q12J943N30k274m06K728M48l418j019
1678b679L750J558m213k650M071L625l845m667L147N618k068o203R88O652N55
1693C639o432j761O066L050n214l982M137M495l104m828J788M463j027m205J63
1708b752L430Q0k867j08K303p2j907O30K046q92k145J435K870j442l531J327M362
1725B767q55n213j19N613J082o075k597N679L803n259n109M221O079k902o589
1740e474J575O905J04o411j201N923K443m877l022L832L319k844l282J820K770
1755A580j438k412R94J665j177j307J461J041j981j052K665J586k951k132L432
$$ y = [4492, -8, -4356, -829, 4135, 1605, -3803, -2534, 2778, 2466, -2638, -3300, 1154, 2480, -1334, -2981, 149, 1955, -458, -2011, 71, 1394, -399, -1211, 732, 1262, -1012, -1418, 1310, 1758, -1660, -2679, 1071, 2629, -1584, -4234, -163, 3462, -383, -5050, -1903, 3715, 1647, -4556, -3568, 3084, 3639, -2793, -4554, 1512, 4562, -652, -4634, -497, 3998, 894, -3934, -2146, 2317, 1290, -2915, -2752, 678, 758, -2109, -2217, 86, 14, -1893, -1263, 783, -109, -2254, -819, 2051, 609, -2922, -1595, 2767, 1912, -3301, -3420, 2193, 3275, -2800, -5397, 282, 4085, -1174, -6283, -2062, 4017, 1115, -5474, -3899, 3006, 3110, -3301, -4502, 1421, 3864, -1013, -4035, -203, 3116, 272, -3010, -1190, 1580, 142, -2270, -1276, 389, -788, -2095, -634, 407, -1574, -2626, 39, 1625, -1326, -3458, -26]
1770b6L285l205m193K835N333j898o129O65O526O68o697k266O150L479n451m654
1786e578M289N376l039n715J782N781m20n272m59M726J332l781j586K993J649
1801B078k209j321J737P85j664l49J823p8k326J47K893K6l504n55L994J345m212
1818a390k231M237L284l880m245L248N162k262n759J115O109K11o002j514N553
1833A636K652m702l462L727L925k696m012J693L794r89l472M24K938k46k573N9
1849a304K157j97j927M01J883o42j954R39K406r05k818R29L468m24l963k55M290
1866B084J060m422k112M008K831l713l772K782M130k138m515J160M606k73m446
1881b730m41M283J365l597j673L176K197k427k182J855K062j504j983J082J469
$$ y = [-26, 3259, 54, -4139, -1304, 4029, 2131, -3998, -3333, 3193, 3861, -2836, -5102, 1048, 4527, -924, -5578, -1289, 4087, 1048, -4667, -2885, 2896, 2476, -2796, -3255, 1471, 2803, -978, -2564, 429, 2078, -131, -1452, 285, 1070, -594, -943, 880, 802, -1524, -1377, 1516, 1542, -1962, -2517, 1477, 2822, -1390, -3621, 616, 3900, 20, -4225, -977, 4185, 1923, -3836, -2721, 3388, 3599, -2403, -3917, 1636, 4288, -414, -3876, -149, 3776, 1080, -2932, -1239, 2555, 1566, -1906, -1482, 1456, 1210, -1363, -1304, 853, 656, -1271, -870, 1013, 371, -1583, -644, 1762, 857, -1961, -1032, 2436, 2012, -1951, -2206, 2084, 3144, -1278, -3390, 618, 3449, -264, -4036, -1254, 2876, 738, -3777, -2617, 1989, 1716, -2730, -3171, 1112, 2477, -1120, -2793, 383, 2580, 153, -2029, -174, 1888, 384, -1599, -517, 952]
1896I52j346j624J102J286j507j623J439J770j510k041J542K597j112k653J145
1911a583L298m24l349J10L650O16l695j357L323J775l305k701K347K755k126l249
1927c915J209L090p74l007L60K984K77k446j63K596P66k022n50K067Q26j814q48
1944a364J585O39j864j044J463P19j944j237J634J242j824j636J727K125j259
1959a038k082J326K774n01k465M79K846K54k612n47K456P70k516j422J884J277
1975H83k036j839J305J664j270j835R31J900n29j558P37J926j81j475N21J882
1991A026o5j677Q6J796K3j990m84J654L62j991r49J511Q75j643j216J400J444
2008A62j113j338J181J795n70j508P17J836j75j573J42J568nj588k81J326J09
$$ y = [952, -394, -2018, -916, 370, -1137, -2760, -1321, 449, -1061, -3102, -1560, 1037, -75, -2728, -1583, 1715, 1291, -2058, -1948, 1702, 2318, -1377, -2734, 589, 2364, -941, -3642, -1295, 1460, -666, -3915, -2706, 384, -390, -3397, -3037, -53, 224, -2222, -2385, 211, 977, -1045, -1595, 472, 1298, -516, -1364, 221, 860, -1004, -2048, -585, 134, -1810, -3047, -1413, -171, -1995, -3631, -1904, 221, -1038, -3120, -1794, 980, 479, -1986, -1507, 1339, 1593, -1019, -1566, 890, 1660, -856, -2278, -394, 883, -1153, -2992, -1687, -23, -1293, -3128, -2197, -297, -826, -2384, -1647, 279, 98, -1377, -856, 1026, 961, -716, -630, 1166, 1189, -801, -1285, 369, 731, -1260, -2209, -698, 177, -1466, -2682, -1282, 162, -951, -2289, -1108, 687, 117, -1391, -674, 1162, 987, -586, -444, 1124, 1119, -469, -750, 576, 685]
2025F85j562m56J288L49j510o21J434P97j312q58J418J273j075j233J129J595
2041A341p41j580N94J699l42j816m0J680J87j688n62J424O76j278q04J055Q91
2058F96p86p88P60P83n62o99N96O36o03o40O15N93p66p68P47Q86p87j023P91J331
2078A012n64j442M91J755n9j751k00J818N31j775j020J442J113j364j561Q21J466
2095G13o37j613K31J525J58j190j28J213N37o61k04P46L62m22r4M08j39o40K1
2114A86M71m61j072O0R10k83j425j08J507M43j456n97J776J383j156j307J344
2131B15K024n61j904K76J985J07k053q28J402O57j586j357P01R40p56j155L19
2148a574R69%m95K94P20K03O5N05L38k76M0Q02K03j063o45R19N77j402j552P00
$$ y = [685, -877, -1333, -45, 304, -1206, -1827, -393, 404, -908, -1766, -348, 925, -150, -1383, -254, 1341, 600, -980, -386, 1313, 971, -845, -885, 795, 982, -706, -1268, 156, 832, -446, -1250, -195, 696, -90, -878, -118, 665, 103, -596, 0, 636, 33, -607, 8, 601, -165, -933, -186, 700, -87, -1110, -319, 1012, 448, -994, -503, 1252, 1193, -558, -758, 1060, 1591, -184, -1204, 238, 1351, -13, -1574, -753, 713, 76, -1537, -1306, 219, 377, -813, -941, 272, 809, 148, -56, 690, 1052, 630, 536, 944, 805, 165, 186, 657, 196, -876, -816, 94, -189, -1614, -1722, -215, 228, -1228, -1825, -49, 1334, 178, -1129, 215, 2239, 1678, -226, 50, 2035, 2142, 89, -739, 663, 1320, -266, -1623, -922, 18, -738, -1893, -1574, -605, -605, -1100, -806, -86, 117, 182, 687, 1025, 749, 789, 1591, 1794, 731, 86, 1005, 1582, 180, -1372, -672]
2168f72J365r26k119J74K077K45k040n42K220J450j449j283J618K056o37j743
2184b06M71J860Oj729n68J103L37j233r25L41L00n34m46R1Jj28M12N16l00m23
2204a054Q66J312k77j255M26J889K33j930p51J813J046j920j895J192J835j190
2220C40k515K87K361J07k395o76K218J387j541j386J353J886m08j416K56J342
2236A200K03q53k62M14j7l54op0o10k70N74J39j013n19J100Q23j149j107J304
2255d73J803q35k045O71K663J93k637q23K558J540k126k176J394K257r07k438
2271a381J25K095J17j957n31J614P30j325q18J075J013o13q07L95O95n7j98J40
2289C12j68l90M49Q53n06j457J03J815L61k035j064J838J551j549j939J119K166
$$ y = [-672, 693, -233, -2352, -2178, -101, 144, -1896, -2438, -218, 1232, -217, -1500, 118, 2174, 1537, -206, 265, 2125, 2131, 402, -166, 937, 1274, 41, -884, -543, -243, -777, -1223, -1132, -1131, -1259, -847, -331, -631, -1054, -188, 1124, 847, -408, 18, 1907, 2140, 210, -541, 1272, 2318, 398, -1497, -305, 1530, 340, -2175, -1888, 473, 580, -1815, -2491, -273, 1114, -427, -1813, -460, 1426, 1018, -398, -142, 1200, 1403, 550, 288, 702, 685, 331, 325, 255, -355, -625, -51, 88, -925, -1444, -344, 479, -670, -1777, -473, 1330, 495, -1550, -879, 1784, 1977, -660, -1483, 1075, 2615, 489, -1687, -293, 1964, 1057, -1381, -1256, 839, 956, -1001, -1532, 82, 812, -513, -1331, -256, 757, 144, -663, -268, 427, 370, 172, 312, 144, -246, 203, 1056, 550, -907, -804, 1011, 1372, -663, -1727, 111, 1662, 113, -1826, -707, 1459]
2306A459p29k315L66K416N4k522n42K463J144k210j701J708K073r91k078L55J835
2323G85J58j311k67Q70J19n75J51N05m70p92M57Q54n35j143L14J047l85j205L43
2342a080J390l61j633L13K178K88k290p61K464J684j972k181J377K463p38k558
2358a417p1K019J16j995n50J474L40j642n99J520Q01j322q77J259J278n99q63
2375a128O37Q83l05l35O47K06j105m73J225N98j748j540J126J590j104k175L63
2392b638K012k2j844l2K004M87j605k44K157J030j785j155J824J723j385k120
2408a593N37J773m30j960l78J052o2j170r3Q77j89r96M11J499J15j226J11J728
2426FO69j153m18J286N85j198o37J070M02j635j088J247J021j628j851R46J942
$$ y = [1459, 730, -1585, -1219, 1197, 1251, -1271, -1813, 650, 1794, -416, -2117, -409, 1664, 673, -1405, -1050, 785, 943, -368, -635, 235, 354, -221, -70, 435, -35, -827, -370, 484, -51, -1194, -880, 167, -218, -1423, -1080, 310, -51, -1684, -1371, 807, 1095, -1195, -1956, 508, 2192, 220, -1961, -584, 1879, 1141, -1417, -1488, 531, 647, -1348, -1898, -424, -84, -1726, -2325, -805, -4, -1326, -2203, -944, 334, -265, -1128, -491, 392, 87, -248, 399, 605, -500, -973, 252, 850, -898, -2438, -1312, 278, -826, -3001, -2638, -626, -648, -2492, -2524, -520, -33, -1638, -1882, 275, 1305, -480, -1635, 189, 1912, 527, -1593, -1056, 717, 287, -1673, -2051, -999, -1061, -2231, -2324, -1447, -1636, -2632, -2221, -722, -607, -1833, -1722, 6, 675, -478, -896, 390, 975, -223, -860, 210, 612, -1023, -2111, -864, 157, -1471, -3322, -2376, -434]
2443d34n58j966K07K068M89j376j70J658O72j136k79J453N71j419q58J201Q78
2460A001j354j421O08J024p36j254L24Q95m11p71O68J089m64r81Q36J656k20j508
2478a019J92J768L03j600o12J287N74j392q63R99O48j288j000J081J142r86j336
2495b102Q67J664k99j432K40J542K63j108j45J062J56j001j48R86J3j236l07J160
2513A75L86j294o77J102Q36r06q06Q71R60p01q42Q29J066p17j191O43J424m53
2531G05j637L5J572K36j511n75J280O94j034p08R41P80p57o78Q26Q39o97r18O07
2550@R93m78j087K13Q80j98r03Q6P45k17p76L13R73k10j059K18J366J97j280l37
2570e61J334O51j147q64R22Q28q95j062O08R66o97j230M17J244k31j294L3J345
$$ y = [-434, -992, -2958, -2751, -683, -194, -1570, -1740, -82, 590, -546, -825, 628, 1199, -220, -1078, 123, 1001, -353, -1774, -1166, -142, -878, -2132, -1808, -913, -1324, -2095, -1427, -338, -802, -1783, -947, 709, 489, -1019, -827, 941, 1244, -356, -968, 319, 893, -499, -1362, -363, 285, -1003, -2003, -922, 220, -766, -2102, -1235, 429, 130, -1302, -1062, 480, 743, -365, -510, 552, 708, -293, -441, 545, 558, -678, -985, 175, 561, -733, -1410, -308, 528, -378, -1184, -313, 647, -54, -896, -67, 999, 282, -909, -266, 1158, 705, -932, -897, 675, 911, -600, -1175, 105, 799, -235, -943, -2, 778, 21, -657, 169, 1008, 311, -607, 0, 993, 515, -572, -359, 521, 323, -580, -494, 251, 34, -742, -429, 544, 334, -725, -507, 859, 1056, -224, -561, 773, 1424, 277, -587, 335, 1163, 268, -794, -186, 780, 83, -1147, -730, 514, 283, -1011, -978, 367]
2588C67L54j010l51R98O08o22l91O37L61o02l80N75K72q04n67O06M65p63p38N03
2608d82O95m80p04N04Q69l50q06N14J133j52j096J27J295J94j225n04J032N64
2626A128r78q57O01O91o88q49M41P59m29p97L83R20j54p70J86R11J00o49OP07
2646F62N4o51k2O48l1q58j72P86J49r74n00P71N61p42o90O20P78m47p25M59R03
2667E79k17q24K57R84rr35j07Q72K33q14l98O00L33o59m27M73L03n56l77N54M37
2688C02n55m82N76O43m06o14M35P59k80p16K66Q12j80q83O0R03K6j024l04Q87
2708B25L94q49o27O43O64n17o75L84O94k55n66K59O56j41n61J58O18p3n49K7N28
2729D37m7n80lN35p0o74j6O97M0q32k13Q71L91q26n33P87P61o14q13N15R57l01
$$ y = [367, 721, -289, -640, 358, 966, 344, -47, 590, 951, 349, -31, 544, 816, 12, -555, 51, 516, -247, -985, -482, 213, -267, -971, -467, 402, 52, -754, -240, 893, 741, -355, -228, 1067, 1261, 36, -468, 564, 1128, 150, -707, -106, 585, -103, -952, -511, 248, -181, -978, -595, 325, 171, -599, -413, 498, 598, -51, -45, 662, 716, 65, 43, 691, 660, -198, -370, 416, 565, -409, -909, -138, 423, -319, -1009, -389, 389, -58, -783, -324, 579, 362, -462, -205, 779, 770, -165, -272, 600, 833, 19, -379, 221, 554, -105, -532, -59, 244, -312, -689, -135, 302, -253, -735, -159, 484, 78, -536, -101, 658, 378, -338, -72, 740, 560, -323, -263, 640, 666, -358, -662, 225, 619, -230, -857, -214, 450, -67, -742, -358, 336, 81, -485, -226, 430, 289, -272, -114, 504, 431, -118, -91, 437, 390, -190, -193, 342, 272, -402, -418, 279, 319, -513, -726, 145, 536, -290, -823, -36, 725, 111, -702, -187, 770, 469]
2751D69r43J59R72Rr57k09Q45L02p99m61N92M37m81m92L49M17k67l19K72L27k73
2772e1k32L56K93l77k48M51L67m99m96N11O06m88q31L44R49k38j077o3J081K87
2792F45j059m97R40O98p54q02O24R22l79r21K23R52j1q40j90P12K66n54l31L38
2812a8J99k63j10J88n7k92J43M26j43n81J05P36M0p52j36Q15L21q00m51Q11O38
2833H19q02q64O58J034m85j264J18J268K06j213n35R67P11o70p36M39P13k35n54
2852d25J93N01j23m32J20L77q3l45J2K04q2j62J68N2m04j88N60M07o51p01N88
2873d14J029k98j168oJ235L92j090o00R04P51p39q43N70Q58n13r85K74J023r1
2892B89j063k19R29M68o61n69L96N43r3k80QP5n5J64K44k06m89J12N98K7o96k18
$$ y = [469, -474, -315, 657, 666, -291, -500, 345, 647, -152, -613, -21, 416, -65, -557, -208, 209, -58, -377, -105, 222, -51, -283, 73, 366, -11, -259, 192, 559, 60, -436, 75, 681, 193, -638, -294, 655, 417, -660, -723, 358, 645, -414, -911, 29, 727, -27, -829, -205, 717, 338, -583, -360, 592, 581, -259, -449, 263, 529, -25, -356, -18, 181, -82, -192, -4, -61, -353, -210, 216, 73, -508, -403, 333, 373, -379, -515, 300, 621, -179, -630, 181, 819, 17, -847, -189, 845, 360, -904, -786, 482, 688, -525, -1060, -93, 618, -52, -788, -349, 364, 129, -425, -232, 269, 146, -286, -166, 211, 128, -217, -205, -1, -83, -245, -77, -25, -429, -617, -57, 350, -301, -1002, -414, 615, 317, -851, -857, 378, 770, -320, -920, -16, 735, -4, -847, -277, 581, 68, -917, -643, 380, 289, -774, -993, -64, 404, -257, -826, -430, 113, 20, -260, -252, -177, -232, -68, 176, -30, -519, -407, 191, 218, -478, -696]
2914f96O39K66o46l62O59M67p12o07P23R05n81j108L19J343O8j289m33J097P29
2933G81q02q48M75P39k69o47J66N09j88m63J73N10j23m81O3M41M1l00J1J88j24
2954a48j42L24K36m80m84N04P67l72r96R6J105K13j012m83Q61O48o61o68N42P00
2974E50m52p47L82Q33k77r09N3R32J67q40l62O30M68m06l73K41K47j78o5K91Q
2995A93m08l8N60J62o12l22N32M33m71n02L81M75l80n10L83N93l64p37L10R18
3015E96j06r56j17R67L78p86n09O11N49m35n08L25M02l46m33L35M26l95n48L00
3035b50O09k09o12R0N88%m64J2M89k1m57R8N96l5o71j03P25K55p37m43N64M81
3057E05m73n90K89M88k75n06K76N12k64n49K70O81r7o78O6P47J50o25k03N61K08
$$ y = [-696, -57, 209, -437, -799, -140, 327, -385, -992, -269, 636, 55, -1053, -734, 609, 677, -612, -1045, 52, 781, -21, -869, -394, 345, 76, -571, -405, 104, -84, -547, -374, 136, 13, -468, -405, 36, 77, -223, -212, -24, -148, -290, 34, 270, -210, -694, -190, 577, 205, -791, -695, 410, 623, -389, -872, -11, 637, -24, -692, -150, 550, 98, -649, -267, 566, 289, -620, -567, 365, 532, -308, -670, -40, 428, 22, -351, -110, 137, -41, -106, 185, 193, -215, -253, 307, 469, -143, -465, 67, 500, 29, -473, -92, 383, 3, -507, -124, 469, 105, -632, -322, 596, 490, -466, -583, 384, 762, -24, -533, 78, 627, 192, -316, 9, 411, 65, -368, -33, 393, -2, -550, -250, 359, 150, -462, -372, 216, 216, -248, -236, 253, 232, -225, -127, 469, 434, -237, -340, 385, 640, -97, -540, 24, 505, 32, -558, -269, 219, -56, -562, -286, 226, -38, -587, -317, 364, 267, -411, -345, 402, 552, -73, -276, 285, 493]
3078D93n04k42M25J56n70l12N07K99n81n17M53N87l33o12K59O56m3m87J32N85
3098C51j3m68P8N75j2o38r4N70J15o77l57M38K57m90l97L50L20l51l11M29M52
3119A27k99l58M41O55j90n53J73O61m0o16r0M85k6o26j82M30J7o29k35N30K82
3140d3n51l38N43N57k73l71L78O00j33l81K11M96j63n27Q1M46j78o57j32M31J2
3161Hn70k36M21J89l63j31M50K70k77p7N35L60l41k98M40M20l38n13J77L96k91
3182B31o15K8M18j87n98K6N79M6n56r3O67L77m08k53N10M95k62l79K50L61k36
3203D01m32J07K51k65m76M7L32j50m16M5L97M7l02J04M29N5k73J20N09M2n18q1
3225b7N15J50o05m18L82L41m61n56K27M76j94m75J67N59K4m35O7N93J92m16j57
$$ y = [493, -11, -253, 172, 328, -242, -554, -47, 252, -329, -846, -393, 194, -139, -751, -492, 164, 121, -366, -234, 351, 338, -130, -52, 523, 511, -127, -221, 349, 464, -213, -570, -132, 125, -365, -762, -412, -92, -443, -754, -325, 127, -172, -530, -89, 566, 376, -177, -4, 657, 617, 1, -89, 396, 370, -256, -438, -8, 9, -620, -855, -325, -43, -594, -932, -389, 168, -105, -476, -98, 502, 369, -12, 199, 695, 532, 5, 86, 532, 354, -303, -435, -4, 8, -562, -798, -377, -188, -551, -682, -232, 38, -239, -316, 219, 579, 238, -60, 380, 800, 462, -51, 126, 522, 231, -384, -356, 62, -125, -723, -697, -118, -72, -628, -721, -54, 323, -85, -338, 172, 667, 405, 26, 276, 637, 401, -31, 76, 327, 62, -414, -367, -35, -185, -601, -556, -159, -112, -414, -310, 119, 174, -99, 21, 530, 572, 54, -27, 488, 638, 33, -385, -3, 338, -123, -679, -452, 24, -170, -645, -478, 81, 105, -330, -263, 330, 522, 106, -51]
3246e1M30K45l42l32J65J33k56k59Q8M6k78j50K64J69k71j59M02L87j76k53L24
3267A26M73j46l93J60M40j59o09n2M60l9o86k90M77K73m80m19L74N12j25l35K26
3288b12N02N3k51J12L61Nk77l0K18j06l56j19J06j12l30m8J91r7k86R1M24O3l23
3311d21N6O07L15l97k23N01M40l39n23J98M52k51o57q0M09m5n73k24M14K23l68
3332d86k31L87L67q2j73K49L32lj10J28J45j16j52J03J2k91k33J23R7l48l09K14
$$ y = [-51, 379, 624, 282, -50, 115, 248, -8, -267, -179, -133, -411, -561, -297, -128, -399, -558, -156, 231, 55, -198, 126, 599, 453, 60, 220, 660, 501, -108, -160, 300, 261, -425, -715, -238, 35, -445, -864, -490, 22, -103, -438, -212, 290, 343, 92, 204, 565, 570, 293, 263, 481, 375, 19, -100, 6, -106, -436, -484, -293, -390, -676, -585, -161, -98, -421, -365, 242, 557, 160, -63, 438, 878, 539, 16, 214, 666, 415, -242, -322, 87, 42, -531, -755, -341, -118, -486, -717, -330, 37, -45, -218, 31, 363, 360, 250, 378, 523, 407, 255, 358, 370, 79, -154, -31, 66, -282, -591, -377]
$$ [...]
8191i
##END NTUPLES=NMR FID
##END=
