##TITLE=c13 ikalashn
LR-789-O-C1
12.12.2024
##JCAMPDX= 6.0         $$ Bruker NMR JCAMP-DX V2.0
##DATA TYPE= NMR SPECTRUM
##DATA CLASS= NTUPLES
##ORIGIN= UXNMR, Bruker Analytische Messtechnik GmbH
##OWNER= root
$$ TOPSPIN		Version 1.3
$$ 2024-12-11 10:00:06.718 +0400  Irina@DPX200
$$ Compression mode = diff/dup
##.OBSERVE FREQUENCY= 50.3282639994
##.OBSERVE NUCLEUS= ^13C
##.ACQUISITION MODE= SIMULTANEOUS
##.ACQUISITION SCHEME= undefined
##.AVERAGES= 18900
##.DIGITISER RES= 17
##SPECTROMETER/DATA SYSTEM= spect
##.PULSE SEQUENCE= zgpg
##.SOLVENT NAME= CDCl3
##.SHIFT REFERENCE= INTERNAL, CDCl3, 1, 234.9338
##AUDIT TRAIL= $$ (NUMBER, WHEN, WHO, WHERE, WHAT)
$$ ##TITLE= Audit trail, TOPSPIN		Version 1.3
$$ ##JCAMPDX= 5.01
$$ ##ORIGIN= Bruker BioSpin GmbH
$$ ##OWNER= Irina
$$ $$ F:/spectra/data/iren/nmr/c13zvl/1/pdata/1/auditp.txt
$$ ##AUDIT TRAIL=  $$ (NUMBER, WHEN, WHO, WHERE, VERSION, WHAT)
(   1,<2024-12-11 09:57:55.125 +0400>,<Irina>,<DPX200>,<TOPSPIN 1.3>,
      <created by zg
	started at 2024-12-10 16:17:03.468 +0400,
	POWCHK disabled, PULCHK disabled
       terminated by command 'halt'
       configuration hash MD5:
       BE 6D 3F 07 2A EA 11 49 91 17 2B D3 AF B3 58 0D
       data hash MD5: 32K
       97 4B C2 2B CF 5B B3 73 5A 44 43 9E 75 B1 CE D2>)
(   2,<2024-12-11 09:59:41.734 +0400>,<Irina>,<DPX200>,<TOPSPIN 1.3>,
      <Start of raw data processing
       efp BC_mod = 2 LB = 1.3 FT_mod = 6 PKNL = 1 PHC0 = 149.7335 PHC1 = 9.225397 SI = 32K 
       data hash MD5: 32K
       CE E5 7F 43 A7 92 B4 FE 88 A8 A8 8E 69 F6 EC 0A>)
(   3,<2024-12-11 09:59:44.218 +0400>,<Irina>,<DPX200>,<TOPSPIN 1.3>,
      <apk 
       data hash MD5: 32K
       36 0E C0 28 1F 2B 5D EB 22 57 A3 28 A6 80 49 BB>)
(   4,<2024-12-11 09:59:45.906 +0400>,<Irina>,<DPX200>,<TOPSPIN 1.3>,
      <abs n ABSG = 5 
       data hash MD5: 32K
       16 29 F0 42 BB 33 AA 0A C9 3D 46 A8 5E B0 02 D5>)
$$ ##END=
$$ 
$$ $$ hash MD5
$$ $$ 8F 18 6D B2 9A 23 67 98 25 CC C2 62 08 2C 97 DA
##$RELAX= 
##$RELAX= 
##$RELAX= 
##$RELAX= 
##$RELAX= 
##$RELAX= 
##$RELAX= 
##$RELAX= 
##$RELAX= 
$$ Bruker specific parameters
$$ --------------------------
##$DU= <F:/spectra>
##$EXPNO= 1
##$NAME= <c13zvl>
##$PROCNO= 1
##$TYPE= <nmr>
##$USER= <iren>
##$AMP= (0..31)
100 100 100 100 100 100 100 100 100 100 100 100 100 100 100 100 100 100 
100 100 100 100 100 100 100 100 100 100 100 100 100 100 
##$ANAVPT= -1
##$AQSEQ= 0
##$AQ_mod= 1
##$AUNM= <au_zg>
##$AUTOPOS= <>
##$BF1= 50.322709
##$BF2= 200.13
##$BF3= 200.13
##$BF4= 200.13
##$BF5= 200.13
##$BF6= 200.13
##$BF7= 200.13
##$BF8= 200.13
##$BYTORDA= 1
##$CFDGTYP= 0
##$CFRGTYP= 5
##$CHEMSTR= <none>
##$CNST= (0..63)
1 1 145 1 1 1 1 1 1 1 1 1 1 1 1 1 1 1 1 1 1 1 1 1 1 1 1 1 1 1 1 1 1 1 
1 1 1 1 1 1 1 1 1 1 1 1 1 1 1 1 1 1 1 1 1 1 1 1 1 1 1 1 1 1 
##$CPDPRG= <waltz16>
##$CPDPRG1= <>
##$CPDPRG2= <waltz16>
##$CPDPRG3= <>
##$CPDPRG4= <mlev>
##$CPDPRG5= <mlev>
##$CPDPRG6= <mlev>
##$CPDPRG7= <mlev>
##$CPDPRG8= <mlev>
##$CPDPRGB= <>
##$CPDPRGT= <>
##$D= (0..63)
$$ [...]
##$SW= 249.617472808154
##$SWIBOX= (0..15)
0 1 3 0 0 0 0 0 0 0 0 0 0 0 0 0 
##$SW_h= 12562.8140703518
##$TD= 32768
##$TD0= 1
##$TE= 300
##$TE2= 300
##$TE3= 300
##$TEG= 300
##$TL= (0..7)
120 120 120 120 120 120 120 120 
##$TP= (0..7)
150 150 150 150 150 150 150 150 
##$TP07= 0
##$TPNAME0= <>
##$TPNAME1= <>
##$TPNAME2= <>
##$TPNAME3= <>
##$TPNAME4= <>
##$TPNAME5= <>
##$TPNAME6= <>
##$TPNAME7= <>
##$TPOAL= (0..7)
0.5 0.5 0.5 0.5 0.5 0.5 0.5 0.5 
##$TPOFFS= (0..7)
0 0 0 0 0 0 0 0 
##$TUNHIN= 0
##$TUNHOUT= 0
##$TUNXOUT= 0
##$USERA1= <user>
##$USERA2= <user>
##$USERA3= <user>
##$USERA4= <user>
##$USERA5= <user>
##$V9= 5
##$VALIST= <valist>
##$VCLIST= <CCCCCCCCCCCCCCC>
##$VD= 0
##$VDLIST= <DDDDDDDDDDDDDDD>
##$VPLIST= <PPPPPPPPPPPPPPP>
##$VTLIST= <TTTTTTTTTTTTTTT>
##$WBST= 1024
##$WBSW= 4
##$XGAIN= (0..3)
0 0 0 0 
##$XL= 0
##$YL= 0
##$YMAX_a= 4424565
##$YMIN_a= -24639541
##$ZGOPTNS= <>
##$ZL1= 120
##$ZL2= 120
##$ZL3= 120
##$ZL4= 120
##$ABSF1= 234.9338
##$ABSF2= -14.71115
##$ABSG= 5
##$ABSL= 3
##$ALPHA= 0
##$AQORDER= 0
##$ASSFAC= 0
##$ASSFACI= 0
##$ASSFACX= 0
##$ASSWID= 0
##$AUNMP= <proc_1d>
##$AXLEFT= 0
##$AXRIGHT= 0
##$AXTYPE= 0
##$AXUNIT= <>
##$AZFE= 0.1
##$AZFW= 0.5
##$BCFW= 0
##$BC_mod= 2
##$BYTORDP= 0
##$COROFFS= 0
##$CY= -3
##$DATMOD= 1
##$DC= 0
##$DFILT= <>
##$DTYPP= 0
##$F1P= 0
##$F2P= 0
##$FCOR= 0.5
##$FTSIZE= 32768
##$FT_mod= 6
##$GAMMA= 0
##$GB= 0
##$INTBC= 1
##$INTSCL= 4.98009e-010
##$ISEN= 30
##$LB= 1.3
##$LEV0= 0
##$LPBIN= 0
##$MAXI= 7.640843
##$MC2= 0
##$MEAN= 0
##$ME_mod= 0
##$MI= 1.154659
##$NCOEF= 0
##$NC_proc= -4
##$NLEV= 6
##$NOISF1= 0
##$NOISF2= 0
##$NSP= 0
##$NTH_PI= 0
##$NZP= 0
##$OFFSET= 234.9338
##$PC= 1.4
##$PHC0= 151.3536
##$PHC1= 9.814398
##$PH_mod= 1
##$PKNL= yes
##$PPARMOD= 0
##$PPDIAG= 0
##$PPIPTYP= 0
##$PPMPNUM= 100
##$PPRESOL= 1
##$PSCAL= 0
##$PSIGN= 0
##$REVERSE= no
##$SF= 50.3227228988183
##$SI= 32768
##$SIGF1= 0
##$SIGF2= 0
##$SINO= 80
##$SIOLD= 32768
##$SREGLST= <13C.CDCl3>
##$SSB= 0
##$STSI= 32768
##$STSR= 0
##$SW_p= 12562.8140703518
##$SYMM= 0
##$S_DEV= 0
##$TDeff= 32768
##$TDoff= 0
##$TI= <>
##$TILT= no
##$TM1= 0
##$TM2= 0
##$TOPLEV= 0
##$USERP1= <user>
##$USERP2= <user>
##$USERP3= <user>
##$USERP4= <user>
##$USERP5= <user>
##$WDW= 1
##$XDIM= 32768
##$YMAX_p= 325965179
##$YMIN_p= -2757827
$$ End of Bruker specific parameters
$$ ---------------------------------
##NTUPLES= NMR SPECTRUM
##VAR_NAME=  FREQUENCY,     SPECTRUM/REAL,   SPECTRUM/IMAG
##SYMBOL=    X,             R,               I
##VAR_TYPE=  INDEPENDENT,   DEPENDENT,       DEPENDENT
##VAR_FORM=  AFFN,          ASDF,            ASDF
##VAR_DIM=   32768,         32768,           32768
##UNITS=     HZ,            ARBITRARY UNITS, ARBITRARY UNITS
##FACTOR=    0.383398360251222, 1,           1
##FIRST=     12562.8140703518, -283261,      190380725
##LAST=      0,             427963,          -117653984
##MIN=       0,             -2757827,        0
##MAX=       12562.8140703518, 325965179,    0
$$ Real data points
##PAGE= N=1
##DATA TABLE= (X++(R..R)), XYDATA
$$ [...]
##PAGE= N=2
##DATA TABLE= (X++(I..I)), XYDATA
21319B07695516M51902K54041K28259M37457K95050m1722j46603p9449j77043
21310B08917408l7648N8028j03572K1317j0991l78654m87956j13939M00877N25065
21300B08789935L54904L1942k95116m20839k27715k8917m535k8883j74556k2508
21290B07973712J40793J36215Q8024n9638m58559k13334J80784J35647o8196J6907
21280B07872355P676r2401L1890J34864j58121L7674L53700K28292J244M7166
21270B08464339j0388k23069r8814R6979J51123j55506k15044j76388j39917Q1509
21260B07774824K5831m151J89364K59348K7295k8984N8593m4472r7860l32188
21250B07827600l52910o7413K31511L16282M05024J63074l16110l77724l31450
$$ plain form
21319 207695516 208147418 208401459 208629718 209067175 209362225 209320503 209173900 209094451 208917408
21310 208917408 208879760 208937788 208834216 208855533 208844542 208465888 207977932 207863993 208264870 208789935
21300 208789935 209144839 209176781 208881665 208460826 208233111 208204194 208199659 208170776 207996220 207973712
21290 207973712 208114505 208250720 208338744 208279106 207820547 207607213 207787997 207923644 207855448 207872355
21280 207872355 207880031 207787630 207819520 207954384 207796263 207833937 208187637 208415929 208417173 208464339
21270 208464339 208453951 208230882 208132068 208229047 208380170 208224664 208009620 207833232 207693315 207774824
21260 207774824 207800655 207796504 207985868 208245216 208272511 208243527 208302120 208257648 208159788 207827600
21250 207827600 207474690 207407277 207638788 207955070 208360094 208523168 208207058 207829334 207497884
21241B07497884l04336k74718j21395J67786L22479j8516m51930l69108N6054
21232B06504200N81033M06605L5717O3978L28820K34458m1843k16873p5268L46837
21222B08167664L91609L1278l02607m01034k31031j16045j41716R0795J86067
21213B07674980K24846J05846j90057j93941K05130K63088j46440k98357j42099
21204B07502996k46782k19556j05875j68092k7793J91651R3888j66547j00368
21195B06753522J17048L98092L89387j15119m90853m14258m3792J93979M39473
21186B07227479M20434J74860K0868N7169j28658k94115l12618k35195M8523J94221
21176B07172968K5307j32333j17031K17761K25260j16692l02098k62150k8694
$$ plain form
21241 207497884 207193548 206918830 206797435 206965221 207287700 207269184 206817254 206448146 206504200
21232 206504200 207085233 207491838 207527555 207591533 207920353 208154811 208112968 207896095 207820827 208167664
21222 208167664 208559273 208590551 208287944 207886910 207655879 207539834 207398118 207488913 207674980
21213 207674980 207899826 208005672 207815615 207621674 207826804 208089892 207943452 207645095 207502996
21204 207502996 207256214 207036658 206930783 206762691 206734898 206926549 207020437 206853890 206753522
21195 206753522 206870570 207268662 207658049 207542930 207052077 206637819 206594027 206788006 207227479
21186 207227479 207647913 207822773 207843641 207900810 207772152 207478037 207165419 206930224 206978747 207172968
21176 207172968 207198275 207065942 206948911 207166672 207391932 207275240 206973142 206710992 206682298
21167B06682298L40335O09545N06135K67831n5382k08399j10972k04902l46559
21158B07479930m17462k21026K02415L08445k0759m73586l53815J95360J79929
21149B06879431J7190L8522J74281M04448K20045J12711j68597l93877j46064
21140B07138090J27753k3195j74254j18675P6383J30907l26085k60279L68012
21131B06938657M99064J84551q2237j35413J47979J97006p3086l92767l71614
21122B06912140m9684K20193L93424J94217n1741k32083k52657k12411j11751
21113B06809647k23496l00762j82056P1938L82861J60427j67483l90765k45491
21104B05914820J66071J39391K35704L19421J00048O5123P6424J56003n6834k40521
$$ plain form
21167 206682298 207022633 207632178 208138313 208406144 208350762 208142363 208031391 207826489 207479930
21158 207479930 207062468 206841442 207043857 207352302 207331543 206857957 206504142 206699502 206879431
21149 206879431 206896621 206935143 207109424 207513872 207733917 207846628 207678031 207284154 207138090
21140 207138090 207265843 207242648 207068394 206949719 207026102 207157009 206830924 206570645 206938657
21131 206938657 207437721 207622272 207540035 207404622 207552601 207749607 207676521 207283754 206912140
21122 206912140 206862456 207082649 207476073 207670290 207618549 207386466 207133809 206921398 206809647
21113 206809647 206586151 206285389 206103333 206175271 206558132 206718559 206551076 206160311 205914820
21104 205914820 206080891 206220282 206455986 206775407 206875455 206940578 207017002 207173005 207116171 206875650
21094B06875650j77300K07222K63136N5629J9565k1260J21485J23501j33030j12413
21084B07222185q985r6541j17218J12299r0826m7445J21294M5731j50385k62245
21074B06727864j61183Q9149L1479K7030J91967P3250k07972l43491k24035j09487
21064B06094571k4784K6475M0797K21014L63222L40054K46186l6215Q7651J17095
21054B07476066k64251k34235q9930k37739m7277L33444M56438J41104P4679Q9590
21044B07697889o0211k35696j51170N5402K29038K30437n7393j57999j90866k74733
21034B07084698l91134l83927l07107k27812O3873L88816L54738J99386J73438
21025B06954969j87428l56965k08473N8019K74268L47402K81837J05338j70905
$$ plain form
21094 206875650 206698350 206905572 207168708 207224337 207243902 207222642 207344127 207467628 207334598 207222185
21084 207222185 207213200 207116659 206999441 207111740 207020914 206973469 207094763 207140494 206990109 206727864
21074 206727864 206566681 206655830 206687309 206714339 206906306 206979556 206771584 206428093 206204058 206094571
21064 206094571 206069787 206096262 206137059 206358073 206721295 207061349 207307535 207271320 207358971 207476066
21054 207476066 207211815 206977580 206887650 206649911 206602634 206936078 207392516 207533620 207608299 207697889
21044 207697889 207637678 207401982 207250812 207306214 207535252 207765689 207708296 207550297 207359431 207084698
21034 207084698 206693564 206309637 206002530 205774718 205838591 206227407 206582145 206781531 206954969
21025 206954969 206767541 206410576 206202103 206260122 206534390 206881792 207163629 207268967 207098062
21016B07098062k86941l5640L31403M31810N3507k33248k65423l54206l09388
21007B06429936k31493p1331N269j6042J06932K35812L37941L30180j27495k48064
20997B06751645j76792k58146k03270k03719j52656L9933J32872L80121N95464
20988B06905452N45966L01325J09342j69633l83700k79829k09935j97462l9897
20979B06581629J20393J40312L9167P1826J00016j33893r0927O355L9273m4148
20969B06830003l35368l72181j66543O039J4172P5503o9625o0113r3533j69905
20959B05658449J42333K89518o3409j94042L7001K32068R9442K5581m4883j91366
20949B05990692L6682J77894J30209K89373J7331m91021l06664r7022K36751N52741
$$ plain form
21016 207098062 206811121 206775481 207106884 207538694 207592201 207358953 207093530 206739324 206429936
21007 206429936 206198443 206127112 206132381 206116339 206223271 206459083 206797024 207127204 206999709 206751645
20997 206751645 206574853 206316707 206113437 205909718 205757062 205796995 205929867 206309988 206905452
20988 206905452 207451418 207752743 207862085 207692452 207308752 207028923 206818988 206621526 206581629
20979 206581629 206702022 206842334 206881501 206953327 207053343 206919450 206828523 206834878 206874151 206830003
20969 206830003 206494635 206122454 205955911 205961950 205976122 206051625 205982000 205921887 205828354 205658449
20959 205658449 205800782 206090300 206026891 205832849 205869850 206101918 206201360 206226941 206182058 205990692
20949 205990692 206027374 206205268 206335477 206624850 206642181 206151160 205844496 205747474 205984225 206536966
20939B06536966J00941k94812j24028M9147l4775k13798k87762k68139k71303
20930B05192437L6816L98852L20360R907j1579J45128R9874j68642j90917r3644
20920B05738592j33312m7387K29297L51847L09474J42382m6336L85Q9081j87111
20910B06446912l79654k73819j88410o2926R5186P4368j56659j62246j55719J92746
20900B05429779L74916J28439j08506j23759n6389o6270O294o4539k08299Q0124
20890B05391790L70342L10204J85478j86493l09721j38741K43958L34063J57165
20881B06358045l1891j25466M4165K47986J20947k31701j19496J05912N7878P4441
20871B06500820R5610P7783j00645k28395m0394K7439J84365J83940j03180n23972
$$ plain form
20939 206536966 206637907 206343095 206219067 206268214 206233439 206019641 205731879 205463740 205192437
20930 205192437 205229253 205628105 205948465 205958372 205946793 206091921 206191795 206023153 205832236 205738592
20920 205738592 205605280 205557893 205787190 206139037 206448511 206590893 206544557 206544942 206634023 206446912
20910 206446912 206067258 205793439 205605029 205542103 205637289 205711657 205554998 205392752 205237033 205429779
20900 205429779 205804695 205933134 205824628 205700869 205644480 205578210 205584504 205519965 205311666 205391790
20890 205391790 205762132 206072336 206257814 206071321 205761600 205622859 205866817 206200880 206358045
20881 206358045 206326154 206200688 206244853 206492839 206613786 206382085 206262589 206368501 206426379 206500820
20871 206500820 206596430 206674213 206573568 206345173 206304779 206332218 206516583 206700523 206597343 206073371
20861B06073371n08809j03014P2404J9883J45267L9990o4384J01145J02929j43486
20851B05735296j56097p669R3593K28634J68955J16647J07732N1837Q9232J9873
20841B06448033j62029j98695k4471o9488J22605K89414J8439j42448j8525j2112
20831B06250723l20962n67940p2302L21665k4308k16755l18640l62059j88783
20822B04500639p7705l642L40214P44283O01978L18718J867k33205k87307Q4147
20812B05989987L7199n06257n57329r8575J40573K50721J96321Q9357R5556P3005
20802B05710558N1634R9524R3889j32874r9291j15744l97597j93350N4965P396
20792B05079110J6679j32978j21938O2250N50j01254K7469j33296k41580J69789
$$ plain form
20861 206073371 205564562 205461548 205533952 205553835 205699102 205739092 205674708 205775853 205878782 205735296
20851 205735296 205579199 205571530 205665123 205893757 206062712 206179359 206287091 206338928 206428160 206448033
20841 206448033 206286004 206087309 206062838 205993350 206115955 206405369 206423808 206281360 206262835 206250723
20831 206250723 205929761 205361821 205289519 205611184 205586876 205370121 205051481 204689422 204500639
20822 204500639 204422934 204419292 204759506 205503789 206105767 206424485 206426352 206193147 205905840 205989987
20812 205989987 206027186 205520929 204963600 204865025 205005598 205256319 205452640 205541997 205637553 205710558
20802 205710558 205762192 205861716 205955605 205822731 205723440 205607696 205210099 205016749 205071714 205079110
20792 205079110 205095789 204962811 204840873 204903123 204903673 204802419 204829888 204696592 204455012 204624801
20782B04624801L92169L56821p617j93084r2289q6113J32489K74695J71103J85708
20772B05758683O0631Q9104J92947L673O6065j32232l84766m32287k85603k09273
20762B04726942k6379q2248k75269j31227L10278O94811K44126j55422m8312j25210
20752B05132090m8423o5662j9318n0868M241J33053N1242j0113J45440K2486j29587
20741B05164581L36222N28416K19320n3440l6625j13471k10026j91545j8919J45609
20731B05770122r7557k30048j08352j19772j76715r1998O401J16874R4789k07557
20721B04956187j77864N1386K36364J17171l48518l12987O5904Q6594J8039J46776
20711B04839052J83283K04843P8768m9297j86295j13156Q8385J0270j2474l3069
$$ plain form
20782 204624801 205016970 205373791 205366174 205173090 205080801 204994688 205127177 205401872 205572975 205758683
20772 205758683 205819314 205908418 206101365 206105038 206171103 206038871 205654105 205221818 204936215 204726942
20762 204726942 204700563 204618315 204343046 204211819 204522097 205216908 205461034 205305612 205257300 205132090
20752 205132090 205083667 205018005 204998687 204947819 204952060 205085113 205136355 205126242 205271682 205294168 205164581
20741 205164581 205500803 206029219 206248539 206195099 206158474 206045003 205834977 205643432 205624513 205770122
20731 205770122 205672565 205442517 205334165 205214393 205037678 204945680 204952081 205068955 205163744 204956187
20721 204956187 204778323 204829709 205066073 205183244 204834726 204521739 204587643 204674237 204692276 204839052
20711 204839052 205022335 205227178 205305946 205256649 205070354 204957198 205045583 205055853 205043379 205010310
20701B05010310J8468K47949M41171K52579o4609l63020l02672P3340K03305L55902
20691B05872723J31334k40685J8065j47374n98729m34803l6331Q0797p7574L4705
20681B04602128K36951K39944K11584K27692J88504K8958j36521k93972l22597
20672B04982671j61124R3016J96305j8199o7087O3423r3690j51039K7130o3650
20662B04807756k28764l01253j92997m9589k56882q9331L81386N94498M32623
20653B05097447K41607J70859l5720k31403k87619l60268k61964r5499j87519
20644B04049921j30050O9887P6147k3325k11979k01909J35374N51144O25458R6963
20634B05037631k74353k14507j82349k04733l1146L51612M20267J59729j03652
$$ plain form
20701 205010310 205028778 205276727 205717898 205970477 205905868 205542848 205240176 205313516 205516821 205872723
20691 205872723 206004057 205763372 205781437 205634063 205035334 204600531 204564200 204644997 204567423 204602128
20681 204602128 204839079 205079023 205290607 205518299 205706803 205735761 205599240 205305268 204982671
20672 204982671 204821547 204914563 205110868 205092669 205025582 205089005 204995315 204844276 204871406 204807756
20662 204807756 204578992 204277739 204084742 204035153 203778271 203688940 204070326 204664824 205097447
20653 205097447 205339054 205509913 205474193 205242790 204955171 204594903 204332939 204237440 204049921
20644 204049921 203919871 203989758 204065905 204042580 203830601 203628692 203764066 204315210 204940668 205037631
20634 205037631 204763278 204548771 204366422 204161689 204130543 204482155 204902422 205062151 204958499
20625B04958499j21554J2584J17822K04537j56938l75609k75365k00527J72738
20616B04336187L66299K02627O0245O5200K99898J48863k09390m01683l09357
20607B04558889O0224K83720K03757j20030l84488l73632r4702J17488K11077
20598B04462303M7667k63028k72942j19989j18758j32617n0257L3576J03176K88400
20588B03977531N6640J25140L94670J78704k3271j58822p3491J0581j26897k40725
20578B04120060N9964J46944J59818K34600J7423k66785k80624k71682M8494M77455
20568B04445667O08451K74459k79314m95359k65021j10504j90809j31762q7984
20559B03767824J09164J61055J20600J84214J31128R6890L67115K60864j28712
$$ plain form
20625 204958499 204836945 204849529 204967351 205171888 205014950 204639341 204363976 204163449 204336187
20616 204336187 204702486 204905113 204965358 205030558 205330456 205479319 205269929 204868246 204558889
20607 204558889 204619113 204902833 205106590 204986560 204602072 204228440 204133738 204251226 204462303
20598 204462303 204509970 204246942 203974000 203854011 203735253 203602636 203552379 203585955 203689131 203977531
20588 203977531 204034171 204159311 204553981 204732685 204709414 204550592 204477101 204487682 204360785 204120060
20578 204120060 204180024 204326968 204486786 204721386 204738809 204472024 204191400 203919718 203968212 204445667
20568 204445667 205054118 205328577 205049263 204553904 204288883 204178379 203987570 203855808 203767824
20559 203767824 203876988 204038043 204158643 204342857 204473985 204570875 204937990 205198854 205070142
20550B05070142O545n8159m9405K54239K56126j34078l56129k18028j6222k6289
20540B04728742K96220L91999J5767k25174k62723j51369q2423j76529k62755
20531B04271755j79891Q8587J38186Q8216J20129M04856M07795j29725l30918
20522B04878990l51656k63609m4872Q2339l5554k24086j27408J30518O9807J54938
20512B04269407J97765M6195O78J27975J74420J41525R982k55168j68218J36814
20502B04681375K54576K43012l8830l18926m29612l76548k35153j11143O2158
20493B03730909K25148K63377P5123n2278j4772p387r8033j21672j73869k12725
20483B03613821j19930N6033J18592J11214J9631J20462Q1939l0220j207j75915
$$ plain form
20550 205070142 205076687 205018528 204969123 205223362 205479488 205345410 204989281 204771253 204755031 204728742
20540 204728742 205024962 205416961 205432728 205207554 204944831 204793462 204711039 204534510 204271755
20531 204271755 204091864 204180451 204318637 204406853 204526982 204931838 205339633 205209908 204878990
20522 204878990 204527334 204263725 204218853 204301192 204265638 204041552 203914144 204044662 204114469 204269407
20512 204269407 204467172 204513367 204514045 204642020 204816440 204957965 204967947 204712779 204544561 204681375
20502 204681375 204935951 205178963 205140133 204821207 204391595 204015047 203779894 203668751 203730909
20493 203730909 203956057 204219434 204294557 204242279 204227507 204220120 204122087 204000415 203826546 203613821
20483 203613821 203493891 203549924 203668516 203779730 203799361 203919823 204001762 203971542 203970335 203794420
20473B03794420q0058j17006p8111Q2041K15492L96160K67780J60526M2820j40645
20463B04543419j06524n7543k7569l8268n3905k45408l28526n7230J04662l9546
20453B03693562k03424j03863L2004P3119J30533J88660J69771J01043P9206J23122
20443B04283733K46338J97530k71745m84152l46110l69782q6957K83346J95875
20434B03648076j26950j99799j42616j2939K22261L70055M27899J46307l96917
20425B03935377m39593j41632J16084K06489K1642k74421l15470J3202K97924
20416B03419602K05149P4362J48674K52944N2520j50463K0316l3194j03295J9703
20406B03906318K69662J14519l25399k71447l370j66373k58765J61677N0900j87966
$$ plain form
20473 203794420 203714362 203597356 203519245 203601286 203816778 204212938 204480718 204641244 204684064 204543419
20463 204543419 204436895 204379352 204351783 204313515 204259610 204014202 203685676 203628446 203733108 203693562
20453 203693562 203490138 203386275 203418279 203491398 203621931 203810591 203980362 204081405 204160611 204283733
20443 204283733 204530071 204727601 204455856 203971704 203625594 203255812 203168855 203452201 203648076
20434 203648076 203521126 203321327 203178711 203165772 203388033 203758088 204185987 204332294 203935377
20425 203935377 203495784 203354152 203470236 203676725 203698367 203423946 203108476 203121678 203419602
20416 203419602 203624751 203699113 203847787 204100731 204153251 204002788 204023104 203989910 203886615 203906318
20406 203906318 204175980 204290499 203965100 203693653 203690283 203523910 203265145 203426822 203477722 203289756
20396B03289756m1792M38546M86571L7066k96627m8138M01604L30158P6083j68694
20386B04504533m35929m30964r2953L3607p7890k63629k43759p9062J23969J78656
20376B03216579O2692j60035j57023L7877K64800K40193J0396J55189K51216J68870
20366B04090754K04820L2194j05196j64182m8758J86881K37647Q2154k32297l41535
20356B03942482l53298m85981l81030M0708K19299J87641n409Q639J25852N1789
20346B03350692J26321J47496j25232l15886l91404k05682L18644P30968M19633
20337B04055550p8448r8631q9824j50334L5659M0497j594q0779q9449j43646l56709
20326B03042292l51201K7770N65604L87872P3264M7527Q4296R1944n7711k20872
$$ plain form
20396 203289756 203247964 203686510 204173081 204210147 203913520 203865382 204266986 204597144 204673227 204504533
20386 204504533 204068604 203637640 203544687 203578294 203500404 203236775 202993016 202913954 203037923 203216579
20376 203216579 203279271 203119236 202962213 203000090 203264890 203505083 203515479 203670668 203921884 204090754
20366 204090754 204295574 204327768 204222572 204058390 204009632 204196513 204434160 204516314 204284017 203942482
20356 203942482 203589184 203103203 202722173 202762881 202982180 203169821 203164412 203173051 203298903 203350692
20346 203350692 203477013 203624509 203499277 203183391 202791987 202586305 202904949 203635917 204055550
20337 204055550 203977102 203878471 203788647 203638313 203673972 203714469 203712875 203632096 203542647 203399001 203042292
20326 203042292 202691091 202718861 203284465 203672337 203745601 203793128 203877424 203969368 203911657 203690785
20316B03690785l96623k31469K246J70452K52935Q6642O6137L1203n1988k7687
20306B03592633J05983j2396o3148J04731J53534J53084J05264P698n9551r7886
20296B03989946k35076k31376p7268q8982p3551j67813k95688j56039K8864J17324
20286B02810341J34523r3612m6114J22227K4197o7580J12123L01949o8135l75901
20276B02854018j13609j2733N692J79885K16795J08882o3384m7090K43388O25130
20266B03996974L64758j38154l24966l26532Q4499K76664K69670j2990k69205
20257B03920718k37209J38074K23489j06791p007J73210J15481P5236j15426l34588
20247B03845187l09463j58447r7265O0828K07593M2941j11852q8184n8627j10906
$$ plain form
20316 203690785 203294162 203062693 203064939 203235391 203488326 203574968 203641105 203672308 203620320 203592633
20306 203592633 203698616 203686220 203623072 203727803 203881337 204034421 204139685 204147383 204087832 203989946
20296 203989946 203754870 203523494 203446226 203357244 203283693 203115880 202820192 202664153 202693017 202810341
20286 202810341 202944864 202851252 202805138 202927365 202951562 202883982 202996105 203298054 203229919 202854018
20276 202854018 202740409 202727676 202733368 202913253 203130048 203238930 203175546 203128456 203371844 203996974
20266 203996974 204361732 204223578 203898612 203572080 203656579 203933243 204202913 204189923 203920718
20257 203920718 203683509 203821583 204045072 203938281 203931274 204104484 204219965 204295201 204179775 203845187
20247 203845187 203535724 203377277 203280012 203340840 203548433 203591374 203479522 203391338 203332711 203221805
20237B03221805j73502j2517k9933k2618J91522k8934j78968j37570J14332J51596
20227B03095213j6081j07844l2751J11528L61596M45433K07670O3760j81279r6387
20217B03850858O9711M9659O426j35070j79081j77077l07603j98200j2401r7934
20207B02869288j60785K3014K48202J70391j97054m76784j42733J48215k6006
20198B02455748J7532J72388K45861L32059K04225m0825j63784j42563j0076j77702
20188B02892863k70186J15262L16076L19463K53385L5619j89332k61070j27819
20179B03084261j1349J24850K07663J51274j92219l92748l7585K90343L79331
20170B03603821J40241k3206o5055j68707k87725l89186l13767L4014N1009k7035
$$ plain form
20237 203221805 203048303 203035786 203005853 202983235 203174757 203145823 202966855 202829285 202943617 203095213
20227 203095213 203079132 202971288 202938537 203050065 203411661 203857094 204064764 204128524 203947245 203850858
20217 203850858 203920569 203970228 203976654 203841584 203662503 203485426 203177823 202979623 202967222 202869288
20207 202869288 202708503 202731517 202979719 203150110 202953056 202476272 202333539 202481754 202455748
20198 202455748 202473280 202645668 202891529 203223588 203427813 203386988 203223204 203080641 203070565 202892863
20188 202892863 202622677 202737939 203054015 203373478 203626863 203662482 203473150 203212080 203084261
20179 203084261 203072912 203197762 203405425 203556699 203364480 202971732 202934147 203224490 203603821
20170 203603821 203744062 203720856 203655801 203487094 203199369 202810183 202496416 202530430 202581439 202554404
20160B02554404M8150J19887J10964j01268R435M26224M23562L17017k6417n62152
20150B03319806n11327j26558K92157K70086j67868l50705j26771k3869j05668
20141B02469283J41612K72093K49292J25926O1264L5609j60297j39581R7087j1627
20131B03140661k33789k53318m764K38631K10070j79830j95634J59047K12162
20122B03093236Q9776J5898J2158P5687N2381j95124P9636J4833m08162l44337
20112B02485982k40086l26058j14783o4220q9398P4351J76684J66243K53732K04870
20102B02527317L1691K1800J04815j37955j78412K52220K91378j12158l52161
20093B02448535n9256O6634q8045j49615L8449J26571J5464r0898Q8697K88632
$$ plain form
20160 202554404 202602554 202722441 202833405 202732137 202741572 203167796 203591358 203908375 203881958 203319806
20150 203319806 202808479 202681921 202974078 203244164 203076296 202725591 202598820 202574951 202469283
20141 202469283 202610895 202882988 203132280 203258206 203319470 203355079 203194782 203055201 203152288 203140661
20131 203140661 202906872 202653554 202648790 202887421 203097491 202917661 202722027 202881074 203093236
20122 203093236 203183012 203198910 203211068 203286755 203339136 203144012 203223648 203238481 202830319 202485982
20112 202485982 202245896 201919838 201805055 201740835 201651437 201725788 201902472 202068715 202322447 202527317
20102 202527317 202559008 202580808 202685623 202547668 202369256 202621476 202912854 202800696 202448535
20093 202448535 202389279 202455913 202367868 202218253 202256702 202383273 202398737 202307839 202396536 202685168
20083B02685168M18286M53701P6823k23250q3365L4927M1735L5262j20914l35644
20073B02982729l64214q4272J83424k1502k70932j46709l4895J82768J48174q1431
20063B02493140J6154L23516K82275p8336n7350L7747j97840j08409n0198j39107
20053B02521592j278j0888o0307l065R6464L09870L07194O7806j47709j33974
20043B02945705k8895n2134j12641J74758L41669L19843L17073N9623M1804M4360
20033B04051165k25712l09781k72447m5784p2292k94744j84447j51509n6585r2247
20023B02345617K5038L3778q4810K9991J88014L04288L02629L01150K67308J43038
20013B03856041j28924l74146k49868j64553k06646j4638M0914j45817k82740
$$ plain form
20083 202685168 203103454 203557155 203633978 203410728 203327363 203362290 203404025 203439287 203318373 202982729
20073 202982729 202618515 202534243 202717667 202696165 202425233 202278524 202243629 202426397 202574571 202493140
20063 202493140 202509294 202832810 203115085 203036749 202979399 203017146 202819306 202710897 202660699 202521592
20053 202521592 202520314 202509426 202449119 202446054 202542518 202852388 203159582 203227388 203079679 202945705
20043 202945705 202916810 202864676 202752035 202926793 203268462 203588305 203905378 203965001 204006805 204051165
20033 204051165 203825453 203515672 203243225 203197441 203125149 202830405 202645958 202494449 202437864 202345617
20023 202345617 202370655 202404433 202319623 202349614 202537628 202841916 203144545 203445695 203713003 203856041
20013 203856041 203727117 203352971 203103103 202938550 202731904 202717266 202758180 202612363 202329623
20004B02329623j54710K2447J20900L12094K39356m8509Q4805L16964J72812P0585
19994B03466367m5090p2548m8424j76396m19433k77869J34207K59110O8310j24415
19984B02763819k00203P9023K06045K68657L19400L8242L9400J05770L3036r956
19974B03643233k99787l05897r8467L3244r346J8893K68131K85216J67296l0929
19964B03671587Q8839R3168J18404K23205L26404M97243P7603n56613n22325m05660
19954B03611855n12399n35246k16303M6420K21018K87946J78960J62169K52567
19945B03496987L17502J07590j1948J54383K1373j74318j65926k46295k20609
19936B03278739J09375K74869L32774J27288k85362k56755q3339J1942K21917
$$ plain form
20004 202329623 202174913 202197360 202318260 202630354 202869710 202821201 202906006 203222970 203395782 203466367
19994 203466367 203421277 203348729 203300305 203123909 202704476 202426607 202560814 202819924 202888234 202763819
19984 202763819 202563616 202642639 202848684 203117341 203436741 203474983 203514383 203620153 203653189 203643233
19974 203643233 203343446 203037549 202939082 202972326 202962980 202981873 203250004 203535220 203702516 203671587
19964 203671587 203760426 203853594 203971998 204195203 204521607 205018850 205096453 204539840 204017515 203611855
19954 203611855 203099456 202564210 202347907 202394327 202615345 202903291 203082251 203244420 203496987
19945 203496987 203814489 203922079 203910131 204064514 204085887 203911569 203745643 203499348 203278739
19936 203278739 203388114 203662983 203995757 204123045 203837683 203580928 203497589 203509531 203731448
19927B03731448K64034k5681j88482k1897K41404J54850r0853q668L70153M66089
19917B04892397K06165J985J51979K04626O9600Q1414j14089k35815j31359R4831
19907B05221734J44381j18072k16738l65047n06994k17173Q1107L33951J38332
19898B04495481k21061j82474m2147M7430L3802J79393K42196L55019O46989N61718
19888B06116346K76066Q6090k42502n64046l79537O383M76013O38588L77933K32161
19878B07023495K93625O6674k57668j78182l5962o7100j6037J21544K12613L84095
19868B07547097L48174j8301n0541J74638J97212J62005L8923L15117L65331K81598
19858B09361253L17359L45160N22643N58038M13637K82795L10025L15743N84719
$$ plain form
19927 203731448 203995482 203969801 203781319 203759422 204000826 204155676 204064823 204056155 204426308 204892397
19917 204892397 205098562 205100547 205252526 205457152 205526752 205608166 205494077 205258262 205126903 205221734
19907 205221734 205366115 205248043 205031305 204666258 204159264 203942091 204023198 204357149 204495481
19898 204495481 204274420 204091946 204049799 204097229 204131031 204310424 204552620 204907639 205554628 206116346
19888 206116346 206392412 206478502 206236000 205671954 205292417 205298800 205774813 206413401 206791334 207023495
19878 207023495 207317120 207383794 207126126 206947944 206911982 206844882 206828845 206950389 207163002 207547097
19868 207547097 207895271 207876970 207826429 208001067 208198279 208360284 208399207 208714324 209079655 209361253
19858 209361253 209678612 210023772 210546415 211104453 211518090 211800885 212110910 212426653 213011372
19849B13011372O56280M93672K87500L26632M29256L49648L62585L49600N17281
19840B16783826Q61047R99505J006820J045136R50115P25108K74197k69374j133531
19831B21242849k548824l461276l967960m951919n681947n787651m944073l954494
19823A85944705l019710j218185M17096J108962J290895J128517Q70790L90860
19815A86913930N0569K28651K66245j2089J39610O11104Q85894R03058P68628
19806A90755600O96634M23390M13827M31891M18058K98332R3026J66988K59058
19797A93956804K53685K27169L99615N27211L28096J41100K06517J36354o4509
19788A96112042j94580k05199q5412J12758K91328K65419m1583m02758l80625
$$ plain form
19849 213011372 213667652 214161324 214448824 214775456 215204712 215554360 215916945 216266545 216783826
19840 216783826 217644873 218644378 219651198 220696334 221646449 222371557 222645754 222376380 221242849
19831 221242849 218694025 215232749 211264789 206312870 200630923 194843272 189899199 185944705
19823 185944705 182924995 181706810 182123906 183232868 184523763 185652280 186523070 186913930
19815 186913930 186964499 187193150 187459395 187447306 187586916 188198020 189083914 189986972 190755600
19806 190755600 191452234 191875624 192289451 192721342 193139400 193437732 193530758 193697746 193956804
19797 193956804 194210489 194437658 194837273 195364484 195692580 195833680 196040197 196176551 196112042
19788 196112042 195917462 195712263 195626851 195739609 196030937 196296356 196254773 195852015 195471390
19779A95471390k01683k0395m8166k09423k90417j72746j167l11515l42842Q2489
19769A93955525L32398L21291J65025K42904L00303P7567N4878J55161O6110j96775
19759A95474387j42436j53349l40793k0665N40277M30081J77592L9738r5733r6230
19749A95812869k50870j48493N0639K3201k1171j55904j1182L50899L93285L04537
19739A96347810K72905l960q4326k12022l58432j90797J22575K34844J93004J74298
19729A96495899Q6344j84728j54274J67454K41938L10401M59540L85232J90527
19720A97998333k86048m08346k55160j25056j48330j98702L22953M00102r0203
19711A97209543j92869j55410l7425J45860J53223K87419K65110L2604P5926L16118
$$ plain form
19779 195471390 195269707 195249312 195201146 194991723 194701306 194528560 194527393 194215878 193873036 193955525
19769 193955525 194287923 194609214 194774239 195017143 195317446 195395013 195449891 195605052 195671162 195474387
19759 195474387 195331951 195178602 194837809 194817144 195357421 195787502 195965094 196004832 195909099 195812869
19749 195812869 195561999 195413506 195464145 195487346 195466175 195310271 195299089 195649988 196043273 196347810
19739 196347810 196620715 196616755 196532429 196320407 195961975 195771178 195893753 196128597 196321601 196495899
19729 196495899 196582243 196397515 196243241 196410695 196652633 196963034 197422574 197807806 197998333
19720 197998333 197712285 197303939 197048779 196923723 196775393 196576691 196899644 197299746 197209543
19711 197209543 197016674 196861264 196823839 196969699 197122922 197410341 197675451 197708055 197783981 198100099
19701A98100099J21470j40064p2248n8063k6962J97966Q2118o5940k6784J6131
19691A98127723k6832P7735J27903N3706L9295P2015l6986j69758K2646J29006
19681A98416453J9828J0588P69r19J43319k7167k53035k26099n9460m331j88742
19670A97831204P4792L42255K4326k28220N4376L85189N13541L54832K16424J57134
19660A99725853K17561k4029o07266n34571R2891K43962r9435k99407l62608l60419
19650A97992532j58342M711J57937J42409J45669M47500L13820K8059j03627j40717
19640A98829951J18255J24056K1828n271j30959j55912O8262K16724j34726k05340
19630A98746868j11892k36799j85687L326N0911j68411l40786j61007K25352L06425
$$ plain form
19701 198100099 198221569 198081505 198009257 197951194 197924232 198122198 198204316 198138376 198111592 198127723
19691 198127723 198100891 198178626 198306529 198360235 198399530 198471545 198434559 198264801 198287447 198416453
19681 198416453 198436281 198446869 198447638 198446719 198590038 198562871 198309836 198083737 198024277 198019946 197831204
19670 197831204 197905996 198248251 198272577 198044357 198098733 198483922 198997463 199352295 199568719 199725853
19660 199725853 199943414 199919385 199312119 198777548 198870439 199114401 199014966 198715559 198352951 197992532
19650 197992532 197834190 197838901 197996838 198139247 198284916 198732416 199046236 199074295 198970668 198829951
19640 198829951 198948206 199072262 199094090 199088819 198957860 198801948 198870210 199086934 198952208 198746868
19630 198746868 198634976 198398177 198212490 198215816 198266727 198098316 197757530 197596523 197821875 198128300
19620A98128300K59117L22708K27246o1673k95389j41990K32271J45049j8016
19611A98797623j07829k45277j71038Q3228K11766L4529M4526J4597k90796k69674
19601A98101655M4265J35481N8510j50196n07093m42706N8461L40215L09227J81030
19591A98128849K26916J68969j37237j82333J96473M27703M67367L52581J74920
19582A99824208R099k15157k36612K4953J81985J43617k7337l8740J40250M3720
19572A99849986j66475j95392j84582m03941l69482j63031n8846L0726J3275J70871
19562A98523109K50516J46844J63841K58972K45426J86588J33145M5707k1762
19553A99932386j08523o587m5540L134q8859j11429J0885J0671j08573j20310
$$ plain form
19620 198128300 198387417 198710125 198937371 198875698 198580309 198438319 198670590 198815639 198797623
19611 198797623 198689794 198444517 198273479 198356707 198568473 198603002 198647528 198662125 198371329 198101655
19601 198101655 198145920 198281401 198339911 198189715 197682622 197239916 197298377 197638592 197947819 198128849
19591 198128849 198355765 198524734 198387497 198205164 198401637 198829340 199296707 199649288 199824208
19582 199824208 199833307 199618150 199381538 199406491 199588476 199732093 199704756 199666016 199806266 199849986
19572 199849986 199683511 199488119 199303537 198899596 198530114 198367083 198308237 198338963 198352238 198523109
19562 198523109 198773625 198920469 199084310 199343282 199588708 199775296 199908441 199954148 199932386
19553 199932386 199823863 199817276 199771736 199774870 199686011 199574582 199585467 199596138 199487565 199367255
19543A99367255j05079R7209K57569J97557J78890Q1698j54635k17730k99890
19534A99402844l73395k38980m6944J07271J03106J52314J22834l6507o7796K01943
19524A99326690L06424J65595J23413K10998K39789m8743k77811l18953k74397
19515A99453005j60181j19901R6441l907l26530m24783k15835J47414K84555r3005
19505A98637273l35280k26604j08766J81878L61290N55425L15495J20576N2574
19496A99553861k7566J03918M3916j03947j65713k84330o6285L11487M40316K57189
19486B00062846l0900l46820l88236k37058j81607O1022J90241K74582L60743
19477A99764813K57909o9524k70574l98847j69613J00083J8114l55977P2030N09196
$$ plain form
19543 199367255 199262176 199359385 199616954 199814511 199993401 200075099 199920464 199702734 199402844
19534 199402844 199029449 198790469 198743525 198850796 198953902 199106216 199229050 199192543 199124747 199326690
19524 199326690 199633114 199798709 199922122 200133120 200372909 200324166 200046355 199727402 199453005
19515 199453005 199292824 199172923 199269364 199265457 198938927 198514144 198298309 198445723 198730278 198637273
19505 198637273 198301993 198075389 197966623 198148501 198509791 199065216 199380711 199501287 199553861
19496 199553861 199526295 199630213 199674129 199570182 199404469 199120139 199053854 199365341 199805657 200062846
19486 200062846 200031946 199685126 199296890 199059832 198878225 198939247 199129488 199404070 199764813
19477 199764813 200022722 199953198 199682624 199283777 199114164 199214247 199232361 198876384 198948414 199457610
19467A99457610L10205J31922R6365J0380m5264K8191o696R3144L38736K58000
19457B00672593k0934Q116J25116J54242k31507l54831k4060p8805j05243j17026
19447B00027661p3810J1135k5688j82133k25560j05461N4314n2211j59449k9938
19437A99238860k8994M3646J04550J25689N3407k9432k8596n2773n9860N3760
19427A99420257J93809J5384l9223J20978J98019P9987j49525l16935j06448L4398
19417A99450701P4677L49324O01641N34266J35865l00883k60943Q2805l115k81653
19407B00382685l10683j3639K14495m6547l28976l80522l6555O6122o550K38269
19397A99778099L28166k4525k24764j67150j38827m245j42013l77289j72366K50797
$$ plain form
19467 199457610 199767815 199899737 199996102 200006482 199961218 199989409 199982713 200075857 200414593 200672593
19457 200672593 200651659 200659775 200784891 200939133 200707626 200352795 200328735 200249930 200144687 200027661
19447 200027661 199953851 199964986 199939298 199757165 199531605 199426144 199480458 199428247 199268798 199238860
19437 199238860 199209866 199253512 199358062 199483751 199537158 199507726 199479130 199426357 199366497 199420257
19427 199420257 199614066 199629450 199590227 199711205 199909224 199989211 199839686 199522751 199416303 199450701
19417 199450701 199525378 199874702 200476343 201010609 201146474 200845591 200584648 200667453 200664338 200382685
19407 200382685 200072002 200058363 200272858 200226311 199897335 199516813 199480258 199546380 199539830 199778099
19397 199778099 200106265 200081740 199856976 199689826 199550999 199546754 199404741 199027452 198855086 199105883
19387A99105883K22189j44711P838J76593K08034L33553J93238N1206k5291j63629
19377A99964903l09606l9777K20227K68091O2978j18118q4429J07641P4512k62102
19367A99884320n25260k88944j68274k2312L13816L99191L88502K92856L7250
19358B00311145k92858j69164J97192J23207J22271J07612j29859k52833q0350
19349A99936363p194k27856l06995q9810M6842K43944L01634J88402R7493j67728
19339B00015095n9727J70920J36993q533q3040o3216Q3396J99788K49476J65856
19329B00807008K1865Q820J14277J11807j15979k64748J3369J11776q0639l66112
19319B00361444m73852j90192M4906J83440l760M0906n1698l2748J70178J96796
$$ plain form
19387 199105883 199328072 199183361 199191199 199367792 199575826 199909379 200102617 200153823 200128532 199964903
19377 199964903 199655297 199615520 199835747 200103838 200166816 200048698 199964269 200071910 200146422 199884320
19367 199884320 199359060 199070116 198901842 198879530 199193346 199592537 199981039 200273895 200311145
19358 200311145 200018287 199849123 200046315 200169522 200291793 200399405 200269546 200016713 199936363
19349 199936363 199929169 199701313 199394318 199304508 199351350 199595294 199896928 200085330 200182823 200015095
19339 200015095 199955368 200126288 200263281 200254748 200171708 200108492 200191888 200391676 200641152 200807008
19329 200807008 200828873 200837693 200951970 201063777 200947798 200683050 200696419 200808195 200727556 200361444
19319 200361444 199887592 199697400 199742306 199925746 199921986 199962892 199911194 199878446 200048624 200245420
19309B00245420P0149O3995J87256L91963K59755j22246o8915J70977K3958j59709
19299B01062603n5426j35003j33063j31547J9370L45184K97251J12420o7847j42741
19289B01171201J4223J12457K37006M7503q6779k05350k73973j99591q3829j62067
19279B00570801J32496J17765j52604r9368J8237m580j67856j40738n1042J44746
19269B00367857M6551J37849M71165L63359K04052P1654j93505k05916K46735
19260B01509801L02365n4702j18470M0761Q0276N7283n7658q6690j54619l12247
19250B01206100l28336j16177k0849r4020O4510K08100j16059m05794j44630j3600
19240B00239245J65354M18476L56393n9696r6045K37864K74212k9258j91730j47601
$$ plain form
19309 200245420 200315569 200379564 200566820 200958783 201218538 201096292 201027377 201198354 201222312 201062603
19299 201062603 201007177 200872174 200739111 200607564 200626934 200972118 201269369 201381789 201313942 201171201
19289 201171201 201185424 201297881 201534887 201582390 201495611 201290261 201016288 200816697 200732868 200570801
19279 200570801 200703297 200821062 200668458 200569090 200587327 200582747 200414891 200274153 200223111 200367857
19269 200367857 200414408 200552257 201023422 201386781 201590833 201662487 201468982 201263066 201509801
19260 201509801 201812166 201757464 201638994 201679755 201760031 201817314 201759656 201672966 201518347 201206100
19250 201206100 200877764 200761587 200740738 200646718 200711228 200919328 200803269 200397475 200252845 200239245
19240 200239245 200404599 200823075 201179468 201119772 201023727 201261591 201535803 201506545 201314815 201167214
19230B01167214k40972j89134j05739P2311L41835L31156M80649L43865j10829
19221B02090356j60279l7165j05390k36695j07415R4613Q2764j53526k90745j63709
19211B01012809Q5814M09089N14226K20346j12444k12168m38151m26522q387L28548
19201B01373160L01906J69933n4138k68028L9487R5695L277J73782L86904M9142
19191B02271120k21147J66425P9845k5822K66178L26853K31777K8157j31183o3721
19181B02928482j03635j34276j63244j99724p6682n3932j29926N0522O725R449
19171B02133759K41774J33459j30907k59208k1308J75422p676l8830J54720Q9278
19161B02470483J47012L76495K25769O310m04813n37483m17913j41509K67385
$$ plain form
19230 201167214 200926242 200737108 200631369 200703680 201045515 201376671 201857320 202201185 202090356
19221 202090356 201930077 201892912 201787522 201550827 201443412 201538025 201620789 201467263 201176518 201012809
19211 201012809 201098623 201507712 202021938 202242284 202129840 201917672 201479521 201052999 201044612 201373160
19201 201373160 201675066 201844999 201790861 201522833 201562320 201658015 201661292 201835074 202221978 202271120
19191 202271120 202049973 202216398 202296243 202270421 202536599 202863452 203095229 203123386 202992203 202928482
19181 202928482 202824847 202690571 202527327 202327603 202250921 202196989 202067063 202117585 202124310 202133759
19171 202133759 202375533 202508992 202378085 202118877 202097569 202272991 202265315 202226485 202381205 202470483
19161 202470483 202617495 202993990 203219759 203226069 202821256 202283773 201865860 201724351 201991736
19152B01991736L51441K76013L24522J69198j63650k08928k913R4696P0546N0863
19142B02953524J36203K9767j4468q967j5487j43145k41266j92989l11684k41905
19132B01949583R6734J75088J16032J83700k2414o033K54954K32082J59733k7398
19122B03112061o9902N1527J24953J08728j9937N3398J63199Q4673j5105N6447
19112B03650042j3629k90248k03519l2945l1048K05966M60087K11093j44588j99974
19102B03611237j23668k32626k28451j37400p970J45377J35052L42205L65088
19093B03868844R1751K64430M67210J85685R0064o8870r9449P8131J46253R5013
19083B05119062n1121p3488j3533k5604K2995j41699k62230k32396n9900K64657
$$ plain form
19152 201991736 202343177 202619190 202943712 203112910 202949260 202740332 202737419 202832115 202902661 202953524
19142 202953524 203089727 203119494 203105026 203096059 203080572 202937427 202696161 202503172 202191488 201949583
19132 201949583 202046317 202221405 202337437 202521137 202498723 202492690 202747644 202979726 203139459 203112061
19122 203112061 203042159 203093686 203218639 203327367 203307430 203360828 203524027 203608700 203593595 203650042
19112 203650042 203636413 203346165 203142646 203109701 203078653 203284619 203744706 203955799 203811211 203611237
19102 203611237 203487569 203254943 203026492 202889092 202881122 203026499 203161551 203503756 203868844
19093 203868844 203960595 204225025 204692235 204877920 204967984 204899114 204799665 204877796 205024049 205119062
19083 205119062 205067941 204994453 204980920 204955316 204978311 204836612 204574382 204341986 204282086 204546743
19073B04546743L96781L55033K55908P6200m6378J85244K89864o7104k65169k93621
19063B05433501m2241k5424k7292r23j20556j78954N2170K44879J81953K2288
19053B05539401J79133K24599l943k49720l00651L3833K96698K12805K9472L4780
19043B05996407l9810p526J12876L12153J83106p9076k04251j56074M7755K11430
19033B06376990N5911j4155J29977K73779P4328k11889j65693r9245L3277N9204
19023B06512484J84082J44806j26630k35591j41451j39623m50713j55447M66675
19014B06058592N42338M19393L96132N75589L35343q3492r1018L32352L89449
19005B08874678K39747k6047q2404J49431K1051j74162j7350K81816J48048p3383
$$ plain form
19073 204546743 204943524 205298557 205554465 205630665 205584287 205769531 206059395 205992291 205727122 205433501
19063 205433501 205391260 205365836 205338544 205337621 205217065 205038111 205090281 205335160 205517113 205539401
19053 205539401 205718534 205943133 205939190 205689470 205388819 205422652 205719350 205932155 205961627 205996407
19043 205996407 205956597 205949071 206061947 206374100 206557206 206478130 206273879 206117805 206165560 206376990
19033 206376990 206432901 206418746 206548723 206822502 206896830 206684941 206519248 206420003 206453280 206512484
19023 206512484 206696566 206841372 206714742 206479151 206337700 206198077 205747364 205591917 206058592
19014 206058592 206600930 207020323 207416455 207992044 208327387 208243895 208152877 208485229 208874678
19005 208874678 209114425 209088378 209005974 209155405 209176456 209002294 208984944 209266760 209414808 209341425
18995B09341425k78056j35980K17993L39372L22153J57269j34498k60794R9482
18986B09668366L67381L54894L26068K09728n7082k20901L2472J44380j78820
18977B10646486l99278m30045l21585m7514J08848L26293O20487O17574K65182
18968B11386448j5900J46499L78334J31168l19382j81088L28132L33396M62486
18959B12650093N49288J83135k57644l02193j64348j98032r7057L35356O76014
18950B13374612M02947J81369K88720L14754K78005K44481K0478k66292j55016
18941B14684058L17173L69226n72k27205j06129J35030K68441N01605P22027M70977
18931B17134631J06860J2253o4799k7380j05903n9132M3893L23520M26579L30518
$$ plain form
18995 209341425 209063369 208927389 209145382 209484754 209806907 209964176 209829678 209568884 209668366
18986 209668366 210035747 210390641 210716709 210926437 210869355 210648454 210680926 210825306 210646486
18977 210646486 210247208 209817163 209495578 209448064 209556912 209883205 210503692 211121266 211386448
18968 211386448 211370548 211517047 211895381 212026549 211707167 211526079 211854211 212187607 212650093
18959 212650093 213199381 213382516 213124872 212822679 212658331 212460299 212363242 212698598 213374612
18950 213374612 213777559 213958928 214247648 214562402 214840407 215084888 215105366 214839074 214684058
18941 214684058 215001231 215370457 215369885 215142680 215036551 215171581 215440022 215941627 216663654 217134631
18931 217134631 217241491 217253744 217188945 217161565 217055662 216996530 217040423 217363943 217790522 218121040
18921B18121040K11529J05033j6667r6747J60459M42116L67578J41380K23003
18912B19658724O47521P05008M75494M46102O88672P04880M56148K08500k59988
18903B23731061k51193K00903N30778O34929M99397L84964M05258N42637M14150
18894B27092884P8328J04937K79731M72514M14629M84685P97914R26941Q09366
18885B31461929N67168L78809M87379O36549O57262P58951R94538J016316P12594
18876B37671495K61414M23166O47818O81854P29682R47909J237188J203113J064917
18867B44868556O49521M69990P97189J098522J237377J252492J281736J451681
18859B53107064J436909J394924J555543J677685J625661J730615K192431K581973
$$ plain form
18921 218121040 218332569 218437602 218420935 218324188 218484647 218926763 219294341 219435721 219658724
18912 219658724 220306245 221011253 221486747 221932849 222621521 223326401 223782549 223991049 223731061
18903 223731061 223479868 223680771 224211549 224846478 225345875 225730839 226136097 226678734 227092884
18894 227092884 227171212 227276149 227555880 228028394 228443023 228927708 229725622 230652563 231461929
18885 231461929 232029097 232407906 232895285 233531834 234189096 234948047 235942585 236958901 237671495
18876 237671495 237932909 238356075 239003893 239685747 240415429 241363338 242600526 243803639 244868556
18867 244868556 245518077 245988067 246785256 247883778 249121155 250373647 251655383 253107064
18859 253107064 254543973 255938897 257494440 259172125 260797786 262528401 264720832 267302805
18851B67302805K550240K235705K399153K732241L243183L697580L691314L684403
18843B91536624M099156M697121N036142N392708N698057O154782O678218P120617
18835C36413425P145262P130975P462247P635552P521857O755003M339998p4391
18827C84329928n847118j5280668l5224333o3280281p7704426o3279562l3695516
18820I0018024j0092834J852439O843089Q912591R784050R632281R140383Q492565
18812A34582588P861236P822459P830839P192114O241388N596278N213621N120354
18804A87460877N099921M857760M567978M216312L840795K840994J464292O24605
18796B14973534Q85714J887175K615968L312808L589084L434181L265589L108419
$$ plain form
18851 267302805 269853045 272088750 274487903 277220144 280463327 284160907 287852221 291536624
18843 291536624 295635780 300332901 305369043 310761751 316459808 322614590 329292808 336413425
18835 336413425 343558687 350689662 358151909 365787461 373309318 380064321 384404319 384329928
18827 384329928 378482810 363202142 327977809 264697528 186993102 123713540 90018024
18820 90018024 79925190 81777629 88620718 97533309 107317359 116949640 126090023 134582588
18812 134582588 142443824 150266283 158097122 165289236 171530624 177126902 182340523 187460877
18804 187460877 192560798 197418558 201986536 206202848 210043643 212884637 214348929 214973534
18796 214973534 215859248 217746423 220362391 223675199 227264283 230698464 233964053 237072472
18788B37072472L136144L421063L470342L023412J556680k084370q083885j4019670
18780B27492188j6910830j7305063j6380110j3931745j0391811p292453m085250
18773A41194926k61642K625914M213610M951913N299555N797796O410785O511290
18765A76744147O505208O372076O129361O061905N848404N697278N272744L193985
18757B21825108j857896r390178j4508019j4650824j5142290j6369326j5042703
18750A34863872j5068716j8295741j8954374j6134294j1814198n267486O12059
18743D9941122M065587N852381O441944O265201N546747M857780M318959L861077
18735I1150798L235777K316677J946769J997631J915865J657985J284681J089694
$$ plain form
18788 237072472 240208616 243629679 247100021 250123433 251680113 249595743 241511858 227492188
18780 227492188 210581358 193276295 176896185 162964440 152572629 145280176 141194926
18773 141194926 140933284 143559198 147772808 152724721 158024276 163822072 170232857 176744147
18765 176744147 183249355 189621431 195750792 201812697 207661101 213358379 218631123 221825108
18757 221825108 219967212 210577034 196069015 181418191 166275901 149906575 134863872
18750 134863872 119795156 101499415 82545041 66410747 54596549 49329063 49941122
18743 49941122 54006709 59859090 66301034 72566235 78112982 82970762 87289721 91150798
18735 91150798 94386575 96703252 98650021 100647652 102563517 104221502 105506183 106595877
18727A06595877J008658J464095J818752J830115K087138K265855J970405J713473
18719A20754368J906622J866961J420302J187235J198031J208726J006020Q87258
18711A31435523J108679J467078J528866J209682J020423Q95231J121242J209138
18703A40995862J016321N91895L05360M72344O40368N58706M47921M65757N23714
18694A46018248L02993J61009O73944J013365O28336L39356N59927N48948M41073
18685A50687199N70908N11217N52543N75963N00264L67460K75840M89486O37371
18676A55168251M17160K47927J64877J64831L38431M35814M14895K31065N5132
18667A57638383J94527K51096J20222O8448J48900J01578j248J63950M30071N93821
$$ plain form
18727 106595877 107604535 109068630 110887382 112717497 114804635 117070490 119040895 120754368
18719 120754368 122660990 124527951 125948253 127135488 128333519 129542245 130548265 131435523
18711 131435523 132544202 134011280 135540146 136749828 137770251 138665482 139786724 140995862
18703 140995862 142012183 142604078 142909438 143381782 144022150 144580856 145028777 145494534 146018248
18694 146018248 146321241 146482250 147156194 148169559 148797895 149137251 149697178 150246126 150687199
18685 150687199 151258107 151769324 152321867 152897830 153398094 153765554 154041394 154530880 155168251
18676 155168251 155585411 155833338 155998215 156163046 156501477 156937291 157352186 157583251 157638383
18667 157638383 157832910 158084006 158204228 158272676 158421576 158523154 158521906 158685856 159115927 159709748
18657A59709748N69651L20220J37926N7709K61543N76670P26487M91841K43802
18648A63095597J19805p9135j36011O9753L73579K40975J48038k642p0121k5685
18638A63734153J56589L18430L57725K48484M3729o2239R0747K06504J85882j4741
18628A65265263j38289J04477R6233n3746n514K95718N25291L37432Q8201P5664
18618A66590730j11245l36764j79126L37158N99789M14097K32465K59023L72283
18609A68178410K22587J97441J45976J58552M5631j77214l01024k45686J24934
18600A68349607L07178L2696k97571k30624Q6945L50299N21509L82619K79743
18591A69782401K55279J58375N1682R1913J95900J61463J05132J99415K62875
$$ plain form
18657 159709748 160279399 160599619 160737545 160795254 161056797 161633467 162359954 162851795 163095597
18648 163095597 163215402 163136267 163000256 163070009 163443588 163684563 163832601 163829959 163759838 163734153
18638 163734153 163890742 164209172 164566897 164815381 164859110 164796871 164887618 165094122 165280004 165265263
18628 165265263 165126974 165231451 165327684 165273938 165268424 165564142 166089433 166426865 166515066 166590730
18618 166590730 166479485 166142721 165963595 166300753 166900542 167314639 167547104 167806127 168178410
18609 168178410 168400997 168598438 168744414 168902966 168948597 168771383 168470359 168224673 168349607
18600 168349607 168656785 168689481 168391910 168161286 168248231 168598530 169120039 169502658 169782401
18591 169782401 170037680 170196055 170247737 170339650 170535550 170697013 170802145 171001560 171264435
18582A71264435J09286j87825j29737J97351J30068m5499J70504J96544J84565
18573A71889692M2535o3324P3537J77803K08299o7767k05990n7540K91535K01263
18563A72490043j10445o8515J60892N4229j2208J28839J75405J08631L40857K95257
18553A73562985j54165j45496O5422O8375K0234J81148J97162L23545L13668Q6652
18543A74519530r7757l52983l28113l30789j89507J00275J91649K47382J34565
18534A73894252j23807k30472j69023o893J85316K71001L99342K90189r736k94422
18524A74205747l17428l4765K0769Q2029K78453M75672N55338L80811k0809j77899
18514A75447918j43136j52340K6247L55390J59814k99743m58153j84795L8059
$$ plain form
18582 171264435 171373721 171185896 171056159 171253510 171383578 171338079 171508583 171705127 171889692
18573 171889692 171932227 171868903 171942440 172120243 172328542 172260775 172054785 171997245 172288780 172490043
18563 172490043 172379598 172311083 172471975 172526204 172513996 172642835 172818240 172926871 173267728 173562985
18553 173562985 173408820 173263324 173328746 173397121 173417355 173598503 173795665 174119210 174432878 174519530
18543 174519530 174421773 174068790 173740677 173409888 173220381 173320656 173512305 173759687 173894252
18534 173894252 173770445 173539973 173370950 173364057 173549373 173820374 174219716 174509905 174500169 174205747
18524 174205747 173888319 173853554 173874323 173956352 174234805 174710477 175265815 175646626 175625817 175447918
18514 175447918 175304782 175152442 175178689 175534079 175693893 175394150 174935997 174751202 174789261
18505A74789261O0698J88853J52858L50891L66498p7363l96866k23808K15776
18496A75426798K82895j70507k15065J31859J44731J37779J42507L088o30K10528
18486A76093983M8682l3614O88n0700o4043k31684j88235n1995j33662m3040Q3910
18475A75430290N8231m8752j0199J96393L17612J47936L6972j27644k71398P9027
18465A75808468L91151R1142l49389l15186J06772J03973R624J85007J74188j30143
18455A76075607o4572K7495n0722R7461M07673M55464O8480j50564j10468j59114
18445A76596740j04847J25850K45660L08589J89076j32547l96189k30820K01553
18436A76803065L57974L29503P4190r9171K3980q118n7783K9762K64106M61334
$$ plain form
18505 174789261 174849959 175038812 175191670 175542561 175909059 175831696 175434830 175211022 175426798
18496 175426798 175709693 175539186 175324121 175455980 175600711 175738490 175880997 175884085 175883455 176093983
18486 176093983 176142665 176109051 176109739 176059039 175994996 175763312 175575077 175523082 175389420 175346380 175430290
18475 175430290 175488521 175439769 175429570 175625963 175943575 176091511 176128483 176000839 175729441 175808468
18465 175808468 176199619 176290761 175941372 175626186 175732958 175836931 175846555 176031562 176205750 176075607
18455 176075607 176011035 176038530 175987808 176085269 176492942 176948406 177016886 176866322 176755854 176596740
18445 176596740 176491893 176617743 176863403 177171992 177361068 177228521 176832332 176601512 176803065
18436 176803065 177161039 177490542 177564732 177465561 177489541 177481423 177423640 177453402 177717508 178178842
18426A78178842N23968K48762k18633k59477j67189L2189R9848r9660l28355m28617
18416A77581678k83689j47621o4560m0182j65276j88072K57949K60738l1331j19807
18406A77059827j08632L9513J94763K47393K88635J47058k1273j43085j02372
18397A77601827Q1110k5798j4780K26800L03423K23474P1983J81873J50544l3789
18387A78766667j76870j92796k1872O9630J3622j90144k68512k48891l9912K66666
18377A77977588N6980r7656J55807L40088K50861J70462J1150j21811j13920j52091
18367A78477458k07291o5930q9305q3871O3302J52061L44350L16987j31977l26751
18357A78449033m2730J58995k9574j18081p1990j16597N0736K22673L44203K80755
$$ plain form
18426 178178842 178702810 178951572 178732939 178473462 178306273 178338462 178438310 178338650 178010295 177581678
18416 177581678 177297989 177150368 177085808 177045626 176880350 176692278 176950227 177210965 177179634 177059827
18406 177059827 176951195 176990708 177185471 177432864 177721499 177868557 177847284 177704199 177601827
18397 177601827 177682937 177657139 177642359 177869159 178172582 178396056 178468039 178649912 178800456 178766667
18387 178766667 178589797 178397001 178375129 178444759 178458381 178268237 177999725 177750834 177710922 177977588
18377 177977588 178034568 177936912 178092719 178432807 178683668 178854130 178865280 178743469 178629549 178477458
18367 178477458 178270167 178204237 178114932 178031061 178094363 178246424 178590774 178907761 178775784 178449033
18357 178449033 178406303 178565298 178535724 178417643 178345653 178229056 178279792 178502465 178846668 179127423
18347A79127423M9530k05144j98037j59533J09942K68429K27730J30545O1848
18338A79412733O1297j0514l4463j04286j96441j80746j67467j47670j89094o5580
18328A78377769K58930L7596m97332l24003K8969M0469Q7994K19875M08472K82069
18318A78920808j5931k64594j16377N28300P04478L76662L6775j84424m4529l1861
18308A79909307k27151j42412K50774K31459j79926l52596k76750j24015J24169
18299A79212859K36287K13422K9393n6434k4071j8164K39334R4530k84543k51007
18289A79391606j64742k39193k32479o0912R7032L00893M40574L60962L37382
18280A80231123K63859j72476n25213l82640l71041l37992p5914l7768R9655K19091
$$ plain form
18347 179127423 179176953 178971809 178773772 178614239 178724181 178992610 179220340 179350885 179412733
18338 179412733 179474030 179463516 179429053 179324767 179128326 178947580 178780113 178632443 178443349 178377769
18328 178377769 178636699 178674295 178176963 177852960 177881929 177922398 178010392 178230267 178638739 178920808
18318 178920808 178904877 178640283 178523906 179052206 179756684 180133346 180170121 179985697 179941168 179909307
18308 179909307 179682156 179539744 179790518 180021977 179842051 179489455 179212705 179088690 179212859
18299 179212859 179449146 179662568 179691961 179635527 179611456 179593292 179832626 179927156 179642613 179391606
18289 179391606 179226864 178987671 178755192 178694280 178791312 179092205 179532779 179893741 180231123
18280 180231123 180494982 180322506 179797293 179414653 179043612 178705620 178629706 178591938 178691593 178910684
18270A78910684J11952l246N2597L15941K72178k44450k22048r8894j44055p9112
18260A78871547P2037n2061j95306J59610M98714L46534Q1265j62427l55819j04101
18250A79159993J58236J09968K94555L01551k9326l32966j88487M3153L17070
18241A79833747M30969R957n13319n14790j66877J83646K43596J51595J92837
18232A79851361K78025J51809p3342k03139j76868k57434l17329M5854L12719
18223A79611656K7988k50703j54235j12156p3775R8698L08533K34840Q9081j38551
18213A79641376j70506l99029k73174Q3427J86748J77744Q1092j04339j99768
18204A79023571M8043K37201J6139P7159K65145L15905K04173M394o6105n623
$$ plain form
18270 178910684 179022636 179019390 179071987 179387928 179660106 179415656 179193608 179094714 178950659 178871547
18260 178871547 178943584 178891523 178696217 178855827 179354541 179701075 179782340 179619913 179264094 179159993
18250 179159993 179318229 179428197 179722752 180024303 179994977 179662011 179473524 179516677 179833747
18241 179833747 180264716 180274673 179761354 179246564 179079687 179263333 179506929 179658524 179851361
18232 179851361 180129386 180281195 180207853 180004714 179827846 179570412 179253083 179298937 179611656
18223 179611656 179639644 179388941 179234706 179122550 179048775 179147473 179456006 179690846 179779927 179641376
18213 179641376 179470870 179071841 178798667 178882094 179068842 179246586 179327678 179223339 179023571
18204 179023571 179071614 179308815 179324954 179402113 179667258 179983163 180187336 180191730 180125625 180120002
18194A80120002p7586j03762j04232R7066J64922J23875N9279J52766R8889j12197
18184A80419022k43076k14242p8442k75080k93511m5779P250K8302O8655J07954
18174A79481053J77027J73901K20491J16756j29950j33109k73927k06704J65625
18165A79591163K35235J35174J67234K89263J06159l68467l04193J19737J54396
18156A80125701k43400m74540l28932k50757n3596J56146K50866L38529L07286
18147A79827303J89688J81569Q6084j60295j69815m5605k22395N4503L06480j0018
18137A80037499k11558k19302L5897J87574J41977j00652k93848r2137K04016
18128A79689466J13172J5269J50057J15996R8663j3868m6807n4848J33064J95733
$$ plain form
18194 180120002 180042416 179938654 179834422 179931488 180096410 180220285 180279564 180432330 180531219 180419022
18184 180419022 180175946 179961704 179883262 179608182 179314671 179268892 179276142 179304444 179373099 179481053
18174 179481053 179658080 179831981 180052472 180169228 180039278 179906169 179632242 179425538 179591163
18165 179591163 179826398 179961572 180128806 180418069 180524228 180155761 179851568 179971305 180125701
18156 180125701 179882301 179407761 179078829 178828072 178774476 178930622 179181488 179520017 179827303
18147 179827303 180016991 180198560 180284644 180124349 179954534 179908929 179686534 179741037 180047517 180037499
18137 180037499 179825941 179606639 179642536 179830110 179972087 179871435 179577587 179485450 179689466
18128 179689466 179802638 179817907 179967964 180083960 180182623 180168755 180121948 180067100 180200164 180395897
18118A80395897j82221m75586l82818l18917j40456J93550L52719L13976K66160
18109A80022304M9727P4635m4370j68295j01090J47747L94855J34133k45087k48539
18099A80016020j60177k8451R1299P3718j26184l7465O8767K99650N40704K6823
18089A80764704k36722M9984L19345K61715j135o9448j15350k55119l10665k97966
18079A80109343k81650J03962L29731J4654m3894K28574L65258M9057k3965j81559
18069A80669511r9367K035k09543k92500q6778J82312K36463q6236j23861J96326
18059A80388362K92502K47044J80224J24170m9179l53528l08806N7213K10615
18050A80788617J29696j19540k4390M28175j7212m68630o16125m91405j26630
$$ plain form
18118 180395897 180213676 179738090 179355272 179036355 178895899 179089449 179442168 179756144 180022304
18109 180022304 180072031 180146666 180102296 179934001 179832911 179980658 180375513 180509646 180264559 180016020
18099 180016020 179855843 179827392 179918691 179992409 179866225 179828760 179897527 180197177 180737881 180764704
18089 180764704 180527982 180577966 180897311 181159026 181157891 181088443 180973093 180717974 180407309 180109343
18079 180109343 179827693 179931655 180261386 180276040 180232146 180460720 180825978 180875035 180851070 180669511
18069 180669511 180570144 180572179 180362636 180070136 179983358 180165670 180402133 180315897 180192036 180388362
18059 180388362 180680864 180927908 181108132 181232302 181183123 180829595 180520789 180578002 180788617
18050 180788617 180918313 180798773 180774383 181202558 181185346 180716716 180100591 179609186 179482556
18041A79482556j60250l2803L11203l9128l00817q8928n9014k13497j48061K76085
18031A79027346N23513N29245N4447l43573k37638j2459J53352L93560L46271
18022A80434064R5082o6784P4197J50601J20003j28962l36114k52919r7024J77071
18012A80169215K75141J75498m142j50172R659K21348L52580J79662j65727j5217
18002A81047845K82952P9148n11837p15254k51551O7849j22419k92464j69566
17993A79414703q8710L9915R4987K61625N89441N26637J60038n3155k20749k04285
17983A80520447j11671k07272l28452k68570j10356m2181M4938J66899J64220
17974A79828002N1748j55186j40705j17706J4358J17478L7912l8376P1311K74536
$$ plain form
18041 179482556 179322306 179289503 179600706 179561578 179260761 179171833 179112819 178899322 178751261 179027346
18031 179027346 179550859 180080104 180134551 179790978 179553340 179540881 179694233 180087793 180434064
18022 180434064 180529146 180462362 180536559 180687160 180807163 180678201 180342087 180089168 179992144 180169215
18012 180169215 180444356 180619854 180615712 180465540 180475199 180696547 181049127 181228789 181063062 181047845
18002 181047845 181330797 181409945 180898108 180182854 179931303 179999152 179876733 179584269 179414703
17993 179414703 179325993 179365908 179460895 179722520 180311961 180838598 180998636 180945481 180724732 180520447
17983 180520447 180408776 180201504 179873052 179604482 179494126 179451945 179496883 179663782 179828002
17974 179828002 179879750 179724564 179583859 179466153 179480511 179597989 179635901 179597525 179668836 179943372
17964A79943372J94021J1049l2017R256L8582O6754l7571j65456l0045N2493P2154
17953A80122592L05425K22117q5244j78781j53611k38310j93569J51346M29185
17944A80381150K66711K6432k65651k80860P7660L10617Q1182j79468m83003l72356
17934A79562414L6140m8858M2382K57770L29204N1961k57977l98924l34141J09965
17924A79349936L38133K03754J23991J22196L29576L81683o0390k69385r1294
17915A80428200J13387j52056l38753m16599k69693K37139M22894K04966K38315
17906A80467800J92394j47766j77079K77280J30454k54415l18251l70902j70635
17897A79628880j9034q3464j693K14886K53662m9020k52243j82186k06001j0849
$$ plain form
17964 179943372 180137393 180148442 180116425 180125681 180164263 180231017 180193446 180027990 179997945 180050438 180122592
17953 180122592 180428017 180650134 180564890 180386109 180232498 179994188 179800619 179951965 180381150
17944 180381150 180647861 180674293 180408642 180127782 180205442 180516059 180597241 180417773 179934770 179562414
17934 179562414 179598554 179549696 179592078 179849848 180179052 180231013 179973036 179574112 179239971 179349936
17924 179349936 179688069 179891823 180015814 180138010 180467586 180849269 180788879 180519494 180428200
17915 180428200 180541587 180389531 180050778 179634179 179364486 179601625 180024519 180229485 180467800
17906 180467800 180660194 180512428 180335349 180612629 180743083 180488668 180170417 179799515 179628880
17897 179628880 179609846 179526382 179524689 179739575 179993237 179944217 179691974 179509788 179303787 179292938
17887A79292938K80500P4037k82989k85536N1388L93611L51619J3395l30149k50972
17877A79307842J26634L85533K38371J2754o3375j80509j57554m5777p0614q5301
17867A79468004K43943M34361K49851j37567k11900k33373j40062J5829J20710
17858A79809796j11707k30807K45824M93869K23191q3063j44266K398k9611l67576
17848A79808048l12698k2185J013m2825k52714j18320K33094K18160L57227J52296
17838A80021096k36860l19766l3772J12787K1514r4831J20774K97215L79256K51206
17828A80518619j27055m21696m18842j6981M17096M03482k2702k15817P7286J93967
17818A80387357J23417K0443J01180j9139l12921k76310J05987J55216j00060
$$ plain form
17887 179292938 179573438 179647475 179364486 179078950 179130338 179523949 179875568 179888963 179558814 179307842
17877 179307842 179434476 179820009 180058380 180071134 180007759 179827250 179669696 179623919 179553305 179468004
17867 179468004 179711947 180146308 180396159 180258592 180046692 179813319 179673257 179689086 179809796
17858 179809796 179698089 179467282 179713106 180206975 180430166 180347103 180202837 180205235 180175624 179808048
17848 179808048 179495350 179473165 179474178 179431353 179178639 179060319 179293413 179511573 179868800 180021096
17838 180021096 179784236 179464470 179430698 179543485 179564999 179470168 179590942 179888157 180267413 180518619
17828 180518619 180391564 179969868 179551026 179534045 179951141 180354623 180331921 180116104 180193390 180387357
17818 180387357 180510774 180531217 180632397 180613258 180300337 180024027 180130014 180285230 180185170
17809A80185170l56581k10659R9538O9317p6134k03230k18461j97084Q6311K15252
17799A79393439K38067K76343P2382k42835k18720j0220K02794J41570j66131
17790A79686689k44709k18124o1251O9823N1153j66394j23492N5586O9636P5928
17780A79194845J67274K52744M3455j81638j80774j77667j59344j09600J53315
17771A79002610L95564L69479J08477j28472N2858J74613N1718o8789m9116p5366
17761A79833576k52133k91901l36186j22532R6265n7606o5219L3889l0616j8856
17751A78788681J79896L56216K23752J56511R7301L7203M0405N2287M5713j4754
17741A79963211r5711k7992M4071j01485p6519Q9962N8743l3237r6457j91222
$$ plain form
17809 180185170 179828589 179617930 179717468 179786785 179710651 179507421 179288960 179091876 179178187 179393439
17799 179393439 179631506 179907849 179980231 179737396 179518676 179508456 179711250 179852820 179686689
17790 179686689 179441980 179223856 179162605 179232428 179283581 179117187 178993695 179049281 179118917 179194845
17780 179194845 179362119 179614863 179658318 179476680 179295906 179118239 178958895 178849295 179002610
17771 179002610 179398174 179767653 179876130 179747658 179800516 179975129 180026847 179958058 179908942 179833576
17761 179833576 179581443 179289542 178953356 178830824 178927089 178869483 178804264 178838153 178807537 178788681
17751 178788681 178968577 179324793 179548545 179705056 179802357 179839560 179879965 179932252 179977965 179963211
17741 179963211 179867500 179839508 179883579 179782094 179705575 179795537 179854280 179821043 179724586 179533364
17731A79533364k71611l5533K71606J30737l2700p297O2549R3603p7334l69053
17721A79298331k73482Q5287J19027K10457M34291M66417J72348l84192m66769
17712A79661715l39958n7711J78889K28878M29674M90610K49646q1973j45835
17703A80613935j87579m44401l53277j3099l8981l59887k89364k57608j81321
17694A78488418m5642K1739J23241R2886Q6346K39844M90790R2026j35843l3049
17684A79420756M6318k200l34520n19682l03423n3741M7494J16724K19155J44764
17674A78781645j36485k64774j00059m5154j15829P7051M20742O95836M49870
17665A79762843K4267k25040k94132j26128M5592R1024J54113J58362L2505j33415
$$ plain form
17731 179533364 179261753 179226220 179497826 179628563 179595863 179588566 179651115 179744718 179667384 179298331
17721 179298331 179024849 179110136 179229163 179439620 179873911 180340328 180512676 180128484 179661715
17712 179661715 179321757 179264046 179442935 179671813 180101487 180592097 180841743 180759770 180613935
17703 180613935 180426356 179981955 179628678 179615579 179576598 179216711 178927347 178669739 178488418
17694 178488418 178442776 178464515 178587756 178680642 178766988 179006832 179497622 179589648 179453805 179420756
17684 179420756 179467074 179464874 179130354 178610672 178307249 178253508 178301002 178417726 178636881 178781645
17674 178781645 178645160 178380386 178280327 178235173 178119344 178196395 178617137 179312973 179762843
17665 179762843 179787110 179562070 179267938 179141810 179187402 179278426 179432539 179590901 179623406 179489991
17655A79489991k71553j23486K09350L32797K99259J50452K7153j267L9552q5491
17645A80066757k22225l70555j93612j22617k59644k62154p0862K61981L41802
17636A79168871k4837k57582P482N38296K29907l44652j59856J88820K13284O3198
17626A79622931L9757J19491o9250l98696n44047l14999k05882q4256J07169R629
17616A78281847J00079L63842L44437J53325L5189J41516K1179q3941r1712k34081
17606A79031680k76451k54152k00371j41780J54162J55725L1291j34891r743K06971
17596A78562441L35561M13437M05863L10270Q729J0953O3002L9316l3683q0606
17586A80035283j03438k08241q3705J13185k14457n37601l33480J3634K60988
$$ plain form
17655 179489991 179218438 179094952 179304302 179637099 179936358 180086810 180113963 180112696 180152248 180066757
17645 180066757 179844532 179473977 179280365 179157748 178898104 178635950 178565088 178827069 179168871
17636 179168871 179144034 178886452 178893934 179432230 179662137 179317485 179157629 179346449 179559733 179622931
17626 179622931 179662688 179782179 179712929 179314233 178770186 178455187 178249305 178165049 178272218 178281847
17616 178281847 178381926 178745768 179090205 179243530 179278719 179420235 179441414 179357473 179265761 179031680
17606 179031680 178755229 178501077 178300706 178158926 178313088 178468813 178500104 178365213 178355470 178562441
17596 178562441 178898002 179311439 179717302 180027572 180036301 180047254 180110256 180149572 180115889 180035283
17586 180035283 179931845 179723604 179639899 179753084 179538627 179001026 178667546 178681180 178942168
17577A78942168L85157J50240l79580m25372k15902J1529K55886K10291J22892
17568A79057309L1058k46355j80268N9347l7065L4174K35738J13020j59387l00306
17558A78607265j97112Q8630K72063R2008N6835J92538K28809O6889k75145l82203
17548A78750577k50364j13047O2955J53430q5768k19409j80125J84253K84393
17539A78586895o1044j70699p3781j02423L04730L21454M744N8283K61483P2002
17529A79201644j63013j24419J4173R0676N1068m2484P8763K39915K03809Q5391
17519A79635523m2547J77716J96704m8828l50576l19167M5415K63204j10291l77237
17509A79069916k40983J86034K90125L4332k71954m51010m19501k92529k04921
$$ plain form
17577 178942168 179327325 179477565 179097985 178672613 178456711 178468240 178724126 178934417 179057309
17568 179057309 179088367 178842012 178661744 178721091 178684026 178718200 178953938 179066958 178907571 178607265
17558 178607265 178410153 178498783 178770846 178862854 178919689 179112227 179341036 179407925 179132780 178750577
17548 178750577 178500213 178387166 178450121 178603551 178517783 178298374 178118249 178302502 178586895
17539 178586895 178525851 178355152 178281371 178178948 178483678 178805132 178809876 178868159 179129642 179201644
17529 179201644 179038631 178914212 178928385 179019061 179070129 179027645 179106408 179346323 179550132 179635523
17519 179635523 179592976 179770692 179967396 179918568 179567992 179248825 179294240 179557444 179447153 179069916
17509 179069916 178828933 179014967 179305092 179339424 179067470 178616460 178196959 177904430 177699509
17500A77699509j59554o5966o281j57259j74981K37073L49595L64361M86090K76821
17490A78849408M9853j69500l34696k53528j63594p7082k39379m54032j2638J06065
17480A77300877p9485J78025K97453j489m0690J90345R1031L333K24968L99530
17470A78563898K70968J81019R484k33908k09415j71110J21917M3481p1889p979
17460A78496466k24838k57431k6268j03907o3379K33058L06874j5906l87928k8147
17450A77928594O69932P82764J41922k40284j78753l51871j82160J87405M86497
17441A79244046N79343J01044k82476m50620n78380m31684n7539k1232k67535
17432A77834967j55880J42746J28860j58203k19476Q2198M92852K07367k9873
$$ plain form
17500 177699509 177539955 177473989 177467708 177310449 177135468 177372541 177722136 178086497 178572587 178849408
17490 178849408 178899261 178729761 178395065 178141537 177977943 177900861 177661482 177207450 177194812 177300877
17480 177300877 177221392 177399417 177696870 177695381 177654691 177845036 177936067 177939400 178164368 178563898
17470 178563898 178834866 179015885 179025369 178791461 178582046 178410936 178532853 178576334 178504445 178496466
17460 178496466 178271628 178014197 177987929 177884022 177820643 178053701 178360575 178344669 177956741 177928594
17450 177928594 178598526 179381290 179523212 179282928 179104175 178752304 178570144 178757549 179244046
17441 179244046 179823389 179924433 179641957 179191337 178612957 178181273 178123734 178102502 177834967
17432 177834967 177679087 177821833 177950693 177792490 177573014 177655212 178148064 178355431 178325558
17423A78325558j43992j30640j52799k67157L5223J85409R7747L5641J35856P2351
17413A78193197n0495J16384J05591K0879j26481j92395K7776J21425J6173m5553
17403A78186501R9480l6702k08649j67090k03259j05822k05932j71449Q3158O8397
17393A77338633j07882k1084L17124N02568K88428J47593L3458k32964k28903
17384A78036971k14999J34026L15161Q1841l72308m56009n1520K31217K18060
17375A77922440l4544j19372P7509J45147J58153K22434K88571R2113r9098K2676
17365A78676029j67444m87898m18365l4893K92995R6515q0719Q0599K51757P1713
17355A78280289k35613l21540k77534j85416k30086l970M93404L48602m7244k61435
$$ plain form
17423 178325558 178181566 178050926 177898127 177630970 177666193 177851602 177949349 177984990 178120846 178193197
17413 178193197 178142702 178259086 178364677 178385556 178259075 178066680 178094456 178215881 178232054 178186501
17403 178186501 178285981 178249279 178040630 177873540 177670281 177564459 177358527 177187078 177270236 177338633
17393 177338633 177230751 177209667 177526791 178029359 178317787 178465380 178498838 178265874 178036971
17384 178036971 177821972 177955998 178271159 178353000 177980692 177524683 177473163 177704380 177922440
17375 177922440 177887896 177768524 177846033 177991180 178149333 178371767 178660338 178752451 178653353 178676029
17365 178676029 178508585 178020687 177602322 177567429 177860424 177956939 177876220 177956819 178208576 178280289
17355 178280289 178044676 177723136 177445602 177260186 177030100 177026130 177519534 177868136 177820892 177559457
17345A77559457j95695L3428L44638M63860K50263n2694k84883m53477k86321
17336A77378576j75734k85007k06381j2068J50475M0290K01302L48401L12377
17327A77752231J73951j16265j51597n6494M0686L1606j26240k4058Q9761R9914
17317A77713495K72148K84447k5794m02322n08315j10379J70974p3935j05965
17308A77214354M12763M57295J67074r6984j07178l3716l38230l89362j29918
17299A77156098J53570J86621l02029m95536k44170P492r8970j87550M9104M47589
17289A76672219P10967M34488j1040j57100r7629j85523k20042l74446k41170
17280A76530724j07879O9379L02718K90465K46995o9117l34913n9654K57019K11138
$$ plain form
17345 177559457 177363762 177397190 177741828 178205688 178455951 178403257 178118374 177664897 177378576
17336 177378576 177202842 176917835 176711454 176699386 176849861 176890151 177091453 177439854 177752231
17327 177752231 177926182 177809917 177658320 177601826 177642512 177674118 177547878 177523820 177613581 177713495
17317 177713495 177985643 178270090 178244296 177841974 177333659 177223280 177394254 177320319 177214354
17308 177214354 177627117 178084412 178251486 178154502 178047324 178013608 177675378 177286016 177156098
17299 177156098 177309668 177496289 177194260 176698724 176454554 176462046 176363076 176175526 176224630 176672219
17289 176672219 177383186 177817674 177806634 177649534 177551905 177366382 177146340 176771894 176530724
17280 176530724 176422845 176492224 176794942 177085407 177332402 177263285 176928372 176868718 177125737 177336875
17270A77336875j6123k63231k28334n0171J14900J68207J53798O0831j32010k57606
17260A76887136j24136K50378L38231K00838R1918J0820L1734L0822m2041l44914
17250A77330786j81832J12079K53268K40046r2105j70704o9850j09345k87995
17241A77024348k22638j36702Q1494J54065N1963M2209J47218R9728q0168j16405
17231A77045112J57053M09236K15106r4123r6883q6162n1566r9342j43810k15645
17221A77038976l89048k86211Q6189J17615J79478R3546N308J85802L742q9545
17211A76945852N2720j97336l09764M7256P0197k8927J1814k6206J18267K55094
17201A76938967R3167J91158J99493j8161k68175k54899P0719K03080K68321K31720
$$ plain form
17270 177336875 177320752 177057521 176829187 176779016 176893916 177062123 177215921 177276752 177144742 176887136
17260 176887136 176763000 177013378 177351609 177552447 177644365 177655185 177686919 177717741 177675700 177330786
17250 177330786 177148954 177261033 177514301 177754347 177662242 177491538 177421688 177312343 177024348
17241 177024348 176801710 176665008 176746502 176900567 176952530 176994739 177141957 177241685 177161517 177045112
17231 177045112 177202165 177611401 177826507 177732384 177635501 177549339 177497773 177398431 177254621 177038976
17221 177038976 176649928 176363717 176449906 176567521 176746999 176840545 176845853 177031655 177035397 176945852
17211 176945852 176998572 176801236 176491472 176538728 176608925 176579998 176591812 176565606 176683873 176938967
17201 176938967 177032134 177223292 177422785 177404624 177136449 176881550 176952269 177155349 177423670 177655390
17191A77655390K10324J72681j64729l59920m3025m87j14357L9021J86722Q9984
17181A77671604o7215J3599J64376J07355j26698l03541k26973p4901l9847k49892
17171A76867867l7556J73814j16892j23985J39082N62516O72839J62227m58763
17162A77841149m63193l22096j48557q3884j32373k7404J16915J70366J4075M4092
17152A77009090J96919J33476q0249j15829q4380j99011k05359r4998Q0909J49146
17142A76789714K73583J06336k16033j0129J4333o3967m9604j84088k90367k96984
17132A76072794o9179j0356m5731J5917K60659K20874nJ08381K18525J39612M3860
17121A76955351J03737J41654j11885m67593k68077L3383M265l8526K70108N05428
$$ plain form
17191 177655390 177865714 178038395 177873666 177513746 177470721 177470234 177355877 177394898 177581620 177671604
17181 177671604 177604389 177617988 177782364 177889719 177763021 177459480 177232507 177157606 177117759 176867867
17171 176867867 176830311 177004125 176887233 176763248 176902330 177464846 178137685 178299912 177841149
17162 177841149 177377956 177055860 176907303 176823419 176691046 176663642 176780557 176950923 176964998 177009090
17152 177009090 177206009 177339485 177259236 177143407 177059027 176860016 176654657 176559659 176640568 176789714
17142 176789714 177063297 177169633 176953600 176943471 176957804 176893837 176844233 176660145 176369778 176072794
17132 176072794 176003615 175993259 175947528 175963445 176224104 176444978 176444973 176553354 176771879 176911491 176955351
17121 176955351 177059088 177200742 177088857 176621264 176353187 176386570 176390835 176352309 176622417 177127845
17111A77127845K59030K8907L9603k9395j54782k45889k64527k2711N5180j22160
17101A76671101j05031j20625k23411k15768j29474K6110R6977J30127N07374
17092A76637380L33727k66684k86214l21800k53992M5108R3560N8188l1114j86390
17082A75821769k48560j81016J47126K33642k1770J56050M95900O05368K73990
17073A77282499j66128m49306k33458K74549N80081L59418q2094l95052l57570
17064A76812939j36585M0392k8660j08833j37506j06635m862p9577n3369k9703
17054A76167601O5179j19031j99941p6114L6324j57357k60883j4841J61095L49128
17044A75951160K14982j53106k18047j54619M2670K70269J78361J7835j93673
$$ plain form
17111 177127845 177386875 177415782 177455385 177425990 177271208 177025319 176760792 176738081 176793261 176671101
17101 176671101 176566070 176445445 176222034 176006266 175876792 175902902 175999879 176130006 176637380
17092 176637380 176971107 176704423 176418209 176096409 175842417 175887525 175981085 176039273 176008159 175821769
17082 175821769 175573209 175392193 175539319 175772961 175751191 175907241 176403141 177008509 177282499
17073 177282499 177116371 176667065 176433607 176708156 177288237 177647655 177565561 177170509 176812939
17064 176812939 176676354 176716746 176688086 176579253 176441747 176335112 176330250 176250673 176197304 176167601
17054 176167601 176232780 176113749 175913808 175837694 175874018 175716661 175455778 175440937 175602032 175951160
17044 175951160 176166142 176013036 175794989 175640370 175683040 175953309 176131670 176149505 175955832
17035A75955832j66484M6100N5621K84792L80770J32484k001k5098l84101m54525
17025A75823390m46239j43127Q6022j04566k43224N2589M14178K15654j15608
17016A75539069L4221O4615n3668J59175L95108K47335j1540j14696j68138Q4988
17006A76176469N56726J64355l87753m36508n21691m72366k8578J84533J29118
16997A75364305O5387K4784J96548L15794J94362m5582p4565k3335k9825J12313
16987A76100186K67529J35862j35637j73635j53242j93843k16818o3468q245K09967
16977A75768656K45475j59308k56683k91467j67577j02543j02009J11888L07512
16968A75353944L58787L93594J51061n5600p1676p4914j53497j38824K25566J49257
$$ plain form
17035 175955832 175789348 175835448 175891069 176175861 176556631 176689115 176687114 176662016 176277915 175823390
17025 175823390 175377151 175234024 175320046 175215480 174972256 175024845 175439023 175654677 175539069
17016 175539069 175573290 175637905 175584237 175743412 176138520 176385855 176374315 176259619 176091481 176176469
17006 176176469 176733195 176897550 176509797 176073289 175551598 175079232 175050654 175235187 175364305
16997 175364305 175429692 175454476 175651024 175966818 176161180 176115598 176041033 176017698 175987873 176100186
16987 176100186 176367715 176503577 176367940 176194305 176041063 175847220 175630402 175566934 175558689 175768656
16977 175768656 176014131 175854823 175598140 175306673 175139096 175036553 174934544 175046432 175353944
16968 175353944 175712731 176106325 176257386 176201786 176130110 176055196 175901699 175762875 175988441 176137698
16958A76137698j91197m33326l67363j76383j34908Q3387K01305K21904J20981
16949A75462098N6116K45505P6728j61353j74206j03836J5452j64633k63270r4683
16939A74893918J45753Q261j45937j0151Q073P1282P5209m0713N346J65544q81
16928A75175704j30658k13490k04992J8475K71932K8788k93247l78091k98992
16919A73975429o1854J04328J93096L96424M38874J29881j20086p6756j20082
16910A74859254m02452j33367J25809J39734M56706O42860J65991n7265j17568
16901A75679702j42760L7419K65759K99318J28324J18253J42126K14881J73668
16892A76916690k60559p27411q55656n32661J2673K18016J51366J55501o1510
$$ plain form
16958 176137698 175946501 175513175 175145812 174969429 174834521 174917908 175119213 175341117 175462098
16949 175462098 175518214 175763719 175840447 175679094 175504888 175401052 175416504 175251871 174988601 174893918
16939 174893918 175039671 175047932 174901995 174891844 174899917 174971199 175046408 175005695 175011041 175176585 175175704
16928 175175704 175045046 174831556 174626564 174645039 174916971 174945759 174652512 174274421 173975429
16919 173975429 173913575 174017903 174210999 174607423 175046297 175176178 175056092 174979336 174859254
16910 174859254 174456802 174323435 174449244 174588978 175045684 175688544 175854535 175797270 175679702
16901 175679702 175536942 175574361 175840120 176139438 176267762 176386015 176528141 176743022 176916690
16892 176916690 176656131 175928720 175073064 174540403 174553076 174771092 174922458 175077959 175016449
16883A75016449k4926P0305o3726j62614o472K87094N35692K90021q2724k84679
16873A75574420n54801n57513k55837j27120N0757J87706J91210K25630J92648
16864A74927100J80842j0076k52350j36776j57565l34483j69207J39337K40376
16855A74427198K37788R1034J00679k3663l19490l78966k33175j5521r498J07751
16845A73984137J66965J11663J37478n635n6910L05912N66049L92396Q5436R000
16835A75696491L0129k49497k93958L365l0732j48521J3789P4629J64869j5739
16825A75244825o1046L8260J58067K14663J14913n2501k25197k16680j98372k0564
16815A74996368r806j7344J03273J16617j6851N6973j5877j91193j76029k69076
$$ plain form
16883 175016449 174991523 175061828 174998102 174835488 174829016 175116110 175651802 175941823 175859099 175574420
16873 175574420 175019619 174462106 174206269 174079149 174129906 174317612 174508822 174734452 174927100
16864 174927100 175107942 175097866 174845516 174708740 174551175 174216692 174047485 174186822 174427198
16855 174427198 174664986 174756020 174856699 174833036 174513546 174134580 173901405 173885884 173876386 173984137
16845 173984137 174151102 174262765 174400243 174394608 174337698 174643610 175209659 175602055 175687491 175696491
16835 175696491 175726620 175477123 175183165 175186530 175155798 175007277 175021066 175095695 175260564 175244825
16825 175244825 175183779 175222039 175380106 175594769 175709682 175657181 175431984 175215304 175016932 174996368
16815 174996368 174986562 174969218 175072491 175189108 175172257 175229230 175213353 175022160 174846131 174577055
16805A74577055k67944l16314m0553M50313M12575j5008r8159j45715j78153J57806
16795A74535903L22842J86270m5267o1148r7576j71655l05136k29442J61445M03640
16785A74699876N36130L78389J66168k7784l24575n75411l84185r6162P489K74595
16775A74654530M15760K84627j08730k35762n456K20987K81366J53121k38051
16766A75422392l94401j04461K08265K17006R8155N0442j13327j93525r398K83789
16756A75464937r3294m94351j91420R1919K80342J58311j38603j8104N0586k40243
16746A74870080m63294l62328k17711q6759J10580J97308K00785J66584r2245
16737A74323000j9332O9693l00634m79391k68817P9615K05987J43592l7140j82554
$$ plain form
16805 174577055 174309111 173992797 173952244 174402557 174815132 174800124 174701965 174556250 174378097 174535903
16795 174535903 174858745 175045015 174999748 174938600 174841024 174669369 174364233 174134791 174296236 174699876
16785 174699876 175236006 175614395 175780563 175752779 175428204 174852793 174468608 174372446 174379935 174654530
16775 174654530 175070290 175354917 175246187 175010425 175004969 175225956 175507322 175660443 175422392
16766 175422392 175027991 174923530 175131795 175348801 175446956 175497398 175384071 175190546 175181148 175464937
16756 175464937 175371643 174877292 174685872 174777791 175058133 175216444 175077841 175059737 175110323 174870080
16746 174870080 174406786 174044458 173826747 173739988 173850568 174047876 174248661 174415245 174323000
16737 174323000 174303668 174373361 174072727 173593336 173324519 173404134 173610121 173753713 173716573 173534019
16727A73534019P735Q8183Q1605L47239L60823K98843r4160l49256k11422j88813
16717A73874796j46391p7003j63001j81921O7292K82369J51979k57150k47712
16708A73303258N2754J38140J48876K31458K54231J34483N6683J42594M1049r6598
16698A74406928j07157K5241K09178J97985K52164K33139k05740k20885J24958
16689A74915811j27897l53481j66482k7692q9485L7518J35408j70283l96148k50913
16679A73506356K69677M19877L01375K10553O4465J05534L9280k4075k46117n11369
16669A74135556n81753j09192L24361K19559j08430j91311k55125k08722L44499
16660A73569442O89507J95533j10788k93858k06084P5434l4307j83701l72411
$$ plain form
16727 173534019 173541754 173629937 173711542 174058781 174419604 174718447 174624287 174275031 174063609 173874796
16717 173874796 173728405 173651402 173488401 173306480 173373772 173656141 173808120 173550970 173303258
16708 173303258 173356012 173494152 173643028 173874486 174128717 174263200 174319883 174462477 174503526 174406928
16698 174406928 174299771 174325012 174534190 174732175 174984339 175217478 175011738 174790853 174915811
16689 174915811 174787914 174434433 174267951 174240259 174150774 174188292 174323700 174153417 173757269 173506356
16679 173506356 173776033 174195910 174497285 174707838 174772303 174877837 174917117 174893042 174646925 174135556
16669 174135556 173553803 173444611 173768972 173988531 173880101 173688790 173433665 173224943 173569442
16660 173569442 174258949 174454482 174343694 174049836 173843752 173919186 173884879 173701178 173328767
16651A73328767m87913k87758k3172J88456J91609L2976k45774j54680J43796
16642A72686307M237j57142r0304J02511j7140r6907R8702K90726L16117j15680
16632A73021427k68886M0886J94581N7071R1313L55583L53312n1774m54783m86493
16622A72852237j96693J01324J31159O6134J10142O3059j82484j98677j46785
16613A72599416o452J65830q2868n33594o38216K77517R02879M94729L04940M1858
16603A73526039q0960k7045k2629n5395J26389M49599L91927J10764j33228j43857
16593A74141604l128n4599k6339K50869J601m15160k20750K9897k1373j94088
16583A73488534j77444p1095j39324j02727n708Q7800j8414j36482l01379l18795
$$ plain form
16651 173328767 172840854 172553096 172529924 172718380 172909989 172942965 172697191 172542511 172686307
16642 172686307 172690544 172533402 172443098 172545609 172528469 172431562 172530264 172820990 173137107 173021427
16632 173021427 172752541 172793427 172988008 173045079 173136392 173491975 173845287 173793513 173338730 172852237
16622 172852237 172655544 172756868 172888027 172954161 173064303 173127362 172944878 172746201 172599416
16613 172599416 172592964 172758794 172675926 172142332 171504116 171781633 172684512 173179241 173484181 173526039
16603 173526039 173445079 173418034 173395405 173340010 173466399 173915998 174307925 174418689 174285461 174141604
16593 174141604 174138476 174083877 174057538 174308407 174310008 173894848 173674098 173703995 173682622 173488534
16583 173488534 173311090 173239995 173100671 172997944 172992236 173080036 173061622 172925140 172623761 172304966
16573A72304966J08758N49296P18571L27337k82827l37834k12390l06839j32888
16564A72736150K82649L23704j09695m07080j85606K34047K57204M7468J00214
16555A73279055K70370K61430J13239j37476q0317j11272k65206k81113j23210
16546A72925500k7744r847p9920m8386J09042L09234J27218l49860k87858K2918
16536A72690297L7655M5590K37458L09093O1166j09704j18155j53602j91976k38888
16526A72568934q489L2273j07251j10525j72396J63072L06743K9048k9881Q9758
16516A72761286L31910M50946q0618m61754j86919j17500k52787k09810n4486
16507A72180268p6144Q1234J70027l1034k68455l97841j98316N4122m1896M5899
$$ plain form
16573 172304966 172413724 172963020 173681591 174008928 173726101 173388267 173175877 172869038 172736150
16564 172736150 173018799 173342503 173232808 172825728 172640122 172874169 173131373 173178841 173279055
16555 173279055 173549425 173810855 173924094 173786618 173706301 173595029 173329823 173048710 172925500
16546 172925500 172897756 172887909 172807989 172759603 172868645 173177879 173305097 172955237 172667379 172690297
16536 172690297 172727952 172773542 173011000 173320093 173381259 173271555 173153400 172999798 172807822 172568934
16526 172568934 172560445 172592718 172485467 172374942 172202546 172365618 172672361 172701409 172671528 172761286
16516 172761286 173093196 173544142 173463524 173001770 172814851 172697351 172444564 172234754 172180268
16507 172180268 172104124 172185358 172355385 172324351 172055896 171658055 171459739 171513861 171471965 171517864
16497A71517864M02539M50823L12073M1364j65627N931J44520K44361J21904q8510
16487A72987242j44490k0215K47068K32663n5345k65363k77364m29266m22008
16478A71852922o4687J02691J64010K70368K24380R5941l1884O7004K45496J57689
16468A73083930q4860k86228j78700L0147K31707J98339j49152j11792J49525
16459A72882916L46998J82299l07498l11435j823j3545O9137J95321L9385j36554
16449A72945201j70807j49777k37853k25327n3481K10668K06259Q005J903P128
16439A72541919k82594l86878k14211P5780O5706K31565O52627L40185j40928
16430A72883171j42894q9189j26479J60556K44100l5320j03842K1206J31225N1185
$$ plain form
16497 171517864 171920403 172371226 172683299 172724663 172559036 172564967 172709487 172953848 173075752 172987242
16487 172987242 172842752 172822537 173069605 173302268 173246923 172981560 172704196 172274930 171852922
16478 171852922 171788235 171890926 172054936 172325304 172549684 172645625 172613741 172680745 172926241 173083930
16468 173083930 172999070 172712842 172534142 172564289 172795996 172994335 172845183 172733391 172882916
16459 172882916 173229914 173412213 173104715 172793280 172791457 172777912 172847049 173042370 173081755 172945201
16449 172945201 172774394 172624617 172386764 172161437 172107956 172318624 172524883 172532888 172534791 172541919
16439 172541919 172259325 171872447 171658236 171734016 171799722 172031287 172683914 173024099 172883171
16430 172883171 172740277 172651088 172524609 172685165 172929265 172893945 172790103 172811309 172942534 172993719
16420A72993719k33829k02520j04742m0463n343J8666P435j36864j18693j61538
16410A72015828q9775K39478L32388K74959Q6362K9932P4682j48817k41974l76974
16400A72196089m40422k41986J21300M04740K40333P4998l0561j5262J29575J93920
16390A72632724K44595p3740l68735k99303j64347n32702p23603j83517L44494
16381A70875866M15908L22284J05571J14880L46901L64081J86334j07578j60083
16372A72464164n5487j10120r1178J55180K76053P5249k12610j59102q8324k63007
16362A71990818j18420J12745L52887N04781K29597j91689l77309m24622m11192
$$ plain form
16420 172993719 172759890 172557370 172452628 172412165 172406822 172425488 172432923 172296059 172177366 172015828
16410 172015828 171926053 172165531 172497919 172772878 172859240 172889172 172963854 172815037 172573063 172196089
16400 172196089 171755667 171513681 171634981 172039721 172280054 172355052 172324491 172309229 172438804 172632724
16390 172632724 172877319 172803579 172434844 172135541 171971194 171438492 170714889 170531372 170875866
16381 170875866 171291774 171614058 171719629 171834509 172181410 172545491 172731825 172624247 172464164
16372 172464164 172408677 172298557 172207379 172362559 172638612 172713861 172501251 172342149 172253825 171990818
16362 171990818 171872398 171985143 172338030 172842811 173072408 172880719 172503410 172078788 171667596
$$ [...]
##END NTUPLES=NMR SPECTRUM
##END=
