##TITLE=c13 ikalashn
LR-788-O-C1
23.10.2024
##JCAMPDX= 6.0         $$ Bruker NMR JCAMP-DX V2.0
##DATA TYPE= NMR SPECTRUM
##DATA CLASS= NTUPLES
##ORIGIN= UXNMR, Bruker Analytische Messtechnik GmbH
##OWNER= root
$$ TOPSPIN		Version 1.3
$$ 2024-10-23 11:17:35.890 +0400  Irina@DPX200
$$ Compression mode = diff/dup
##.OBSERVE FREQUENCY= 50.3277412709
##.OBSERVE NUCLEUS= ^13C
##.ACQUISITION MODE= SIMULTANEOUS
##.ACQUISITION SCHEME= undefined
##.AVERAGES= 20310
##.DIGITISER RES= 17
##SPECTROMETER/DATA SYSTEM= spect
##.PULSE SEQUENCE= zgpg
##.SOLVENT NAME= CDCl3
##.SHIFT REFERENCE= INTERNAL, CDCl3, 1, 219.1352
##AUDIT TRAIL= $$ (NUMBER, WHEN, WHO, WHERE, WHAT)
$$ ##TITLE= Audit trail, TOPSPIN		Version 1.3
$$ ##JCAMPDX= 5.01
$$ ##ORIGIN= Bruker BioSpin GmbH
$$ ##OWNER= Irina
$$ $$ F:/spectra/data/iren/nmr/c13zvl/1/pdata/1/auditp.txt
$$ ##AUDIT TRAIL=  $$ (NUMBER, WHEN, WHO, WHERE, VERSION, WHAT)
(   1,<2024-10-23 11:16:48.296 +0400>,<Irina>,<DPX200>,<TOPSPIN 1.3>,
      <created by zg
	started at 2024-10-22 15:55:44.359 +0400,
	POWCHK disabled, PULCHK disabled
       terminated by command 'halt'
       configuration hash MD5:
       BE 6D 3F 07 2A EA 11 49 91 17 2B D3 AF B3 58 0D
       data hash MD5: 32K
       5D A6 6A 7E C0 47 59 BD A9 6A D8 E7 AC 16 A8 81>)
(   2,<2024-10-23 11:16:51.500 +0400>,<Irina>,<DPX200>,<TOPSPIN 1.3>,
      <Start of raw data processing
       efp BC_mod = 2 LB = 2 FT_mod = 6 PKNL = 1 PHC0 = 167.8297 PHC1 = 11.88474 SI = 32K 
       data hash MD5: 32K
       36 D8 9A B4 B8 FD BC 0A 95 D7 4B 4D E9 73 32 83>)
(   3,<2024-10-23 11:16:53.765 +0400>,<Irina>,<DPX200>,<TOPSPIN 1.3>,
      <apk 
       data hash MD5: 32K
       A3 5F AC DA D8 4F 9D A4 C1 7B 1F EC BE 3F 8F 16>)
(   4,<2024-10-23 11:16:56.171 +0400>,<Irina>,<DPX200>,<TOPSPIN 1.3>,
      <abs n ABSG = 5 
       data hash MD5: 32K
       B3 72 B6 A1 CD 64 66 8B 65 BF 71 55 75 A3 1C 51>)
$$ ##END=
$$ 
$$ $$ hash MD5
$$ $$ 15 54 28 36 36 DA 1A 3F B9 9E C3 4E 59 54 E4 FE
##$RELAX= 
##$RELAX= 
##$RELAX= 
##$RELAX= 
##$RELAX= 
##$RELAX= 
##$RELAX= 
##$RELAX= 
##$RELAX= 
$$ Bruker specific parameters
$$ --------------------------
##$DU= <F:/spectra>
##$EXPNO= 1
##$NAME= <c13zvl>
##$PROCNO= 1
##$TYPE= <nmr>
##$USER= <iren>
##$AMP= (0..31)
100 100 100 100 100 100 100 100 100 100 100 100 100 100 100 100 100 100 
100 100 100 100 100 100 100 100 100 100 100 100 100 100 
##$ANAVPT= -1
##$AQSEQ= 0
##$AQ_mod= 1
##$AUNM= <au_zg>
##$AUTOPOS= <>
##$BF1= 50.322709
##$BF2= 200.13
##$BF3= 200.13
##$BF4= 200.13
##$BF5= 200.13
##$BF6= 200.13
##$BF7= 200.13
##$BF8= 200.13
##$BYTORDA= 1
##$CFDGTYP= 0
##$CFRGTYP= 5
##$CHEMSTR= <none>
##$CNST= (0..63)
1 1 145 1 1 1 1 1 1 1 1 1 1 1 1 1 1 1 1 1 1 1 1 1 1 1 1 1 1 1 1 1 1 1 
1 1 1 1 1 1 1 1 1 1 1 1 1 1 1 1 1 1 1 1 1 1 1 1 1 1 1 1 1 1 
##$CPDPRG= <waltz16>
##$CPDPRG1= <>
##$CPDPRG2= <waltz16>
##$CPDPRG3= <>
##$CPDPRG4= <mlev>
##$CPDPRG5= <mlev>
##$CPDPRG6= <mlev>
##$CPDPRG7= <mlev>
##$CPDPRG8= <mlev>
##$CPDPRGB= <>
##$CPDPRGT= <>
##$D= (0..63)
$$ [...]
##$SW= 238.246489333188
##$SWIBOX= (0..15)
0 1 3 0 0 0 0 0 0 0 0 0 0 0 0 0 
##$SW_h= 11990.4076738609
##$TD= 32768
##$TD0= 1
##$TE= 300
##$TE2= 300
##$TE3= 300
##$TEG= 300
##$TL= (0..7)
120 120 120 120 120 120 120 120 
##$TP= (0..7)
150 150 150 150 150 150 150 150 
##$TP07= 0
##$TPNAME0= <>
##$TPNAME1= <>
##$TPNAME2= <>
##$TPNAME3= <>
##$TPNAME4= <>
##$TPNAME5= <>
##$TPNAME6= <>
##$TPNAME7= <>
##$TPOAL= (0..7)
0.5 0.5 0.5 0.5 0.5 0.5 0.5 0.5 
##$TPOFFS= (0..7)
0 0 0 0 0 0 0 0 
##$TUNHIN= 0
##$TUNHOUT= 0
##$TUNXOUT= 0
##$USERA1= <user>
##$USERA2= <user>
##$USERA3= <user>
##$USERA4= <user>
##$USERA5= <user>
##$V9= 5
##$VALIST= <valist>
##$VCLIST= <CCCCCCCCCCCCCCC>
##$VD= 0
##$VDLIST= <DDDDDDDDDDDDDDD>
##$VPLIST= <PPPPPPPPPPPPPPP>
##$VTLIST= <TTTTTTTTTTTTTTT>
##$WBST= 1024
##$WBSW= 4
##$XGAIN= (0..3)
0 0 0 0 
##$XL= 0
##$YL= 0
##$YMAX_a= 12227239
##$YMIN_a= -41049443
##$ZGOPTNS= <>
##$ZL1= 120
##$ZL2= 120
##$ZL3= 120
##$ZL4= 120
##$ABSF1= 219.1352
##$ABSF2= -19.13512
##$ABSG= 5
##$ABSL= 3
##$ALPHA= 0
##$AQORDER= 0
##$ASSFAC= 0
##$ASSFACI= 0
##$ASSFACX= 0
##$ASSWID= 0
##$AUNMP= <proc_1d>
##$AXLEFT= 0
##$AXRIGHT= 0
##$AXTYPE= 0
##$AXUNIT= <>
##$AZFE= 0.1
##$AZFW= 0.5
##$BCFW= 0
##$BC_mod= 2
##$BYTORDP= 0
##$COROFFS= 0
##$CY= -3
##$DATMOD= 1
##$DC= 0
##$DFILT= <>
##$DTYPP= 0
##$F1P= 0
##$F2P= 0
##$FCOR= 0.5
##$FTSIZE= 32768
##$FT_mod= 6
##$GAMMA= 0
##$GB= 0
##$INTBC= 1
##$INTSCL= 1.406111e-010
##$ISEN= 30
##$LB= 2
##$LEV0= 0
##$LPBIN= 0
##$MAXI= 7.640843
##$MC2= 0
##$MEAN= 0
##$ME_mod= 0
##$MI= 1.154659
##$NCOEF= 0
##$NC_proc= -3
##$NLEV= 6
##$NOISF1= 0
##$NOISF2= 0
##$NSP= 0
##$NTH_PI= 0
##$NZP= 0
##$OFFSET= 219.1352
##$PC= 1.4
##$PHC0= 192.0417
##$PHC1= -2.564437
##$PH_mod= 1
##$PKNL= yes
##$PPARMOD= 0
##$PPDIAG= 0
##$PPIPTYP= 0
##$PPMPNUM= 100
##$PPRESOL= 1
##$PSCAL= 0
##$PSIGN= 0
##$REVERSE= no
##$SF= 50.322709
##$SI= 32768
##$SIGF1= 0
##$SIGF2= 0
##$SINO= 80
##$SIOLD= 32768
##$SREGLST= <13C.CDCl3>
##$SSB= 0
##$STSI= 32768
##$STSR= 0
##$SW_p= 11990.4076738609
##$SYMM= 0
##$S_DEV= 0
##$TDeff= 32768
##$TDoff= 0
##$TI= <>
##$TILT= no
##$TM1= 0
##$TM2= 0
##$TOPLEV= 0
##$USERP1= <user>
##$USERP2= <user>
##$USERP3= <user>
##$USERP4= <user>
##$USERP5= <user>
##$WDW= 1
##$XDIM= 32768
##$YMAX_p= 261768043
##$YMIN_p= -1780835
$$ End of Bruker specific parameters
$$ ---------------------------------
##NTUPLES= NMR SPECTRUM
##VAR_NAME=  FREQUENCY,     SPECTRUM/REAL,   SPECTRUM/IMAG
##SYMBOL=    X,             R,               I
##VAR_TYPE=  INDEPENDENT,   DEPENDENT,       DEPENDENT
##VAR_FORM=  AFFN,          ASDF,            ASDF
##VAR_DIM=   32768,         32768,           32768
##UNITS=     HZ,            ARBITRARY UNITS, ARBITRARY UNITS
##FACTOR=    0.365929370215793, 1,           1
##FIRST=     11990.4076738609, 97412,        5685323
##LAST=      0,             814158,          -41258499
##MIN=       0,             -1780835,        0
##MAX=       11990.4076738609, 261768043,    0
$$ Real data points
##PAGE= N=1
##DATA TABLE= (X++(R..R)), XYDATA
$$ [...]
##PAGE= N=2
##DATA TABLE= (X++(I..I)), XYDATA
24414 235726748 235649890 235559399 235514644 235526393 235574645 235600248 235516482 235321775 235066242 234811844
24404 234811844 234633076 234568877 234611444 234739450 234937493 235198815 235483440 235711175 235853263
24395 235853263 235951136 235989247 235951740 235902639 235893097 235941230 236032233 236093561 236050876 235904241 235757763
24384 235757763 235721481 235766211 235797063 235806412 235810970 235798157 235782090 235762818 235753946 235825912 235978355
24373 235978355 236123895 236234821 236344668 236424494 236401420 236274321 236128686 236002654 235839091
24364 235839091 235656867 235551922 235507120 235474724 235522257 235659604 235774734 235825494 235833343 235781440
24354 235781440 235691644 235653532 235718969 235873772 236046440 236199158 236368146 236556584 236731747 236842680
24344 236842680 236888419 236912849 236918910 236880782 236803372 236727987 236745022 236877584 237048352 237190615
24334 237190615 237234200 237140470 236997213 236934807 236972206 237048576 237152699 237375000 237728919 238052414
24324 238052414 238194200 238163852 238065391 238001918 238012222 238099301 238254854 238450012 238665264 238822417
24314 238822417 238852899 238842917 238917987 239068268 239149870 239049399 238846510 238722701 238756366 238881600
24304 238881600 239008167 239113718 239211306 239284571 239351492 239466917 239636917 239848636 240090901 240311795
24294 240311795 240494436 240675952 240895027 241157912 241452913 241790890 242151491 242428755 242591540
24285 242591540 242761676 243014864 243286418 243514184 243744000 244056014 244432467 244765930 245007653
24276 245007653 245168683 245319716 245517342 245747203 246043149 246435921 246828008 247170624 247547845
24267 247547845 247994267 248485478 249038141 249649253 250271620 250841743 251274607 251536205 251664001
24258 251664001 251629153 251315900 250678811 249726686 248446146 246895114 245174204 243368026 241592632
24249 241592632 239930786 238415912 237062110 235831398 234661213 233479066 232269131 231022610
24241 231022610 229708340 228341687 226955689 225583817 224268404 223080142 222069995 221237342
24233 221237342 220595426 220202351 220069242 220133897 220306926 220481058 220641260 220869302 221203541
24224 221203541 221632851 222098214 222587411 223131644 223683944 224152295 224511193 224804781 225087956
24215 225087956 225384662 225646857 225757382 225672780 225496051 225350357 225247035 225157508 225062401 224949349
24205 224949349 224822771 224694092 224585117 224469125 224352584 224283769 224271701 224251780 224160912 224020488
24195 224020488 223891781 223797573 223717282 223688069 223785542 223913208 223947915 223964548 224041218 224198463
24185 224198463 224405081 224611838 224815996 224997349 225114293 225187605 225261254 225378671 225565566
24176 225565566 225778833 225944319 226029480 226023499 225976632 225990186 226079502 226218949 226414350 226631576
24166 226631576 226831478 226979752 227057764 227115812 227216187 227364695 227526620 227656711 227707949 227697886
24156 227697886 227680235 227698980 227792447 227941815 228066137 228185687 228347801 228500028 228583059 228648264
24146 228648264 228743409 228825882 228864614 228863563 228836734 228813308 228837330 228926483 229044705 229104336 229037794
24135 229037794 228918527 228851657 228904098 229055387 229195750 229290349 229360120 229383828 229354613 229295008
24125 229295008 229275834 229360353 229490188 229540805 229495667 229462398 229489887 229476618 229376778 229266707
24115 229266707 229188044 229142394 229161094 229236108 229277387 229241887 229177552 229183722 229313412 229516808 229710983
24104 229710983 229837857 229892627 229935057 229964325 229934586 229848654 229709072 229574007 229548489 229639319
24094 229639319 229787611 229918153 229952088 229844506 229630696 229394424 229196605 229086316 229107483
24085 229107483 229249207 229469679 229721987 229976469 230213483 230416545 230501978 230349659 230044316
24076 230044316 229813077 229747693 229776547 229837775 229945880 230125615 230362205 230591144 230721570 230683931
24066 230683931 230521755 230339115 230242586 230279029 230322753 230291083 230284860 230364277 230481360 230551260
24056 230551260 230584952 230662103 230728154 230672518 230532431 230419986 230385980 230363722 230290050 230235408
24046 230235408 230289309 230438165 230599431 230760421 230939412 231077883 231100935 231010920 230864760 230707758
24036 230707758 230535321 230358292 230217961 230142097 230135783 230214263 230372807 230528773 230666273 230829034
24026 230829034 231023268 231180691 231182974 230987162 230719592 230536683 230445117 230422207 230482170 230599254
24016 230599254 230698366 230761070 230845390 231034695 231297955 231502446 231558664 231456744 231249119 231013705
24006 231013705 230805738 230626507 230418564 230181260 229982101 229848360 229805739 229890782 230069714
23997 230069714 230292212 230542890 230722586 230717435 230578799 230451767 230373223 230306334 230251424 230226320
23987 230226320 230201274 230132741 230025756 229974059 230027547 230102016 230096440 230016224 229960438 229975751 229997830
23976 229997830 229999864 230014194 230030459 230029129 230043094 230112511 230210176 230287116 230353175 230444860 230516094
23965 230516094 230522530 230456876 230353736 230318249 230376337 230464374 230539145 230630199 230757305 230872309
23955 230872309 230957112 231044807 231077817 230982605 230816534 230699571 230690788 230775609 230865020 230889473 230864067
23944 230864067 230802908 230750183 230753727 230829779 230943016 231006186 230989057 230977429 231033961 231152127 231311753
23933 231311753 231448708 231452845 231312681 231147774 231120199 231290914 231554749 231741101 231786993 231739032
23923 231739032 231624650 231421963 231195093 231061211 231001088 230945148 230880886 230865852 230939112 231045060
23913 231045060 231111419 231100878 231048319 231005831 230974957 230954646 230929756 230912513 230950753 231013665 231051807
23902 231051807 231102068 231218692 231342080 231362285 231263774 231122152 230994730 230932773 230966051 231019343
23892 231019343 230988461 230845615 230656193 230543460 230587781 230738825 230877152 230924100 230887476 230770955
23882 230770955 230589380 230388089 230188065 230009320 229856093 229716966 229641734 229686916 229849855
23873 229849855 230101279 230397061 230661613 230784191 230744774 230638590 230524506 230428546 230344453 230268462
23863 230268462 230237415 230325061 230569292 230894837 231177622 231363530 231468225 231544497 231629878 231710399
23853 231710399 231730603 231624078 231401229 231181519 231032529 230915876 230827190 230849887 231005547 231162715
23843 231162715 231200983 231137458 231046192 230942993 230869859 230907005 231066695 231271534 231457389 231632348
23833 231632348 231826650 231985210 232033153 231956848 231838751 231769725 231746768 231734939 231686119 231559843
23823 231559843 231364592 231144935 230994428 230985519 231074806 231153925 231157543 231112480 231090719 231099882 231108891
23812 231108891 231124437 231124514 231074417 231021907 230995466 230940007 230836869 230727937 230683462 230745924 230875558
23801 230875558 231001175 231070085 231066022 231039038 231043517 231032720 230957769 230845379 230726466 230656887 230672172
23790 230672172 230706869 230663137 230558955 230517841 230632475 230832433 230976763 231044518 231090885 231178202
23780 231178202 231314923 231439604 231518193 231568438 231618160 231656384 231628637 231562407 231495734 231418284
23770 231418284 231362160 231386393 231500283 231675259 231816692 231826933 231712609 231528500 231330705 231204468
23760 231204468 231173362 231179793 231193953 231267412 231393340 231413104 231247746 230999902 230779654 230636594
23750 230636594 230592704 230662574 230802767 230908671 230915325 230809813 230635350 230468030 230359763 230388848
23740 230388848 230582555 230844890 231058195 231169012 231241423 231326681 231426742 231527547 231568862 231499766
23730 231499766 231343559 231206425 231161127 231210215 231308434 231391659 231436380 231365452 231185232 230997333
23720 230997333 230870487 230819947 230805735 230774762 230694886 230570649 230480207 230491321 230521997 230515676 230569266
23709 230569266 230754407 230947201 231035537 231068858 231165385 231387868 231652148 231850499 231945724 231924608
23699 231924608 231802228 231615773 231387590 231144271 230983882 230936778 230898430 230825310 230799936 230864640
23689 230864640 230967885 231052957 231088514 231069744 230994168 230825954 230609579 230493077 230522650 230605648
23679 230605648 230639433 230588737 230486599 230368319 230218456 230021322 229788447 229607498 229579010 229750191
23669 229750191 230064710 230384372 230608530 230713436 230743223 230773284 230862949 231000470 231110279 231183843
23659 231183843 231245928 231329953 231429855 231473503 231439204 231406645 231426404 231496193 231618043 231791465
23649 231791465 231941412 231964046 231855887 231684565 231521092 231446441 231486166 231571828 231622609 231595290
23639 231595290 231525253 231481474 231439884 231371399 231338476 231355701 231395630 231463169 231560662 231656089 231672174
23628 231672174 231539562 231341944 231185021 231033704 230913664 230916400 231010332 231099010 231141888 231116075
23618 231116075 231010498 230875035 230790557 230790913 230857149 230981119 231144725 231303062 231396612 231403692
23608 231403692 231378391 231421518 231534055 231618656 231628299 231585157 231516980 231439117 231368498 231327637 231314301
23597 231314301 231289512 231225852 231114636 230937425 230764669 230750248 230932326 231242449 231593062 231916017
23587 231916017 232177398 232314505 232260968 232072876 231856807 231625459 231377646 231177676 231093756
23578 231093756 231085808 231033319 230888375 230714893 230560379 230409804 230273573 230156811 230089809 230131126
23568 230131126 230289362 230531914 230783907 230960849 231020421 230997707 230945622 230871944 230782773 230680059
23558 230680059 230558239 230438493 230362369 230375649 230494872 230662955 230835217 231025042 231208852
23549 231208852 231291344 231272914 231255547 231304173 231384087 231430966 231451018 231486827 231501823 231429275 231278178
23538 231278178 231134856 231071422 231093921 231170562 231247893 231304211 231341020 231317106 231209335 231051392
23528 231051392 230848445 230606766 230410138 230345625 230390395 230491205 230630945 230764614 230870626
23519 230870626 231004131 231161718 231298381 231367548 231370849 231383569 231468980 231577660 231581222 231432974
23509 231432974 231207905 231038450 230983014 231025356 231113963 231197291 231275590 231354661 231373029 231292765
23499 231292765 231182604 231092287 231020007 230943402 230860331 230832506 230971258 231267329 231548193 231685454
23489 231685454 231673441 231580958 231482047 231417824 231351209 231234114 231076463 230921923 230797036 230717537
23479 230717537 230704883 230800006 231005391 231214607 231338800 231385705 231408634 231446163 231496716 231525576
23469 231525576 231523167 231509467 231502792 231489636 231455994 231429111 231460757 231526763 231560150 231560958 231573078 231570785
23457 231570785 231520256 231494487 231561116 231676223 231765131 231780020 231768080 231806015 231910408 232056819
23447 232056819 232180457 232205667 232106454 231906697 231635500 231345399 231145059 231057207 231025187 231004743
23437 231004743 231018446 231055289 231038389 230972884 230930775 230980559 231166342 231459733 231706970 231760960
23427 231760960 231643333 231498074 231485457 231655897 231878884 231986419 231921205 231742805 231542585
23418 231542585 231376456 231295488 231275930 231227970 231148011 231120161 231194439 231310933 231386859 231374288
23408 231374288 231294476 231204010 231171245 231259398 231439043 231598808 231690584 231709971 231622849 231448443
23398 231448443 231303684 231233890 231169234 231061661 230942039 230889567 230942964 231083719 231262451 231406944
23388 231406944 231460128 231408520 231297994 231217778 231212618 231219066 231189785 231143299 231089278 231017037 230906730
23377 230906730 230821262 230847773 230931670 230986397 231043132 231156064 231262406 231298887 231292475 231271750 231212980
23366 231212980 231097378 230983556 230951121 231039706 231207787 231360199 231427850 231402499 231332887 231253996
23356 231253996 231196841 231168777 231133059 231076250 231022554 230996314 231038739 231160958 231307596 231374431
23346 231374431 231344980 231292424 231179626 230959015 230694552 230488604 230400545 230414976 230545054 230769741
23336 230769741 230968696 231109271 231173051 231126052 231048473 231004562 230967790 230934438 230926047 230960937 230973776
23325 230973776 230906465 230843282 230867810 230944006 231024723 231104136 231139861 231089201 230990985 230906225 230834987
23314 230834987 230763960 230672221 230539744 230408269 230375890 230499492 230736291 230973563 231146901 231251137
23304 231251137 231309554 231331907 231257459 231066242 230860113 230735338 230690739 230702604 230714859 230651141
23294 230651141 230496389 230303830 230151681 230055867 229995114 229993651 230061142 230157072 230239210 230300137
23284 230300137 230324787 230314356 230301047 230286418 230270935 230280102 230341243 230471735 230625594 230713266 230710465
23273 230710465 230687536 230715596 230793252 230893032 230976028 230981421 230948888 230967758 231010706 231041001 231065428
23262 231065428 231059605 231021866 230938444 230795121 230644254 230587492 230650857 230745027 230810737 230813408 230773292
23251 230773292 230736431 230686109 230602790 230511990 230448634 230431345 230442574 230431602 230370224 230335381 230421005
23240 230421005 230589254 230752829 230902436 231010872 231026908 230967227 230868962 230817298 230921162 231165336
23230 231165336 231411771 231492629 231371842 231194390 231120298 231157612 231212178 231246944 231259945 231272105
23220 231272105 231314064 231362314 231362663 231296787 231183501 231016637 230816258 230649286 230549211 230515666
23210 230515666 230561051 230678741 230802773 230860350 230868828 230850543 230761405 230613624 230485233 230413508
23200 230413508 230384147 230456671 230685273 230984693 231238302 231400589 231489202 231530393 231562841 231625120
23190 231625120 231684354 231677471 231578128 231429917 231296226 231191801 231134086 231122663 231096874 231008650
23180 231008650 230872971 230776696 230766190 230829012 230941771 231074205 231181079 231255236 231332886 231388024
23170 231388024 231419953 231467723 231508846 231518215 231507407 231487047 231414477 231290764 231163785 231064510 230994048
23159 230994048 230944256 230912973 230948269 231066256 231174120 231194070 231143302 231086297 230994007 230812546
23149 230812546 230602434 230455437 230387856 230415837 230513376 230584393 230601201 230607604 230635187 230647861 230626422
23138 230626422 230620468 230658562 230716026 230784619 230848358 230867688 230875364 230931786 231013564 231047441 231007640
23127 231007640 230960366 231026543 231219618 231427012 231542197 231569815 231534413 231459124 231401270 231410454
23117 231410454 231484355 231559251 231547722 231435690 231294034 231184156 231100057 231001038 230873277 230751454
23107 230751454 230667198 230665439 230717265 230728343 230626976 230407609 230200457 230121395 230150494 230231851
23097 230231851 230339458 230450031 230516033 230510732 230501480 230577720 230766256 230998536 231166334 231210365
23087 231210365 231128117 230956696 230763609 230615866 230555858 230608448 230725523 230801045 230817928 230849183
23077 230849183 230931471 230992827 230977062 230936830 230938689 230991742 231045348 231040544 230953704 230830390 230784273
23066 230784273 230803786 230773558 230695519 230614365 230538599 230478506 230426680 230420181 230519621 230666732 230796744
23055 230796744 230896914 230953979 230999224 231007953 230934820 230808763 230666473 230519533 230360368 230193613
23045 230193613 230085841 230109511 230235061 230361808 230440020 230479685 230510444 230537824 230536809 230510864
23035 230510864 230474651 230404856 230307147 230220268 230154810 230084959 230004966 229929616 229884812 229949393 230131323
23024 230131323 230348312 230548744 230730673 230889376 230968243 230916539 230792928 230671723 230547315
23015 230547315 230440424 230397189 230368431 230326992 230305173 230320532 230366895 230445273 230540382 230655851
23005 230655851 230750203 230735556 230615732 230477523 230390445 230387008 230459362 230514545 230514806 230491824 230488805
22994 230488805 230552368 230670654 230809667 230960725 231077570 231154543 231250305 231412655 231598991 231701610
22984 231701610 231680378 231595443 231519236 231462917 231422149 231363931 231267448 231161177 231034735 230902459
22974 230902459 230833039 230871792 230978805 231077363 231173383 231282516 231337879 231274553 231113579 230946644
22964 230946644 230813721 230693802 230626653 230610108 230592367 230559583 230516707 230477695 230451971 230452641 230444024
22953 230444024 230410022 230398978 230428598 230503131 230609102 230723307 230843619 230946618 230993679 231004632
22943 231004632 231010039 231004354 230982441 230977053 231007743 231056049 231103358 231178140 231305153 231392651 231370143
22932 231370143 231250917 231083568 230923981 230795421 230727236 230732954 230723182 230639803 230558097 230538396
22922 230538396 230599193 230724094 230827159 230888094 230961771 231051648 231081429 231037592 231010576 231048022
22912 231048022 231137174 231212668 231235334 231247837 231327256 231498853 231628066 231583504 231436502 231328997
22902 231328997 231325176 231340011 231311396 231327925 231427034 231507743 231468650 231286507 231009270 230745005
22892 230745005 230580888 230429511 230149602 229804785 229580731 229556904 229703639 229983759 230294833
22883 230294833 230525086 230640716 230671390 230665873 230636845 230590703 230536352 230497016 230526826 230612818 230697579
22872 230697579 230740645 230714865 230614539 230464030 230296431 230140398 230003427 229886884 229809970 229793806
22862 229793806 229817618 229847776 229827726 229759041 229768801 229921025 230120981 230273475 230379297 230402137
22852 230402137 230299919 230143306 230043762 230060256 230117718 230167205 230259247 230400422 230573369 230722299
22842 230722299 230768399 230695780 230582976 230539302 230585147 230669353 230732015 230739908 230630404 230392074
22832 230392074 230124872 229930238 229900170 230043808 230247748 230390776 230460678 230503332 230536896 230556674
22822 230556674 230572872 230609364 230656237 230673956 230655794 230677137 230744100 230751132 230670334 230549803 230401534
22811 230401534 230241796 230128938 230127152 230244182 230474501 230757765 230979241 231061748 230987429 230836435
22801 230836435 230680663 230555602 230538629 230658385 230798121 230837353 230783507 230720113 230740916 230887998
22791 230887998 231101402 231253373 231262124 231172388 231075409 230966645 230822879 230675197 230532435 230404863
22781 230404863 230345711 230377866 230485584 230642031 230766644 230784129 230768915 230765513 230690115 230549530
22771 230549530 230464778 230539053 230701257 230785415 230794545 230824575 230886433 230930992 230917774 230868827 230803271
22760 230803271 230729048 230658825 230585786 230549795 230584079 230621158 230629252 230626099 230673939 230795070 230892986
22749 230892986 230872001 230712216 230506965 230364330 230288413 230290166 230348132 230398398 230463273 230539365
22739 230539365 230564253 230554974 230549120 230535686 230483198 230440161 230503746 230667504 230854360 231000248 231058909
22728 231058909 230990609 230811718 230597456 230403820 230285660 230252270 230236856 230200326 230187324 230211517
22718 230211517 230271596 230363439 230402073 230349107 230229847 230092720 229969481 229897391 229876047 229851342
22708 229851342 229793033 229709613 229666613 229694819 229730982 229757248 229808933 229919534 230072998 230188149
22698 230188149 230208206 230153896 230045922 229893749 229730181 229631507 229609245 229598262 229615839 229693668
22688 229693668 229846969 230073435 230292089 230424358 230503844 230556511 230565044 230562143 230575219 230579911 230559036
22677 230559036 230510132 230412228 230259970 230137618 230086178 230062139 230069959 230129892 230233018 230384443
22667 230384443 230548554 230650867 230667809 230608821 230483266 230310004 230166070 230140773 230284335 230575193
22657 230575193 230935137 231231806 231357601 231295458 231084520 230815475 230560239 230374309 230285490
22648 230285490 230263579 230251054 230285169 230429475 230635216 230805491 230914410 230942135 230847039 230635149
22638 230635149 230369213 230166752 230107738 230164099 230218417 230195149 230078332 229922516 229848818 229927774
22628 229927774 230128807 230352008 230526788 230616730 230585331 230462153 230290747 230072593 229846434
22619 229846434 229713126 229739174 229878589 230040164 230138803 230115927 230005228 229904259 229848604 229833138
22609 229833138 229814904 229820498 229920601 230057366 230135283 230129248 230074583 230037204 230078598 230209356 230404238
22598 230404238 230612209 230766953 230806749 230693337 230478925 230280622 230150935 230097893 230132143 230255359
22588 230255359 230425853 230575122 230705699 230808727 230798785 230704651 230625289 230571381 230541446 230518851
22578 230518851 230440537 230314498 230229302 230248268 230374613 230522836 230599182 230616591 230606614 230563929
22568 230563929 230493639 230417804 230361047 230346587 230303599 230146224 229944929 229786835 229637709 229502526
22558 229502526 229417081 229398349 229450331 229574862 229754934 229921078 230025843 230057573 230051832 230074729
22548 230074729 230137222 230157967 230146011 230199910 230265622 230215781 230080593 229956421 229905695 229916106
22538 229916106 229952938 229997026 230056720 230115606 230140647 230152751 230178196 230188513 230142197 230069102 230039407
22527 230039407 230104785 230236083 230367499 230454104 230457897 230353237 230155145 229970869 229870129 229801491
22517 229801491 229749599 229774611 229840127 229862930 229837869 229810741 229822613 229899753 230024796 230106301 230075275
22506 230075275 230006613 229999195 229999374 229907632 229713901 229471045 229261086 229138321 229106535 229163143 229242316
22495 229242316 229270538 229284845 229350903 229478054 229605186 229639477 229541424 229360374 229204034 229159162
22485 229159162 229188351 229237520 229297413 229374086 229480941 229606397 229686268 229647854 229497944 229322336
22475 229322336 229208247 229197926 229292723 229473651 229690465 229861095 229958360 229972961 229928034 229889011
22465 229889011 229884850 229894186 229875314 229814602 229733986 229633992 229567571 229595339 229680412 229739061 229753661
22454 229753661 229788740 229876982 230009145 230179978 230329114 230371323 230279588 230125795 230024167 230030452
22444 230030452 230074426 230024723 229881133 229761919 229715015 229744722 229807868 229835027 229826929 229829188 229846694
22433 229846694 229869197 229908622 229987227 230040915 229977761 229867871 229779606 229660458 229486615 229327982
22423 229327982 229269914 229322856 229426117 229474715 229447417 229394220 229377943 229433436 229546284 229645640
22413 229645640 229628066 229535045 229492217 229545745 229685060 229877148 230091674 230296000 230485236 230642803
22403 230642803 230732803 230765708 230771319 230778044 230815969 230866829 230891049 230926965 230971585 230995260 231002040
22392 231002040 230984912 230964618 230934108 230851615 230741875 230644490 230525973 230363108 230163771 229957131
22382 229957131 229789739 229660645 229530737 229406457 229324497 229285857 229260819 229229784 229245235 229381840
22372 229381840 229601203 229805480 229916387 229905178 229806029 229663096 229540821 229457517 229395370 229387168
22362 229387168 229416764 229430311 229465420 229595958 229811830 230060585 230232644 230207163 230011432 229779742
22352 229779742 229651292 229755287 230078697 230413668 230576201 230520139 230334310 230140388 229982416
22343 229982416 229842289 229697203 229556633 229475032 229469227 229521291 229652504 229866386 230108932 230328251
22333 230328251 230494237 230571225 230516103 230367059 230224876 230202245 230319696 230453908 230473993 230376543
22323 230376543 230208891 230018536 229852760 229742867 229682024 229655935 229660727 229658760 229649991 229681157 229809429
22312 229809429 230057313 230351246 230585548 230697000 230665977 230544526 230416778 230304721 230225149
22303 230225149 230197023 230219056 230288538 230371760 230411901 230409614 230398924 230405051 230425937 230405914 230274522
22292 230274522 230048575 229835072 229693508 229634401 229683073 229811792 229937165 229984343 229916560 229804273
22282 229804273 229777181 229866541 229986772 230049569 230096523 230196079 230270306 230285227 230300627 230314203 230316748
22271 230316748 230334012 230347993 230366518 230386762 230325681 230180433 230094752 230204400 230416161 230558318
22261 230558318 230604478 230612062 230623488 230589444 230438165 230228508 230061033 229941025 229852618 229750587
22251 229750587 229612354 229518941 229531439 229640001 229761664 229810856 229787180 229718395 229656175 229684549
22241 229684549 229829075 230014061 230190229 230404240 230712343 231073290 231317731 231306829 231092508
22232 231092508 230844909 230688344 230579290 230414421 230235761 230162481 230186007 230251832 230315442 230306913
22222 230306913 230238854 230143295 230046844 229972040 229955732 230051750 230187174 230251419 230219302 230162921 230171636
22211 230171636 230265191 230412282 230536069 230583421 230555705 230449595 230229292 229917620 229644616 229503056
22201 229503056 229445810 229433443 229513173 229683770 229859433 229975995 230051176 230101439 230115011 230108736
22191 230108736 230079428 230002933 229886986 229758236 229675983 229665506 229664268 229651908 229699995 229833523
22181 229833523 229991062 230045188 229927797 229721577 229562616 229504806 229535119 229621774 229700964 229745238
22171 229745238 229798308 229866960 229910852 229893082 229787495 229620174 229464515 229408611 229412569 229391923
22161 229391923 229419320 229554790 229714224 229809925 229825508 229779816 229701563 229614818 229569636 229595303
22151 229595303 229645824 229672575 229710855 229802884 229986677 230229408 230456051 230614327 230635665 230516836
22141 230516836 230316608 230111605 230022117 230072446 230140305 230125165 230039114 229905034 229729855 229565981
22131 229565981 229439299 229347009 229298974 229270756 229227992 229212622 229283123 229368978 229340411 229169600
22121 229169600 228986456 228955480 229064008 229184397 229197391 229104643 229009858 228999508 229042968 229062276
22111 229062276 229091650 229208601 229399257 229574284 229701378 229828556 230039027 230362572 230709134
22102 230709134 230967026 231109943 231143036 231052686 230871748 230650321 230400637 230147427 229950347
22093 229950347 229890246 229976193 230092103 230155064 230198769 230263512 230275823 230193884 230047989 229879179
22083 229879179 229735831 229680054 229707773 229730261 229764845 229889422 230079694 230229379 230287265 230282887
22073 230282887 230247793 230198214 230123433 230019226 229900742 229779119 229668120 229607154 229608705 229623092
22063 229623092 229643290 229689730 229717686 229685232 229615401 229503592 229353759 229269429 229285567 229335366
22053 229335366 229363203 229384871 229462503 229616416 229818268 230056422 230319895 230523125 230590412 230539373
22043 230539373 230392942 230184735 229977086 229790979 229587924 229346313 229130926 229055212 229154567
22034 229154567 229385922 229614575 229728259 229755393 229737309 229674139 229608298 229582811 229579670 229570782 229560863
22023 229560863 229590364 229693393 229836094 229958818 230025478 230050136 230099566 230187574 230297384 230413455
22013 230413455 230501339 230546373 230575056 230603168 230601545 230478923 230227246 230023073 230009298 230101722
22003 230101722 230183424 230235267 230221185 230123894 230008308 229954573 229987926 230055711 230100696 230139576 230147413
21992 230147413 229997522 229668740 229332345 229150444 229160707 229317414 229511682 229675092 229776306
21983 229776306 229808437 229854599 229966520 230042407 229974959 229763529 229506885 229349617 229330754 229368727
21973 229368727 229388208 229373207 229358641 229426153 229588693 229807425 230022216 230158334 230180551 230076956
21963 230076956 229888138 229725737 229646931 229617275 229579915 229525376 229487101 229451100 229389149 229306944
21953 229306944 229285185 229385226 229539400 229654129 229664252 229548723 229369871 229201405 229111456 229156651
21943 229156651 229306601 229463024 229549946 229613550 229675529 229697421 229649614 229553262 229484549 229491168 229550641
21932 229550641 229596234 229573237 229471453 229307755 229195904 229239639 229381711 229537314 229640464 229638272
21922 229638272 229565279 229552848 229662102 229839075 230025664 230162285 230170307 230014643 229767092 229578547
21912 229578547 229542043 229607438 229674344 229656476 229548636 229421919 229337205 229363002 229496475 229684196
21902 229684196 229814385 229772766 229614082 229481124 229414635 229385138 229383891 229441890 229563563 229708181
21892 229708181 229841964 229905824 229864874 229777161 229712796 229695285 229646511 229516025 229348591 229177618
21882 229177618 229079376 229102766 229188513 229275745 229313827 229282137 229245108 229268295 229311403 229352830 229446960
21871 229446960 229580129 229684713 229703279 229652342 229605511 229565009 229483091 229385042 229354117 229443850
21861 229443850 229620391 229822502 229993541 230096505 230176352 230314674 230482318 230575475 230601643 230588734
21851 230588734 230523284 230439117 230378783 230320835 230226308 230089488 229946777 229848955 229845956 229905950 229957699
21840 229957699 230038648 230160717 230241714 230264239 230296473 230340692 230328500 230248085 230139533 230052647
21830 230052647 230008341 229988914 230000617 230031751 230007818 229886925 229686148 229500358 229406213 229398827
21820 229398827 229503428 229716672 229913447 229982974 229931701 229797424 229622098 229485850 229450126 229518197
21810 229518197 229631378 229670850 229595755 229477381 229359834 229263878 229183633 229138393 229164498 229211393
21800 229211393 229230884 229246989 229296829 229364793 229439490 229568250 229710245 229744078 229696021 229674497
21790 229674497 229709942 229784906 229871020 229942938 229973227 229986695 230028862 230103444 230207021 230335174
21780 230335174 230476039 230583139 230580452 230457223 230302853 230188299 230099860 229999585 229936762 229945774
21770 229945774 229910115 229761068 229581668 229489169 229460916 229408283 229366835 229418904 229526966 229622527
21760 229622527 229740032 229886008 229985202 230044654 230192152 230427190 230601104 230644526 230602425 230585297
21750 230585297 230618130 230659999 230725260 230744627 230665029 230561068 230489884 230445182 230408307 230381857 230362078
21739 230362078 230333373 230304123 230263325 230180570 230084359 230028791 230013618 230004506 229989221 229976924 229936615
21728 229936615 229837638 229709200 229632402 229674607 229845036 230064842 230198001 230222373 230242304 230262802
21718 230262802 230223618 230173331 230110203 229993666 229839084 229713142 229682493 229736772 229774990 229706432
21708 229706432 229569023 229490827 229553310 229741665 230018901 230329693 230539076 230548542 230413495 230263412
21698 230263412 230169862 230122405 230108843 230101143 230072825 230048095 230085523 230180823 230271670 230310244 230303811
21687 230303811 230262440 230209727 230189326 230159349 230087597 230023970 230002787 230022894 230080866 230152850 230198686
21676 230198686 230244659 230329474 230446762 230606503 230781578 230945837 231077981 231135788 231105695 231001862
21666 231001862 230885270 230798435 230773966 230832781 230899383 230855189 230668561 230474363 230428660 230522220
21656 230522220 230639333 230731001 230836429 230955413 231031651 231015615 230922541 230841865 230819082 230800074
21646 230800074 230754443 230718530 230671753 230575670 230479308 230450415 230478869 230539613 230631348 230739795 230839353
21635 230839353 230886304 230882749 230837297 230743181 230608389 230450270 230311105 230237720 230236226 230303314 230435259
21624 230435259 230573673 230654892 230682369 230668065 230610399 230533969 230440115 230344597 230318430 230369591 230463739
21613 230463739 230592786 230723712 230807474 230846571 230909155 231055290 231186509 231200582 231147647 231123099
21603 231123099 231129355 231119957 231078030 231001357 230907695 230837819 230842429 230935717 231064560 231214283 231384888
21592 231384888 231503167 231510190 231437250 231370376 231310047 231201769 231034936 230911849 230916022 230982072
21582 230982072 230998248 230919049 230799586 230728359 230721706 230743620 230791245 230870366 230976660 231119611
21572 231119611 231246968 231255583 231146351 231023210 230932802 230810996 230624616 230440788 230345309 230422399
21562 230422399 230682927 231020275 231290487 231402872 231375048 231288574 231232018 231238438 231285330 231348468
21552 231348468 231396926 231405009 231411230 231471903 231612032 231805371 231952009 231973263 231881448 231764061
21542 231764061 231701581 231708281 231746450 231731615 231640396 231553141 231524663 231550136 231635715 231748020 231823514
21531 231823514 231845505 231839433 231823908 231759510 231640782 231534006 231475281 231459801 231452312 231452532 231500783
21520 231500783 231588648 231694424 231823951 231990258 232159262 232282592 232375751 232508941 232705859
21511 232705859 232878647 232919495 232807806 232608836 232432224 232344291 232327340 232350034 232390017 232428316
21501 232428316 232458102 232476936 232504603 232571216 232652645 232692355 232696408 232727277 232821790 232967151 233134017
21490 233134017 233298919 233469232 233681633 233911596 234094332 234201206 234271853 234320786 234297091 234217681
21480 234217681 234205633 234294936 234411919 234463936 234434206 234378248 234358940 234463073 234707401 234973662
21470 234973662 235133011 235147238 235165079 235333982 235662735 236039193 236318026 236483785 236599268
21461 236599268 236709726 236846258 237051840 237352797 237717031 238087934 238470745 238885328 239322640
21452 239322640 239760625 240158862 240479942 240774102 241157480 241710298 242372636 242990865 243517605
21443 243517605 244007992 244539092 245134903 245712458 246229907 246727285 247207626 247714800 248380636
21434 248380636 249199669 249983614 250448532 250270088 249166487 246937088 243793625 240307731
21426 240307731 236565904 232059969 226617442 221046161 216502551 213504241 211906992 211344080
21418 211344080 211420853 211846834 212437203 213057361 213669034 214309903 215031063 215831582 216662169
21409 216662169 217452334 218054658 218384891 218474781 218404643 218313839 218321916 218455093 218726478 219101623
21399 219101623 219512917 219975828 220498989 221027817 221500062 221849070 222099749 222314544 222500840
21390 222500840 222666471 222852180 223087562 223364678 223665832 223939716 224163842 224354460 224467729
21381 224467729 224498232 224528792 224607786 224661502 224615308 224501300 224356071 224173116 224029072 224013223
21371 224013223 224101796 224191702 224189373 224060775 223823025 223540181 223274542 223076036 222987349 223009561
21361 223009561 223114547 223240993 223323153 223367502 223408395 223456172 223561686 223749747 223964215 224129297
21351 224129297 224223590 224292256 224367206 224460051 224596572 224761366 224890691 224959969 224983731 224990133
21341 224990133 224990666 224944529 224799355 224585055 224415263 224318489 224298018 224380030 224510276 224644024
21331 224644024 224743707 224791498 224888526 225058667 225222443 225329978 225361084 225292090 225132470 224944660
21321 224944660 224779141 224724544 224852640 225071356 225231409 225276425 225274198 225318842 225418512 225545313
21311 225545313 225701717 225910571 226126266 226264772 226304640 226294257 226245976 226145959 226029653 225908753
21301 225908753 225790412 225720038 225741015 225809994 225856200 225880585 225924047 226049974 226277008 226512606
21291 226512606 226655311 226736174 226839821 226937464 226980503 227035501 227141132 227288123 227459699 227585997
21281 227585997 227643176 227650932 227611686 227518104 227393099 227317423 227317525 227360369 227375835 227329870 227265631
21270 227265631 227250270 227333689 227490337 227644675 227763031 227818179 227780058 227638868 227471713 227366215
21260 227366215 227321060 227319558 227341762 227337981 227314238 227337587 227432206 227581392 227706743 227757421 227780761
21249 227780761 227769224 227689894 227606200 227604226 227685206 227781553 227809202 227806762 227871235 228006806 228181379
21238 228181379 228352677 228485542 228523353 228476422 228443640 228441489 228410221 228338259 228261615 228207768 228199261
21227 228199261 228244742 228324277 228410655 228516803 228655499 228780933 228840817 228805160 228654119 228434290
21217 228434290 228207962 228011964 227924352 227925312 227848691 227631609 227370531 227202149 227187285 227233657
21207 227233657 227249001 227254684 227339665 227566115 227860146 228104653 228255871 228330954 228337333 228276939
21197 228276939 228152145 228006736 227895642 227826570 227767940 227692980 227632390 227610498 227608793 227662616
21187 227662616 227783511 227897146 227980792 228092885 228207561 228214797 228130728 228073140 228144404 228354003
21177 228354003 228589404 228691139 228589348 228331079 228064363 227935253 227958498 228057898 228165660
21168 228165660 228254342 228300142 228272656 228213859 228200614 228260853 228365277 228484013 228613497 228698894
21158 228698894 228662837 228533745 228355967 228127579 227910175 227775756 227720609 227707097 227699067 227699192
21148 227699192 227738048 227826568 227955433 228094791 228206542 228303277 228419877 228568512 228697472 228785591
21138 228785591 228859042 228903902 228934761 228948620 228878902 228758435 228655774 228569215 228493635 228432844
21128 228432844 228371319 228307329 228292195 228335158 228380705 228376334 228322362 228245276 228141029 228027898 227984526
21117 227984526 228071249 228269054 228516836 228729405 228863170 228939398 228976519 229005375 229068172 229172956
21107 229172956 229238993 229193707 229054381 228865933 228683322 228586141 228598282 228726916 228932327 229084399
21097 229084399 229116636 229074749 229026346 229042938 229176851 229329990 229356771 229248950 229052208 228823081
21087 228823081 228651729 228583340 228614168 228728516 228863931 228953325 228993641 229038347 229081082 229094596
21077 229094596 229106587 229124721 229092008 228995091 228899515 228882136 228959062 229119230 229276426 229345803
21067 229345803 229373398 229405556 229396912 229325987 229242116 229159249 229066000 228970162 228893113 228828842 228735710
21056 228735710 228637203 228647177 228768667 228878778 228904311 228882919 228878616 228937343 229087484 229282623
21046 229282623 229439049 229540173 229649846 229785680 229881798 229895927 229826558 229731677 229695582 229716729
21036 229716729 229771055 229898600 230041034 230095403 230083605 230060849 229975496 229768304 229544225 229433453
21026 229433453 229381260 229308189 229273823 229318458 229403049 229483493 229504364 229467287 229456423 229471845 229483997
21015 229483997 229525058 229630310 229771272 229860678 229867391 229845307 229797345 229676372 229578628 229624595
21005 229624595 229717991 229714090 229616303 229570831 229680888 229893235 230050654 230036820 229897667 229750462
20995 229750462 229668947 229664734 229711853 229736191 229664254 229518045 229426462 229493460 229638225 229732161 229779519
20984 229779519 229794732 229782176 229742578 229683452 229659716 229697519 229774510 229855312 229924913 229936866 229889486
20973 229889486 229867236 229880421 229847179 229768363 229717509 229740963 229817171 229879791 229902388 229932077 229990619
20962 229990619 230012061 229962576 229918408 229970803 230106360 230252330 230367274 230479120 230629445 230766113
20952 230766113 230848232 230863739 230774139 230650914 230635025 230722055 230781251 230786600 230770104 230719430 230603490
20941 230603490 230433662 230276831 230198455 230205031 230241988 230234950 230173011 230137131 230182525 230290290 230372974
20930 230372974 230360414 230255111 230080258 229876095 229652369 229437300 229287852 229219593 229234896 229356616
20920 229356616 229540695 229699365 229792319 229836479 229872791 229937420 230039190 230123621 230183271 230301216
20910 230301216 230497591 230675528 230752886 230748983 230723209 230690459 230647443 230619487 230639427 230673540 230579599
20899 230579599 230356794 230152524 230032889 229975218 229962373 230000383 230062415 230127865 230187217 230239140
20889 230239140 230274239 230287215 230281935 230246856 230167868 230042246 229869219 229708444 229665925 229731278
20879 229731278 229817741 229885062 229929925 229963016 229997690 230023559 230041005 230118410 230287108 230456150
20869 230456150 230548096 230586857 230558838 230436005 230271491 230154008 230154273 230230183 230282119 230302920 230332999
20858 230332999 230378676 230410865 230372447 230286378 230213106 230147287 230101832 230134719 230225156 230293284 230332951
20847 230332951 230362352 230349950 230308180 230282064 230287439 230336952 230433039 230559207 230665421 230757938 230902058
20836 230902058 231053349 231131458 231091102 230927175 230701339 230554917 230564054 230639729 230670269 230715088
20826 230715088 230882821 231143304 231389973 231543979 231628997 231706548 231780753 231826582 231818553 231748913
20816 231748913 231658221 231556981 231444813 231396301 231452141 231582566 231734369 231866227 231945628 231966040
20806 231966040 231963981 231930910 231831870 231692120 231553895 231433481 231332317 231277966 231319118 231451353
20796 231451353 231618915 231759018 231829625 231809931 231737006 231634177 231499554 231387288 231307091 231236501
20786 231236501 231210159 231269250 231379093 231481323 231566093 231645708 231752173 231922319 232130425 232324969
20776 232324969 232468436 232536976 232540673 232542366 232619042 232766247 232867458 232824270 232666338 232503600
20766 232503600 232413767 232396790 232419523 232511512 232711572 232943762 233129487 233274887 233356347 233339179
20756 233339179 233272556 233243436 233283294 233360280 233468936 233616769 233776941 233949537 234140193 234279759
20746 234279759 234283300 234164041 233998675 233841163 233711323 233557781 233361264 233174501 233036130
20737 233036130 232947290 232887337 232820113 232743003 232687452 232657542 232632269 232639488 232711946 232782086 232803473
20726 232803473 232814127 232889170 233045523 233184310 233246098 233279344 233326887 233367925 233395020 233431790
20716 233431790 233503106 233607623 233736493 233834041 233860389 233837453 233805460 233823905 233873581 233863993 233774461
20705 233774461 233673159 233622686 233645086 233691199 233679936 233584466 233413698 233213550 233049969 232999403
20695 232999403 233033659 233068876 233123055 233241658 233418565 233611494 233738311 233739161 233646445 233543701
20685 233543701 233514764 233624079 233848637 234142430 234433167 234593200 234584050 234506138 234427873 234364228
20675 234364228 234359663 234426402 234522535 234611620 234698320 234785805 234822909 234787437 234693984 234565070 234475596
20664 234475596 234476257 234567783 234718179 234863295 234941015 234904209 234800254 234762255 234819224 234930400
20654 234930400 235058127 235166691 235260240 235297797 235270712 235315508 235478996 235628210 235672410 235609054
20644 235609054 235464581 235332338 235319454 235437275 235645090 235855318 235990057 236087424 236208530
20635 236208530 236304569 236299258 236201813 236093675 236054206 236106733 236222061 236321527 236398831 236500810
20625 236500810 236593714 236660290 236762553 236911963 237076557 237175117 237111865 236913822 236701790 236519827
20615 236519827 236388839 236307811 236269826 236302633 236382946 236447805 236432618 236359845 236350054 236473953 236633048
20604 236633048 236744823 236853639 236993404 237137357 237245020 237296508 237318892 237392118 237548335 237738229
20594 237738229 237908801 237995979 237985407 237916290 237812549 237692205 237567202 237431914 237362673 237404786
20584 237404786 237488578 237583042 237744417 238015054 238317669 238555629 238755515 238958243 239099807
20575 239099807 239106835 238963090 238711765 238460331 238293098 238210091 238192449 238236277 238325365 238464044
20565 238464044 238651584 238827751 238970512 239107487 239252788 239432925 239628917 239707027 239600850
20556 239600850 239456148 239406483 239451926 239560041 239671204 239749089 239781697 239805367 239873836 239996474
20546 239996474 240161494 240324485 240421659 240471019 240536881 240580493 240562569 240547553 240542984 240527525 240540368
20535 240540368 240567029 240611970 240729908 240943572 241197892 241410823 241525285 241575941 241684059 241885373
20525 241885373 242096193 242224187 242240498 242194806 242170088 242200199 242239476 242290116 242386354 242518808
20515 242518808 242713935 242992108 243267543 243457909 243623677 243799870 243912064 243908052 243825302 243753292
20505 243753292 243742594 243780122 243835539 243879171 243906762 243982065 244189642 244543888 244914694 245171045
20495 245171045 245348605 245491630 245617293 245792650 246032529 246272136 246484396 246636941 246684347
20486 246684347 246715729 246838705 247017988 247165659 247301098 247458362 247611385 247811446 248127823
20477 248127823 248519377 248893866 249192937 249416102 249631199 249873046 250147699 250477110 250827542
20468 250827542 251127673 251360174 251556563 251734392 251904592 252106637 252382205 252735797 253112805
20459 253112805 253409254 253637198 253911048 254179274 254343763 254499853 254738457 254994716 255190175
20450 255190175 255354248 255580845 255921621 256362990 256852994 257334712 257769351 258148312 258480623
20441 258480623 258790798 259101405 259457406 259840186 260213925 260618663 261127166 261748527 262371922
20432 262371922 262895018 263315964 263650456 263967513 264323220 264741217 265256327 265847908 266478016
20423 266478016 267123445 267822413 268608021 269403504 270189442 271011414 271820542 272529283 273143074
20414 273143074 273766284 274496277 275360982 276354285 277447525 278551331 279628379 280785538
20406 280785538 282112665 283545512 284998139 286447093 287876752 289354191 290981340 292765579
20398 292765579 294637817 296503488 298376551 300341839 302536061 305117438 308097141 311304647
20390 311304647 314572100 317921197 321470008 325314336 329533810 334111902 338996253 344209714
20382 344209714 349853791 356019402 362691467 369745781 376913878 383794391 389853961 394402550
20374 394402550 396744533 396256190 391832607 380822054 359100713 323834655 278340892
20367 278340892 232778947 196822331 173442930 160433032 154621282 153593253 155661848
20360 155661848 159652876 164708109 170175709 175648728 180948184 186070123 191152412 196278530
20352 196278530 201445660 206523328 211317983 215775093 219966122 223908509 227532801 230719965
20344 230719965 233304612 235195563 236569304 237926372 239645442 241662993 243768042 245906361
20336 245906361 248082583 250305629 252626746 255025955 257463350 259929165 262500902 265360958
20328 265360958 268607321 272033939 275042379 276745175 276289690 273189684 267205445 257971011
20320 257971011 245343511 230200052 214406298 199985362 188596282 181186426 177655019
20313 177655019 177081319 178299223 180411042 183051563 186299346 190258714 194872369 200002755
20305 200002755 205536755 211428825 217620324 224004025 230470478 236974547 243458516 249710410
20297 249710410 255279346 259457737 261179777 258710205 249639759 232137205 207301421 179317854
20289 179317854 152353412 129288079 112383542 102408482 98269617 98184362 100558160 104199226
20281 104199226 108353408 112561298 116550685 120292119 123799685 126979326 129710773 131879925
20273 131879925 133443865 134458842 135067083 135588834 136392365 137608630 139163937 140958080
20265 140958080 142896070 144927735 147004880 149031618 150966890 152812586 154527819 156071606
20257 156071606 157495540 158872095 160195441 161450611 162612239 163625978 164537167 165450903
20249 165450903 166378259 167304833 168243137 169205798 170201559 171228172 172267697 173283477 174250042
20240 174250042 175136089 175886902 176493892 177068101 177712091 178374212 178962602 179559062 180275151
20231 180275151 181070470 181803600 182400726 182899208 183346559 183749876 184093412 184436859 184869864
20222 184869864 185375485 185867900 186284277 186563514 186709618 186823746 187018646 187297711 187627889
20213 187627889 188030740 188508632 188999581 189455203 189843781 190125109 190339411 190593822 190888661
20204 190888661 191141755 191340961 191526566 191739892 191973611 192244831 192565878 192891303 193207730
20195 193207730 193532440 193838638 194043921 194146554 194253773 194423655 194608654 194746062 194814557
20186 194814557 194845505 194904615 195047784 195315014 195660399 196038572 196432399 196802671 197146689
20177 197146689 197510334 197868082 198143676 198355418 198512808 198613571 198676630 198755591 198947627
20168 198947627 199269201 199659592 199994046 200133795 200090706 200048296 200094278 200139200 200095481 199973666
20158 199973666 199880614 199885949 199913064 199891813 199868728 199914040 200025522 200173973 200347369 200522085
20148 200522085 200640404 200702642 200803654 201014561 201288965 201521868 201700874 201896413 202138302
20139 202138302 202368255 202503923 202556487 202606865 202660549 202715230 202825249 203022831 203248582 203372699
20129 203372699 203310381 203141603 203035727 203071194 203202102 203354898 203476097 203546935 203572347 203591999
20119 203591999 203650112 203778478 203963748 204156758 204329493 204505394 204694394 204880156 205040379
20110 205040379 205178024 205328872 205462742 205562949 205633489 205627582 205572752 205551772 205562767 205553089
20100 205553089 205503823 205396769 205279012 205219325 205216099 205209608 205143420 205066386 205033944 205065998 205181111
20089 205181111 205343921 205487522 205572520 205605384 205651673 205705655 205722612 205718055 205716415 205731407 205752508
20078 205752508 205778012 205845971 205965394 206088539 206179972 206241087 206319316 206466333 206659269 206845780
20068 206845780 206963808 206976397 206939172 206890885 206809618 206702201 206635400 206659559 206704845 206706741 206745345
20057 206745345 206894128 207073891 207167990 207178403 207207777 207303551 207464637 207716584 207973824 208113974
20047 208113974 208172053 208250292 208363759 208479798 208566956 208628654 208672432 208713901 208788824 208855871
20037 208855871 208839068 208736483 208606775 208491856 208447520 208511605 208625966 208697851 208660103 208529335
20027 208529335 208427897 208458351 208584434 208719566 208818899 208861794 208846788 208793576 208725245 208679573
20017 208679573 208659700 208652385 208670761 208748530 208946223 209270141 209582172 209762436 209827247 209830350
20007 209830350 209776717 209672265 209622467 209719490 209919952 210110854 210206809 210163489 209997938 209811560
19997 209811560 209713584 209759484 209921319 210097601 210192728 210201286 210193171 210212321 210300417 210498720 210772821
19986 210772821 211023450 211213240 211270849 211145481 210941204 210797224 210805399 210937693 211097000 211242193
19976 211242193 211339911 211337842 211219754 211053129 210910410 210800547 210753536 210771605 210796563 210762204
19966 210762204 210674312 210637326 210697657 210800499 210876960 210914118 210938076 210972500 211029941 211135586
19956 211135586 211270784 211369312 211438830 211523939 211639674 211790811 211934711 212005043 212020764 212014823
19946 212014823 211958945 211852839 211703965 211552915 211459821 211409660 211337269 211232562 211166058 211192683
19936 211192683 211325783 211540132 211729752 211805663 211795681 211776052 211805802 211859885 211865173 211843287 211868056
19925 211868056 211928076 212012846 212129097 212235706 212325803 212469265 212669695 212856414 212979842 213022094
19915 213022094 212993150 212866688 212665542 212510494 212486906 212587674 212738421 212862966 212963541
19906 212963541 213063083 213127244 213137340 213093015 212994775 212883800 212849325 212923437 213059120 213209996
19896 213209996 213312599 213312363 213189673 213013207 212855897 212694741 212488024 212264599 212096268 212017643
19886 212017643 212027765 212085335 212116214 212114372 212133197 212190731 212275838 212396196 212565733 212775816
19876 212775816 212953186 213032510 213057443 213122495 213261354 213400585 213450878 213418598 213404131 213491873
19866 213491873 213624389 213662681 213529466 213288001 213072174 212921271 212791009 212686239 212676200
19857 212676200 212778294 212987657 213292742 213607793 213813175 213835859 213662018 213383756 213181360
19848 213181360 213167316 213275685 213406989 213525926 213604058 213603565 213530337 213496842 213593804 213737371
19838 213737371 213782608 213686750 213538364 213437553 213391981 213420185 213559225 213782906 214002359 214108606
19828 214108606 214081893 213979155 213859567 213793750 213781863 213759401 213713570 213678033 213700337 213795431
19818 213795431 213875450 213878561 213832610 213770818 213710949 213682971 213698845 213737256 213806074 213887657 213943946
19807 213943946 213993657 214054673 214111158 214164824 214230538 214311727 214422195 214602236 214865189 215099777
19797 215099777 215130076 214946030 214729348 214607590 214596005 214675802 214726002 214647113 214466841 214244436
19787 214244436 214017015 213862533 213842727 213905736 213981624 214008360 213978277 213968199 214073357 214267781
19777 214267781 214434415 214512018 214480682 214356043 214237402 214177039 214180027 214244999 214305050 214287275
19767 214287275 214187008 214071125 213982882 213945889 214017056 214218082 214457275 214615954 214669949 214683115
19757 214683115 214723176 214759718 214758541 214783100 214847690 214867117 214798304 214656550 214430611 214134319
19747 214134319 213884455 213805221 213905435 214077158 214285902 214551754 214776678 214827223 214751506 214685217
19737 214685217 214665780 214685691 214758008 214887915 215067752 215201566 215154031 214946248 214707284 214503700
19727 214503700 214328448 214212211 214195107 214304273 214511020 214764050 215020610 215235064 215375780
19718 215375780 215419288 215350946 215236767 215174229 215148109 215109765 215083863 215086541 215093024 215062541 215004068
19707 215004068 215004487 215083837 215168052 215197994 215193028 215205749 215209441 215180765 215181066 215279495 215470609 215680761
19695 215680761 215820443 215828587 215698581 215460977 215215027 215104948 215119545 215148043 215152219 215140176
19685 215140176 215109358 215093641 215132723 215186711 215192187 215169119 215183391 215261942 215363537 215432807 215455318
19674 215455318 215424202 215366088 215313785 215291795 215333415 215473177 215635996 215713217 215734309 215728555 215670832
19663 215670832 215578777 215482927 215412936 215404489 215403325 215322560 215131749 214828804 214517546 214334182
19653 214334182 214295940 214289881 214277536 214311641 214364969 214391436 214393385 214411937 214475521 214545455 214525938
19642 214525938 214394206 214252497 214164915 214131533 214146837 214200903 214312122 214486847 214686390 214832335
19632 214832335 214874004 214867525 214899912 214968450 215065099 215205675 215322677 215349500 215342682 215395899 215510863
19621 215510863 215671486 215875811 216070082 216205504 216272028 216290157 216270224 216221893 216121398 215900370
19611 215900370 215597715 215381683 215334969 215419777 215549026 215667089 215757367 215791743 215771976 215749061
19601 215749061 215734048 215705860 215688665 215710153 215755961 215800035 215837912 215886125 215945823 216007990 216037544
19590 216037544 215990165 215899680 215835616 215782885 215704475 215662613 215696238 215774009 215857435 215912250 215922098
19579 215922098 215920394 215916945 215896308 215869512 215847433 215787636 215654765 215521124 215458823 215457220 215489876
19568 215489876 215522970 215552276 215602217 215615495 215541848 215442701 215378733 215362386 215399751 215495192 215635451
19557 215635451 215802368 215965312 216053290 215995226 215804495 215531698 215242090 215025519 214939833 214947592
19547 214947592 215013212 215123541 215211495 215239795 215293271 215422206 215603605 215835287 216030059 216062370
19537 216062370 215952336 215814571 215729944 215737053 215775272 215772782 215768344 215784521 215773530 215724204 215670123
19526 215670123 215661974 215706350 215698816 215600601 215482783 215314349 215079110 214907807 214845991 214820924
19516 214820924 214870662 215030329 215247454 215436969 215537609 215557043 215535315 215536526 215541640 215504608
19506 215504608 215465709 215471917 215563349 215733905 215853374 215819604 215698302 215620357 215617806 215626863 215620921
19495 215620921 215621476 215668916 215793916 215941251 216026931 216070608 216088653 216032934 215969386 215976707 216025769
19484 216025769 216093717 216211142 216370040 216477593 216434154 216258572 216125430 216086923 216065042 216018123
19474 216018123 215867497 215588174 215287080 215052970 214904676 214851270 214932680 215149095 215396331
19465 215396331 215597534 215705611 215656896 215496530 215359589 215341809 215414520 215515004 215652731 215854696
19455 215854696 216088426 216277083 216371802 216348279 216234944 216126898 216078505 216057146 216004523 215921564
19445 215921564 215888010 215923311 216008218 216120201 216223347 216282306 216313498 216356202 216418586 216458524
19435 216458524 216406794 216258292 216098895 215995249 215970714 215999660 216036790 216075016 216105181 216110434
19425 216110434 216073194 216001486 215922399 215830158 215700764 215562149 215531488 215655241 215848698 216015585
19415 216015585 216125229 216191726 216201183 216165579 216153980 216209737 216287225 216326953 216323762 216287286 216198343
19404 216198343 216093481 216049382 216059130 216080330 216089710 216095923 216133825 216191808 216229085 216223547 216179036
19393 216179036 216122106 216057613 215986938 215949405 215945566 215977559 216063749 216225641 216450695 216662648
19383 216662648 216767908 216712526 216515317 216244714 216035621 215981252 216043738 216144837 216208201 216211515
19373 216211515 216193961 216210676 216244187 216215751 216074892 215861569 215630531 215398285 215221841 215117094
19363 215117094 215063892 215076552 215160113 215246399 215214671 215063261 214908799 214860270 214912083 214930776
19353 214930776 214866293 214871070 214970949 215037187 215062070 215142000 215337633 215613426 215858129 216007184
19343 216007184 216074824 216120813 216211547 216347760 216485126 216592703 216650120 216649153 216581015 216406484
19333 216406484 216126475 215826063 215645732 215646133 215755419 215901708 216050255 216180631 216242561 216150457
19323 216150457 215981766 215898794 215929552 215981297 215976742 215953685 215957546 215973053 215957898 215918750 215927420
19312 215927420 215994700 216056949 216060218 216024875 216013635 216019805 215997304 215967872 215937223 215858232 215718923
19301 215718923 215560986 215437623 215363300 215277409 215140898 215065480 215150400 215290514 215384731 215468368
19291 215468368 215594686 215770351 215981259 216226077 216441462 216538882 216542791 216533202 216496423 216387524
19281 216387524 216246680 216144711 216130016 216186160 216228190 216191313 216112513 216061923 216064914 216120639 216205211
19270 216205211 216250599 216182683 216007333 215811231 215659340 215542869 215419078 215347870 215373347 215433995
19260 215433995 215453790 215434355 215450805 215530560 215615277 215602226 215460632 215329732 215333895 215408224 215435263
19249 215435263 215434929 215466125 215522646 215586250 215630288 215668911 215744119 215811531 215832077 215836217 215853861
19238 215853861 215890697 215941701 216034448 216182025 216318208 216354586 216303570 216195614 215997967 215678515
19228 215678515 215321120 215051608 214934098 215005050 215220952 215451424 215612434 215725728 215804767
19219 215804767 215817642 215732189 215546992 215319292 215132978 215033381 214965659 214899194 214896280 215003268
19209 215003268 215193319 215363152 215475893 215593376 215725028 215826787 215901771 215946357 215920332 215862558
19199 215862558 215848734 215895201 215977043 216035211 216034520 216038936 216095183 216125973 216089039 216042256 216036126 216076118
19187 216076118 216143562 216212110 216203010 216101149 216015920 216022983 216095316 216206217 216323179 216362452 216265337
19176 216265337 216101913 215996847 215950273 215932841 215957946 216001176 216044847 216066436 216019263 215926936
19166 215926936 215823225 215713211 215609258 215528779 215479426 215467345 215491018 215529410 215560172 215580265
19156 215580265 215632130 215708058 215729448 215705322 215720392 215810003 215941628 216065166 216144088 216167721
19146 216167721 216135439 216045467 215907458 215762356 215642208 215526593 215421924 215348114 215290576 215208218
19136 215208218 215126646 215136455 215291882 215518720 215658883 215623703 215464308 215295668 215241346 215367236
19126 215367236 215610047 215820161 215913610 215907577 215868612 215885246 215976677 216122536 216293748 216447435
19116 216447435 216557450 216629325 216715168 216839879 216962391 217021793 217015442 216969368 216856645 216671166
19106 216671166 216455888 216275764 216178732 216141840 216092437 216046000 216065030 216118101 216173689 216272404
19096 216272404 216479390 216757049 216959336 217035695 217017434 216920924 216771088 216642492 216551075 216453249
19086 216453249 216351849 216254281 216179880 216144551 216152439 216215982 216320542 216429275 216555750 216698990
19076 216698990 216758217 216674114 216545772 216475216 216463524 216421564 216271047 216054899 215874647 215752669
19066 215752669 215658292 215627464 215653432 215693414 215745636 215765318 215731691 215693022 215668412 215692383 215770941
19055 215770941 215834449 215855253 215893998 216008354 216156794 216284988 216402586 216498114 216525899 216468865
19045 216468865 216382010 216342361 216347285 216327524 216234631 216039834 215764127 215471662 215221637 215077908
19035 215077908 215071465 215163707 215283335 215358279 215417743 215554838 215731673 215827767 215763910 215575524
19025 215575524 215412070 215397625 215500382 215593017 215636795 215670666 215708970 215738645 215770008 215813546
19015 215813546 215837352 215867779 215932428 215986063 216035037 216108100 216183515 216230243 216233901 216188265 216092727
19004 216092727 215956584 215833675 215767904 215764618 215822844 215915334 216011130 216074947 216048207 215910569
18994 215910569 215762431 215727075 215787713 215811805 215754838 215730017 215790619 215879595 216012336 216200559
18984 216200559 216359061 216410749 216337725 216164744 215956852 215787783 215664449 215532405 215400255
18975 215400255 215351870 215431232 215570068 215667119 215660948 215570129 215439334 215322916 215271449 215226096
18965 215226096 215166838 215166250 215234004 215315354 215408309 215520131 215594803 215636859 215655323 215621302 215554302
18954 215554302 215484757 215438199 215421758 215415850 215389349 215291091 215142290 215003811 214926423 214920437 214943429
18943 214943429 214956986 214954758 214961392 214997947 215085194 215219640 215314852 215288434 215150293 214983337 214911359
18932 214911359 214987019 215141288 215273218 215348709 215387482 215389212 215333756 215279065 215326912 215435437
18922 215435437 215462202 215353818 215150937 214967349 214912934 214973600 215088507 215256841 215506394 215772472
18912 215772472 215956595 216058620 216123515 216191910 216247891 216262980 216282288 216335994 216377910 216386614 216390358
18901 216390358 216408560 216433817 216448141 216430329 216410807 216482557 216591530 216583244 216467767 216347965
18891 216347965 216285313 216291972 216344460 216385306 216335919 216172810 216000717 215955001 216002242 216052626 216097013
18880 216097013 216098169 216017933 215869568 215712459 215626086 215611672 215587030 215520022 215432884 215351183 215261089
18869 215261089 215137017 215031014 214976651 214962803 215021870 215166618 215359893 215539631 215642138 215727911
18859 215727911 215846457 215920048 215889826 215799174 215722264 215715470 215810067 215944478 216002093 215915829 215724606
18848 215724606 215542403 215477145 215577195 215772976 215937546 215990302 215949453 215872885 215804723 215733957
18838 215733957 215606131 215455236 215402787 215517227 215760469 216026510 216210162 216272919 216258386 216237791
18828 216237791 216223251 216186023 216138775 216053858 215901861 215747127 215650204 215570967 215429664 215289682
18818 215289682 215290091 215401597 215472800 215399064 215200476 214988579 214828047 214718481 214654687 214674156
18808 214674156 214778813 214909057 214995979 215036398 215037538 215035792 215085577 215182547 215274644 215309025 215287444
18797 215287444 215233704 215163282 215118871 215077315 214940774 214685176 214460924 214441092 214579700 214681766
18787 214681766 214657216 214600431 214664534 214903787 215204055 215410687 215479131 215443421 215382334 215314326
18777 215314326 215209622 215086826 214970983 214883726 214824649 214795487 214808400 214827969 214840739 214893828
18767 214893828 214975396 215041582 215108335 215180995 215243748 215326807 215457225 215568044 215593985 215549877
18757 215549877 215485102 215459250 215554292 215736877 215855481 215839303 215725034 215610496 215594002 215654540
18747 215654540 215722986 215759523 215733301 215676514 215617323 215586618 215647693 215770646 215872526 215922282
18737 215922282 215916717 215863489 215780151 215713383 215727663 215816932 215887817 215890469 215819177 215728048 215716459
18726 215716459 215788990 215884446 215981585 216108430 216257190 216368108 216391109 216327854 216250975 216199570
18716 216199570 216161137 216114256 216018562 215873271 215745350 215689846 215712369 215766208 215807618 215821982
18706 215821982 215860969 216016867 216284257 216537710 216668880 216674156 216592439 216445720 216250235 216003842
18696 216003842 215697383 215379767 215129071 214987424 214952330 214964746 214967257 214955873 214941716 214979419
18686 214979419 215141615 215397503 215644822 215811213 215867640 215825553 215753365 215706218 215701086 215689890
18676 215689890 215635899 215556942 215448840 215342920 215325498 215444340 215638825 215787623 215819079 215786298
18666 215786298 215748139 215690291 215578256 215413418 215241080 215128295 215117344 215193592 215291824 215400345
18656 215400345 215542110 215654440 215739142 215857082 216010350 216148957 216238750 216270268 216247485 216176607
18646 216176607 216031263 215838747 215704908 215646514 215585170 215492673 215386046 215258498 215118270 215010785
18636 215010785 214934204 214829235 214706101 214622280 214582739 214610184 214723441 214894154 215040588 215088949
18626 215088949 215031472 214932240 214845061 214786384 214788968 214904473 215125409 215372388 215554626 215609433
18616 215609433 215572171 215475073 215353561 215266474 215249173 215303345 215388409 215474665 215544646 215545242 215443636
18605 215443636 215302009 215227061 215253732 215318404 215415447 215553776 215659984 215662509 215581326 215500058
18595 215500058 215463393 215476740 215530612 215586052 215543189 215388221 215208712 215041277 214887638 214798023
18585 214798023 214781440 214783343 214785932 214772388 214708256 214660600 214699170 214788774 214890753 214969349 215000170
18574 215000170 214977238 214912030 214838757 214763972 214700326 214648333 214562236 214414509 214264066 214191601
18564 214191601 214132228 214052070 214047243 214149291 214297251 214468131 214654045 214813415 214921516 215002946
18554 215002946 215125930 215298683 215439735 215476628 215423186 215320989 215197531 215059335 214914609
18545 214914609 214773774 214625930 214500672 214404943 214305976 214220401 214174174 214167881 214194018 214278100
18535 214278100 214428113 214593507 214724651 214832856 214920725 214942005 214850876 214675178 214548731 214557578
18525 214557578 214718520 214995206 215257331 215384226 215359072 215212348 215036054 214953719 214978136 215023696
18515 215023696 215041066 215023460 215009850 215034041 215069397 215111067 215171839 215236849 215244495 215142464 214980376
18504 214980376 214884522 214900168 214940926 214924104 214820417 214675898 214620753 214754498 214990101 215152596
18494 215152596 215159996 215091099 215015106 214908467 214815991 214807657 214855052 214890587 214906575 214929457 214938646
18483 214938646 214906403 214843635 214739606 214589322 214473736 214443442 214467052 214492709 214491928 214513402 214625891
18472 214625891 214855243 215149257 215433632 215634672 215692214 215648793 215593942 215557657 215508606 215408561
18462 215408561 215252973 215095496 215026300 215061583 215117858 215125288 215149081 215254712 215333603 215304439
18452 215304439 215250753 215223809 215202728 215172013 215120625 215035010 214896652 214753124 214666541 214583357
18442 214583357 214481262 214484125 214602427 214678638 214623414 214481168 214333052 214233684 214199508 214190549
18432 214190549 214142714 214059591 214032671 214074401 214078556 214011564 213912119 213825617 213802220 213866769 213997179
18421 213997179 214128961 214234299 214289009 214275593 214281935 214389405 214536476 214634631 214617379 214509380
18411 214509380 214443286 214457194 214469578 214420610 214329011 214256210 214254096 214300317 214330160 214338019 214325830
18400 214325830 214240262 214081145 213948835 213893842 213940113 214089648 214257853 214394214 214503764 214570247
18390 214570247 214557002 214442609 214238521 214062495 214049277 214138986 214234344 214346803 214478006 214556748
18380 214556748 214570637 214550200 214487668 214378445 214232896 214118104 214097024 214107897 214090784 214075843
18370 214075843 214056696 214022492 214010625 214031722 214018298 213930196 213820510 213751022 213787401 213991469
18360 213991469 214317413 214643850 214826755 214827792 214797694 214833183 214859434 214790943 214609729 214370762
18350 214370762 214209802 214213881 214328307 214441080 214508173 214532874 214530335 214559072 214624202 214685059 214752242
18339 214752242 214816677 214842822 214844466 214841668 214802801 214711643 214638558 214630273 214638995 214623188 214608833 214600956
18327 214600956 214611258 214677877 214781647 214851234 214854061 214856439 214959742 215172708 215382310 215468623
18317 215468623 215375077 215173856 214984277 214822532 214678497 214553957 214477586 214467260 214499819 214581526
18307 214581526 214703329 214793152 214813972 214782568 214759063 214786599 214773039 214647209 214497731 214401603
18297 214401603 214322008 214179843 214018201 213962711 214031232 214148738 214219438 214170330 214045556 213951725
18287 213951725 213909477 213890546 213905477 213983097 214159409 214443083 214737982 214950133 215055546 215053746
18277 215053746 214966662 214817461 214641452 214469914 214321390 214213241 214122365 214061927 214058583 214051495
18267 214051495 214020375 214037728 214158860 214400059 214687422 214906421 214991766 214918342 214755366 214621242
18257 214621242 214553804 214528838 214480816 214326583 214103783 213922838 213809342 213754226 213818246 214046577
18247 214046577 214358558 214649994 214889214 215100408 215230274 215170548 214947682 214703546 214477853
18238 214477853 214268119 214148120 214165591 214292882 214441129 214523557 214509367 214397195 214206662 214008881
18228 214008881 213899695 213934182 214075658 214194851 214173484 214049646 213932577 213889758 213905474 213904134
18218 213904134 213871290 213830341 213789017 213772547 213815508 213899200 213960030 213979360 213998276 214101547 214322630
18207 214322630 214590947 214765005 214732134 214552668 214381141 214294536 214258341 214166121 213981808 213770354
18197 213770354 213622174 213602632 213678393 213740092 213761585 213801895 213852342 213885909 213921327 213937221 213893713
18186 213893713 213809804 213770111 213843226 213978295 214055382 214045767 214051675 214188134 214418451 214567440
18176 214567440 214531351 214388828 214269380 214146375 213980331 213829299 213770885 213842612 213995369 214130057
18166 214130057 214211702 214193824 214023613 213755117 213529383 213436905 213468055 213556533 213621841 213642822
18156 213642822 213642465 213644293 213624694 213549716 213455291 213373284 213324618 213382333 213602546 213935335 214199292
18145 214199292 214261643 214182476 214082242 214035670 214085031 214226139 214410851 214641557 214914801 215162652
18135 215162652 215303434 215300366 215212002 215097541 214946351 214774776 214609630 214437819 214256420 214107082
18125 214107082 214026537 213961843 213916087 213956429 214035422 214034282 213943745 213831825 213769242 213770803 213805585
18114 213805585 213880235 214039804 214271975 214490231 214654368 214779337 214809455 214676861 214451552
18105 214451552 214249363 214071285 213945211 213969543 214090289 214172254 214191097 214195724 214206033 214230299
18095 214230299 214244928 214212576 214161932 214115010 214078106 214050604 214021923 213976211 213912248 213866626 213866434
18084 213866434 213892743 213899249 213837041 213697735 213528331 213421514 213497221 213724490 213927372 213999171
18074 213999171 213983637 213982701 214005977 213972714 213885315 213850252 213922435 214019196 214021871 213892146 213702266
18063 213702266 213558326 213514989 213583584 213737280 213883307 213969479 214001998 214008960 214008701 213970516 213893397
18052 213893397 213850411 213896231 213960728 213940659 213872477 213883943 213989363 214086465 214082579 213962212 213752257
18041 213752257 213509823 213335360 213286325 213329591 213394327 213469901 213573897 213690301 213812193 213945642
18031 213945642 214060022 214156022 214275617 214353968 214275067 214101611 213996936 214031313 214153310 214282804
18021 214282804 214392744 214465436 214499972 214504788 214455076 214380987 214291166 214110493 213862173 213679188
18011 213679188 213620184 213655937 213768737 213935875 214098360 214199344 214242018 214198592 214082559 213978895
18001 213978895 213907598 213863785 213839713 213768905 213639593 213529646 213474061 213481687 213538037 213590600 213630728
17990 213630728 213646386 213595729 213500376 213430600 213441020 213510686 213549471 213499690 213377296 213271069
17980 213271069 213291338 213453988 213663715 213843439 213941005 213897044 213766302 213666895 213601412 213509586
17970 213509586 213388730 213295080 213252032 213230133 213179491 213098809 213001305 212878904 212774505 212725813
17960 212725813 212756424 212834143 212905908 212986483 213065576 213120715 213171302 213215552 213255711 213313382 213334822
17949 213334822 213323070 213352912 213424624 213476222 213460245 213419868 213384318 213333597 213267711 213214071 213234373
17938 213234373 213322372 213371801 213321244 213217998 213152976 213138370 213082295 213002150 213019637 213199535
17928 213199535 213513365 213856010 214170419 214425293 214540818 214564686 214616871 214670499 214685187 214674132
17918 214674132 214656855 214658096 214610445 214459829 214312586 214245737 214218275 214161067 214072457 214006949 213942473
17907 213942473 213817700 213630573 213420880 213219261 213035882 212923643 212943986 213049243 213130341
17898 213130341 213147727 213135255 213129751 213150399 213150826 213117723 213142439 213258791 213378566 213414491 213338429
17887 213338429 213187624 213033465 212919000 212811889 212707336 212645721 212630899 212639064 212653204 212651214
17877 212651214 212568319 212422673 212318475 212291443 212320989 212405708 212520116 212647014 212806371 212973649
17867 212973649 213104604 213182176 213234778 213283395 213341409 213455229 213618002 213755758 213848981 213914762
17857 213914762 213929792 213890784 213833604 213792298 213773473 213752398 213684216 213567562 213491065 213482620 213475049
17846 213475049 213432731 213340157 213199050 213082591 213048397 213069924 213071273 212951127 212712655 212532962
17836 212532962 212534804 212680580 212900416 213133909 213300411 213312407 213218690 213141374 213099522 213040155
17826 213040155 212936928 212777678 212630225 212595938 212684822 212825211 212996275 213170532 213283181
17817 213283181 213336382 213414399 213574185 213792952 214019568 214200550 214267503 214183470 214033814 213903072
17807 213903072 213771426 213608918 213455519 213298020 213120354 212987190 212980995 213120774 213327559
17798 213327559 213538180 213675040 213688354 213645032 213620418 213649324 213742023 213839505 213877550 213823319
17788 213823319 213678135 213510156 213333072 213167399 213070430 213030791 213028501 213056805 213073085 213088919
17778 213088919 213136730 213187726 213204016 213196656 213236289 213342974 213429819 213422649 213348268 213270531 213200712
17767 213200712 213116851 213059727 213116561 213277590 213410639 213390349 213193068 212942951 212801450 212789226
17757 212789226 212824620 212867387 212908681 212955077 212985668 213010402 213096497 213251609 213438316 213570962
17747 213570962 213624277 213642311 213626902 213611771 213633305 213609386 213510351 213416373 213358460 213308324 213224587
17736 213224587 213084325 212930338 212817539 212777652 212768039 212724507 212678371 212683299 212705530 212693977 212674382
17725 212674382 212673213 212698025 212728449 212721190 212666304 212612270 212575820 212522981 212453275 212386130 212319030
17714 212319030 212253438 212221772 212235662 212278205 212331911 212341897 212272268 212175634 212145922 212222673 212355706
17703 212355706 212493429 212626074 212730947 212744436 212681341 212684453 212830452 213040215 213227270 213371071
17693 213371071 213448112 213442252 213392477 213333032 213285702 213287485 213307144 213277792 213180691 213019069 212815465
17682 212815465 212625731 212488475 212395337 212366805 212437394 212544937 212632628 212736551 212862314 212910858
17672 212910858 212816773 212625165 212426110 212281227 212246581 212298945 212308077 212241615 212187465 212185788 212215337
17661 212215337 212273648 212373213 212526071 212687736 212777460 212781344 212768448 212749968 212684819 212605575 212531535
17650 212531535 212482773 212453721 212449326 212495299 212539319 212540059 212499147 212420594 212316072 212236216 212245774
17639 212245774 212342585 212454469 212554620 212679385 212818098 212919405 212941606 212862144 212696805 212520352
17629 212520352 212413877 212364455 212324049 212264926 212176200 212114484 212134084 212196846 212225631 212206586 212227085
17618 212227085 212368428 212578755 212745289 212826043 212851268 212823796 212705366 212547414 212422418 212340034
17608 212340034 212310044 212315439 212359792 212429525 212462378 212421690 212299692 212175379 212158027 212217462 212253643
17597 212253643 212267968 212282851 212285322 212285785 212323849 212361408 212333806 212296838 212315199 212327112 212270572
17586 212270572 212159959 212022517 211913560 211927205 212078517 212279164 212438850 212522689 212568551 212590208
17576 212590208 212541837 212442300 212407245 212529232 212733316 212871414 212921462 212922203 212853071 212727273
17566 212727273 212646969 212653294 212723916 212849082 212991380 213083641 213074496 212957043 212772887 212610303
17556 212610303 212549114 212569000 212573980 212513654 212394323 212213644 212002914 211829106 211753842 211816275
17546 211816275 211979104 212192714 212429111 212627977 212734886 212761448 212738787 212658704 212531051 212398511
17536 212398511 212266848 212178205 212221772 212372914 212481780 212408272 212205833 212030053 211904325 211826780
17526 211826780 211831907 211930754 212080169 212188607 212175356 212033007 211866327 211773873 211763333 211840196
17516 211840196 211996630 212192014 212367613 212452337 212429739 212369659 212317611 212252823 212210799 212252915
17506 212252915 212298515 212201139 212002243 211890269 211888247 211893215 211875727 211850097 211852686 211885118 211908165
17495 211908165 211914796 211946897 212085337 212333076 212599558 212806890 212903844 212884124 212800592 212726048
17485 212726048 212699126 212703044 212706941 212698137 212636025 212521908 212354759 212151237 211985606 211907838 211961557
17474 211961557 212110398 212247978 212327133 212361111 212413329 212544480 212704640 212788296 212748947 212596737
17464 212596737 212359603 212089379 211824286 211629204 211519020 211458515 211430290 211412570 211369817 211268035
17454 211268035 211155238 211118516 211164874 211229713 211271584 211274666 211230332 211163233 211104492 211074584 211131369
17443 211131369 211293844 211452827 211492335 211447773 211425778 211465688 211565030 211683464 211772560 211786204
17433 211786204 211702273 211566950 211425118 211297570 211192919 211106443 211047293 211004825 211000019 211049160
17423 211049160 211113415 211130573 211110522 211107826 211130680 211133271 211151095 211265394 211393684 211425591 211346583
17412 211346583 211198641 211045211 210972822 211049604 211242390 211442848 211552920 211562606 211530640 211491701
17402 211491701 211441752 211409197 211416657 211396652 211333795 211269282 211248430 211309103 211404261 211448109 211460808
17391 211460808 211511432 211656450 211856530 211961311 211906314 211760223 211643525 211683069 211869690 212093132
17381 212093132 212251848 212298378 212240243 212129698 212011934 211894417 211793073 211729981 211731368 211804842
17371 211804842 211916548 211996538 212018097 211971860 211831543 211631418 211477668 211446216 211487380 211494129
17361 211494129 211424783 211297135 211142072 211019250 211001428 211125798 211334185 211502913 211579772 211594631
17351 211594631 211604414 211659315 211721442 211752930 211749651 211644101 211455883 211358064 211418598 211520880 211568185
17340 211568185 211555871 211522389 211507853 211512403 211507613 211552449 211656482 211751615 211862859 212029022 212200651
17329 212200651 212318101 212358311 212326047 212213417 212075009 212021579 212058188 212087095 212061080 212030212
17319 212030212 212028753 212067836 212118092 212059825 211824450 211481833 211209637 211143712 211216929 211289661
17309 211289661 211285664 211212212 211125165 211084406 211072018 211072822 211103413 211157520 211190465 211170850 211102574
17298 211102574 211030910 211012758 211052984 211166363 211363171 211592215 211783277 211919583 212036273 212136375
17288 212136375 212179115 212154887 212100950 212009456 211872094 211736883 211706584 211836024 212027987 212160788
17278 212160788 212195777 212132655 211990688 211827710 211707478 211649508 211606501 211500112 211328800 211141918
17268 211141918 211004250 210961281 210999259 211104336 211295352 211542211 211780038 211955886 212035829 212052326
17258 212052326 212029325 211971574 211881508 211761482 211694725 211747560 211860968 211921925 211856134 211677804
17248 211677804 211485770 211412239 211496970 211658863 211781648 211870318 211980582 212089115 212067812 211844346
17238 211844346 211521535 211223040 211005480 210910688 210955027 211076129 211211304 211365065 211514645
17229 211514645 211577634 211530908 211454627 211404502 211376501 211344569 211274957 211160853 211011020 210870392
17219 210870392 210740357 210586955 210423500 210300823 210266720 210329814 210476201 210657910 210790385
17210 210790385 210843308 210807357 210670958 210508353 210433318 210506258 210673064 210851976 210994410 211129515
17200 211129515 211298080 211441468 211477432 211360815 211155794 210998229 210960866 210977289 210973739 210957890
17190 210957890 210996634 211118793 211280670 211410076 211450704 211405350 211294815 211191502 211205134 211325891
17180 211325891 211449657 211518586 211562346 211606037 211573313 211395795 211142080 210972029 211001224 211163025
17170 211163025 211248678 211188175 211048337 210927728 210890177 210897762 210947450 211068568 211217393 211357498
17160 211357498 211494914 211635848 211743093 211796562 211860904 211950694 211955977 211815063 211628502 211514301
17150 211514301 211479451 211502553 211550984 211565706 211513835 211447879 211443905 211504934 211557938 211531039 211400749
17139 211400749 211247193 211172111 211143693 211066519 210934643 210800592 210696222 210622015 210582233 210615592
17129 210615592 210704154 210782607 210820244 210798706 210739509 210719855 210746392 210757595 210761147 210778951 210774546
17118 210774546 210728632 210658087 210589950 210541456 210510212 210500855 210527533 210612935 210741680 210861584 210952972
17107 210952972 210999440 210953056 210799268 210580545 210362068 210207692 210132679 210082023 210038131 210064807
17097 210064807 210214047 210431913 210609365 210709050 210742400 210768566 210877599 211041260 211113780 211046621
17087 211046621 210874209 210618792 210343073 210183554 210201816 210292271 210360348 210414394 210435485 210384205
17077 210384205 210272991 210165562 210097718 210093855 210153873 210220039 210270560 210299477 210289134 210270916 210307852
17066 210307852 210379154 210446596 210446765 210363214 210301748 210320290 210363378 210432746 210603992 210878604 211138182
17055 211138182 211250110 211203013 211108023 211053210 211058354 211076231 211061978 211044267 211016644 210961097 210896789
17044 210896789 210845257 210816806 210810416 210785827 210724393 210670262 210680148 210762171 210826353 210757448 210590413
17033 210590413 210471919 210456581 210439812 210361414 210330751 210406209 210524745 210618357 210636883 210569699
17023 210569699 210474833 210441946 210493527 210547181 210529520 210461193 210383771 210336991 210324734 210300909 210229634
17012 210229634 210170800 210206353 210288188 210332893 210338846 210333832 210281788 210158466 210022188 209954009 210041794
17001 210041794 210260749 210449457 210566015 210662890 210698994 210676888 210672296 210655402 210575753 210473502
16991 210473502 210366403 210259222 210244637 210389363 210589158 210716965 210774719 210832808 210915124 210974364
16981 210974364 210914864 210737600 210552502 210433520 210371905 210338198 210351828 210397489 210446038 210524121
16971 210524121 210627732 210714388 210774799 210786489 210721139 210584817 210380367 210141235 209966789 209932715
16961 209932715 210008071 210092522 210124150 210110723 210072153 210043593 210050160 210092497 210164471 210247286 210282541
16950 210282541 210256776 210224195 210143882 209933448 209702367 209577181 209515152 209486933 209511107 209589771
16940 209589771 209675194 209726024 209727609 209703726 209696883 209687583 209640410 209606553 209660320 209802083 209950451
16929 209950451 210075481 210180823 210231023 210250819 210295237 210352560 210359198 210285847 210131856 209908700
16919 209908700 209695575 209546117 209405870 209241159 209083072 209021301 209091254 209216022 209321977
16910 209321977 209390185 209438913 209502720 209595455 209691014 209781194 209909556 210091942 210235031 210339267
16900 210339267 210518482 210701210 210728316 210624779 210512390 210421941 210317501 210202183 210111654 210088814
16890 210088814 210149969 210288109 210484230 210648294 210682196 210574431 210352064 210092522 209891186
16881 209891186 209808605 209828959 209910304 210033501 210186659 210370250 210561673 210693464 210708868 210609369
16871 210609369 210471997 210362421 210289734 210265111 210304568 210364540 210365361 210304911 210231296 210170568 210074682
16860 210074682 209953451 209907731 209927718 209920176 209919883 209981723 210052370 210083438 210035957 209902097 209772203
16849 209772203 209735300 209751159 209759358 209839390 210053624 210292575 210456332 210588131 210676598 210689228
16839 210689228 210743769 210887713 211034599 211135682 211188843 211197613 211136358 210983013 210773145 210581601
16829 210581601 210450436 210414388 210457141 210464692 210379028 210243685 210106203 210004360 209988341 210043409
16819 210043409 210101167 210080632 210012581 209992010 210012662 210041381 210067634 210128803 210210121 210280329 210346412
16808 210346412 210357032 210329020 210348648 210400160 210419962 210424083 210429993 210399604 210326892 210207300 210056414
16797 210056414 209933832 209874812 209896403 209980420 210038416 210025719 209974748 209905293 209797277 209679128
16787 209679128 209623772 209672270 209796814 209912551 209987725 210074525 210207647 210376654 210559275 210711860
16777 210711860 210806766 210844648 210804134 210669545 210451563 210168659 209895783 209733782 209675213 209625489
16767 209625489 209499338 209294947 209105863 208998188 208976007 209062180 209267159 209565464 209866859
16758 209866859 210036210 210048315 209946151 209865385 209920275 210047815 210149584 210204201 210254421 210289554
16748 210289554 210283962 210209796 210053321 209907794 209857386 209892669 209965442 210032834 210035377 209974857 209945364
16737 209945364 209960665 209946349 209833551 209575157 209263496 209069194 209061504 209209626 209403857 209543715
16727 209543715 209601540 209575528 209461750 209327092 209241886 209157986 209009585 208882138 208884292 208963716
16717 208963716 209039914 209120099 209260777 209447625 209633210 209800583 209908104 209935516 209923915 209928528
16707 209928528 209987820 210092613 210194491 210293615 210377450 210424127 210417935 210305924 210116154 210001336
16697 210001336 210017994 210057055 210029742 209975129 209904565 209782116 209649651 209564476 209526056 209542731
16687 209542731 209659996 209841915 209979839 210031524 210026275 209951512 209820741 209732220 209733662 209745429
16677 209745429 209682852 209538280 209368232 209223009 209127338 209115975 209186947 209300379 209423625 209523806
16667 209523806 209583555 209622790 209666620 209732378 209767233 209766302 209793537 209820542 209802619 209767156 209728403
16656 209728403 209664229 209561909 209429385 209278697 209151846 209090419 209039901 208928625 208766683 208601315
16646 208601315 208470438 208413186 208475217 208640678 208847597 209076632 209293397 209470317 209631112
16637 209631112 209768075 209803652 209697743 209575375 209608568 209788054 209945962 209952987 209826785 209679130
16627 209679130 209612202 209609871 209622461 209631112 209636232 209646924 209678830 209794766 209928293 209983208 209997121
16616 209997121 209942578 209832379 209677510 209448998 209227915 209110156 209079180 209079016 209098171 209116440
16606 209116440 209131904 209170480 209196953 209180693 209165614 209176253 209193029 209188665 209131369 209032821 208937648
16595 208937648 208861657 208829367 208846308 208857297 208847139 208846098 208884767 208964325 209044670 209105113 209210883
16584 209210883 209371809 209478044 209478117 209426062 209419337 209479464 209547087 209559462 209483780 209354339 209259659
16573 209259659 209227414 209240069 209251644 209178398 209013139 208825174 208687170 208588794 208493424 208435607
16563 208435607 208433991 208480852 208561371 208679035 208816697 208931936 209015940 209066397 209050192 208936081
16553 208936081 208768975 208662899 208728578 208922101 209135479 209291364 209287950 209089431 208795523 208557989
16543 208557989 208482838 208569008 208716732 208819194 208850099 208835326 208823317 208805578 208769111 208762715 208769976
16532 208769976 208708518 208574933 208437200 208346522 208350228 208450145 208602418 208724642 208722017 208609032
16522 208609032 208522918 208561415 208674122 208736406 208709453 208686426 208747383 208809102 208785529 208749663 208757844
16511 208757844 208766708 208713539 208573767 208387454 208216592 208144719 208209990 208316573 208366417 208381236
16501 208381236 208423529 208479504 208510012 208542402 208618810 208746612 208914640 209087321 209224385 209315465
16491 209315465 209330381 209265314 209191227 209148675 209122293 209101061 209066670 209011150 208928536 208838546 208773851
16480 208773851 208737733 208721622 208670695 208550514 208408811 208335816 208346542 208397347 208475477 208615311
16470 208615311 208862375 209146528 209287765 209265295 209223539 209243084 209267347 209259658 209236395 209216273
16460 209216273 209211147 209231290 209295977 209359746 209341911 209214169 209033837 208899315 208899825 208994913 209027943
16449 209027943 208946467 208848298 208777004 208711128 208620804 208508163 208415185 208353052 208336342 208341409 208346479
16438 208346479 208393919 208493790 208608917 208693681 208747407 208793993 208818198 208827103 208855911 208892433 208913003
16427 208913003 208950113 208957684 208857203 208688271 208526246 208405378 208332269 208339444 208427111 208510147
16417 208510147 208484882 208325306 208103214 207938142 207866633 207815804 207764053 207797465 207993882 208289147
16407 208289147 208541181 208656037 208655795 208647968 208682533 208758047 208817345 208843825 208893287 208981514 209028803
16396 209028803 208984245 208869882 208722420 208584444 208529699 208581942 208662433 208686539 208643691 208583293
16386 208583293 208508419 208385884 208268086 208254866 208348797 208472735 208564922 208616907 208671559 208746901
16376 208746901 208842515 208920186 208902463 208803934 208707483 208667562 208681671 208710574 208702562 208656804 208622163
16365 208622163 208575176 208476839 208388174 208335134 208337547 208459322 208656269 208780197 208750474 208633085
16355 208633085 208512323 208418873 208348038 208244715 208107446 208023962 208021481 208068928 208210508 208459937
16345 208459937 208702817 208835459 208879736 208924881 208962154 208908977 208768455 208613608 208459994 208313586
16335 208313586 208252866 208344765 208543746 208783624 209041576 209241850 209322187 209299012 209214989 209114297
16325 209114297 208990716 208818129 208596210 208367558 208191407 208129174 208204706 208345484 208452911
16316 208452911 208485033 208440844 208320959 208150482 207985870 207902285 207953766 208116313 208304413 208442438
16306 208442438 208542538 208674495 208848504 209000616 209093197 209123259 209075400 208944219 208763993 208592707
$$ [...]
##END NTUPLES=NMR SPECTRUM
##END=
