##TITLE=c13 ikalashn
LR-786-OM-C1
16.10.2024
##JCAMPDX= 6.0         $$ Bruker NMR JCAMP-DX V2.0
##DATA TYPE= NMR SPECTRUM
##DATA CLASS= NTUPLES
##ORIGIN= UXNMR, Bruker Analytische Messtechnik GmbH
##OWNER= root
$$ TOPSPIN		Version 1.3
$$ 2024-10-16 08:30:03.234 +0400  Irina@DPX200
$$ Compression mode = diff/dup
##.OBSERVE FREQUENCY= 50.3277412709
##.OBSERVE NUCLEUS= ^13C
##.ACQUISITION MODE= SIMULTANEOUS
##.ACQUISITION SCHEME= undefined
##.AVERAGES= 17760
##.DIGITISER RES= 17
##SPECTROMETER/DATA SYSTEM= spect
##.PULSE SEQUENCE= zgpg
##.SOLVENT NAME= CDCl3
##.SHIFT REFERENCE= INTERNAL, CDCl3, 1, 219.1352
##AUDIT TRAIL= $$ (NUMBER, WHEN, WHO, WHERE, WHAT)
$$ ##TITLE= Audit trail, TOPSPIN		Version 1.3
$$ ##JCAMPDX= 5.01
$$ ##ORIGIN= Bruker BioSpin GmbH
$$ ##OWNER= Irina
$$ $$ F:/spectra/data/iren/nmr/c13zvl/1/pdata/1/auditp.txt
$$ ##AUDIT TRAIL=  $$ (NUMBER, WHEN, WHO, WHERE, VERSION, WHAT)
(   1,<2024-10-16 08:28:53.531 +0400>,<Irina>,<DPX200>,<TOPSPIN 1.3>,
      <created by zg
	started at 2024-10-15 15:33:34.984 +0400,
	POWCHK disabled, PULCHK disabled
       terminated by command 'halt'
       configuration hash MD5:
       BE 6D 3F 07 2A EA 11 49 91 17 2B D3 AF B3 58 0D
       data hash MD5: 32K
       E1 B4 64 FB E9 56 3C CD AD DA 49 15 2C EF A8 16>)
(   2,<2024-10-16 08:29:10.234 +0400>,<Irina>,<DPX200>,<TOPSPIN 1.3>,
      <Start of raw data processing
       efp BC_mod = 2 LB = 2 FT_mod = 6 PKNL = 1 PHC0 = 196.8808 PHC1 = 1.824199 SI = 32K 
       data hash MD5: 32K
       FA 25 37 BC 7F 04 23 4E C7 52 AA 02 B8 9A FA 8D>)
(   3,<2024-10-16 08:29:17.375 +0400>,<Irina>,<DPX200>,<TOPSPIN 1.3>,
      <apk 
       data hash MD5: 32K
       FB 4A 79 B4 51 4D BE 54 02 DE 44 B1 5D D5 DD 71>)
(   4,<2024-10-16 08:29:19.281 +0400>,<Irina>,<DPX200>,<TOPSPIN 1.3>,
      <abs n ABSG = 5 
       data hash MD5: 32K
       9B 8B F8 E5 22 3B 8D 79 F8 C7 66 2B 23 6A 3A BE>)
$$ ##END=
$$ 
$$ $$ hash MD5
$$ $$ 9B 6F B9 B1 F5 62 2C D8 F9 BD 61 B7 5A A7 95 9A
##$RELAX= 
##$RELAX= 
##$RELAX= 
##$RELAX= 
##$RELAX= 
##$RELAX= 
##$RELAX= 
##$RELAX= 
##$RELAX= 
$$ Bruker specific parameters
$$ --------------------------
##$DU= <F:/spectra>
##$EXPNO= 1
##$NAME= <c13zvl>
##$PROCNO= 1
##$TYPE= <nmr>
##$USER= <iren>
##$AMP= (0..31)
100 100 100 100 100 100 100 100 100 100 100 100 100 100 100 100 100 100 
100 100 100 100 100 100 100 100 100 100 100 100 100 100 
##$ANAVPT= -1
##$AQSEQ= 0
##$AQ_mod= 1
##$AUNM= <au_zg>
##$AUTOPOS= <>
##$BF1= 50.322709
##$BF2= 200.13
##$BF3= 200.13
##$BF4= 200.13
##$BF5= 200.13
##$BF6= 200.13
##$BF7= 200.13
##$BF8= 200.13
##$BYTORDA= 1
##$CFDGTYP= 0
##$CFRGTYP= 5
##$CHEMSTR= <none>
##$CNST= (0..63)
1 1 145 1 1 1 1 1 1 1 1 1 1 1 1 1 1 1 1 1 1 1 1 1 1 1 1 1 1 1 1 1 1 1 
1 1 1 1 1 1 1 1 1 1 1 1 1 1 1 1 1 1 1 1 1 1 1 1 1 1 1 1 1 1 
##$CPDPRG= <waltz16>
##$CPDPRG1= <>
##$CPDPRG2= <waltz16>
##$CPDPRG3= <>
##$CPDPRG4= <mlev>
##$CPDPRG5= <mlev>
##$CPDPRG6= <mlev>
##$CPDPRG7= <mlev>
##$CPDPRG8= <mlev>
##$CPDPRGB= <>
##$CPDPRGT= <>
##$D= (0..63)
$$ [...]
##$SW= 238.246489333188
##$SWIBOX= (0..15)
0 1 3 0 0 0 0 0 0 0 0 0 0 0 0 0 
##$SW_h= 11990.4076738609
##$TD= 32768
##$TD0= 1
##$TE= 300
##$TE2= 300
##$TE3= 300
##$TEG= 300
##$TL= (0..7)
120 120 120 120 120 120 120 120 
##$TP= (0..7)
150 150 150 150 150 150 150 150 
##$TP07= 0
##$TPNAME0= <>
##$TPNAME1= <>
##$TPNAME2= <>
##$TPNAME3= <>
##$TPNAME4= <>
##$TPNAME5= <>
##$TPNAME6= <>
##$TPNAME7= <>
##$TPOAL= (0..7)
0.5 0.5 0.5 0.5 0.5 0.5 0.5 0.5 
##$TPOFFS= (0..7)
0 0 0 0 0 0 0 0 
##$TUNHIN= 0
##$TUNHOUT= 0
##$TUNXOUT= 0
##$USERA1= <user>
##$USERA2= <user>
##$USERA3= <user>
##$USERA4= <user>
##$USERA5= <user>
##$V9= 5
##$VALIST= <valist>
##$VCLIST= <CCCCCCCCCCCCCCC>
##$VD= 0
##$VDLIST= <DDDDDDDDDDDDDDD>
##$VPLIST= <PPPPPPPPPPPPPPP>
##$VTLIST= <TTTTTTTTTTTTTTT>
##$WBST= 1024
##$WBSW= 4
##$XGAIN= (0..3)
0 0 0 0 
##$XL= 0
##$YL= 0
##$YMAX_a= 11036338
##$YMIN_a= -36977161
##$ZGOPTNS= <>
##$ZL1= 120
##$ZL2= 120
##$ZL3= 120
##$ZL4= 120
##$ABSF1= 219.1352
##$ABSF2= -19.13512
##$ABSG= 5
##$ABSL= 3
##$ALPHA= 0
##$AQORDER= 0
##$ASSFAC= 0
##$ASSFACI= 0
##$ASSFACX= 0
##$ASSWID= 0
##$AUNMP= <proc_1d>
##$AXLEFT= 0
##$AXRIGHT= 0
##$AXTYPE= 0
##$AXUNIT= <>
##$AZFE= 0.1
##$AZFW= 0.5
##$BCFW= 0
##$BC_mod= 2
##$BYTORDP= 0
##$COROFFS= 0
##$CY= -3
##$DATMOD= 1
##$DC= 0
##$DFILT= <>
##$DTYPP= 0
##$F1P= 0
##$F2P= 0
##$FCOR= 0.5
##$FTSIZE= 32768
##$FT_mod= 6
##$GAMMA= 0
##$GB= 0
##$INTBC= 1
##$INTSCL= 1.406111e-010
##$ISEN= 30
##$LB= 2
##$LEV0= 0
##$LPBIN= 0
##$MAXI= 7.640843
##$MC2= 0
##$MEAN= 0
##$ME_mod= 0
##$MI= 1.154659
##$NCOEF= 0
##$NC_proc= -3
##$NLEV= 6
##$NOISF1= 0
##$NOISF2= 0
##$NSP= 0
##$NTH_PI= 0
##$NZP= 0
##$OFFSET= 219.1352
##$PC= 1.4
##$PHC0= 185.8858
##$PHC1= 0.1320419
##$PH_mod= 1
##$PKNL= yes
##$PPARMOD= 0
##$PPDIAG= 0
##$PPIPTYP= 0
##$PPMPNUM= 100
##$PPRESOL= 1
##$PSCAL= 0
##$PSIGN= 0
##$REVERSE= no
##$SF= 50.322709
##$SI= 32768
##$SIGF1= 0
##$SIGF2= 0
##$SINO= 80
##$SIOLD= 32768
##$SREGLST= <13C.CDCl3>
##$SSB= 0
##$STSI= 32768
##$STSR= 0
##$SW_p= 11990.4076738609
##$SYMM= 0
##$S_DEV= 0
##$TDeff= 32768
##$TDoff= 0
##$TI= <>
##$TILT= no
##$TM1= 0
##$TM2= 0
##$TOPLEV= 0
##$USERP1= <user>
##$USERP2= <user>
##$USERP3= <user>
##$USERP4= <user>
##$USERP5= <user>
##$WDW= 1
##$XDIM= 32768
##$YMAX_p= 333543598
##$YMIN_p= -1622694
$$ End of Bruker specific parameters
$$ ---------------------------------
##NTUPLES= NMR SPECTRUM
##VAR_NAME=  FREQUENCY,     SPECTRUM/REAL,   SPECTRUM/IMAG
##SYMBOL=    X,             R,               I
##VAR_TYPE=  INDEPENDENT,   DEPENDENT,       DEPENDENT
##VAR_FORM=  AFFN,          ASDF,            ASDF
##VAR_DIM=   32768,         32768,           32768
##UNITS=     HZ,            ARBITRARY UNITS, ARBITRARY UNITS
##FACTOR=    0.365929370215793, 1,           1
##FIRST=     11990.4076738609, 77395,        9904201
##LAST=      0,             382504,          -38175333
##MIN=       0,             -1622694,        0
##MAX=       11990.4076738609, 333543598,    0
$$ Real data points
##PAGE= N=1
##DATA TABLE= (X++(R..R)), XYDATA
$$ [...]
##PAGE= N=2
##DATA TABLE= (X++(I..I)), XYDATA
$$ plain form
22927 200751185 200757766 200858166 201070521 201341583 201630671 201889126 202029543 202033602 201980149 201929393
22917 201929393 201870230 201778920 201701945 201654572 201578726 201508952 201505426 201556614 201627602 201671967 201660630
22906 201660630 201667734 201777232 201905090 201940295 201879840 201762550 201636406 201529585 201466148 201463810
22896 201463810 201502828 201578158 201665701 201739742 201791252 201806850 201800476 201757254 201628054 201501019 201487856
22885 201487856 201569100 201681745 201747730 201709206 201591080 201481376 201446605 201484457 201558457 201663849
22875 201663849 201794350 201876897 201851485 201755579 201663271 201632146 201629845 201596823 201545367 201520442 201547466
22864 201547466 201598860 201669126 201808920 202023798 202189684 202219217 202217013 202208269 202067745 201795800
22854 201795800 201554062 201487631 201589991 201745496 201876283 202006873 202158421 202238689 202134191
$$ packed form
22927B00751185O581J00400K12355K71062K89088K58455J40417M059n3453n0756
22917B01929393n9163r1310p6975m7373p5846o9774l526N1188P0988M4365j1337
22906B01660630P104J09498J27858L5205o0455j17290j26144j06821o3437k338
22896B01463810L9018P5330Q7543P4041N1510J5598o374m3222j29200j27035j3163
22885B01487856Q1244J12645O5985l8524j18126j09704l4771L7852P4000J05392
22875B01663849J30501Q2547k5412r5906r2308l1125k301l3022n1456k4925K7024
22864B01547466N1394P0266J39794K14878J65886K9533k204q744j40524k71945
22854B01795800k41738o6431J02360J55505J30787J30590J51548Q0268j04498
$$ plain form
22845 202134191 201918120 201739867 201611968 201469311 201324706 201278817 201379148 201555461 201683028
22836 201683028 201671419 201584910 201563845 201649957 201779124 201875405 201913356 201888932 201829134 201786482 201804212
22825 201804212 201826024 201739330 201571603 201423361 201351327 201355745 201421251 201507469 201545393 201508496 201456698
22814 201456698 201421584 201395443 201366878 201310383 201257403 201213246 201143173 201016859 200865615 200723697
22804 200723697 200610933 200570699 200634690 200788274 201025783 201349961 201699381 202021651 202234752
22795 202234752 202234830 202084500 201937857 201831751 201737221 201671367 201617202 201515311 201389915 201280566
22785 201280566 201233010 201262513 201307494 201333390 201346755 201334032 201324311 201413356 201587251 201771270 201952454
22774 201952454 202152786 202349848 202492552 202552662 202540877 202452875 202274511 202067587 201938568 201903083
$$ packed form
22845B02134191k16071j78253j27899j42657j44605m5889J00331J76313J27567
22836B01683028j1609q6509k1065Q6112J29167R6281L7951k4424n9798m2652J7730
22825B01804212K1812q6694j67727j48242p2034M418O5506Q6218L7924l6897n1798
22814B01456698l5114k6141k8565n6495n2980m4157p0073j26314j51244j41918
22804B00723697j12764m0234O3991J53584K37509L24178L49420L22270K13101
22795B02234752P8j50330j46643j06106r4530o5854n4165j01891j25396j09349
22785B01280566m7556K9503M4981K5896J3365j2723r721Q9045J73895J84019J81184
22774B01952454K00332J97062J42704O0110j1785q8002j78364k06924j29019l5485
$$ plain form
22764 201903083 201881934 201844291 201810242 201785470 201787092 201820245 201848222 201874932 201883537 201801259 201632672
22753 201632672 201446523 201307085 201255608 201262542 201258349 201227102 201197258 201197466 201238055 201302623 201338967
22742 201338967 201299950 201258999 201353109 201581394 201822422 201973418 201977916 201827861 201594778 201331048
22732 201331048 201086217 200962314 200959294 200971218 200972919 201009417 201050956 201009231 200907129 200829730 200857316
22721 200857316 201007227 201205426 201462891 201782335 202010722 202070367 202064283 202077945 202065058 201954053
22711 201954053 201743027 201499005 201287053 201143026 201066332 201068044 201097518 201072635 200985403 200912557
22701 200912557 200891273 200889965 200951093 201073242 201202168 201312060 201386647 201402932 201386209 201361376
22691 201361376 201297176 201198628 201144769 201221337 201400650 201543524 201560743 201468680 201356927 201288199
$$ packed form
22764B01903083k1149l7643l4049k4772J622L3153K7977K6710Q605q2278j68587
22753B01632672j86149j39438n1477O934m193l1247k9844K08M0589O4568L6344
22742B01338967l9017m0951R4110K28285K41028J50996M498j50055k33083k63730
22732B01331048k44831j23903l020J1924J701L6498M1539m1725j02102p7399K7586
22721B00857316J49911J98199K57465L19444K28387N9645o084J3662j2887j11005
22711B01954053k11026k44022k11952j44027p6694J712K9474k4883q7232p2846
22701B00912557k1284j308O1128J22149J28926J09892P4587J6285j6723k4833
22691B01361376o4200r8548n3859P6568J79313J42874J7219r2063j11753o8728
$$ plain form
22681 201288199 201242962 201173994 201097638 201043249 201027130 201032062 201028505 201022871 201034951 201066178 201095379
22670 201095379 201118921 201170512 201253787 201316854 201345234 201335148 201284695 201276784 201354510 201449701 201534759
22659 201534759 201566156 201520879 201479947 201501452 201602562 201764957 201891869 201902868 201822735 201698889
22649 201698889 201572839 201454909 201343647 201215599 201106739 201097074 201159391 201216761 201258690 201289586
22639 201289586 201274074 201170028 200982263 200787179 200617037 200482631 200446712 200557646 200800157
22630 200800157 201069181 201241034 201291488 201269387 201225377 201198434 201176102 201139747 201090130 201048325
22620 201048325 200999481 200911411 200810568 200732925 200712179 200701991 200651261 200626367 200684183 200800688
22610 200800688 200959040 201099467 201141806 201125022 201129525 201159130 201191123 201188522 201127904 201069588 201048651
$$ packed form
22681B01288199m5237o8968p6356n4389j6119M932l557n634J2080L1227K9201
22670B01095379K3542N1591Q3275O3067K8380j0086n0453p911P7726R5191Q5058
22659B01534759L1397m5277m0932K1505J01110J62395J26912J0999q0133j23846
22649B01698889j26050j17930j11262j28048j08860r665O2317N7370M1929L0896
22639B01289586j5512j04046j87765j95084j70142j34406l5919J10934K42511
22630B00800157K69024J71853N0454k2101m4010k6943k2332l6355m9617m1805
22620B01048325m8844q8070j00843p7643k0746j0188n0730k4894N7816J16505
22610B00800688J58352J40427M2339j6784M503K9605L1993k601o0618n8316k0937
$$ plain form
22599 201048651 201017918 200942655 200856511 200818283 200833784 200854953 200836165 200794265 200782425 200793597 200794179
22588 200794179 200790844 200769376 200718678 200651603 200600422 200599820 200673822 200864362 201117233 201291450 201359426
22577 201359426 201430326 201570286 201746459 201880762 201888838 201769596 201622821 201554337 201565933 201615331
22567 201615331 201673482 201725778 201765891 201785372 201778461 201724243 201644432 201564090 201412285 201150189 200861414
22556 200861414 200659229 200604074 200682335 200881932 201153070 201373022 201487357 201503056 201436882 201351978
22546 201351978 201304682 201273873 201225162 201215571 201323702 201507831 201658338 201793366 201928197 201983648
22536 201983648 201972577 202026537 202176578 202343174 202506208 202630749 202657158 202580686 202440994 202298249
22526 202298249 202255952 202333566 202401847 202372637 202282591 202172421 202044036 201909849 201817955 201795997
$$ packed form
22599B01048651l0733p5263q6144l8228J5501K1169j8788m1900j1840J1172N82
22588B00794179l335k1468n0698o7075n1181o02P4002J90540K52871J74217O7976
22577B01359426P0900J39960J76173J34303Q076j19242j46775o8484J1596M9398
22567B01615331N8151N2296M0113J9481o911n4218p9811q0342j51805k62096k88775
22556B00861414k02185n5155P8261J99597K71138K19952J14335J5699o6174q4904
22546B01351978m7296l0809m8711r591J08131J84129J50507J35028J34831N5451
22536B01983648j1071N3960J50041J66596J63034J24541K6409p6472j39692j42745
22526B02298249m2297P7614O8281k9210r0046j10170j28385j34187r1894k1958
$$ plain form
22516 201795997 201808631 201790554 201727509 201663559 201588772 201439338 201245804 201060671 200938182 200975453
22506 200975453 201187996 201449270 201610944 201623839 201500793 201296205 201089213 200957313 200928279
22497 200928279 200946938 200929406 200878336 200860693 200876775 200876169 200815769 200747532 200797657 200953464 201062199
22486 201062199 201104006 201189192 201352021 201529487 201655595 201697277 201661459 201592795 201567587 201623547
22476 201623547 201689934 201694002 201646926 201625199 201653265 201679493 201620942 201479186 201382922 201381651 201416302
22465 201416302 201444517 201396022 201261374 201120717 201008307 200920179 200897211 200958912 201018342 201020812
22455 201020812 200986989 200976230 201037748 201143991 201214382 201198359 201120206 201057781 201066972 201144691 201250799
22444 201250799 201333984 201333410 201245055 201108255 200921483 200681235 200420443 200213352 200116592 200131234
$$ packed form
22516B01795997J2634j8077o3045o3950p4787j49434j93534j85133j22489L7271
22506B00975453K12543K61274J61674J2895j23046k04588k06992j31900k9034
22497B00928279J8659j7532n1070j7643J6082o06o0400o8237N0125J55807J08735
22486B01062199M1807Q5186J62829J77466J26108M1682l5818o8664k5208N5960
22476B01623547O6387M068m7076k1727K8066K6228n8551j41756r6264j271L4651
22465B01416302K8215m8495j34648j40657j12410q8128k2968O1701N9430K470
22455B01020812l3823j0759O1518J06243P0391j6023p8153o2425R191P7719J06108
22444B01250799Q3185n74q8355j36800j86772k40248k60792k07091r6760J4642
$$ plain form
22434 200131234 200221346 200390829 200575457 200679923 200683778 200641560 200636337 200704318 200832323 200996416
22424 200996416 201164961 201313160 201405600 201437160 201489934 201603709 201735881 201854791 201909566 201828701
22414 201828701 201654377 201493826 201396296 201345974 201326180 201329343 201375521 201455801 201519157 201555475 201578284
22403 201578284 201572332 201506988 201412702 201328255 201283719 201305071 201359941 201431751 201505660 201522177 201485973
22392 201485973 201443324 201392822 201311656 201228252 201178494 201154966 201113133 201060501 201056887 201088184 201093021
22381 201093021 201074094 201058425 201042596 201039224 201092025 201228301 201359974 201403972 201418365 201471225 201541081
22370 201541081 201579030 201560742 201479766 201321018 201101455 200914192 200862246 200926691 200998634 201021006
22360 201021006 201003713 200958690 200902780 200907298 201000083 201129960 201215862 201221963 201212409 201267240 201344609
$$ packed form
22434B00131234R0112J69483J84628J04466L855m2218n223O7981J28005J64093
22424B00996416J68545J48199R2440L1560N2774J13775J32172J18910N4775q0865
22414B01828701j74324j60551r7530n0322j9794L163M6178Q0280O3356L6318K2809
22403B01578284n952o5344r4286q4447m4536K1352N4870P1810P3909J6517l6204
22392B01485973m2649n0502q1166q3404m9758k3528m1833n2632l614L1297M837
22381B01093021j8927j5669j5829l372N2801J36276J31673M3998J4393N2860O9856
22370B01541081L7949j8288q0976j58748k19563j87263n1946O4445P1943K2372
22360B01021006j7293m5023n5910M518R2785J29877Q5902O101r554N4831P7369
$$ plain form
22349 201344609 201325824 201193810 201067529 201036033 201078772 201184161 201323585 201426009 201479117 201523547
22339 201523547 201639777 201825136 201938349 201913980 201826176 201745424 201680456 201680270 201735941 201742340 201705292
22328 201705292 201636703 201501279 201340778 201202277 201106223 201094857 201160612 201258054 201344903 201381382
22318 201381382 201366633 201301998 201195264 201090856 201003873 200901233 200795144 200741004 200761731 200761140
22308 200761140 200699130 200632785 200592831 200624469 200782553 201062672 201372781 201624748 201778761 201759104
22298 201759104 201560977 201363551 201287605 201294226 201320587 201291401 201170937 201043357 200965205 200894809
22288 200894809 200827928 200822614 200914784 201051036 201146572 201159248 201105849 201076193 201136377 201253941 201350305
22277 201350305 201353119 201241975 201068406 200953167 200985882 201142489 201357960 201594320 201809240 201925852
$$ packed form
22349B01344609j8785j32014j26281l1496M2739J05389J39424J02424N3108M4430
22339B01523547J16230J85359J13213k4369q7804q0752o4968j86N5671O399l7048
22328B01705292o8589j35424j60501j38501r6054j1366O5755R7442Q6849L6479
22318B01381382j4749o4635j06734j04408q6983j02640j06089n4140K0727n91
22308B00761140o2010o6345l9954L1638J58084K80119L10109K51967J54013j9657
22298B01759104j98127j97426p5946O621K6361k9186j20464j27580p8152p0396
22288B00894809o6881n314R2170J36252R5536J2676n3399k9656O0184J17564R6364
22277B01350305K814j11144j73569j15239L2715J56607K15471K36360K14920J16612
$$ plain form
22267 201925852 201921930 201889080 201921027 202021951 202121588 202164184 202167707 202180704 202186722 202133944 202034852
22256 202034852 201950665 201886334 201856477 201934658 202072264 202144970 202140471 202113942 202086223 202100186 202217433
22245 202217433 202378347 202492976 202523972 202471686 202428652 202471768 202514409 202447900 202266269 201963657
22235 201963657 201597590 201315541 201150022 201029770 200946326 200932756 201003625 201078451 201030241 200863313
22225 200863313 200666635 200490549 200379176 200351073 200389595 200500952 200666427 200806184 200890213 200945069
22215 200945069 200994727 201077131 201201993 201328298 201420674 201470812 201429438 201290007 201156710 201123252
22205 201123252 201185818 201291939 201374126 201372528 201314915 201236639 201133154 201038480 200999171 201020060 201058083
22194 201058083 201062318 201004663 200899946 200796149 200690256 200582404 200518345 200543876 200647500 200747245
$$ packed form
22267B01925852l922l2850L1947J00924R9637M2596L523J2997O018n2778r9092
22256B02034852q4187o4331k9857P8181J37606P2706m499k6529k7719J3963J17247
22245B02217433J60914J14629L0996n2286m3034M3116M2641o6509j81631l02612
22235B01963657l66067k82049j65519j20252q3444j3570P0869P4826m8210j66928
22225B00863313j96678j76086j11373k8103L8522J11357J65475J39757Q4029N4856
22215B00945069M9658Q2404J24862J26305R2376N0138m1374j39431j33297l3458
22205B01123252O2566J06121Q2187j598n7613p8276j03485r4674l9309K0889L8023
22194B01058083M235n7655j04717j03797j05893j07852o4059K5531J03624R9745
$$ plain form
22184 200747245 200788919 200747633 200641149 200544506 200521677 200585945 200683866 200742713 200747900 200735382 200738404
22173 200738404 200793264 200896494 201035740 201230240 201404418 201459916 201416469 201334200 201241867 201185033
22163 201185033 201196552 201218684 201193379 201139919 201111112 201158428 201295662 201428264 201462404 201402319
22153 201402319 201308396 201225273 201131281 201055758 201071666 201177731 201328662 201465053 201555738 201551010
22143 201551010 201392690 201155987 200954673 200800863 200720761 200703631 200691998 200692308 200744060 200849231
22133 200849231 200953036 201044509 201134395 201174527 201111161 200960324 200770390 200618081 200537980 200514544
22123 200514544 200531171 200583178 200709563 200895157 201063298 201203798 201347189 201470487 201520714 201521270
22113 201521270 201519431 201526933 201533353 201523935 201487578 201406532 201293632 201204196 201155981 201119217 201072527
$$ packed form
22184B00747245M1674m1286j06484r6643k2829O4268R7921N8847N187j2518L022
22173B00738404N4860J03230J39246J94500J74178N5498m3447q2269r2333n6834
22163B01185033J1519K2132k5305n3460k8807M7316J37234J32602L4140o0085
22153B01402319r3923q3123r3992p5523J5908J06065J50931J36391R0685m728
22143B01551010j58320k36703k01314j53810q0102j7130j1633L10N1752J05171
22133B00849231J03805R1473Q9886M0132o3366j50837j89934j52309q0101k3436
22123B00514544J6627N2007J26385J85594J68141J40500J43391J23298N0227N56
22113B01521270j839P502O420r418l6357q1046j12900q9436m8215l6764m6690
$$ plain form
22102 201072527 201057293 201114008 201200861 201283678 201384921 201517400 201663366 201756126 201762510 201731496
22092 201731496 201702480 201659167 201565926 201413413 201237871 201134958 201135325 201145825 201120022 201055894 200980669
22081 200980669 200926912 200903023 200920034 200921998 200875520 200851837 200894574 200934754 200916749 200892569 200914027
22070 200914027 200950265 200950883 200942197 201015015 201127936 201188441 201184474 201134606 201096185 201110095 201159435
22059 201159435 201239525 201364642 201498689 201565897 201545073 201511687 201544167 201634507 201707085 201737646
22049 201737646 201727199 201643632 201536850 201513351 201570018 201630711 201701466 201798051 201842018 201787830 201671578
22038 201671578 201505757 201280256 200972034 200659723 200511058 200548541 200724438 200998865 201284140
22029 201284140 201491372 201601666 201685915 201776622 201835577 201852192 201783038 201623216 201461533 201353420
$$ packed form
22102B01072527j5234N6715Q6853Q2817J01243J32479J45966R2760O384l1014
22092B01731496k9016m3313r3241j52513j75542j02913L67J0500k5803o4128p5225
22081B00980669n3757k3889J7011J964m6478k3683M2737M0180j8005k4180K1458
22070B00914027L6238O18q686P2818J12921O0505l967m9868l8421J3910M9340
22059B01159435Q0090J25117J34047O7208k0824l3386L2480R0340P2578L0561
22049B01737646j0447q3567j06782k3499N6667O0693P0755R6585M3967n4188j16252
22038B01671578j65821k25501l08222l12311j48665L7483J75897K74427K85275
22029B01284140K07232J10294Q4249R0707N8955J6615o9154j59822j61683j08113
$$ plain form
22019 201353420 201304110 201280170 201245846 201222964 201265152 201381107 201507906 201565321 201579510 201566205
22009 201566205 201484362 201390172 201369648 201435979 201529073 201561025 201508566 201449300 201432856 201421029 201367859
21998 201367859 201259952 201118057 200981714 200907447 200914191 200965112 201025352 201099565 201195689 201321016
21988 201321016 201442711 201526066 201572072 201614968 201662122 201661067 201603154 201537802 201505961 201494278 201462317
21977 201462317 201378753 201247048 201169878 201207088 201311345 201445186 201562809 201601549 201528379 201354752
21967 201354752 201134615 200909322 200731072 200649093 200641979 200658647 200703686 200787842 200881497 200961346
21957 200961346 201015672 201069509 201132865 201155776 201136610 201135292 201144753 201099544 201023680 200968284 200926324
21946 200926324 200892368 200864268 200820952 200795655 200817351 200837373 200823842 200807826 200816723 200858863 200912645
$$ packed form
22019B01353420m9310k3940l4324k2882M2188J15955J26799N7415J4189j3305
22009B01566205q1843r4190k0524O6331R3094L1952n2459n9266j6444j1827n3170
21998B01367859j07907j41895j36343p4267O744N0921O0240P4213R6124J25327
21988B01321016J21695Q3355M6006M2896M7154j055n7913o5352l1841j1683l1961
21977B01462317q3564j31705p7170L7210J04257J33841J17623L8740p3170j73627
21967B01354752k20137k25293j78250q1979p114J6668M5039Q4156R3655P9849
21957B00961346N4326N3837O3356K2911j9166j318R461m5209p5864n5396m1960
21946B00926324l3956k8100m3316k5297K1696K0022j3531j6016Q897M2140N3782
$$ plain form
21935 200912645 200935960 200912538 200889856 200959817 201137765 201356948 201532994 201647087 201716535 201697980
21925 201697980 201576287 201413582 201250192 201112271 200968751 200781066 200587708 200443238 200378468
21916 200378468 200355957 200307780 200256679 200260283 200331941 200474124 200649719 200816301 200946277 201018041
21906 201018041 201068158 201138653 201218948 201293828 201348367 201340542 201252288 201135611 201081671 201105715 201160582
21895 201160582 201228107 201298401 201374077 201457569 201501942 201473090 201372409 201172946 200882127 200630551
21885 200630551 200511208 200502021 200559208 200606749 200604402 200629089 200767457 200975999 201168325 201316203
21875 201316203 201442631 201543925 201579774 201561579 201499989 201402571 201331705 201342466 201404753 201465810
21865 201465810 201482072 201444022 201366961 201293138 201274266 201291779 201333423 201399091 201432292 201366797 201212422
$$ packed form
21935B00912645K3315k3422k2682O9961J77948K19183J76046J14093O9448j8555
21925B01697980j21693j62705j63390j37921j43520j87685j93358j44470o4770
21916B00378468k2511m8177n1101L604P1658J42183J75595J66582J29976P1764
21906B01018041N0117P0495Q0295P4880N4539p825q8254j16677n3940K4044N4867
21895B01160582O7525P0294P5676Q3492M4373k8852j00681j99463k90819k51576
21885B00630551j19343r187N7187M7541k347K4687J38368K08542J92326J47878
21875B01316203J26428J01294L5849j8195o1590r7418p0866J0761O2287O1057
21865B01465810J6262l8050p7061p3823j8872J7513M1644O5668L3201o5495j54375
$$ plain form
21854 201212422 201022131 200846453 200746290 200739582 200782068 200860373 201008666 201182057 201326063 201446521
21844 201446521 201527774 201568481 201607973 201633776 201638216 201628927 201559838 201420291 201245138 201101580 201079763
21833 201079763 201176588 201297207 201348001 201282876 201103803 200896087 200762778 200726562 200761492 200823683
21823 200823683 200891754 200928921 200906917 200887062 200924006 201000412 201107316 201254367 201418854 201558296
21813 201558296 201653012 201675057 201619376 201558744 201560620 201556295 201428760 201220906 201055919 201006313 201049186
21802 201049186 201105796 201123020 201078506 200987449 200919815 200890772 200793763 200631224 200524289 200519258 200581197
21791 200581197 200664321 200763887 200886337 200986732 200999266 200938158 200873390 200853621 200890588 200993695
21781 200993695 201117582 201158405 201106649 201023558 200947309 200880070 200823476 200808501 200885971 201081425
$$ packed form
21854B01212422j90291j75678j00163o708M2486P8305J48293J73391J44006J20458
21844B01446521Q1253M0707L9492K5803M440r289o9089j39547j75153j43558k1817
21833B01079763R6825J20619N0794o5125j79073k07716j33309l6216L4930O2191
21823B00823683O8071L7167k2004j9855L6944P6406J06904J47051J64487J39442
21813B01558296R4716K2045n5681o0632J876m325j27535k07854j64987m9606M2873
21802B01049186N6610J7224m4514r1057o7634k9043r7009j62539j06935n031O1939
21791B00581197Q3124R9566J22450J00395J2534o1108o4768j9769L6967J03107
21781B00993695J23887M0823n1756q3091p6249o7239n6594j4975P7470J95454
$$ plain form
21771 201081425 201271362 201320213 201248362 201159329 201126402 201186242 201303243 201363888 201294577 201111125
21761 201111125 200891247 200744908 200740691 200865210 201057026 201257228 201417006 201469047 201449057 201417150
21751 201417150 201366021 201289679 201183929 201053044 200956120 200965486 201070460 201224169 201397777 201565578
21741 201565578 201706487 201776484 201719360 201589223 201484811 201416782 201363470 201358552 201411706 201471357
21731 201471357 201524393 201599290 201700609 201807840 201862766 201776767 201572867 201349649 201163250 201032641
21721 201032641 200935552 200864560 200861842 200958696 201055333 201018843 200875663 200741187 200679582 200720833 200807956
21710 200807956 200847936 200843331 200876209 200989364 201129070 201228048 201259710 201263323 201290733 201359088 201446547
21699 201446547 201469953 201381986 201257268 201205066 201244510 201312833 201382908 201464385 201561957 201653396 201693194
$$ packed form
21771B01081425J89937M8851p1851q9033l2927N9840J17001O0645o9311j83452
21761B01111125k19878j46339m217J24519J91816K00202J59778N2041j9990l1907
21751B01417150n1129p6342j05750j30885r6924R366J04974J53709J73608J67801
21741B01565578J40909O9997n7124j30137j04412o8029n3312m918N3154N9651
21731B01471357N3036P4897J01319J07231N4926q5999k03900k23218j86399j30609
21721B01032641r7089p0992k718R6854R6637l6490j43180j34476o1605M1251Q7123
21710B00807956L9980m605L2878J13155J39706R8978L1662L613K7410O8355Q7459
21699B01446547K3406q7967j24718n2202L9444O8323P0075Q1477R7572R1439L9798
$$ plain form
21688 201693194 201656131 201590155 201582960 201694695 201887126 202068031 202209375 202295079 202303072 202278615
21678 202278615 202291685 202345242 202400673 202415465 202376316 202309571 202232245 202159854 202074009 201954706 201836879
21667 201836879 201760622 201745973 201794564 201860629 201895090 201875165 201823602 201800832 201774897 201709377 201639913
21656 201639913 201604937 201606386 201662196 201807221 202003866 202174768 202247336 202200075 202111533 202047520
21646 202047520 201996698 201956166 201971572 202076133 202218560 202317930 202317015 202226360 202118047 202057117 202049125
21635 202049125 202037341 201978782 201899579 201837085 201788933 201773724 201816783 201882870 201943419 201984369 202053525
21624 202053525 202194086 202315339 202344112 202285058 202192089 202142557 202142296 202174930 202252443 202371774 202519944
21613 202519944 202674810 202782564 202817000 202794697 202762081 202728137 202657909 202570280 202537300 202600837
$$ packed form
21688B01693194l7063o5976p195J11735J92431J80905J41344Q5704P993k4457
21678B02278615J3070N3557N5431J4792l9149o6745p7326p2391q5845j19303j17827
21667B01836879p6257j4649M8591O6065L4461j9925n1563k2770k5935o5520o9464
21656B01639913l4976J449N5810J45025J96645J70902P2568m7261q8542o4013
21646B02047520n0822m0532J5406J04561J42427R9370r15r0655j08313o0930p992
21635B02049125j1784n8559p9203o2494m8152j5209M3059O6087O0549M0950O9156
21624B02053525J40561J21253K8773n9054r2969m9532k61L2634P7513J19331J48170
21613B02519944J54866J07754L4436k2303l2616l3944p0228q7629l2980O3537
$$ plain form
21603 202600837 202742665 202923635 203094539 203224397 203283778 203227950 203052604 202825888 202659613
21594 202659613 202605193 202601492 202590441 202608910 202654326 202636086 202507701 202324796 202178291 202103483
21584 202103483 202082756 202077396 202093061 202135507 202149513 202102421 202019241 201941780 201910784 201948847 202041169
21573 202041169 202118629 202174110 202272079 202394448 202441694 202381836 202287602 202209830 202166071 202144810 202160560
21562 202160560 202261663 202423580 202586496 202709413 202755474 202726007 202682326 202653873 202629887 202630917
21552 202630917 202701760 202808648 202861829 202861992 202840431 202762701 202657893 202592083 202549951 202516762 202540806
21541 202540806 202653188 202787226 202889145 203015476 203241130 203552844 203877441 204096696 204172050
21532 204172050 204178209 204182507 204196888 204190637 204156149 204101997 204052539 204022801 204007387 203965458 203871486
$$ packed form
21603B02600837J41828J80970J70904J29858N9381n5828j75346k26716j66275
21594B02659613n4420l701j1051J8469M5416j8240j28385j82905j46505p4808
21584B02103483k0727n360J5665M2446J4006m7092q3180p7461l0996L8063R2322
21573B02041169P7460N5481R7969J22369M7246n9858r4234p7772m3759k1261J5750
21562B02160560J01103J61917J62916J22917M6061k9467m3681k8453k3986J030
21552B02630917P0843J06888N3181J63k1561p7730j04808o5810m2132l3189K4044
21541B02540806J12382J34038J01919J26331K25654L11714L24597K19255P5354
21532B04172050O159M298J4381o251l4488n4152m9458k9738j5414m1929r3972
$$ plain form
21521 203871486 203778250 203729617 203762072 203848981 203905504 203894779 203898143 203942952 203991856 204106385 204271439
21510 204271439 204374498 204410179 204429405 204402484 204290119 204145085 204062570 204080177 204149591 204253668
21500 204253668 204403746 204541406 204614735 204589620 204493895 204414542 204420236 204527163 204721522 204930137
21490 204930137 205107618 205241053 205308339 205319993 205284171 205228887 205223173 205313538 205457924 205597427
21480 205597427 205672199 205680012 205720281 205805796 205894889 206054164 206316857 206605523 206887704 207187518
21470 207187518 207492887 207759702 207989802 208176300 208298592 208385352 208486586 208626936 208824288
21461 208824288 209075321 209326182 209521481 209682608 209853347 210029456 210218562 210457651 210786532
21452 210786532 211227681 211785782 212419851 213052232 213600921 214018468 214325881 214594742 214912469
$$ packed form
21521B03871486r3236m8633L2455Q6909N6523j0725L364M4809M8904J14529J65054
21510B04271439J03059L5681J9226k6921j12365j45034q2515J7607O9414J04077
21500B04253668J50078J37660P3329k5115r5725p9353N694J06927J94359K08615
21490B04930137J77481J33435O7286J1654l5822n5284n714R0365J44386J39503
21480B05597427P4772P813M0269Q5515Q9093J59275K62693K88666K82181K99814
21470B07187518L05369K66815K30100J86498J22292Q6760J01234J40350J97352
21461B08824288K51033K50861J95299J61127J70739J76109J89106K39089L28881
21452B10786532M41149N58101O34069O32381N48689M17547L07413K68861L17727
$$ plain form
21443 214912469 215329869 215837779 216432846 217101549 217784946 218482951 219245036 220061783 220860763
21434 220860763 221504915 221827192 221636913 220621521 218490171 215418973 211864809 208093538
21426 208093538 204105840 199749075 195127990 190652610 186765005 183949136 182440528 181995732
21418 181995732 182198210 182727815 183363155 183950078 184446838 184937924 185485952 186068475 186640905
21409 186640905 187196056 187795007 188484231 189288140 190172569 191021689 191752084 192379434 192931911
21400 192931911 193372548 193686454 193936763 194165507 194328470 194445085 194636876 194903819 195125730
21391 195125730 195222117 195178341 195020208 194788234 194590389 194514837 194591494 194799742 194982929 194970162
21381 194970162 194724439 194360243 194015829 193751509 193573541 193444539 193347895 193273765 193230491 193248178
$$ packed form
21443B14912469M17400N07910N95067O68703O83397O98005P62085Q16747P98980
21434B20860763O44152L22277j90279j015392k131350l071198l554164l771271
21426B08093538l987698m356765m621085m475380l887605k815869j508608m44796
21418A81995732K02478N29605O35340N86923M96760M91086N48028N82523N72430
21409A86640905N55151N98951O89224Q03909Q84429Q49120P30395O27350N52477
21400A92931911M40637L13906K50309K28744J62963J16615J91791K66943K21911
21391A95125730R6387m3776j58133k31974j97845p5552P6657K08248J83187j2767
21381A94970162k45723l64196l44414k64320j77968j29002r6644p4130m3274J7687
$$ plain form
21371 193248178 193326729 193436768 193564590 193721491 193877397 194011007 194139809 194284805 194433833
21362 194433833 194536174 194644164 194873879 195217276 195539650 195725515 195811790 195938324 196142375
21353 196142375 196308117 196331364 196206135 196030608 195908580 195901396 196035275 196212560 196319632 196380279
21343 196380279 196443427 196505803 196589954 196708456 196856693 197016970 197161918 197281785 197384123 197449421
21333 197449421 197513402 197603196 197682123 197692695 197603216 197481753 197397878 197357207 197355541 197388836 197438057
21322 197438057 197500162 197557297 197583243 197574353 197564706 197589942 197640602 197639130 197501065 197230660 196968644
21311 196968644 196849458 196884956 197006321 197130683 197259488 197401681 197498592 197511201 197461590 197369666
21301 197369666 197276112 197270834 197365071 197473780 197523291 197527848 197556287 197648663 197791237 197983864 198185678
$$ packed form
21371A93248178P8551J10039J27822J56901J55906J33610J28802J44996J49028
21362A94433833J02341J07990K29715L43397L22374J85865Q6275J26534K04051
21353A96142375J65742K3247j25229j75527j22028p184J33879J77285J07072O0647
21343A96380279O3148O2376Q4151J18502J48237J60277J44948J19867J02338O5298
21333A97449421O3981Q9794P8927J0572q9479j21463q3875m0671j666L3295M9221
21322A97438057O2105N7135K5946q890r647K5236N0660j472j38065k70405k62016
21311A96968644j19186L5498J21365J24362J28805J42193R6911J2609m9611r1924
21301A97369666r3554n278R4237J08709M9511M557K8439R2376J42574J92627K01814
$$ plain form
21290 198185678 198311126 198389704 198509176 198630771 198671835 198597299 198486996 198426055 198423893 198490633
21280 198490633 198632556 198813769 198968789 199057457 199095585 199092063 199027391 198942768 198909475 198921478
21270 198921478 198918634 198874445 198833291 198855524 198924324 198963753 198945505 198965610 199056288 199126128 199123469
21259 199123469 199080521 199049185 199063250 199117485 199150048 199128434 199067674 198996025 198998359 199127586 199331290
21248 199331290 199502458 199584793 199630939 199687578 199719302 199699876 199659347 199614292 199618691 199718509 199851233
21237 199851233 199918185 199839210 199591101 199268302 198991790 198811336 198709122 198664071 198659173 198675901
21227 198675901 198757564 198904644 199025078 199051225 198967633 198832198 198718887 198659543 198653128 198693011
21217 198693011 198791579 198929723 199078268 199215058 199331604 199442982 199532746 199567655 199598529 199657416
$$ packed form
21290A98185678J25448P8578J19472J21595M1064p4536j10303o0941k162O6740
21280A98490633J41923J81213J55020Q8668L8128l522o4672q4623l3293J2003
21270A98921478k844m4189m1154K2233O8800L9429j8248K0105R0678O9840k659
21259A99123469m2948l1336J4065N4235L2563k1614o0760p1649K334J29227K03704
21248A99331290J71168Q2335M6146N6639L1724j9426m0529m5055M399R9818J32724
21237A99851233O6952p8975k48109l22799k76512j80454j02214m5051m898J6728
21227A98675901Q1663J47080J20434K6147q3592j35435j13311n9344o415L9883
21217A98693011R8568J38144J48545J36790J16546J11378Q9764L4909L0874N8887
$$ plain form
21207 199657416 199699141 199739725 199798875 199834534 199793918 199728347 199699739 199708657 199749086 199802040 199865067
21196 199865067 199936735 199996999 200059402 200142255 200235102 200313326 200386896 200519117 200726816 200918158
21186 200918158 200983661 200917111 200785666 200655837 200543175 200484414 200517900 200590960 200609627 200564638
21176 200564638 200475249 200331181 200169977 200042718 199989160 200002461 200047277 200098262 200125707 200122900
21166 200122900 200061711 199952550 199881388 199872046 199901623 199954919 200015996 200024532 199956434 199876353 199824141
21155 199824141 199811563 199831231 199792010 199640211 199428912 199208677 199048021 199023335 199111580 199203609
21145 199203609 199283085 199412292 199591303 199769351 199880563 199928945 199993721 200086402 200102184 200040825
21135 200040825 199970831 199883670 199745493 199529950 199285693 199136762 199188696 199402306 199668807 199899091
$$ packed form
21207A99657416M1725M0584N9150L5659m0616o5571k8608Q918M0429N2954O3027
21196A99865067P1668O0264O2403Q2853R2847P8224P3570J32221K07699J91342
21186B00918158O5503o6550j31445j29829j12662n8761L3486P3060J8667m4989
21176B00564638q9389j44068j61204j27259n3558J3301M4816N0985K7445k807
21166B00122900o1189j09161p1162r342K9577N3296O1077Q536o8098q0081n2212
21155A99824141j2578J9668l9221j51799k11299k20235j60656k4686Q8245R2029
21145A99203609P9476J29207J79011J78048J11212M8382O4776R2681J5782o1359
21135B00040825o9994q7161j38177k15543k44257j48931N1934K13610K66501K30284
$$ plain form
21125 199899091 199999814 199943525 199825009 199761915 199781769 199837523 199902918 199942337 199922259 199844484
21115 199844484 199779095 199816036 199932630 200039689 200056240 199938522 199753273 199598100 199498587 199453154
21105 199453154 199431489 199432122 199511485 199715802 200038613 200379175 200652190 200836966 200907905 200846997
21095 200846997 200700049 200546809 200429559 200374811 200385116 200454177 200589676 200757028 200881013 200926972
21085 200926972 200923351 200894214 200816681 200679816 200510649 200344459 200208167 200115182 200035647 199951976
21075 199951976 199940901 200069390 200297895 200501971 200596239 200589869 200535981 200451546 200338889 200249953
21065 200249953 200250463 200330812 200431664 200489543 200418939 200260218 200195272 200294920 200466445 200605285
21055 200605285 200707703 200817025 200905285 200940457 200926251 200887896 200860414 200819556 200708372 200550403
$$ packed form
21125A99899091J00723n6289j18516o3094J9854N5754O5395L9419k0078p7775
21115A99844484o5389L6941J16594J07059J6551j17718j85249j55173r9513m5433
21105A99453154k1665O33P9363K04317L22811L40562K73015J84776P0939o0908
21095B00846997j46948j53240j17250n4748J0305O9061J35499J67352J23985M5959
21085B00926972l621k9137p7533j36865j69167j66190j36292r2985p9535q3671
21075A99951976j1075J28489K28505K04076R4268o370n3888q4435j12657q8936
21065B00249953N10Q0349J00852N7879p0604j58721o4946R9648J71525J38840
21055B00605285J02418J09322Q8260L5172j4206l8355k7482m0858j11184j57969
$$ plain form
21045 200550403 200445489 200441488 200535698 200715797 200935283 201136320 201256379 201266761 201206271 201129828
21035 201129828 201037702 200939487 200856401 200792187 200737593 200716134 200797692 200922585 200937870 200823021
21025 200823021 200672495 200554638 200483394 200471999 200579637 200819607 201072964 201223118 201241093 201191237
21015 201191237 201148886 201124853 201128896 201156084 201218271 201343562 201508954 201649000 201707723 201669300
21005 201669300 201529501 201312793 201118742 201031342 201075548 201231501 201434036 201617667 201740638
20996 201740638 201826466 201917641 202031223 202129034 202130085 202008482 201814620 201656394 201551608 201464822
20986 201464822 201403437 201365625 201323392 201276124 201249738 201219381 201168290 201142624 201142661 201135841 201093833 201025029
20974 201025029 200944767 200853930 200814938 200890640 201013267 201078323 201115607 201224831 201426948 201589512
$$ packed form
21045B00550403j04914m001R4210J80099K19486K01037J20059J0382o0490p6443
21035B01129828r2126r8215q3086o4214n4594k1459Q1558J24893J5285j14849
21025B00823021j50526j17857p1244j1395J07638K39970K53357J50154J7975m9856
21015B01191237m2351k4033M043K7188O2187J25291J65392J40046N8723l8423
21005B01669300j39799k16708j94051q7400M4206J55953K02535J83631J22971
20996B01740638Q5828R1175J13582R7811J051j21603j93862j58226j04786q6786
20986B01464822o1385l7812m2233m7268k6386l0357n1091k5666L7o820m2008o8804
20974B01025029q0262r0837l8992P5702J22627O5056L7284J09224K02117J62564
$$ plain form
20964 201589512 201574059 201424893 201280952 201195829 201165720 201202189 201328113 201476461 201522464 201481293
20954 201481293 201460768 201526716 201673712 201838767 201917420 201884801 201838520 201860570 201881488 201803281
20944 201803281 201649570 201505440 201431398 201398355 201409506 201553038 201843019 202136997 202278539 202296360
20934 202296360 202328947 202432312 202550082 202610959 202585751 202498287 202387376 202298765 202284731 202329018
20924 202329018 202408450 202549419 202707117 202781758 202770238 202712449 202604307 202481208 202413264 202407741
20914 202407741 202410996 202398128 202422059 202546535 202780833 203080051 203351003 203472823 203398470 203206836
20904 203206836 202997369 202838773 202748095 202726392 202757602 202783250 202800497 202853626 202919902 202958947
20894 202958947 202971324 202912215 202735085 202532473 202435963 202422013 202410136 202382911 202419309 202537559
$$ packed form
20964B01589512j5453j49166j43941q5123l0109L6469J25924J48348M6003m1171
20954B01481293k0525O5948J46996J65055P8653l2619m6281K2050K0918p8207
20944B01803281j53711j44130p4042l3043J1151J43532K89981K93978J41542J7821
20934B02296360L2587J03365J17770O0877k5208q7464j10911q8611j4034M4287
20924B02329018P9432J40969J57698P4641j1520n7789j08142j23099o7944n523
20914B02407741L255j2868K3931J24476K34298K99218K70952J21820p4353j91634
20904B03206836k09467j58596r0678k1703L1210K5648J7247N3129O6276L9045
20894B02958947J2377n9109j77130k02612r6510j3950j1877k7225L6398J18250
$$ plain form
20884 202537559 202633578 202634621 202553994 202497380 202511324 202551828 202600671 202656703 202700501 202701485 202638612
20873 202638612 202537821 202444328 202385854 202411664 202518808 202659953 202810873 202967982 203101389 203200917
20863 203200917 203286953 203309785 203228469 203134663 203085738 203057617 203002139 202883312 202783728 202802468 202890230
20852 202890230 202930502 202852363 202698341 202577631 202578325 202695034 202834489 202962137 203092267 203228668
20842 203228668 203351774 203424353 203445032 203443870 203447555 203470830 203524875 203577332 203592282 203600057 203634568
20831 203634568 203678083 203686271 203669385 203656730 203645178 203630832 203630807 203635810 203645462 203706989 203781174 203776062
20819 203776062 203722752 203733003 203844226 204030751 204210818 204286254 204278125 204242356 204175043 204117951
20809 204117951 204155759 204241833 204254591 204208816 204169041 204103265 203981528 203829436 203690113 203582929
$$ packed form
20884B02537559R6019J043q0627n6614J3944M0504M8843N6032M3798R84o2873
20873B02638612j00791r3493n8474K5810J07144J41145J50920J57109J33407R9528
20863B03200917Q6036K2832q1316r3806m8925k8121n5478j18827r9584J8740Q7762
20852B02890230M0272p8139j54022j20710O94J16709J39455J27648J30130J36401
20842B03228668J23106P2579K0679j162L685K3275N4045N2457J4950P775L4511
20831B03634568M3515Q188j6886j2655j1552j4346k5N003R652O1527P4185n112
20819B03776062n3310J0251J11223J86525J80067P5436q129l5769o7313n7092
20809B04117951L7808Q6074J2758m5775l9775o5776j21737j52092j39323j07184
$$ plain form
20799 203582929 203518891 203513374 203554967 203621646 203681145 203693738 203670759 203632223 203574067 203562034 203671297
20788 203671297 203847696 203978639 204000964 203907062 203775785 203703174 203689463 203685003 203680434 203704212 203763192
20777 203763192 203788729 203788854 203901144 204123373 204306413 204378281 204368989 204348574 204355048 204404088 204418718
20766 204418718 204299646 204142098 204052712 203983655 203897597 203854383 203910850 204050908 204243573 204482854
20756 204482854 204705330 204806798 204783179 204748689 204770876 204824001 204896244 205025264 205221978 205481450
20746 205481450 205767158 206040631 206253768 206368667 206373100 206311079 206244923 206172622 206082120 205976214
20736 205976214 205847492 205692392 205558918 205502560 205497860 205468261 205453149 205531757 205668524 205770231
20726 205770231 205774732 205672625 205564045 205499030 205433134 205390229 205429668 205566358 205748747 205895935
$$ packed form
20799B03582929o4038n517M1593O6679N9499J2593k2979l8536n8156j2033J09263
20788B03671297J76399J30943K2325r3902j31277p2611j3711m460m569K3778N8980
20777B03763192K5537J25J12290K22229J83040P1868r292k0415O474M9040J4630
20766B04418718j19072j57548q9386o9057q6058m3214N6467J40058J92665K39281
20756B04482854K22476J01468k3619l4490K2187N3125P2243J29020J96714K59472
20746B05481450K85708K73473K13137J14899M433o2021o6156p2301r0502j05906
20736B05976214j28722j55100j33474n6358m700k9599j5112P8608J36767J01707
20726B05770231M501j02107j08580o5015o5896m2905L9439J36690J82389J47188
$$ plain form
20716 205895935 205917922 205815104 205727276 205753909 205873178 206027477 206238259 206512852 206738260 206814807
20706 206814807 206710939 206488503 206307911 206285213 206398537 206560607 206678522 206724560 206746882 206777267
20696 206777267 206821183 206878691 206938140 206966188 206965215 206954157 206942678 206889726 206737147 206558117 206487152
20685 206487152 206546238 206674879 206835986 207009901 207162532 207263238 207299140 207252651 207150159 207045486
20675 207045486 206974013 206942012 206955039 206980573 206973157 206974306 207011015 207029717 206980949 206894744 206843393
20664 206843393 206906122 207084931 207293698 207476337 207647215 207820299 207969729 208066376 208164592 208289393
20654 208289393 208396966 208546968 208779870 208967295 209017896 208955054 208803802 208603290 208381431
20645 208381431 208135876 207921722 207795159 207769899 207853018 208018001 208174709 208262292 208319029 208373100
$$ packed form
20716B05895935K1987j02818q7828K6633J19269J54299K10782K74593K25408P6547
20706B06814807j03868k22436j80592k2698J13324J62070J17915M6038K2322L0385
20696B06777267M3916N7508N9449K8048r73j1058j1479n2952j52579j79030p0965
20685B06487152N9086J28641J61107J73915J52631J00706L5902m6489j02492j04673
20675B07045486p1473l2001J3027K5534p416J149L6709J8702m8768q6205n1351
20664B06843393O2729J78809K08767J82639J70878J73084J49430R6647R8216J24801
20654B08289393J07573J50002K32902J87425N0601o2842j51252k00512k21859
20645B08381431k45555k14154j26563k5260Q3119J64983J56708Q7583N6737N4071
$$ plain form
20635 208373100 208413347 208436317 208447745 208436971 208409655 208393689 208417558 208511135 208622637 208681777 208693122
20624 208693122 208700293 208732226 208755075 208754627 208812641 208995499 209210281 209380988 209527129 209645246
20614 209645246 209730079 209789746 209842232 209880802 209875943 209815745 209755531 209808031 209977804 210160965 210304230
20603 210304230 210420287 210502686 210524118 210522389 210543228 210592858 210691075 210844749 211018529 211169468
20593 211169468 211288469 211423825 211604942 211756501 211768302 211679230 211601498 211594341 211684037 211808248
20583 211808248 211874612 211864116 211817625 211770612 211749494 211750835 211768439 211846706 212018239 212246851 212472034
20572 212472034 212632919 212675336 212615783 212470800 212256030 212072006 211997681 211985674 211987768 212032130
20562 212032130 212174463 212429055 212754141 213106495 213425971 213654782 213798110 213887071 213929726
$$ packed form
20635B08373100M0247K2970J1428j0774k7316j5966K3869R3577J11502N9140J1345
20624B08693122P171L1933K2849m48N8014J82858K14782J70707J46141J18117
20614B09645246Q4833N9667N2486L8570m859o0198o0214N2500J69773J83161J43265
20603B10304230J16057Q2399K1432j729K0839M9630R8217J53674J73780J50939
20593B11169468J19001J35356J81117J51559J1801q9072p7732p157Q9696J24211
20583B11808248O6364j0496m6491m7013k1118J341J7604P8267J71533K28612K25183
20572B12472034J60885M2417n9553j44983k14770j84024p4325j2007K094M4362
20562B12032130J42333K54592L25086L52354L19476K28811J43328Q8961M2655
$$ plain form
20553 213929726 213961273 214004019 214020418 213972343 213921943 213972508 214140100 214363251 214566855 214684671
20543 214684671 214722564 214749095 214783566 214836103 214907405 214936580 214862960 214768733 214805209 214939215 215047664
20532 215047664 215132538 215216807 215303817 215410226 215495923 215533071 215565910 215645507 215777008 215938520
20522 215938520 216133565 216352246 216546052 216708312 216841856 216926406 216961970 216999317 217054008 217140995
20512 217140995 217294207 217504820 217737230 217959560 218133105 218251156 218338239 218411986 218523973
20503 218523973 218713667 218916862 219070859 219186092 219304838 219486752 219702889 219885319 220015074
20494 220015074 220149185 220365624 220600947 220759949 220871772 221015908 221223850 221481823 221758252
20485 221758252 222037947 222347650 222706407 223053704 223313982 223461930 223536510 223589628 223663596 223811857
$$ packed form
20553B13929726L1547M2746J6399m8075n0400N0565J67592K23151K03604J17816
20543B14684671L7893K6531L4471N2537P1302K9175p3620r4227L6476J34006J08449
20532B15047664Q4874Q4269Q7010J06409Q5697L7148L2839P9597J31501J61512
20522B15938520J95045K18681J93806J62260J33544Q4550L5564L7347N4691Q6987
20512B17140995J53212K10613K32410K22330J73545J18051Q7083P3747J11987
20503B18523973J89694K03195J53997J15233J18746J81914K16137J82430J29755
20494B20015074J34111K16439K35323J59002J11823J44136K07942K57973K76429
20485B21758252K79695L09703L58757L47297K60278J47948P4580N3118P3968J48261
$$ plain form
20475 223811857 224051629 224296355 224487856 224673685 224867450 225017681 225113352 225205585 225355905
20466 225355905 225582872 225875024 226245640 226703618 227191627 227639214 227976716 228201425 228421145
20457 228421145 228703777 229062531 229484476 229950600 230388613 230700781 230896629 231087633 231358064
20448 231358064 231676065 231977857 232240079 232448053 232638625 232938200 233423834 233990231 234477523
20439 234477523 234864038 235235022 235707048 236344116 237101320 237896367 238625940 239228464 239710102
20430 239710102 240097732 240484735 240989527 241677309 242477113 243250844 243970992 244637236 245230865
20421 245230865 245756169 246271008 246892752 247690409 248613480 249561628 250543910 251578789 252623214
20412 252623214 253690058 254838588 256048218 257229659 258365663 259521870 260719566 261914357
$$ packed form
20475B23811857K39772K44726J91501J85829J93765J50231R5671R2233J50320
20466B25355905K26967K92152L70616M57978M88009M47587L37502K24709K19720
20457B28421145K82632L58754M21945M66124M38013L12168J95848J91004K70431
20448B31358064L18001L01792K62222K07974J90572K99575M85634N66397M87292
20439B34477523L86515L70984M72026O37068P57204P95047P29573O02524M81638
20430B39710102L87630L87003N04792O87782P99804P73731P20148O66244N93629
20421B45230865N25304N14839O21744P97657R23071R48148R82282J034879J044425
20412B52623214J066844J148530J209630J181441J136004J156207J197696J194791
$$ plain form
20404 261914357 263153753 264528228 265992056 267460204 268966195 270565271 272279139 274121527
20396 274121527 276149862 278434797 280941442 283577468 286293682 289094295 292031398 295122762
20388 295122762 298408042 301986689 305951095 310340243 315099852 320162182 325541261 331320212
20380 331320212 337528262 344196388 351372076 359025067 367044806 375271119 383455459 391229065
20372 391229065 398036911 403006144 404695243 400419972 385444519 353617963 301874893
20365 301874893 237345846 176313943 131899840 106535761 95659026 93734487 96857713
20358 96857713 102661576 109691472 117052260 124338615 131423075 138300428 144985404 151455067
20350 151455067 157726051 163861167 169917832 175883992 181698153 187293525 192591491 197536523
$$ packed form
20404B61914357J239396J374475J463828J468148J505991J599076J713868J842388
20396B74121527K028335K284935K506645K636026K716214K800613K937103L091364
20388B95122762L285280L578647L964406M389148M759609N062330N379079N778951
20380C31320212O208050O668126P175688P652991Q019739Q226313Q184340P773606
20372C91229065O807846M969233J689099m275271j4975453l1826556n1743070
20365C01874893o4529047o1031903m4414103k5364079j0876735j924539L123226
20358I6857713N803863P029896P360788P286355P084460O877353O684976O469663
20350A51455067O270984O135116O056665N966160N814161N595372N297966M945032
$$ plain form
20342 197536523 202176517 206580009 210747824 214660796 218319511 221788552 225169249 228551293
20334 228551293 231975278 235421050 238901941 242460085 246108179 249788285 253384802 256827803
20326 256827803 260072339 263079025 265727973 267704943 268505750 267482420 263845422 256920363
20318 256920363 246803497 234408378 220512303 205514721 190413921 176881041 166142870
20311 166142870 158781003 155057669 154774262 157293049 161854707 167761330 174381339 181316325
20303 181316325 188488609 195850739 203171266 210074494 216209824 221147735 223931148 222975657
20295 222975657 216633845 204771110 189850749 174377615 158332282 140974143 122110088
20288 122110088 101484307 80096008 60579477 45072488 34935442 30634319 31071946
$$ packed form
20342A97536523M639994M403492M167815L912972L658715L469041L380697L382044
20334B28551293L423985L445772L480891L558144L648094L680106L596517L443001
20326B56827803L244536L006686K648948J976970Q00807j023330l636998o925059
20318B56920363j0116866j2395119j3896075j4997582j5100800j3532880j0738171
20311A66142870p361867l723334k83407K518787M561658N906623O620009O934986
20303A81316325P172284P362130P320527O903228O135330M937911K783413r55491
20295B22975657o341812j1862735j4920361j5473134j6045333j7358139j8864055
20288A22110088k0625781k1388299j9516531j5506989j0137046m301123M37627
$$ plain form
20281 31071946 34428084 39209195 44521250 49868517 54943517 59555489 63713824 67564002
20273 67564002 71159120 74478260 77515194 80314182 82921365 85359157 87701578 90045711
20265 90045711 92464044 94951666 97438026 99864709 102235258 104541822 106705412 108721490
20257 108721490 110712008 112688611 114533966 116201684 117736493 119200796 120644526 122023707
20249 122023707 123306884 124578095 125847480 127041461 128157409 129204788 130178805 131127130
20241 131127130 132105118 133103392 134041017 134863713 135644153 136489981 137389574 138275255 139146917
20232 139146917 140010730 140851832 141662437 142453197 143215290 143886530 144461945 145050168 145689985
20223 145689985 146316546 146916590 147503631 148054588 148577284 149107454 149666084 150228700 150765045
$$ packed form
20281C1071946L356138M781111N312055N347267N075000M611972M158335L850178
20273F7564002L595118L319140L036934K798988K607183K437792K342421K344133
20265I0045711K418333K487622K486360K426683K370549K306564K163590K016078
20257A08721490J990518J976603J845355J667718J534809J464303J443730J379181
20249A22023707J283177J271211J269385J193981J115948J047379R74017R48325
20241A31127130R77988R98274R37625Q22696P80440Q45828Q99593Q85681Q71662
20232A39146917Q63813Q41102Q10605P90760P62093O71240N75415N88223O39817
20223A45689985O26561O00044N87041N50957N22696N30170N58630N62616N36345
$$ plain form
20214 150765045 151261323 151755025 152296581 152855622 153366575 153829420 154235094 154550964 154811430
20205 154811430 155043147 155245160 155429964 155605224 155783846 156013143 156304943 156617458 156934955
20196 156934955 157259857 157563975 157790549 157919464 158014531 158156001 158357598 158602963 158868587
20187 158868587 159132740 159379701 159619083 159882679 160166379 160402921 160544789 160616203 160713365
20178 160713365 160917638 161200928 161478279 161703684 161890822 162076515 162271605 162466546 162646498
20169 162646498 162792430 162911545 163055661 163242785 163430443 163611543 163821742 164080516 164343743
20160 164343743 164569156 164739132 164852377 164993453 165187133 165358942 165473420 165546291 165613061
20151 165613061 165728792 165925250 166167439 166424332 166652284 166833456 167035161 167292869 167527000
$$ packed form
20214A50765045M96278M93702N41556N59041N10953M62845M05674L15870K60466
20205A54811430K31717K02013J84804J75260J78622K29297K91800L12515L17497
20196A56934955L24902L04118K26574J28915R5067J41470K01597K45365K65624
20187A58868587K64153K46961K39382K63596K83700K36542J41868P1414R7162
20178A60713365K04273K83290K77351K25405J87138J85693J95090J94941J79952
20169A62646498J45932J19115J44116J87124J87658J81100K10199K58774K63227
20160A64343743K25413J69976J13245J41076J93680J71809J14478P2871O6770
20151A65613061J15731J96458K42189K56893K27952J81172K01705K57708K34131
$$ plain form
20142 167527000 167672255 167748314 167817245 167955062 168184887 168438065 168628656 168741542 168837706 168959368
20132 168959368 169109630 169298135 169490129 169603847 169615253 169588649 169586821 169623900 169696747 169799522
20122 169799522 169907511 170027077 170147241 170237611 170318167 170408905 170525697 170697266 170928509 171153815
20112 171153815 171273653 171283188 171243998 171220128 171265747 171382009 171507083 171591991 171686551 171849790
20102 171849790 172071987 172294071 172441027 172480786 172477254 172451268 172381799 172323208 172302056 172285296
20092 172285296 172252635 172204381 172200123 172304474 172524602 172774350 172950718 173022353 173015982 172993001
20082 172993001 173021450 173139869 173333765 173552493 173737822 173856313 173920518 173955617 173955807 173930487
20072 173930487 173945699 174045631 174205624 174347592 174420276 174460618 174540830 174680969 174858177 175055861
$$ packed form
20142A67527000J45255P6059O8931J37817K29825K53178J90591J12886R6164J21662
20132A68959368J50262J88505J91994J13718J1406k6604j828L7079P2847J02775
20122A69799522J07989J19566J20164R0370Q0556R0738J16792J71569K31243K25306
20112A71153815J19838R535l9190k3870M5619J16262J25074Q4908R4560J63239
20102A71849790K22197K22084J46956L9759l532k5986o9469n8591k1152j6760
20092A72285296l2661m8254m258J04351K20128K49748J76368P1635o371k2981
20082A72993001K8449J18419J93896K18728J85329J18491O4205L5099J90k5320
20072A73930487J5212R9932J59993J41968P2684M0342Q0212J40139J77208J97684
$$ plain form
20062 175055861 175238623 175384853 175490587 175545269 175561673 175638001 175823720 176003989 176059718 176016185
20052 176016185 175972522 175976181 176011907 176066931 176125642 176148363 176120090 176110088 176178989 176316135 176472656
20041 176472656 176576946 176583126 176522765 176471907 176485388 176562271 176663488 176758823 176876839 177029391
20031 177029391 177147271 177191264 177182470 177166373 177167845 177151415 177081909 176995515 176961014 176972487 176966112
20020 176966112 176981223 177114845 177338931 177552486 177720315 177859551 177961603 178017601 178045083 178071493
20010 178071493 178114861 178146529 178118819 178038201 177979695 178000137 178051787 178082570 178076148 178026062 177958402
19999 177958402 177937417 177947637 177912968 177857383 177882709 178014702 178175163 178340365 178564503 178799237
19989 178799237 178934326 178951586 178901943 178868258 178864248 178853940 178830972 178861156 179035175 179300304
$$ packed form
20062A75055861J82762J46230J05734N4682J6404P6328J85719J80269N5729m3533
20052A76016185m3663L659L5726N5024N8711K2721k8273j0002O8901J37146J56521
20041A76472656J04290O180o0361n0858J3481P6883J01217R5335J18016J52552
20031A77029391J17880M3993q794j6097J472j6430o9506q6394l4501J1473o375
20020A76966112J5111J33622K24086K13555J67829J39236J02052N5998K7482K6410
20010A78071493M3368L1668k7710q0618n8506K0442N1650L0783o422n0086o7660
19999A77958402k0985J0220l4669n5585K5326J31993J60461J65202K24138K34734
19989A78799237J35089J7260m9643l3685m010j0308k2968L0184J74019K65129
$$ plain form
19979 179300304 179494131 179558256 179558381 179557347 179569174 179558383 179480293 179347839 179230036 179164906 179136179
19968 179136179 179126761 179119359 179127559 179168500 179253122 179369039 179482126 179588134 179730759 179904014
19958 179904014 180063694 180241418 180448363 180626783 180739118 180776379 180744301 180637840 180468730
19949 180468730 180283304 180132903 180080004 180134220 180196939 180183083 180110590 180061709 180092536 180198246
19939 180198246 180335091 180431891 180481584 180549689 180664166 180793302 180890624 180898210 180817234 180726340
19929 180726340 180709480 180760123 180790930 180756817 180673752 180564900 180497659 180559667 180734662 180913499
19919 180913499 180997429 180979986 180946947 180967758 181005883 181000177 180952044 180889632 180858322 180852187 180849985
19908 180849985 180887585 180995083 181146296 181294198 181417025 181501192 181567908 181674347 181850043 182055176
$$ packed form
19979A79300304J93827O4125J25j034J1827j0791p8090j32454j17803o5130k8727
19968A79136179r418p402Q200M0941Q4622J15917J13087J06008J42625J73255
19958A79904014J59680J77724K06945J78420J12335L7261l2078j06461j69110
19949A80468730j85426j50401n2899N4216O2719j3856p2493m8881L0827J05710
19939A80198246J36845R6800M9693O8105J14477J29136R7322P586q0976r0894
19929A80726340j6860N0643L0807l4113q3065j08852o7241O2008J74995J78837
19919A80913499Q3930j7443l3039K0811L8125n706m8133o2412l1310o135k202
19908A80849985L7600J07498J51213J47902J22827Q4167O6716J06439J75696K05133
$$ plain form
19898 182055176 182159027 182104660 181993524 181849028 181611544 181314226 181059136 180922739 180934257
19889 180934257 181058833 181251433 181451590 181629013 181776950 181900769 182019123 182082934 182089522 182073948
19879 182073948 182042407 182039636 182057536 182046195 182036225 182105590 182267431 182460349 182584527 182568145 182437053
19868 182437053 182257152 182076997 181963233 181908587 181803759 181609648 181391015 181210022 181091473
19859 181091473 181087007 181197463 181363067 181554119 181744349 181886282 182002980 182165203 182318320
19850 182318320 182367595 182377759 182422686 182506458 182610539 182703380 182765490 182819251 182891769 182956339 182966561
19839 182966561 182943054 182945216 182946604 182871031 182761939 182709620 182686854 182632482 182596729 182684768 182882449
19828 182882449 183058461 183101265 183035133 183024334 183137186 183255461 183288507 183270034 183250519 183242761
$$ packed form
19898A82055176J03851n4367j11136j44496k37484k97318k55090j36397J1518
19889A80934257J24576J92600K00157J77423J47937J23819J18354O3811O588j5574
19879A82073948l1541k771J7900j1341r970O9365J61841J92918J24178j6382j31092
19868A82437053j79901j80155j13764n4646j04828j94111k18633j80993j18549
19859A81091473m466J10456J65604J91052J90230J41933J16698J62223J53117
19850A82318320M9275J0164M4927Q3772J04081R2841O2110N3761P2518O4570J0222
19839A82966561k3507K162J388p5573j09092n2319k2766n4372l5753Q8039J97681
19828A82882449J76012M2804o6132j0799J12852J18275L3046j8473j9515p758
$$ plain form
19818 183242761 183202408 183098497 182996942 182977482 183050810 183171298 183288554 183386367 183466861 183521853
19808 183521853 183527656 183495536 183498815 183510912 183455586 183361476 183268577 183216050 183233359 183306379 183432633
19797 183432633 183552213 183616951 183637859 183618195 183592489 183603018 183615456 183569043 183479295 183439052 183497972
19786 183497972 183582102 183624991 183634197 183624430 183575166 183494866 183429474 183411621 183439501 183460820 183469969
19775 183469969 183513886 183614644 183776549 183954645 184050693 184032858 183960809 183893066 183833438 183757251
19765 183757251 183654102 183538969 183419796 183341094 183325954 183354170 183416868 183524432 183672428 183801517
19755 183801517 183821876 183727192 183589726 183483278 183466640 183512884 183552393 183610070 183751353 183905235
19745 183905235 183963070 183889386 183731812 183587331 183516523 183507064 183528556 183591679 183671360 183750334 183865686
$$ packed form
19818A83242761m0353j03911j01555j9460P3328J20488J17256R7813Q0494N4992
19808A83521853N803l2120L279J2097n5326r4110r2899n2527J7309P3020J26254
19797A83432633J19580O4738K0908j9664k5706J0529J2438m6413q9748m0243N8920
19786A83497972Q4130M2889R206r767m9264q0300o5392j7853K7880K1319R149
19775A83469969M3917J00758J61905J78096R6048j7835p2049o7743n9628p6187
19765A83757251j03149j15133j19173p8702j5140K8216O2698J07564J47996J29089
19755A83801517K0359r4684j37466j06448j6638M6244L9509N7677J41283J53882
19745A83905235N7835p3684j57574j44481p0808r459K1492O3123P9681P8974J15352
$$ plain form
19734 183865686 184007086 184125046 184174180 184150715 184108026 184081501 184063657 184037727 183999511 183917748
19724 183917748 183794889 183689778 183648171 183618477 183527687 183415360 183439588 183672277 183936201 184093408
19714 184093408 184160192 184176088 184172635 184196373 184289393 184417614 184539093 184641605 184701880 184647019
19704 184647019 184427220 184106870 183863258 183821340 183917948 184021452 184043302 184002651 183971927 183973717
19694 183973717 184001782 184046192 184081854 184142838 184290054 184506211 184726933 184907469 185009706 185003898
19684 185003898 184900531 184779677 184732621 184768669 184847347 184907222 184903208 184819774 184663222 184512279
19674 184512279 184422347 184378206 184365295 184371504 184346226 184298812 184293160 184346175 184430992 184543906 184672666
19663 184672666 184771649 184808453 184781759 184753650 184747697 184731875 184691123 184626665 184539016 184437796 184392358
$$ packed form
19734A83865686J41400J17960M9134k3465m2689k6525j7844k5930l8216q1763
19724A83917748j22859j05111m1607k9694r0790j12327K4228K32689K63924J57207
19714A84093408O6784J5896l453K3738R3020J28221J21479J02512O0275n4861
19704A84647019k19799l20350k43612m1918R6608J03504K1850m0651l0724J790
19694A83973717K8065M4410L5662O0984J47216K16157K20722J80536J02237n808
19684A85003898j03367j20854m7056L6048P8678N9875m014q3434j56552j50943
19674A84512279q9932m4141j2911O209k5278m7414n652N3015Q4817J12914J28760
19663A84672666R8983L6804k6694k8109n953j5822m0752o4458q7649j01220m5438
$$ plain form
19652 184392358 184432216 184514394 184572089 184563468 184478770 184302685 184088015 183910880 183808307 183812898
19642 183812898 183945919 184150570 184338828 184450267 184488440 184474328 184415402 184381680 184426854 184532526
19632 184532526 184667094 184804077 184910459 184995277 185078178 185169201 185211643 185114220 184925017 184739340
19622 184739340 184609501 184569910 184604645 184655154 184649597 184615772 184639119 184687041 184671847 184579640 184449583
19611 184449583 184347178 184266769 184163140 184044691 183938289 183930182 184095149 184355965 184556499 184640417
19601 184640417 184661316 184657557 184615035 184572202 184599452 184741850 184966248 185154530 185206489 185117753
19591 185117753 184951135 184801448 184693093 184602750 184568915 184626949 184684829 184640105 184531731 184436540
19581 184436540 184377427 184342515 184326140 184361238 184488610 184649507 184709240 184643231 184560215 184521246
$$ packed form
19652A84392358L9858Q2178N7695q621q4698j76085k14670j77135j02573M591
19642A83812898J33021K04651J88258J11439L8173j4112n8926l3722M5174J05672
19632A84532526J34568J36983J06382Q4818Q2901R1023M2442r7423j89203j85677
19622A84739340j29839l9591L4735N0509n557l3825K3347M7922j5194r2207j30057
19611A84449583j02405q0409j03629j18449j06402q107J64967K60816K00534Q3918
19601A84640417K0899l759m2522m2833K7250J42398K24398J88282N1959q8736
19591A85117753j66618j49687j08355r0343l3835N8034N7880m4724j08374r5191
19581A84436540n9113l4912j6375L5098J27372J60897N9733o6009q3016l8969
$$ plain form
19571 184521246 184505838 184489047 184461553 184424975 184426571 184487539 184545594 184560306 184559647 184618233 184745984
19560 184745984 184842815 184788814 184608014 184428705 184320681 184302989 184375156 184540693 184751435 184865452
19550 184865452 184847117 184816273 184912569 185175273 185497643 185749215 185885619 185921512 185883246 185813272
19540 185813272 185738658 185663893 185581310 185488769 185423040 185418934 185497235 185606636 185653019 185629407 185577061
19529 185577061 185481061 185334438 185170966 185012408 184908535 184870355 184855308 184868633 184973068 185179579
19519 185179579 185392045 185516501 185569598 185574283 185518526 185401988 185227967 185049685 184968320 184999199
19509 184999199 185054527 185090429 185163476 185255082 185300185 185320006 185327987 185303453 185267649 185256357 185252389
19498 185252389 185200063 185062279 184854721 184643679 184539023 184583273 184714126 184868808 185009166
$$ packed form
19571A84521246j5408j6791k7494l6578J596O0968N8055J4712o59N8586J27751
19560A84745984R6831n4001j80800j79309j08024j7692P2167J65537K10742J14017
19550A84865452j8335l0844R6296K62704L22370K51572J36404L5893l8266o9974
19540A85813272p4614p4765q2583r2541o5729m106P8301J09401M6383k3612n2346
19529A85577061r6000j46623j63472j58558j03873l8180j5047J3325J04435K06511
19519A85179579K12466J24456N3097M685n5757j16538j74021j78282q1365L0879
19509A84999199N5328L5902P3047R1606M5103J9821P981k4534l5804j1292l968
19498A85252389n2326j37784k07558k11042j04656M4250J30853J54682J40358
$$ plain form
19489 185009166 185127551 185224735 185285721 185309831 185299039 185277494 185295890 185373781 185501275 185654187
19479 185654187 185800476 185890461 185842158 185654819 185452856 185329066 185260923 185175795 185049996 184932067
19469 184932067 184899041 184977822 185112842 185241842 185394945 185550548 185600069 185518635 185386421 185280843
19459 185280843 185223022 185219799 185302164 185488906 185730182 185955308 186107136 186203775 186289257 186319538
19449 186319538 186260661 186124721 185960097 185863613 185875495 185934536 185953958 185898006 185790160 185658745
19439 185658745 185541491 185435336 185344799 185316354 185325663 185334203 185347795 185351041 185306153 185233271 185200524
19428 185200524 185211433 185259779 185377608 185500278 185529804 185443436 185309093 185264936 185345102 185461457
19418 185461457 185541215 185597582 185652955 185680935 185630856 185504025 185401071 185372397 185333822 185212548
$$ packed form
19489A85009166J18385R7184O0986K4110j0792k1545J8396P7891J27494J52912
19479A85654187J46289Q9985m8303j87339k01963j23790o8143q5128j25799j17929
19469A84932067l3026P8781J35020J29000J53103J55603M9521q1434j32214j05578
19459A85280843n7821l223Q2365J86742K41276K25126J51828R6639Q5482L0281
19449A86319538n8877j35940j64624r6484J1882N9041J9422n5952j07846j31415
19439A85658745j17254j06155r0537k8445R309Q540J3592L246m4888p2882l2747
19428A85200524J0909M8346J17829J22670K9526q6368j34343m4157Q0166J16355
19418A85461457P9758N6367N5373K7980n0079j26831j02954k8674l8575j21274
$$ plain form
19408 185212548 185089900 185084021 185201004 185341169 185405530 185402620 185411964 185472997 185529987 185530089 185510211
19397 185510211 185511783 185536991 185589017 185670737 185755112 185804659 185798472 185778006 185776328 185741393 185650599
19386 185650599 185554068 185534596 185609607 185682138 185695127 185645435 185485193 185270187 185144077 185155125
19376 185155125 185290319 185519091 185758621 185937688 186062315 186210551 186390569 186503899 186505371
19367 186505371 186432709 186335765 186240209 186149792 186088186 186066182 186061254 186084979 186075932 185989994 185892547
19356 185892547 185824122 185773200 185713431 185638006 185559931 185452511 185299430 185146418 185063854 185057610
19346 185057610 185081247 185100910 185106362 185140098 185220796 185288060 185315901 185345595 185427643 185566517 185716653
19335 185716653 185789598 185767783 185712190 185647468 185574240 185520152 185490556 185436498 185321165 185213469
$$ packed form
19408A85212548j22648n879J16983J40165O4361k910R344O1033N6990J02j9878
19397A85510211J572K5208N2026Q1720Q4375M9547o187k0466j678l4935r0794
19386A85650599r6531j9472P5011P2531J2989m9692j60242k15006j26110J1048
19376A85155125J35194K28772K39530J79067J24627J48236J80018J13330J472
19367A86505371p2662r6944r5556r0417o1606k2004m928K3725r047q5938r7447
19356A85892547o8425n0922n9769p5425p8075j07420j53081j53012q2564o244
19346A85057610K3637J9663N452L3736Q0698O7264K7841K9694Q2048J38874J50136
19335A85716653P2945k1815n5593o4722p3228n4088k9596n4058j15333j07696
$$ plain form
19325 185213469 185192906 185247627 185301118 185334837 185428168 185584682 185725594 185814883 185814780 185710976 185605016
19314 185605016 185584435 185664034 185810138 185912797 185911975 185852926 185802494 185796865 185828460 185880452 185936795
19303 185936795 185980278 186024575 186085820 186138484 186150861 186155821 186187695 186202749 186165868 186116778 186134596
19292 186134596 186206706 186250412 186244155 186202968 186157636 186137783 186142849 186189860 186250768 186271673 186265083
19281 186265083 186225396 186119432 186033792 186059438 186170087 186312844 186475373 186652813 186817978 186932668
19271 186932668 186943240 186847484 186742990 186710232 186728997 186722937 186661570 186612080 186619717 186628853 186565280
19260 186565280 186467009 186398625 186327436 186169329 185959746 185806051 185752166 185789523 185852262 185866994
19250 185866994 185796797 185674828 185573220 185511495 185449544 185369709 185337899 185439124 185652113 185848374
$$ packed form
19325A85213469k0563N4721N3491L3719R3331J56514J40912Q9289j03j03804j05960
19314A85605016k0581P9599J46104J02659q22n9049n0432n629L1595N1992N6343
19303A85936795M3483M4297O1245N2664J2377M960L1874J5054l6881m9090J7818
19292A86134596P2110M3706o257m1187m5332j9853N066M7011O0908K0905o590
19281A86265083l9687j05964q5640K5646J10649J42757J62529J77440J65165J14690
19271A86932668J0572r5756j04494l2758J8765o060o1367m9490P637R136o3573
19260A86565280r8271o8384p1189j58107k09583j53695n3885L7357O2739J4732
19250A85866994p0197j21969j01608o1725o1951p9835l1810J01225K12989J96261
$$ plain form
19240 185848374 185908615 185810052 185620928 185474751 185453758 185561446 185752590 185901848 185892464 185741757
19230 185741757 185587094 185528188 185551294 185615036 185691830 185804540 185962094 186110640 186190748 186154710
19220 186154710 185995155 185795419 185629058 185564463 185597281 185617310 185628951 185707924 185850004 185977049
19210 185977049 186006841 185957682 185974442 186145963 186372234 186513345 186577120 186596642 186544697 186378150
19200 186378150 186121633 185868172 185680644 185585752 185583570 185641894 185707968 185747756 185764947 185756127 185756131
19189 185756131 185812045 185875048 185891223 185830001 185667130 185439207 185264283 185248121 185354811 185474371
19179 185474371 185568526 185667378 185769849 185837033 185846638 185828544 185820253 185850931 185915697 185962299 185990175
19168 185990175 186055684 186159130 186218328 186170447 186011384 185770892 185516975 185337748 185279446 185296664
$$ packed form
19240A85848374O0241r8563j89124j46177k0993J07688J91144J49258r384j50707
19230A85741757j54663n8906K3106O3742P6794J12710J57554J48546Q0108l6038
19220A86154710j59555j99736j66361o4595L2818K0029J1641P8973J42080J27045
19210A85977049K9792m9159J6760J71521K26271J41111O3775J9522n1945j66547
19200A86378150k56517k53461j87528r4892k182N8324O6074L9788J7191q820M
19189A85756131N5914O3003J6175o1222j62871k27923j74924j6162J06690J19560
19179A85474371R4155R8852J02471O7184R605j8094q291L0678O4766M6602K7876
19168A85990175O5509J03446N9198m7881j59063k40492k53917j79227n8302J7218
$$ plain form
19158 185296664 185276154 185198282 185160879 185224176 185311500 185348443 185376435 185435394 185512024 185601417 185652293
19147 185652293 185631202 185583546 185533256 185473446 185433093 185474102 185601929 185694048 185662580 185559648
19137 185559648 185522296 185612343 185758544 185861326 185877998 185842318 185797429 185770591 185766995 185762907 185738795
19126 185738795 185690397 185627421 185600489 185648848 185736194 185764404 185692645 185609710 185621340 185697507 185747406
19115 185747406 185763888 185793695 185855934 185913491 185937489 185978474 186075813 186200658 186322646 186389331
19105 186389331 186326136 186133563 185905394 185789876 185834135 185895705 185863611 185798498 185800631 185877160
19095 185877160 185969294 186051775 186143013 186228606 186265095 186263449 186232486 186134385 185966207 185809249 185716872
19084 185716872 185695967 185769030 185920258 186068053 186125311 186098361 186091466 186138583 186176453 186198937 186299564
$$ packed form
19158A85296664k0510p7872l7403O3297Q7324L6943K7992N8959P6630Q9393N0876
19147A85652293k1091m7656n0290n9810m0353M1009J27827R2119l1468j02932
19137A85559648l7352R0047J46201J02782J6672l5680m4889k6838l596m088k4112
19126A85738795m8398o2976k6932M8359Q7346K8210p1759q2935J1630P6167M9899
19115A85747406J6482K9807O2239N7557K3998M0985R7339J24845J21988O6685
19105A86389331o3195j92573k28169j15518M4259O1570l2094o5113K133P6529
19095A85877160R2134Q2481R1238Q5593L6489j646l0963r8101j68178j56958r2377
19084A85716872k0905P3063J51228J47795N7258k6950o895M7117L7870K2484J00627
$$ plain form
19073 186299564 186486383 186638064 186669395 186593446 186478725 186386398 186360533 186387337 186416447 186398911
19063 186398911 186325343 186243126 186254136 186368147 186454676 186462858 186454799 186499351 186611952 186740838 186812738
19052 186812738 186776474 186650762 186543422 186548486 186622978 186671840 186647143 186557893 186412471 186268985
19042 186268985 186189675 186159176 186121303 186042715 185911965 185708497 185498270 185390065 185420102 185531142
19032 185531142 185609235 185600965 185575700 185623969 185711011 185750053 185757412 185794752 185808484 185766576 185713310
19021 185713310 185646983 185579000 185559924 185573530 185535379 185434743 185287933 185080107 184879370 184818667
19011 184818667 184909185 185068475 185231034 185371201 185499115 185632578 185734510 185809362 185924250
19002 185924250 186074594 186196504 186253138 186268202 186266490 186235642 186188126 186143079 186052085 185896460
$$ packed form
19073A86299564J86819J51681L1331p5949j14721r2327k5865K6804K9110j7536
19063A86398911p3568q2217J1010J14011Q6529Q182q059M4552J12601J28886P1900
19052A86812738l6264j25712j07340N064P4492M8862k4697q9250j45422j43486
19042A86268985p9310l0499l7873p8588j30750k03468k10227j08205L0037J11040
19032A85531142P8093q270k5265M8269Q7042L9042P359L7340J3732m1908n3266
19021A85713310o6327o7983j9076J3606l8151j00636j46810k07826k00737o0703
19011A84818667R0518J59290J62559J40167J27914J33463J01932P4852J14888
19002A85924250J50344J21910N6634J5064j712l0848m7516m5047r0994j55625
$$ plain form
18992 185896460 185796062 185817704 185919248 186036922 186069978 186026315 186010674 186048468 186094389 186081075
18982 186081075 186053014 186050967 186026991 186032234 186094376 186171903 186247625 186265467 186224627 186197156 186209396
18971 186209396 186219173 186166514 186051376 185907188 185787797 185710525 185662730 185660550 185683012 185721182 185771310
18960 185771310 185766418 185699253 185644465 185647803 185713344 185795306 185862330 185908770 185927689 185946346 186015923
18949 186015923 186112978 186160049 186104048 185969411 185873919 185885956 185938056 185945791 185891695 185803890 185740358
18938 185740358 185751836 185776182 185723990 185612404 185553028 185574909 185610198 185631681 185655737 185737402 185903979
18927 185903979 186057257 186066188 185921439 185714683 185499180 185320987 185230000 185240177 185284600 185264792
18917 185264792 185175994 185105976 185092491 185106109 185137008 185177478 185214352 185231762 185207331 185157085 185131336
$$ packed form
18992A85896460j00398K1642J01544J17674L3056m3663j5641L7794M5921j3314
18982A86081075k8061k047k3976N243O2142P7527P5722J7842m0840k7471J2240
18971A86209396R777n2659j15138j44188j19391p7272m7795k180K2462L8170N0128
18960A85771310m892o7165n4788L338O5541Q1962O7024M6440J8919J8657O9577
18949A86015923R7055M7071n6001j34637r5492J2037N2100P735n4096q7805o3532
18938A85740358J1478K4346n2192j11586n9376K1881L5289K1483K4056Q1665J66577
18927A85903979J53278Q931j44749k06756k15503j78193r0987J0177M4423j9808
18917A85264792q8798p0018j3485J3618L0899M0470L6874J7410k4431n0246k5749
$$ plain form
18906 185131336 185217723 185443769 185749070 186034566 186192254 186229249 186230619 186203993 186122183 186069438
18896 186069438 186086547 186086481 186039317 185969563 185925537 185953926 186037834 186127666 186171256 186189974 186247821
18885 186247821 186297913 186253241 186167610 186155077 186191602 186141968 185969222 185789304 185731239 185821600
18875 185821600 185948085 185979061 185913863 185806527 185672460 185559835 185565938 185705263 185887830 185989620
18865 185989620 185953114 185807327 185641426 185535880 185461547 185370769 185310918 185307787 185332320 185370957
18855 185370957 185438598 185562016 185719681 185852020 185944407 185995672 186006787 185954762 185852629 185800731
18845 185800731 185832998 185891685 185943932 185983431 185984920 185905224 185745712 185553375 185395881 185307482
18835 185307482 185285472 185304400 185322206 185349622 185431933 185531422 185577457 185556196 185481993 185350739 185172274
$$ packed form
18906A85131336Q6387K26046L05301K85496J57688L6995J370k6626q1810n2745
18896A86069438J7109o6m7164o9754m4026K8389Q3908Q9832M3590J8718N7847
18885A86247821N0092m4672q5631j2533L6525m9634j72746j79918n8065R0361
18875A85821600J26485L0976o5198j07336j34067j12625O103J39325J82567J01790
18865A85989620l6506j45787j65901j05546p4333r0778n9851l131K4533L8637
18855A85370957O7641J23418J57665J32339R2387N1265J1115n2025j02133n1898
18845A85800731L2267N8687N2247L9499J489p9696j59512j92337j57494q8399
18835A85307482k2010J8928J7806K7416Q2311R9489M6035k1261p4203j31254j78465
$$ plain form
18824 185172274 184997770 184885982 184867928 184870977 184836009 184801257 184791397 184806459 184832197 184849433 184852934
18813 184852934 184823649 184759042 184735987 184810791 184955789 185105134 185185772 185202690 185265341 185387253
18803 185387253 185486920 185547330 185594646 185629589 185655005 185654007 185635166 185616124 185640191 185731211 185796084
18792 185796084 185792851 185785583 185844829 185976608 186128507 186235844 186213908 186067446 185917221 185842809
18782 185842809 185816011 185813916 185863049 185916944 185900260 185807654 185669439 185570971 185576052 185678474 185775552
18771 185775552 185766699 185697279 185655737 185668366 185751723 185824017 185757904 185608428 185514568 185492456 185446658
18760 185446658 185363492 185298060 185234149 185137374 185011190 184887879 184856429 184947866 185072596 185165711
18750 185165711 185268678 185395589 185472630 185463548 185418669 185408971 185439272 185460701 185455364 185445597 185418666
$$ packed form
18824A85172274j74504j11788j8054L049l4968l4752r860J5062K5738J7236L501
18813A84852934k9285o4607k3055P4804J44998J49345Q0638J6918O2651J21912
18803A85387253R9667O0410M7316L4943K5416r98j8841j9042K4067R1020O4873
18792A85796084l233p268N9246J31779J51899J07337k1936j46462j50225p4412
18782A85842809k6798k095M9133N3895j6684r2606j38215r8468N081J02422R7078
18771A85775552q853o9420m1542J2629Q3357P2294o6113j49476r3860k2112m5798
18760A85446658q3166o5432o3911r6775j26184j23311l1450R1437J24730R3115
18750A85165711J02967J26911P7041r082m4879r698L0301K1429n337r767k6931
$$ plain form
18739 185418666 185391637 185383293 185371842 185366394 185371477 185366378 185326383 185256110 185195191 185211005 185290141 185317619
18727 185317619 185243177 185127482 185082012 185168147 185312360 185387389 185401952 185468390 185598094 185726858
18717 185726858 185788747 185804922 185861827 185923723 185905847 185842970 185792051 185730176 185650088 185593088 185569739
18706 185569739 185579183 185603555 185658974 185775852 185917692 186020354 186033741 185918713 185690022 185398771
18696 185398771 185124480 184917726 184773528 184719284 184769737 184904470 185042947 185106705 185124862 185170479
18686 185170479 185266837 185359552 185358013 185289495 185256794 185298960 185409816 185570063 185699535 185708076 185600403
18675 185600403 185480253 185457999 185527834 185609967 185649193 185677949 185732659 185783106 185758556 185620783
18665 185620783 185413298 185209069 185058260 184959417 184879034 184808725 184796293 184909197 185132353 185346283
$$ packed form
18739A85418666k7029q344j1451n448N083n099l9995p0273o0919J5814P9136K7478
18727A85317619p4442j15695m5470Q6135J44213P5029J4563O6438J29704J28764
18717A85726858O1889J6175N6905O1896j7876o2877n0919o1875q0088n7000k3349
18706A85569739R444K4372N5419J16878J41840J02662J3387j15028k28691k91251
18696A85398771k74291k06754j44198n4244N0453J34733J38477O3758J8157M5617
18686A85170479R6358R2715j539o8518l2701M2166J10856J60247J29472Q541j07673
18675A85600403j20150k2254O9835Q2133L9226K8756N4710N0447k4550j37773
18665A85620783k07485k04229j50809r8843q0383p0309j2432J12904K23156K13930
$$ plain form
18655 185346283 185471507 185547393 185611239 185674922 185767055 185878214 185909462 185837116 185773343 185805816
18645 185805816 185925865 186100355 186259687 186295724 186186770 186013954 185855620 185743778 185636960
18636 185636960 185511466 185402998 185301747 185220317 185227203 185342764 185507297 185615774 185607306 185509584
18626 185509584 185419327 185408423 185430148 185436196 185440209 185464440 185502227 185535855 185555194 185534251 185421277
18615 185421277 185202334 184963495 184843993 184899144 185064671 185230027 185309454 185293398 185218536 185156986
18605 185156986 185181634 185274494 185308086 185257348 185205542 185190061 185218909 185266775 185277599 185273899 185327786
18594 185327786 185434287 185523428 185493125 185300179 185078649 185006699 185091372 185184050 185199330 185180687
18584 185180687 185193990 185242590 185281801 185297968 185274745 185177524 185030375 184907529 184882862 184970073
$$ packed form
18655A85346283J25224P5886O3846O3683R2133J11159L1248p2346o3773L2473
18645A85805816J20049J74490J59332L6037j08954j72816j58334j11842j06818
18636A85636960j25494j08468j01251q1430O886J15561J64533J08477q468r7722
18626A85509584r0257j0904K1725O048M013K4231L7787L3628J9339k0943j12974
18615A85421277k18943k38839j19502N5151J65527J65356P9427j6056p4862o1550
18605A85156986K4648R2860L3592n0738n1806j5481K8848M7866J0824l700N3887
18594A85327786J06501Q9141l0303j92946k21530p1950Q4673R2678J5280j8643
18584A85180687J3303M8600L9211J6167k3223r7221j47149j22846k4667Q7211
$$ plain form
18574 184970073 185163901 185394364 185494198 185405575 185265460 185194763 185221948 185299573 185310425 185229080
18564 185229080 185141428 185133808 185219430 185316420 185306311 185215269 185163931 185189795 185250612 185314742 185392635
18553 185392635 185474844 185517569 185502129 185443356 185358815 185298120 185308808 185368002 185425515 185456738 185470891
18542 185470891 185511016 185595248 185678567 185706177 185670187 185614193 185575211 185560649 185550826 185528482 185458869
18531 185458869 185334443 185235330 185203879 185232140 185301561 185355492 185344804 185245549 185113700 185094375
18521 185094375 185196703 185322649 185433475 185489903 185497630 185535896 185653931 185758858 185776777 185758568
18511 185758568 185719642 185631443 185518070 185381263 185225342 185116958 185077285 185043615 185003163 185003701
18501 185003701 185052120 185109655 185141062 185165972 185228703 185348200 185443811 185451341 185431852 185450786 185517963
$$ packed form
18574A84970073J93828K30463R9834q8623j40115p0697K7185P7625J0852q1345
18564A85229080q7652p620Q5622R6990j0109r1042n1338K5864O0817O4130P7893
18553A85392635Q2209M2725j5440n8773q4541o0695J0688N9194N7513L1223J4153
18542A85470891M0125Q4232Q3319K7610l5990n5994l8982j4562r823k2344o9613
18531A85458869j24426r9113l1451K8261O9421N3931j0688r9255j31849j9325
18521A85094375J02328J25946J10826N6428P727L8266J18035J04927J7919j8209
18511A85758568l8926q8199j13373j36807j55921j08384l9673l3670m0452N38
18501A85003701M8419N7535L1407K4910O2731J19497R5611P530j9489J8934O7177
$$ plain form
18490 185517963 185607188 185646487 185594698 185521087 185486679 185472693 185479055 185518902 185583336 185674840 185790988
18479 185790988 185856904 185758447 185496466 185211895 185009733 184888594 184803112 184746879 184722966 184719354
18469 184719354 184758211 184873664 185057128 185270029 185479854 185626677 185661600 185638572 185665822 185780362
18459 185780362 185932244 186072084 186166290 186156701 186009718 185783215 185552877 185366694 185256959 185236164
18449 185236164 185324214 185529735 185772885 185910281 185898123 185791956 185670682 185613937 185629252 185631851
18439 185631851 185576593 185519782 185506760 185532217 185587356 185642532 185688875 185731928 185726404 185646923 185539468
18428 185539468 185466186 185443151 185450371 185450855 185391706 185299472 185209557 185092709 184953539 184827789 184727970
18417 184727970 184638203 184561887 184543282 184564616 184568208 184574650 184651569 184782349 184895464 185018762 185195914
$$ packed form
18490A85517963Q9225L9299n1789p3611l4408j3986O362L9847O4434R1504J16148
18479A85790988O5916r8457k61981k84571k02162j21139q5482n6233k3913l612
18469A84719354L8857J15453J83464K12901K09825J46823L4923k3028K7250J14540
18459A85780362J51882J39840R4206r589j46983k26503k30338j86183j09735k0795
18449A85236164Q8050K05521K43150J37396j2158j06167j21274n6745J5315K599
18439A85631851n5258n6811j3022K5457N5139N5176M6343M3053n524p9481j07455
18428A85539468p3282k3035P220M84n9149r2234q9915j16848j39170j25750r9819
18417A84727970q9767p6316j8605K1334L592O442P6919J30780J13115J23298J77152
$$ plain form
18406 185195914 185395078 185588532 185765098 185860202 185798173 185577966 185265967 184994511 184826216
18397 184826216 184721424 184677421 184674121 184643152 184551928 184444916 184412520 184469540 184566502 184662908 184702261
18386 184702261 184678127 184685598 184769227 184878030 184980081 185070824 185110670 185040785 184892114 184802545
18376 184802545 184806608 184770648 184606033 184365791 184138047 183970929 183907297 183941131 184023470 184100261
18366 184100261 184121493 184121245 184180307 184320883 184544064 184838097 185116368 185256082 185275604 185301245
18356 185301245 185371189 185406458 185345751 185183084 184992506 184855246 184761139 184665728 184597956 184657809
18346 184657809 184815924 184986450 185155446 185295756 185351719 185286053 185104340 184862320 184626050
18337 184626050 184422561 184270425 184198526 184202060 184237744 184251855 184221192 184155999 184082424 184041796 184050030
$$ packed form
18406A85195914J99164J93454J76566R5104o2029k20207l11999k71456j68295
18397A84826216j04792m4003l300l0969r1224j07012l2396N7020R6962R6406L9353
18386A84702261k4134P471Q3629J08803J02051R0743L9846o9885j48671q9569
18376A84802545M063l5960j64615k40242k27744j67118o3632L3834Q2339P6791
18366A84100261K1232k48N9062J40576K23181K94033K78271J39714J9522K5641
18356A85301245O9944L5269o0707j62667j90578j37260r4107r5411o7772N9853
18346A84657809J58115J70526J68996J40310N5963o5666j81713k42020k36270
18337A84626050k03489j52136p1899L534L5684J4111l0663o5193p3575m0628Q234
$$ plain form
18326 184050030 184035333 183973940 183932140 183931312 183979976 184071645 184176736 184316341 184475946 184588652
18316 184588652 184646318 184694149 184770980 184854291 184893991 184901397 184927070 184943733 184881204 184727604 184524144
18305 184524144 184375529 184347526 184396697 184495588 184626946 184736168 184787882 184784161 184772062 184803208
18295 184803208 184833575 184796816 184716367 184669958 184667563 184658797 184639220 184625473 184647428 184696602 184694032
18284 184694032 184593040 184448671 184331143 184254692 184227571 184249890 184315423 184421811 184550192 184672737
18274 184672737 184753751 184758257 184701485 184641291 184557957 184397218 184203460 184069669 184004785 183935611
18264 183935611 183810452 183708008 183735596 183902231 184104375 184237999 184307398 184376162 184458137 184488205
18254 184488205 184481370 184524764 184655538 184845532 184969069 184948768 184859347 184776976 184658624 184448482
$$ packed form
18326A84050030j4697o1393m1800q28M8664R1669J05091J39605J59605J12706
18316A84588652N7666M7831P6831Q3311L9700P406K5673J6663o2529j53600k03460
18305A84524144j48615k8003M9171R8891J31358J09222N1714l721j2099L1146
18295A84803208L0367l6759q0449m6409k395q766j9577j3747K1955M9174k570
18284A84694032j00992j44369j17528p6451k7121K2319O5533J06388J28381J22545
18274A84672737Q1014M506n6772o0194q3334j60739j93758j33791o4884o9174
18264A83935611j25159j02444K7588J66635K02144J33624O9399O8764Q1975L0068
18254A84488205o835M3394J30774J89994J23537k0301q9421q2371j18352k10142
$$ plain form
18244 184448482 184197993 184031219 184007332 184075734 184167163 184270090 184430155 184667238 184904759 185039394
18234 185039394 185042457 184953088 184878494 184847432 184763434 184598948 184475217 184464992 184489400 184488649 184498191
18223 184498191 184525721 184467710 184265745 184023341 183868335 183821431 183818198 183813962 183846847 183957402
18213 183957402 184127092 184336326 184577817 184796952 184885453 184784975 184556356 184345349 184288420
18204 184288420 184367424 184448545 184476124 184464083 184438042 184410694 184364397 184318935 184307870 184318689 184291714
18193 184291714 184235020 184200269 184216204 184297734 184426772 184532952 184568324 184561500 184563628 184611145 184701374
18182 184701374 184791807 184813603 184765682 184728125 184763541 184829574 184836380 184785323 184727572 184685318 184626906
18171 184626906 184516932 184362791 184250056 184300486 184539562 184838826 185063795 185150925 185123441 185068661
$$ packed form
18244A84448482k50489j66774k3887O8402R1429J02927J60065K37083K37521J34635
18234A85039394L063q9369p4594l1062q3998j64486j23731j0225K4408p51R542
18223A84498191K7530n8011k01965k42404j55006m6904l233m236L2885J10555
18213A83957402J69690K09234K41491K19135Q8501j00478k28619k11007n6929
18204A84288420P9004Q1121K7579j2041k6041k7348m6297m5462j1065J0819k6975
18193A84291714n6694l4751J5935Q1530J29038J06180L5372o824K128M7517R0229
18182A84701374R0433K1796m7921l7557L5416O6033O806n1057n7751m2254n8412
18171A84626906j09974j54141j12735N0430K39076K99264K24969Q7130k7484n4780
$$ plain form
18161 185068661 184988790 184820943 184612173 184455345 184351748 184244031 184113278 184044229 184137515 184404891
18151 184404891 184735213 184951451 184955117 184840306 184730209 184609145 184423639 184207058 184073434
18142 184073434 184068213 184076679 184019080 183920529 183846085 183856476 183957820 184094826 184189270 184197390 184158839
18131 184158839 184163316 184239035 184336636 184362844 184295699 184242100 184259842 184290544 184269590 184203207 184118618
18120 184118618 184048730 184010261 184018080 184063668 184101272 184135620 184160318 184155386 184119294 184039398 183906944
18109 183906944 183728952 183546460 183422297 183436548 183605116 183876735 184151600 184339152 184426539
18100 184426539 184465956 184500511 184505489 184472207 184480150 184572483 184668916 184722515 184747383 184719125 184650183
18089 184650183 184621930 184683054 184791182 184847795 184814685 184734449 184639403 184541755 184451491 184407704 184424443
$$ packed form
18161A85068661p9871j67847k08770j56828j03597j07717j30753o9049R3286K67376
18151A84404891L30322K16238L666j14811j10097j21064j85506k16581j33624
18142A84073434n221Q466n7599r8551p4444J0391J01344J37006R4444Q120l8551
18131A84158839M477P5719R7601K6208o7145n3599J7742L0702k0954o6383q4589
18120A84118618o9888l8469P819M5588L7604L4348K4698m932l6092p9896j32454
18109A83906944j77992j82492j24163J4251J68568K71619K74865J87552Q7387
18100A84426539L9417L4555M978l3282P943R2333R6433N3599K4868k8258o8942
18089A84650183k8253O1124J08128N6613l3110q0236r5046r7648r0264m3787J6739
$$ plain form
18078 184424443 184427584 184332954 184169732 184045210 183994161 183947520 183855634 183746102 183660810 183579361
18068 183579361 183519520 183543593 183653604 183770153 183810968 183774750 183682184 183569791 183525121 183578914
18058 183578914 183668234 183715598 183692771 183662261 183679844 183720976 183752994 183776140 183796571 183799965 183820026
18047 183820026 183910549 184061580 184208803 184314076 184416728 184574544 184739866 184762810 184598496
18038 184598496 184384708 184246617 184210655 184254730 184310867 184288198 184149927 183976419 183884230 183922548
18028 183922548 184053559 184175902 184181605 184057228 183883333 183757823 183738666 183788056 183849685 183943978
18018 183943978 184083786 184244218 184360704 184357058 184270997 184208464 184193699 184163513 184099583 184070224
18008 184070224 184101292 184176512 184269474 184327765 184328302 184280132 184216355 184170549 184142891 184142806 184188410 184263540
$$ packed form
18078A84424443L141r4630j63222j24522n1049m6641r1886j09532q5292q1449
18068A83579361n9841K4073J10011J16549M0815l6218r2566j12393m4670N3793
18058A83578914Q9320M7364k2827l0510J7583M1132L2018K3146K0431L394K0061
18047A83820026R0523J51031J47223J05273J02652J57816J65322K2944j64314
18038A84598496k13788j38091l5962M4075N6137k2669j38271j73508r2189L8318
18028A83922548J31011J22343N703j24377j73895j25510j9157M9390O1629R4293
18018A83943978J39808J60432J16486l646q6061o2533j4765l0186o3930k9359
18008A84070224L1068P5220R2962N8291N37m8170o3777m5806k7658q5M5604P5130
$$ plain form
17996 184263540 184308026 184257403 184106135 183920050 183801273 183799752 183825946 183792858 183739223 183724269
17986 183724269 183745663 183772197 183790927 183806528 183776243 183705206 183708992 183879232 184177122 184465604
17976 184465604 184628270 184647958 184622429 184612769 184576819 184490902 184342985 184150774 183982353 183898287
17966 183898287 183912194 183992424 184087903 184171975 184248986 184283017 184214708 184077042 183962144 183906596
17956 183906596 183899226 183947522 183999690 183971257 183905113 183886194 183882886 183848262 183820479 183804977 183782111
17945 183782111 183788835 183847133 183929616 183986977 183968412 183919720 183891177 183863540 183860672 183873528 183858929
17934 183858929 183830725 183809579 183794703 183824294 183916152 183983665 183954019 183852367 183764462 183778057 183853378
17923 183853378 183900538 183912123 183902605 183873818 183843864 183823521 183832946 183906798 184028638 184162861 184280179
$$ packed form
17996A84263540M4486n0623j51268j86085j18777j521K6194l3088n3635j4954
17986A83724269K1394K6534J8730J5601l0285p1037L786J70240K97890K88482
17976A84465604J62666J9688k5529r660l5950q5917j47917j92211j68421q4066
17966A83898287J3907Q0230R5479Q4072P7011L4031o8309j37666j14898n5548
17956A83906596p370M8296N2168k8433o6144j8919l308l4624k7783j5502k2866
17945A83782111O724N8298Q2483N7361j8565m8692k8543k7637k868J2856j4599
17934A83858929k8204k1146j4876K9591R1858O7513k9646j01652q7905J3595P5321
17923A83853378M7160J1585r518k8787k9954k0343R425P3852J21840J34223J17318
$$ plain form
17912 184280179 184345380 184351499 184315367 184240418 184107076 183910135 183695269 183521627 183446043 183522726
17902 183522726 183696960 183845377 183917377 183935623 183962477 184010080 184015945 183942664 183816555 183685990
17892 183685990 183620020 183667319 183806220 183969070 184097636 184160530 184169262 184155350 184136177 184123287
17882 184123287 184124084 184114719 184041306 183866079 183626897 183419100 183327787 183376545 183513466 183641870
17872 183641870 183694784 183690178 183703521 183763688 183808181 183764292 183665592 183580187 183519925 183488625 183478334
17861 183478334 183445147 183376284 183319445 183269813 183201860 183106690 182993946 182901721 182855656 182874430 182975114
17850 182975114 183123946 183270591 183383822 183468832 183533739 183541678 183495106 183468903 183509259 183596499
17840 183596499 183667585 183658630 183570602 183469137 183391773 183345693 183357554 183433207 183572989 183725648
$$ packed form
17912A84280179O5201O119l6132p4949j33342j96941k14866j73642p5584P6683
17902A83522726J74234J48417P2000J8246K6854M7603N865p3281j26109j30565
17892A83685990o5970M7299J38901J62850J28566O2894Q732j3912j9173j2890
17882A84123287P97r365p3413j75227k39182k07797r1313M8758J36921J28404
17872A83641870N2914m606J3343O0167M4493m3889r8700q5405o0262l1300j0291
17861A83478334l3187o8863n6839m9632o7953r5170j12744r2225m6065J8774J00684
17850A82975114J48832J46645J13231Q5010O4907P939m6572k6203M0356Q7240
17840A83596499P1086q955q8028j01465p7364m6080J1861P5653J39782J52659
$$ plain form
17830 183725648 183828479 183920392 184013513 184049940 183983677 183822818 183653931 183558379 183569129 183665160
$$ packed form
17830A83725648J02831R1913R3121L6427o6263j60859j68887r5552J0750R6031
$$ [...]
##END NTUPLES=NMR SPECTRUM
##END=
