##TITLE=31P ikalashn
LR-794-O-C3-HB(CHCl3)
18.12.2024
##JCAMPDX= 6.0         $$ Bruker NMR JCAMP-DX V2.0
##DATA TYPE= NMR SPECTRUM
##DATA CLASS= NTUPLES
##ORIGIN= UXNMR, Bruker Analytische Messtechnik GmbH
##OWNER= root
$$ TOPSPIN		Version 1.3
$$ 2024-12-18 10:02:09.718 +0400  Irina@DPX200
$$ Compression mode = diff/dup
##.OBSERVE FREQUENCY= 81.01967998063
##.OBSERVE NUCLEUS= ^31P
##.ACQUISITION MODE= SIMULTANEOUS
##.ACQUISITION SCHEME= undefined
##.AVERAGES= 32
##.DIGITISER RES= 17
##SPECTROMETER/DATA SYSTEM= spect
##.PULSE SEQUENCE= zgpg
##.SOLVENT NAME= D2O
##.SHIFT REFERENCE= INTERNAL, D2O, 1, 298.5841
##AUDIT TRAIL= $$ (NUMBER, WHEN, WHO, WHERE, WHAT)
$$ ##TITLE= Audit trail, TOPSPIN		Version 1.3
$$ ##JCAMPDX= 5.01
$$ ##ORIGIN= Bruker BioSpin GmbH
$$ ##OWNER= Irina
$$ $$ F:/spectra/data/iren/nmr/P31dec/1/pdata/1/auditp.txt
$$ ##AUDIT TRAIL=  $$ (NUMBER, WHEN, WHO, WHERE, VERSION, WHAT)
(   1,<2024-12-18 10:00:54.609 +0400>,<Irina>,<DPX200>,<TOPSPIN 1.3>,
      <acquisition in progress>)
(   2,<2024-12-18 10:01:48.515 +0400>,<Irina>,<DPX200>,<TOPSPIN 1.3>,
      <Start of raw data processing
       efp BC_mod = 2 LB = 5 FT_mod = 6 PKNL = 1 PHC0 = 165.2236 PHC1 = 413.3014 SI = 32K 
       data hash MD5: 32K
       CB 4A D5 B1 F6 4D 4A 8A E9 4B A3 0A 7B EE 4A 20>)
(   3,<2024-12-18 10:01:50.515 +0400>,<Irina>,<DPX200>,<TOPSPIN 1.3>,
      <apk 
       data hash MD5: 32K
       F5 96 60 FD E6 15 68 CA E5 1B 4E 81 7D D9 10 27>)
(   4,<2024-12-18 10:01:52.921 +0400>,<Irina>,<DPX200>,<TOPSPIN 1.3>,
      <abs n ABSG = 5 
       data hash MD5: 32K
       92 FC 24 D8 CA 34 57 CD 83 2A 85 01 99 D2 DD 79>)
$$ ##END=
$$ 
$$ $$ hash MD5
$$ $$ 5D D1 27 3D 65 13 A9 85 8B C9 38 BF A0 9B E2 C7
##$RELAX= 
##$RELAX= 
##$RELAX= 
##$RELAX= 
##$RELAX= 
##$RELAX= 
##$RELAX= 
##$RELAX= 
##$RELAX= 
##$RELAX= 
##$RELAX= 
$$ Bruker specific parameters
$$ --------------------------
##$DU= <F:/spectra>
##$EXPNO= 1
##$NAME= <P31dec>
##$PROCNO= 1
##$TYPE= <nmr>
##$USER= <iren>
##$AMP= (0..31)
100 100 100 100 100 100 100 100 100 100 100 100 100 100 100 100 100 100 
100 100 100 100 100 100 100 100 100 100 100 100 100 100 
##$ANAVPT= -1
##$AQSEQ= 0
##$AQ_mod= 1
##$AUNM= <au_zg>
##$AUTOPOS= <>
##$BF1= 81.014009
##$BF2= 200.13
##$BF3= 200.13
##$BF4= 200.13
##$BF5= 200.13
##$BF6= 200.13
##$BF7= 200.13
##$BF8= 200.13
##$BYTORDA= 1
##$CFDGTYP= 0
##$CFRGTYP= 5
##$CHEMSTR= <none>
##$CNST= (0..63)
1 1 145 1 1 1 1 1 1 1 1 1 1 1 1 1 1 1 1 1 1 1 1 1 1 1 1 1 1 1 1 1 1 1 
1 1 1 1 1 1 1 1 1 1 1 1 1 1 1 1 1 1 1 1 1 1 1 1 1 1 1 1 1 1 
##$CPDPRG= <waltz16>
##$CPDPRG1= <>
##$CPDPRG2= <waltz16>
##$CPDPRG3= <>
##$CPDPRG4= <mlev>
##$CPDPRG5= <mlev>
##$CPDPRG6= <mlev>
##$CPDPRG7= <mlev>
##$CPDPRG8= <mlev>
##$CPDPRGB= <>
##$CPDPRGT= <>
##$D= (0..63)
0 1 0 0 0 0 0 0 0 0.06 0 0.03 2e-005 3e-006 0 0 0.0002 0 0 0 0 0 0 0 0 
0 0 0 0 0 0 0 0 0 0 0 0 0 0 0 0 0 0 0 0 0 0 0 0 0 0 0 0 0 0 0 0 0 0 0 
0 0 0 0 
##$DATE= 1734501705
##$DBL= (0..7)
120 120 120 11 120 120 24 19 
##$DBP= (0..7)
$$ [...]
##$SW_h= 37037.037037037
##$TD= 32768
##$TD0= 1
##$TE= 300
##$TE2= 300
##$TE3= 300
##$TEG= 300
##$TL= (0..7)
0 120 53 12 22 120 120 120 
##$TP= (0..7)
150 150 150 150 150 150 150 150 
##$TP07= 0
##$TPNAME0= <>
##$TPNAME1= <>
##$TPNAME2= <>
##$TPNAME3= <>
##$TPNAME4= <>
##$TPNAME5= <>
##$TPNAME6= <>
##$TPNAME7= <>
##$TPOAL= (0..7)
0.5 0.5 0.5 0.5 0.5 0.5 0.5 0.5 
##$TPOFFS= (0..7)
0 0 0 0 0 0 0 0 
##$TUNHIN= 0
##$TUNHOUT= 0
##$TUNXOUT= 0
##$USERA1= <user>
##$USERA2= <user>
##$USERA3= <user>
##$USERA4= <user>
##$USERA5= <user>
##$V9= 5
##$VALIST= <valist>
##$VCLIST= <CCCCCCCCCCCCCCC>
##$VD= 0
##$VDLIST= <DDDDDDDDDDDDDDD>
##$VPLIST= <PPPPPPPPPPPPPPP>
##$VTLIST= <TTTTTTTTTTTTTTT>
##$WBST= 1024
##$WBSW= 4
##$XGAIN= (0..3)
0 0 0 0 
##$XL= 0
##$YL= 0
##$YMAX_a= 10237
##$YMIN_a= -8835
##$ZGOPTNS= <>
##$ZL1= 120
##$ZL2= 120
##$ZL3= 120
##$ZL4= 120
##$ABSF1= 298.5841
##$ABSF2= -158.5842
##$ABSG= 5
##$ABSL= 5
##$ALPHA= 0
##$AQORDER= 0
##$ASSFAC= 0
##$ASSFACI= 0
##$ASSFACX= 0
##$ASSWID= 0
##$AUNMP= <proc_1d>
##$AXLEFT= 0
##$AXRIGHT= 0
##$AXTYPE= 0
##$AXUNIT= <>
##$AZFE= 0.1
##$AZFW= 0.5
##$BCFW= 0
##$BC_mod= 2
##$BYTORDP= 0
##$COROFFS= 0
##$CY= 12.5935478210449
##$DATMOD= 1
##$DC= 0
##$DFILT= <>
##$DTYPP= 0
##$F1P= 47.1127640792319
##$F2P= -24.0371245302204
##$FCOR= 0.5
##$FTSIZE= 32768
##$FT_mod= 6
##$GAMMA= 0
##$GB= 0
##$INTBC= 1
##$INTSCL= 7.269226e-011
##$ISEN= 30
##$LB= 5
##$LEV0= 0
##$LPBIN= 0
##$MAXI= 12.09355
##$MC2= 0
##$MEAN= 0
##$ME_mod= 0
##$MI= 0.7550151
##$NCOEF= 0
##$NC_proc= -7
##$NLEV= 6
##$NOISF1= 298.5841
##$NOISF2= 270.0111
##$NSP= 0
##$NTH_PI= 0
##$NZP= 0
##$OFFSET= 298.5841
##$PC= 1.4
##$PHC0= 171.7626
##$PHC1= 368.4687
##$PH_mod= 1
##$PKNL= yes
##$PPARMOD= 0
##$PPDIAG= 0
##$PPIPTYP= 0
##$PPMPNUM= 100
##$PPRESOL= 1
##$PSCAL= 0
##$PSIGN= 0
##$REVERSE= no
##$SF= 81.014009
##$SI= 32768
##$SIGF1= 270.0111
##$SIGF2= -158.5842
##$SINO= 77.54984
##$SIOLD= 32768
##$SREGLST= <31P.CDCl3>
##$SSB= 0
##$STSI= 32768
##$STSR= 0
##$SW_p= 37037.037037037
##$SYMM= 0
##$S_DEV= 0
##$TDeff= 32768
##$TDoff= 0
##$TI= <>
##$TILT= no
##$TM1= 0
##$TM2= 0
##$TOPLEV= 0
##$USERP1= <user>
##$USERP2= <user>
##$USERP3= <user>
##$USERP4= <user>
##$USERP5= <user>
##$WDW= 1
##$XDIM= 32768
##$YMAX_p= 277659293
##$YMIN_p= -744370
$$ End of Bruker specific parameters
$$ ---------------------------------
##NTUPLES= NMR SPECTRUM
##VAR_NAME=  FREQUENCY,     SPECTRUM/REAL,   SPECTRUM/IMAG
##SYMBOL=    X,             R,               I
##VAR_TYPE=  INDEPENDENT,   DEPENDENT,       DEPENDENT
##VAR_FORM=  AFFN,          ASDF,            ASDF
##VAR_DIM=   32768,         32768,           32768
##UNITS=     HZ,            ARBITRARY UNITS, ARBITRARY UNITS
##FACTOR=    1.13031516577767, 1,            1
##FIRST=     37037.037037037, -35800,        -64418
##LAST=      0,             -203280,         149451
##MIN=       0,             -744370,         0
##MAX=       37037.037037037, 277659293,     0
$$ Real data points
##PAGE= N=1
##DATA TABLE= (X++(R..R)), XYDATA
$$ [...]
17183e7336l0383l3250j9367L5610N6135K4105J0622K1780N110j9675j0932J0747
17171f834l87j0086j2571l0262k6434J7329P3290R8425P8904M0837L1320K8536
17159B82067j5311n6172p5658j05186j04050n2697q2K7926L8034M6461N6990L7854
17147H0176n027k6218k0686l2290l9013j5028K3814M3471L1556m286n0957n5710
17135g0198k3890j0752j5187j8696p929m19M663J8800J2885M913K5952K8417L0150
17122b1291M0183L2906J1963N60L2267M6057K5449k493k7549k9673l3881n6173
17110A8325n8374k8005M161K3871M0602M4648J7174k8587k9417J1564K3654j6146
17098B3470n2184l1096P309k5371l2893L3351N7356K4437j0923m111K1953J5828
$$ y = [-57336, -87719, -120969, -140336, -104726, -48591, -24486, -13864, 7916, 13026, -6649, -17581, -6834, -7221, -17307, -29878, -60140, -86574, -69245, 4045, 102470, 181374, 222211, 253531, 282067, 266756, 210584, 134926, 29740, -74310, -127007, -127089, -99163, -61129, -14668, 42322, 80176, 75149, 48931, 28245, -4045, -43058, -58086, -34272, 9199, 40755, 36469, -14488, -70198, -94088, -104840, -120027, -138723, -146652, -147071, -142408, -123608, -110723, -105810, -79858, -51441, -21291, 18892, 51798, 63761, 64321, 96588, 142645, 168094, 165601, 138052, 108379, 74498, 18325, -40049, -68054, -63893, -40022, 580, 45228, 62402, 33815, 4398, 15962, 39616, 23470, -28714, -59810, -52501, -77872, -110765, -77414, -20058, 4379, -6544, -10655, 11298, 27126]
17086B7126j5497l9222m5295l6924k2336j4007j0355K4176P6567R2145Q0910O2445
17074A79733L9446L1008J296k9945k3477k9131l4997j5641O060J2891L306m3548
17062I7001o7709m9457p837M2035N6090L6504K8071M0131J3682j1145N400K2704
17050B05470m592l2592l3465k5742j8294j3116Q68L800J2865L0001L1902J9166
17038A76271J8435K1694P371J0676P002l1208o1846o6716n1509j5678L5474K7659
17026G7625l8181p0586m0964n292K2416L6595K3503K4173K1134m831o221K608
17014D1979p346n4633q7783m1404O695K2805O1059O6873J0829k4964j717J4226
17002F619O378P302K0600J1224O786M3120N2676K5824K0290K9565J3525k0152
$$ y = [27126, 11629, -27593, -72888, -109812, -132148, -146155, -156510, -132334, -55767, 36378, 117288, 179733, 219179, 250187, 251483, 221538, 198061, 168930, 133933, 118292, 124352, 137243, 140549, 97001, 29292, -20165, -28002, 14033, 70123, 106627, 134698, 174829, 188511, 177366, 182766, 205470, 200878, 168286, 134821, 109079, 90785, 77669, 78537, 82337, 95202, 125203, 157105, 176271, 194706, 216400, 223771, 234447, 241449, 210241, 148395, 81679, 30170, 14492, 49966, 77625, 39444, -31142, -72106, -77398, -54982, -18387, 5116, 29289, 50423, 45592, 39371, 41979, 34633, -20000, -107783, -149187, -142492, -119687, -58628, 8245, 19074, -5890, -7607, 6619, 12997, 20299, 40899, 52123, 58909, 102029, 154705, 180529, 200819, 230384, 243909, 223757]
16990B23757l8709k3878Q762k333n8444r0769p5820k7000m808m749M452J806k1540
16977a09273l4003j594K5731P558j3666j6971k344L314k6148k9207K5434O3805
16965a07364O8883M6760M9411M6537K7973J8763Q665k2817n5559n1619l2954N99
16953b722L2375K4575R605j2988k9693j1334K553O236O327K246J2089K0660P466
16940F7395R731k386m4555m0350m545J6473L9082O1906M7994j2681o3346n8304
16928A6414m4826m7532l4435k9281k0919N955M2743O4669O4436O1596N4601K4616
16916A58037l6638m2232J0835M0448j601j3909J3586J6657R443j4516l7022o1421
16904D1667o8080m8468J130M3548O7411O1831L1806M4055P8256P0907L8103l947
$$ y = [223757, 185048, 161170, 169932, 167599, 109155, 18386, -57434, -84434, -89242, -93991, -89539, -87733, -109273, -143276, -144870, -119139, -111581, -125247, -142218, -144562, -141248, -167396, -196603, -171169, -107364, -38481, 8279, 57690, 104227, 132200, 150963, 159628, 136811, 81252, 29633, -3321, -2722, 29653, 54228, 63833, 50845, 21152, 9818, 12371, 18607, 24934, 27180, 39269, 59929, 67395, 77126, 74740, 30185, -10165, -14710, 1763, 40845, 102751, 150745, 138064, 74718, 16414, -28412, -75944, -110379, -139660, -160579, -154624, -111881, -47212, 17224, 78820, 133421, 158037, 121399, 79167, 90002, 130450, 128849, 114940, 128526, 145183, 154626, 140110, 103088, 41667, -26413, -74881, -73751, -30203, 37208, 99039, 130845, 174900, 253156, 324063, 362166, 358219]
16892C58219m1365o9712p9871m6239j0667j0205j3787J6765M7596N1450K5567
16881B27751j0755m1721m7553l3739o143N111P384Q027l0252n4148j6680M4139
16869E1421N0002J9074N718J6101L8725M0035O764k4849n1150m1089j5541j4613
16857H0598l3208m4467l9268j9067K1157L7440J8928l996j04K4468M8216L4278
16845A24975P288p738j3458n287k40j6178k4510l010M104l4314p1952n0227j2333
16832a02880Q276K3864L9681M2646L6385L4646K5470K0283L0185K3268l0334q7884
16820F3606q0474m4298k4377k545K3989M1665M8392M4016M0249M1169O4644Q0345
16808B96381N4716L131k6728l6046n4037m4733p812K7147L9101K1629j7027l7569
$$ y = [358219, 316854, 247142, 167271, 121032, 110365, 100160, 86373, 103138, 150734, 202184, 227751, 216996, 175275, 127722, 93983, 87840, 92951, 100335, 108362, 78110, 23962, 7282, 51421, 101423, 120497, 126215, 142316, 181041, 221076, 227840, 202991, 151841, 110752, 95211, 80598, 47390, 2923, -36345, -55412, -34255, 3185, 22113, 18117, 18013, 42481, 90697, 124975, 132263, 124525, 111067, 105780, 105540, 89362, 64852, 61842, 65946, 31632, -40320, -90547, -102880, -94604, -70740, -31059, 11587, 47972, 82618, 108088, 128371, 158556, 181824, 151490, 63606, -16868, -61166, -85543, -88088, -64099, -22434, 25958, 69974, 110223, 151392, 216036, 296381, 351097, 354228, 327500, 291454, 237417, 192684, 184872, 212019, 251120, 272749, 255722, 218153]
16796B18153k6982N670M0646N7568L5733K3972J8280j4914o3807p6329m7729o1405
16784A08856p7847q7544r8038j01861j00368p4448n2386l8692l1284l3468l256
16773e90336K7210J5044k0413m6425m2596n297K9448L9905L7024M2986Q9428J41590
16761b82432J28411N3213j235j9430j3710K6790M7317M4108L2971j2982n6333
16750e3312q1562p0459l8562o994L2730M3354K0926j1585j5503P612J4001j3097
16738a72451l5560j3100Q457J4854K1397K2305n029k5371L348L3545K1738j0119
16726a35986k5323k4348J4339L1750L086k9609k7671j6447R099L5637K5305P66
16714a39402k3404j1266J5472J6127K2389J7245L629J4522L2112K0726l0304p5493
$$ y = [218153, 191171, 196841, 237487, 295055, 330788, 354760, 373040, 358126, 294319, 217990, 170261, 108856, 31009, -56535, -154573, -256434, -356802, -431250, -483636, -522328, -553612, -587080, -590336, -563126, -548082, -568495, -614920, -657516, -662813, -633365, -593460, -556436, -513450, -424022, -282432, -154021, -100808, -102043, -121473, -135183, -108393, -61076, -16968, 16003, 3021, -53312, -134874, -205333, -243895, -250889, -218159, -174805, -153879, -165464, -180967, -173355, -159354, -172451, -208011, -221111, -212654, -197800, -176403, -154098, -159127, -184498, -181150, -147605, -125867, -135986, -161309, -185657, -171318, -139568, -136482, -166091, -193762, -210209, -201110, -165473, -140168, -139402, -162806, -174072, -158600, -142473, -120084, -102839, -99210, -84688, -52576, -31850, -62154, -137647]
16702a37647p2046k5277K9123N3645M4037M0334J5687j6245j6173l931j9267n6615
16690a64375r1246r1271m0883N714L0768N0740K7848p038k5751l2086o080K9778
16678c13882N4473N0012K0539R788J0480O302J9065M6521N2017J8186m146J6290
16666a4355K4187O527j9830P23L4057K4369j1031o0981r1444r1267m2927L4146
16654b07826P8627N9599K4712p902j7200j4980l0446l1867o491O572p454K071
16642a52585l064j4678o076K73N311J8495L8233M4326R945m1203q1370r2123p6301
16629c50817m8412n790K4338O0710P7911N0625J9857L3392P8822P2704K5529J2101
16617E0970J8483K3055K0102L071r776P283J8541n253k9311k9690j0555j1397
$$ y = [-137647, -209693, -234970, -205847, -152202, -108165, -67831, -52144, -68389, -84562, -88493, -107760, -164375, -255621, -346892, -387775, -382061, -351293, -300553, -272705, -279743, -305494, -337580, -343660, -313882, -259409, -209397, -188858, -179070, -168590, -162288, -143223, -96702, -44685, -26499, -30645, -14355, 9832, 16359, -3471, -2748, 31309, 55678, 44647, -16334, -107778, -199045, -241972, -207826, -129199, -69600, -44888, -52790, -69990, -84970, -115416, -147283, -153774, -147202, -154656, -152585, -155649, -170327, -176403, -176130, -170819, -152324, -114091, -69765, -59820, -101023, -182393, -274516, -350817, -399229, -405019, -380681, -319971, -242060, -191435, -171578, -138186, -59364, 13340, 38869, 50970, 69453, 92508, 112610, 115681, 105905, 113188, 131729, 126476, 97165, 67475, 56920, 45523]
16605D5523l0246k9265o531J372k1465l7934j1500K4989K8933J6479K7198L8922
16593D6475O621l5009o6775p9106o5146n1043l8786j0744K989O348l694p542K1198
16580b74214L3932J6980J9445K687k2413P262N4461N8311K0078m042j3872k6730
16568a28115j1622K5270N4184O0609N1347K6550j6353k6910j8986n949L0670L1305
16556G2000j9932n5241n5857m3821l4420N733M9196N1974L6573K8598L8984K1858
16544I5645j2295k1219p161j3424l6689r688K655l3091m6407m1500n0357n1492
16532b25023j1692N4143Q9737O5329J2176k009K5261M9868M3743n236o2510o8035
16520c4248k7583J9346L8566J8145K6500M0399J4132m4245p5725l9133J3421L5629
$$ y = [45523, 15277, -13988, -20519, -19147, -40612, -78546, -90046, -65057, -36124, -19645, 7553, 46475, 53096, 18087, -48688, -127794, -192940, -243983, -282769, -293513, -290524, -284176, -287870, -295412, -274214, -240282, -223302, -203857, -201170, -223583, -216321, -161860, -103549, -83471, -87513, -101385, -128115, -139737, -114467, -60283, 326, 51673, 78223, 61870, 34960, 15974, 10025, 40695, 72000, 52068, -3173, -59030, -102851, -137271, -131538, -82342, -30368, 6205, 34803, 73787, 95645, 83350, 62131, 54970, 41546, 4857, -4831, -2176, -35267, -81674, -123174, -173531, -225023, -236715, -182572, -92835, -27506, -15330, -17339, 7922, 57790, 101533, 96297, 33787, -34248, -61831, -42485, -3919, 14226, 40726, 81125, 95257, 51012, -24713, -63846, -50425, -14796]
16508a4796J0539k4829m0560l1647o160K1991K9279K3895K6752J7837j0785l6900
16496c5384n0418n5086p9135r0457n6352J530N2644O8612N1425K7571L1713M1512
16484i1825K1306L338J0470J7944L2440J9863l4191n1635n7254p5027p0937k6180
16472c01688L5451O6333P1229N4093O216k6155q527K7166N6335R8295J96498K86116
16460E61362J51390p8861j88561j94774j45222j06931p8684m1122k0044j497L2643
16449a10301K4257J6943M4052Q0257P0580J9322j3609j3321j6881j7929j6209
16438F7161l2776n2170l7347P663L6490K5047K2568M9884N0673L2304P1910J09512
16426C50919O9150K5746j4398o0042n7475l5649k4560j2353j4340l0804j0434
$$ y = [-14796, -4257, -29086, -69646, -101293, -107453, -85462, -56183, -32288, -5536, 12301, 1516, -35384, -85802, -140888, -220023, -310480, -366832, -365302, -312658, -244046, -192621, -165050, -133337, -91825, -70519, -67181, -56711, -38767, -6327, 13536, -20655, -72290, -129544, -204571, -275508, -301688, -266237, -199904, -128675, -74582, -68366, -94521, -103048, -75882, -19547, 78748, 275246, 561362, 712752, 633891, 445330, 250556, 105334, -1597, -80281, -121403, -141447, -142944, -110301, -86044, -69101, -25049, 55208, 125788, 145110, 131501, 118180, 101299, 83370, 67161, 34385, -17785, -55132, -47469, -10979, 14068, 36636, 86520, 137193, 169497, 241407, 350919, 420069, 445815, 431417, 371375, 313900, 278251, 253691, 241338, 226998, 196194, 185760]
16415A85760K2222J4735k0930m2388l9237m0075k2859o339k6176n5873o7888m8290
16403a47338O405M1524J9733k0431k5581K5091P3362Q9702P8375K8694l1189n8378
16391G9969m0711q606O079j7014m3519o0933j00951j26664p3749L146M9581O5937
16379b67435K7845k6057k1304j9194j8546Q266L4142O8525Q5494P9508M0699n164
16367a3221j1124O113L6293N5160N8904L8130N41l8202m0003l3466m9449m7620
16355c7944l1283k5515P687O0927Q4610O6381N2609K7309k999j1744j6994m5860
16343A27184m9647p09K7257J7591J0460N349k6241m5721k5684j4968k3607l2158
16331c0894j8912J2254L7755P6302Q2072O0841M6136J6091m5648o2641l1903k5642
$$ y = [185760, 207982, 222717, 201787, 159399, 120162, 80087, 57228, 50889, 24713, -31160, -99048, -147338, -140933, -99409, -79676, -100107, -125688, -100597, -27235, 62467, 140842, 169536, 138347, 79969, 39258, 30652, 36731, 19717, -23802, -84735, -185686, -312350, -386099, -382953, -333372, -267435, -239590, -265647, -286951, -306145, -324691, -316425, -282283, -213758, -128264, -48756, -8057, -13221, -24345, -18232, 18061, 73221, 132125, 170255, 170796, 132594, 92591, 59125, 9676, -37944, -69227, -94742, -87055, -26128, 58482, 124863, 177472, 204781, 201782, 190038, 173044, 127184, 77537, 76828, 104085, 121676, 132136, 137485, 111244, 65523, 39839, 24871, 1264, -30894, -49806, -37552, 203, 76505, 158577, 219418, 265554, 281645, 235997, 173356, 141453, 115811]
16319A15811m2929l4630j6846R487K6634J6188J1001N869j3744k7093j35M9470
16307I9083O7532N0216J8078j2791n3376q9202q3429o3297l7360Q485L0566K5217
16295d0278L8601N9652N8602M8503J8498j6153j1085k449r660k9094l6169j9928
16283E9040N073K2080J1394k050l0825m7227m7631n3406m0532O86M8397P8476
16271C475O0039M0607M6783J658o9594q9081o3944k9629k7566k2052K9407O7655
16259e2242N9097K6998j2771n7131q6121p8405k1480N5674Q6579P4618O4783N4765
16247A14364L8428K5400K4755n88k4240k3084l1259k6472j0863o357J2930K9091
16235A22105M5774M3892R961k1051l3353j3956J3106J2795K3209K8568J2920K370
$$ y = [115811, 72882, 38252, 21406, 30893, 57527, 73715, 84716, 90585, 76841, 49748, 49613, 99083, 166615, 216831, 234909, 222118, 168742, 79540, -3889, -67186, -104546, -96061, -65495, -40278, -1677, 57975, 116577, 165080, 183578, 167425, 156340, 153891, 144231, 115137, 78968, 59040, 64113, 86193, 97587, 95537, 64712, 17485, -30146, -83552, -124084, -123398, -75001, 3475, 63514, 104121, 150904, 152562, 82968, -6113, -70057, -99686, -127252, -149304, -119897, -52242, 6855, 33853, 21082, -36049, -122170, -200575, -222055, -166381, -79802, -5184, 59599, 114364, 152792, 178192, 202947, 202359, 178119, 155035, 123776, 97304, 86441, 80084, 93014, 122105, 167879, 211771, 221732, 200681, 167328, 153372, 166478, 179273, 202482, 231050, 243970, 246340]
16223B46340l3467m6437l6940m9355m4703m3199p2197p2491l7028R939P8170J12782
16211A1414Q5015N3090K3891K6l4744n4242o2400m5790k0132k4416n0499n9471
16199a78258n0392k9904j396O974m41n750J8179O7348Q2130N2218M3248N3319
16187E7275K9083p486k7517k7886j9564l1130k3621K8497N2334J6258q856j1306
16175B6081r513p756k592J5977L1382J3454l8764o3907l519P4602J11361J12893
16163B59699N8478k8915o6482n9263r952M9354L4162M065J1059J1236l85M944
16151B68000L843l3530n8915n1741n0909m8763l3537j6515j862q735j1971r59
16139d5594L528k907k0747k5198R590L6752L9645L1797K6620K8428L5198K1561
$$ y = [246340, 212873, 166436, 129496, 80141, 35438, -7761, -79958, -152449, -189477, -179538, -101368, 11414, 96429, 149519, 173410, 173436, 138692, 84450, 22050, -23740, -43872, -68288, -118787, -178258, -228650, -258554, -259950, -252976, -253417, -259167, -240988, -173640, -91510, -39292, 3956, 57275, 86358, 78872, 51355, 23469, 3905, -27225, -50846, -22349, 29985, 46243, 37387, 26081, 16568, 8812, 6220, 22197, 53579, 67033, 28269, -35638, -39157, 35445, 146806, 259699, 318177, 289262, 222780, 163517, 153565, 202919, 237081, 241146, 252205, 263441, 263056, 268000, 271843, 238313, 179398, 127657, 76748, 27985, -5552, -22067, -23929, -32664, -44635, -45594, -42066, -44973, -65720, -90918, -81328, -44576, -4931, 26866, 53486, 81914, 117112, 138673]
16127A38673k3528n0493l8356k5834k2423j962k874k9485m4177n3592o5669l7510
16115b57230J703J2755J782Q615L4835O2813P0701L5205N240k531j4915k0285
16103f1312N599K7132K8916J0701L572Q848o75j1503j3155j0095P719K9242L9295
16090F4284N4432M0076j7540j8893K3895K4123k391R457L0333K7740J4552k2171
16078B27897n9263o4449l7056k1768k2111k3540M975K4676P116k89K9862N0965
16066A17015K0032k9946l0577k026K58n940j8379l7264l4399P733M8812M2672
16054G7991K519j2448J9057M6057M2304M0137M8015O8913P5213N4829L1584K9940
16042E24111L2602K9422J8856j328L793J0013k5555n8005n3369l5805l5704m8958
$$ y = [138673, 115145, 64652, 26296, 462, -21961, -23923, -26797, -56282, -100459, -154051, -219720, -257230, -255527, -242772, -240990, -232375, -197540, -134727, -64026, -28821, -23581, -26112, -41027, -61312, -55713, -28581, 335, 11036, 14608, 23456, 22781, 11278, -1877, -11972, -4253, 24989, 64284, 118716, 158792, 141252, 122359, 146254, 170377, 167986, 177443, 207776, 235516, 250068, 227897, 168634, 104185, 67129, 45361, 23250, -290, 4685, 29361, 36477, 36188, 66050, 117015, 137047, 107101, 76524, 74498, 74756, 68816, 50437, 13173, -21226, -13493, 35319, 77991, 80510, 68062, 87119, 133176, 175480, 215617, 263632, 332545, 407758, 462587, 494171, 524111, 556713, 586135, 604991, 603663, 607456, 617469, 591914, 533909, 480540, 444735, 409031, 360073]
16030C60073l0967k2210o1776p4730j0591O0311M6807o541m7061m2497J4069K8556
16018B13443J7001K9239M729j9018o807j2114k7956l5037k1909M511j0899l7486
16006I7697j4663K4988M7186M5974Q694j3874k992R443q52k2266l0445l4167l9750
15993G4973m0205l0171j6853K56p742j0414K2237M4570L5729k067m6813o7476
15981d3976m7001k2539P49K6084J4194p516j6347l4413n1111n7158l0024K7207
15969b41851Q5300J16901P6619K9749J8250L8165O1503P0193N7360r00m5626l5789
15957B29874K703K6603M1704K4849k0262m2327k1505k0794m4641l4799p384o636
15945A27385k8474m1478l4220j747K4k9929m3972m1144l8938n3464o1541m1068
$$ y = [360073, 329106, 306896, 245120, 170390, 159799, 220110, 266917, 260376, 213315, 170818, 184887, 213443, 230444, 259683, 264412, 245394, 238587, 226473, 198517, 163480, 141571, 146082, 135183, 97697, 83034, 108022, 155208, 201182, 209876, 196002, 193010, 202453, 201601, 179335, 148890, 114723, 74973, 34768, 4597, -12256, -12000, -19742, -30156, -7919, 36651, 72380, 70313, 23500, -43976, -90977, -113516, -112767, -86683, -72489, -80005, -96352, -130765, -181876, -239034, -269058, -241851, -156551, -39650, 36969, 66718, 84968, 123133, 184636, 254829, 312189, 311289, 265663, 229874, 232577, 259180, 300884, 325733, 305471, 263144, 241639, 220845, 176204, 141405, 134021, 127385, 98911, 57433, 23213, 21466, 21490, -8439, -52411, -93555, -132493, -185957, -247498, -288566]
15933b88566l1623j0049L2136M3282L1793M3891O7134O2886M1280L7555K9118
15922E8837R523R880P768r284j8677j1757J6709L9729M7820N8821N8825J4225
15910B82419l2256r778J7411q717m0355p6024j02474p9543k9010O724J8522L0962
15898b2119M1465L5989J5816m717j7148l3048m0295k1020l722j6388k6324j4346
15886a05857J0129Q679j4461j7032K7175Q0344O1614J6253l122l2396o2545l7802
15874f9021K6531N3288K2901r082R16J0295L4287N4034L5717J2074J6561K5602
15862B14103L881k0098k2147j0933M686Q785O358Q936P991J9839L4634L4950M7592
15849C38577M9495J8178j3884m3625n6858m6854j0612M760r318r612j0727k9990
$$ y = [-288566, -320189, -330238, -298102, -254820, -223027, -179136, -112002, -49116, -7836, 29719, 58837, 68360, 78240, 86008, 76724, 58047, 46290, 62999, 102728, 150548, 209369, 268194, 282419, 250163, 240385, 257796, 249079, 208724, 132700, 30226, -49317, -78327, -71603, -53081, -22119, 19346, 55335, 71151, 66434, 49286, 16238, -24057, -45077, -48799, -65187, -91511, -105857, -95728, -87049, -101510, -118542, -91367, -11023, 50591, 66844, 63722, 31326, -31219, -69021, -42490, 10798, 33699, 24617, 25533, 35828, 70115, 124149, 159866, 171940, 188501, 214103, 217984, 197886, 175739, 164806, 169492, 178277, 184635, 193571, 201562, 221401, 256035, 290985, 338577, 388072, 406250, 392366, 348741, 291883, 245029, 234417, 239177, 229859, 220247, 209520, 179530]
15837A79530n9189o9424l2570n643j6735p794M0560O9964N1040Q866k2180m4300
15825I2125k7342L4636O8068N9157M0090J2059l2097l6405P56L4470N7817O7098
15813C70432K4745n0640j05203j21438q8465m9568l3703j1091L7902O9316O1561
15802A03848J5936m5697o3447k4652K0767L0151K9313N8571Q2478N2670j910k7116
15790B30912j7354P441K2881M280k6576l4415l2271k1245l0449l3323l702J6980
15778H3159l658k5663j4616n014j1283j1729j5347o04K0519R422p586O041L6830
15765F0471K6119J210l2583n6260n1667j5980K3182O1491Q3493K5531p0837j04593
15753e0423o5005m5047n0042l4518N163N2382P7508R2547J08062R3790M5125j1732
$$ y = [179530, 120341, 50917, 18347, 12704, -4031, -11825, 28735, 98699, 149739, 158605, 136425, 92125, 64783, 99419, 167487, 226644, 266734, 278793, 246696, 210291, 211047, 245517, 303334, 370432, 395177, 344537, 239334, 117896, 29431, -20137, -53840, -64931, -27029, 42287, 103848, 119784, 74087, 10640, -14012, 6755, 36906, 66219, 124790, 207268, 259938, 258028, 230912, 213558, 220999, 243880, 248160, 221584, 187169, 154898, 133653, 103204, 69881, 66179, 83159, 79501, 53838, 39222, 34208, 22925, 11196, -4151, -4755, 15764, 25186, 17600, 23641, 60471, 86590, 87800, 55217, -1043, -52710, -68690, -45508, 15983, 99476, 125007, 54170, -50423, -115428, -160475, -210517, -245035, -239872, -187490, -109982, -17435, 90627, 184417, 229542, 217810]
15741B17810k9599k3593j836J6293L157l357o007k0920m5441m5591k2334l353
15729C5229j4142k1501k6277l4372k526M0889M8453N0577N2545K1659j8312j6012
15717A16210r566l0615l3130O300N5266O8512N2370K2280k8228p0199p0042n0596
15705B8562l6011k9611k7649k5050o998j546J8926M3768K8408j7110m7283l5876
15693a07470j6434q858k2636k6477m693J3319J8384J1772N236K4991M6705L5313
15681c0848J0671j220q746j0917l5633m1033p887J8773L7176N9111O5549J6892
15669G1888j1059R324O764L8J9255K0501p16k0070l0826j8515J904n419M722J2912
15655F0703n000m0930o9179o2283m1728l1424k6992k3663k2264j1059j8141l9226
$$ y = [217810, 188211, 164618, 162782, 179075, 182232, 178875, 172868, 151948, 106507, 60916, 38582, 35229, 21087, -414, -26691, -61063, -63589, -22700, 25753, 76330, 128875, 150534, 132222, 116210, 106644, 76029, 42899, 49199, 104465, 172977, 225347, 247627, 219399, 149200, 79158, 28562, -7449, -37060, -64709, -89759, -96757, -98303, -79377, -35609, -7201, -24311, -71594, -107470, -123904, -132762, -155398, -181875, -186568, -173249, -154865, -143093, -137857, -112866, -66161, -30848, -20177, -21397, -30143, -41060, -76693, -117726, -125613, -106840, -69664, -10553, 54996, 71888, 60829, 70153, 76917, 76955, 96210, 116711, 115995, 95925, 65099, 46584, 48488, 43069, 47791, 60703, 55703, 14773, -54406, -116689, -158417, -189841, -216833, -240496, -262760, -273819, -291960, -331186]
15643c31186l6042N039N1857Q0832P8581M5996L9209N1853L8436J054n6064r2464
15631a22899p9224j9044L9459M6085K5843K1019L1756M2055M2131L6531M4823
15620A08535N2287N5864M0116j1312n2878o3005m5972j7778m344m832j7176k9080
15608A0425k7703l3141m7431l9771R448O9434R2181Q7734P9397M6716K283m365
15596B45207n322r683p023k1110k5138o292R017k53L341M1566L6247l548j9167
15583B37842k8441m1382l8433j1826J5856L0233K0134j0230j8640j0979l882k2433
15571A17819l7028j005K1237J6503J8649O707o935r936k1563l4309l3656k4415
15559A2068j4300j9124l9731j9896K3346K6064K0734M3911N4930M4453K0992n892
$$ y = [-331186, -367228, -362189, -310332, -229500, -150919, -104923, -65714, -13861, 24575, 25629, -30435, -122899, -202123, -221167, -181708, -135623, -109780, -88761, -57005, -14950, 27181, 63712, 108535, 160822, 216686, 256802, 245490, 192612, 129607, 83635, 65857, 61513, 56681, 39505, 10425, -17278, -50419, -97850, -137621, -128173, -58739, 33442, 121176, 200573, 247289, 249572, 245207, 239885, 230202, 223179, 202069, 176931, 170639, 179656, 179403, 182744, 224310, 260557, 257009, 237842, 209401, 168019, 129586, 117760, 133616, 163849, 183983, 173753, 155113, 144134, 140252, 117819, 80791, 79786, 101023, 117526, 136175, 142882, 135947, 126011, 104448, 70139, 36483, 12068, -2232, -21356, -61087, -80983, -57637, -31573, -10839, 33072, 88002, 132455, 153447, 147555]
15547A47555j0883L294L7743O2652L9372m103k5324m3328m9060m0956m3944l7300
15535C5718j6610J3293P460l9368m7277l2095k5005J812J8488k918k4278j9434
15523a30214m387O737K0523M6827N7863M1232J3840l3965o1853o1555m4369m04
15511a49725K0659K7623M4113O7787R7040J07905R5027Q2128M8679k0753q3377
15500C37106q2835m9314l1223m1812j4913J1582j421J3602O8486P5067L9857J8577
15488C42759J1651Q496j64j3129m5359p1956p2928m3856k478m723l6946l3484
15476C7883J5721P1586Q3570L7350k1444l5361j3071J7407J6604j3335m3410o1446
15464I2054o3580m1474j6261k4623m5817k0047J5635M6632O9854M7686K0874k9051
$$ y = [147555, 136672, 139966, 177709, 240361, 279733, 275630, 250306, 206978, 157918, 116962, 73018, 35718, 19108, 32401, 39861, 493, -46784, -78879, -103884, -102072, -83584, -86502, -110780, -130214, -134601, -127864, -107341, -60514, -2651, 38581, 52421, 18456, -43397, -104952, -149321, -149725, -129066, -101443, -57330, 10457, 107497, 215402, 310429, 392557, 441236, 420483, 337106, 254271, 204957, 173734, 131922, 117009, 128591, 127170, 140772, 209258, 284325, 324182, 342759, 354410, 362906, 362742, 349613, 304254, 232298, 159370, 115514, 113036, 108313, 71367, 37883, 53604, 125190, 208760, 246110, 224666, 189305, 176234, 193641, 210245, 196910, 153500, 92054, 28474, -13000, -29261, -53884, -99701, -119748, -104113, -57481, 12373, 60059, 80933, 51882]
15452E1882n1033k9231L977K3846K2078M1271M5383n372l7235p59M9400M5807
15440A60014o407k6294o581M616l934j1316j9234j1599L101j0458l8355o5686
15428c2133o7190m0508j0859m12j1645J4521O0567O8232M1514J30l5784m1088
15416e4655k3740j7519l5776o8789o6996j0966N6243Q2231O0387L1413m441n0209
15404a02817l9563Q974K7619J2095J4435L3233L7568N3771N3809K5074J2445L654
15392A40297j9139k7657k0638Q666M3272K9152j3674l2054j8836R685J2680R809
15380A21563m87j3184n80K0699J6771q854k2570l2123m1633j6435N620L3103L0823
15367I2713M803l575l908j9733n6368p1006m2174j124L4567O4336Q5962O7822
$$ y = [51882, 849, -28382, -24405, -559, 21519, 62790, 108173, 102801, 65566, 64807, 114207, 160014, 153607, 127313, 120732, 125348, 121414, 110098, 90864, 79265, 82366, 71908, 33553, -32133, -99323, -139831, -150690, -151102, -162747, -148226, -87659, -19427, 22087, 22217, -13567, -54655, -78395, -95914, -131690, -200479, -267475, -278441, -222198, -139967, -79580, -48167, -52608, -102817, -142380, -133406, -105787, -93692, -79257, -46024, -8456, 45315, 99124, 124198, 136643, 140297, 121158, 93501, 72863, 81529, 124801, 153953, 140279, 108225, 89389, 99074, 111754, 121563, 121076, 107892, 107312, 128011, 144782, 135928, 113358, 81235, 39602, 23167, 28787, 61890, 92713, 97516, 93941, 90033, 70300, 13932, -57074, -99248, -100372, -65805, -1469, 84493, 152315]
15355A52315L3397q303n6529q0534r3532p4601k6021K6762O2176M3847J1502K937
15343f584J1504K72k7510j4864J0759K0845Q225q568k032K2230L3210Q974j0126
15330D6335r380R148J1915k059k519J300o466j8801k3246n2405p6260m1723J1104
15317a53057J1396j2259j6374j3472k2735m0271m6289l2114k2025k9302j5333
15306c91835J2260M2279Q6104R4946O0123J549k0575K2929O8265O2518M1541K9946
15294A10050K8554N2661P3020N3038K2150J3529K4352J9577M7699J24907J93605
15283G63142K19774K31211K56761K63976K13674J39924N0058o3196j19259j13590
15273A842475o2068L2417Q7748L1289r6297j98748k32506j97351j64536j67766
$$ y = [152315, 185712, 177409, 120880, 40346, -53186, -127787, -153808, -127046, -64870, -21023, -9521, -6584, 4920, 5192, -22318, -37182, -26423, -5578, 2647, -5921, -7953, 14277, 47487, 56461, 46335, 36955, 46103, 58018, 55959, 53440, 54740, 48274, 29473, 6227, -46178, -122438, -164161, -153057, -141661, -153920, -170294, -183766, -206501, -246772, -293061, -325175, -347200, -376502, -391835, -379575, -337296, -251192, -156246, -96123, -94574, -115149, -92220, -23955, 38563, 80104, 110050, 138604, 191265, 264285, 317323, 339473, 353002, 377354, 396931, 444630, 569537, 763142, 982916, 1214127, 1470888, 1734864, 1948538, 2088462, 2138520, 2075324, 1956065, 1842475, 1780407, 1812824, 1900572, 1931861, 1835564, 1636816, 1404310, 1206959, 1042423, 874657]
15263H74657j60401j32373j36193j48034j11149n2502j4733m4697p8882m6688
15253e0995m24L2698L3249j715l2491m4261m300N5035P4134L4700l3853o5198
15241c421l7963M831M3543O1055O4366O0616M2541L2178J0561n1146q4999k6972
15229A15190M8906R1979Q0591L7511J5338O644m9717j25477j16911p0710m1900
15218h556r247j0724l5572k8501p955k1026j1196n8j10L4716N7529L7702K4865
15205B1867N664j4254J335L187j1049l1318l8722j6637J9824K7950O278p322j0866
15192d4063m358P529K2938K1128K0571L552m0460o0740m7290J43K5325J1722j0941
15179i4944l2788m3387k1405J2397J9936J4750K3447K1646n705k7313l1641p190
$$ y = [874657, 714256, 581883, 445690, 297656, 186507, 134005, 119272, 74575, -4307, -50995, -51419, -18721, 14528, 12813, -19678, -63939, -68239, -13204, 60930, 95630, 61777, -3421, -41384, -36553, 6990, 68045, 132411, 193027, 235568, 267746, 278307, 227161, 142162, 115190, 164096, 256075, 336666, 374177, 389515, 396159, 346442, 220965, 104054, 33344, -8556, -17803, -28527, -64099, -92600, -100555, -121581, -132777, -132835, -132945, -98229, -40700, -2998, 21867, 27531, 13277, 14612, 17799, 6750, -24568, -63290, -79927, -60103, -32153, -25875, -33197, -44063, -48421, -40892, -17954, 3174, 23745, 27297, -13163, -73903, -121193, -121050, -95725, -84003, -94944, -127732, -171119, -192524, -180127, -160191, -145441, -121994, -100348, -106053, -133366, -165007, -172197]
15167a72197L8738P7539O5895J9081o717j4446q008j9739m4115k2775K0584M6735
15155a9425L9812K3547J8793J4552j1532l5678l9089j9928P202L8235O5483M5671
15143A27643o517l6397k8457m799R387J6379K1285L0735J6044m0626n9359l6370
15131H948J237L4469M1485K3230j337k7540j8910J0813K1668K6990L8969L6093
15119A96115M1846L9018j3674o1122m8890j7901j5777j5999j2242l280J5356J066
15107A04516k7825l3031j4779q378l5593l5473K29J5189J6951J7667J0035k9622
15095b0114o8837p2044m2893J685L93k4742k0529K662J0379J7949L7444J5126
15083a63521k4365j3832P941J5782L5153N7219P6936R2263Q8170M5966q46R840
$$ y = [-172197, -133459, -55920, 9975, 29056, 22339, 7893, -115, -19854, -63969, -86744, -66160, -19425, 20387, 43934, 62727, 77279, 65747, 30069, -9020, -28948, -21746, 16489, 81972, 127643, 121126, 84729, 56272, 51473, 60860, 77239, 98524, 129259, 145303, 104677, 45318, 8948, 10185, 44654, 86139, 109369, 108032, 80492, 61582, 72395, 94063, 121053, 160022, 196115, 237961, 276979, 263305, 202183, 153293, 135392, 119615, 103616, 91374, 88094, 103450, 104516, 76691, 43660, 28881, 20503, -15090, -50563, -50334, -35145, -18194, -527, 9508, -20114, -88951, -160995, -203888, -202203, -201810, -226552, -247081, -244419, -234040, -216091, -178647, -163521, -187886, -201718, -193777, -177995, -142842, -85623, -8687, 83576, 171746, 217712, 216866, 226706]
15071B26706K4431j5127n7596o4955l7599k090q971l0936l1143j7461j8437r506
15059d2684K7797M9317L1173j1806k0019J0841K0874J2715K3781M8093O3538M3678
15047B57298n955m4670k9455K2229N5794J5380o0876q0979n6629m3309m2419j6200
15035b9791J6381N8366R3214R8089O9019r23n7593n3604q750J8432J0529l126
15023B10243l1405m8041o2815o1002m2513k9479k8329k8705J965J6981j091j0547
15011a14738K6703N9658O9014P4596P0822N6973K2329j9529m9629m4097k5449
15000A26653j0916j3662k1990j9400k179K2441K0849m999j4199M1618P5470L7059
14988B36745m946k6076j3730M784j0856j3932j7085m6421o1788n1295j0395K5495
$$ y = [226706, 251137, 236010, 178414, 113459, 75860, 73770, 64799, 33863, 2720, -14741, -33178, -42684, -14887, 34430, 65603, 53797, 33778, 44619, 65493, 78208, 101989, 150082, 213620, 257298, 251343, 206673, 177218, 199447, 255241, 270621, 209745, 128766, 72137, 28828, -13591, -29791, -13410, 44956, 138170, 236259, 305278, 304355, 246762, 193158, 184408, 202840, 213369, 210243, 178838, 130797, 67982, 6980, -35533, -65012, -93341, -122046, -120081, -103100, -104191, -114738, -88035, -28377, 40637, 115233, 186055, 243028, 265357, 245828, 196199, 152102, 126653, 115737, 102075, 80085, 60685, 58506, 80947, 101796, 96797, 82598, 124216, 199686, 236745, 231799, 205723, 191993, 196777, 185921, 171989, 154904, 108483, 46695, -4600, -14995, 10500]
14976A0500R748k8244n2252l7455k2460j1416K4106N924n3005m3214q964J3855
14964a92877N0958N3805J6392m492j8616o6166q7891m4321L834J2744K6754M8245
14952b01631M2538K2784j5055l4864j1499K7569N7913L3086j0833j5222l8964
14941a44178o0937m7735j4962N3392R8439N9890j1868j8847K5231L7626j2902
14930c6851p4659n7911L1139J03630J14071P0532J6910K556j0705l5928m6131
14919G6653m0064j8713j6331l6135j3904M3263P2067K7747l0396k4729P639J7429
14907F4526J1619J8183N1949Q3117Q9603L6483l3873m0285o2400q9037q9107o3326
14895b2548k1663K49K5981M3913N4715J7060n0658m4217L4949N8569k183m2643
$$ y = [10500, 20248, -7996, -60248, -97703, -120163, -131579, -107473, -101549, -154554, -197768, -206732, -192877, -141919, -88114, -71722, -76214, -94830, -160996, -248887, -293208, -289374, -276630, -249876, -201631, -159093, -136309, -151364, -186228, -197727, -170158, -112245, -79159, -89992, -105214, -144178, -205115, -252850, -267812, -214420, -115981, -56091, -67959, -86806, -61575, -23949, -36851, -111510, -169421, -138282, -34652, 79419, 149951, 166861, 169417, 158712, 122784, 76653, 36589, 17876, 1545, -34590, -48494, -5231, 66836, 94583, 64187, 39458, 47097, 64526, 76145, 94328, 146277, 229394, 318997, 355480, 321607, 281322, 218922, 129885, 40778, -22548, -44211, -43962, -17981, 25932, 80647, 97707, 47049, 2832, 37781, 96350, 94167, 51524]
14883E1524o0866p3900k5582M4792O4771N2479M8248N2130L1635J7731J5917J1700
14871B30579J4345J6292p728l7064l4270k8997k9161k8654k4042L302M0446N9217
14859A74265J8157m5900o3929n2948l7237r651J7401K4116K8056L3685K0684O81
14847A07380o169o744p700J535N293p100l2632n7815m7427K161J008l9314j9951
14834a07475K7442N3598K8959M731J2757K6087L9701K9152K763k373r576k5367
14822H0399j4047J1278K9201M1619M4702L7705L6217K7287l490q366m650j9993
14810B57862j5277P796K9433L6622J1683l4381m8410k2274m505J2677R981j9234
14798B21973m5428m8075k2811J1454O576m271j584P010M0874N4988M9570N6746
$$ y = [51524, -9342, -83242, -108824, -64032, 739, 53218, 101466, 153596, 185231, 202962, 218879, 230579, 244924, 261216, 253488, 216424, 182154, 153157, 123996, 95342, 71300, 74602, 115048, 174265, 192422, 146522, 82593, 29645, -7592, -17243, 158, 24274, 52330, 86015, 106699, 107380, 101211, 94467, 86767, 88302, 93595, 86495, 53863, -3952, -51379, -49218, -48210, -87524, -107475, -80033, -26435, 2524, 7255, 20012, 46099, 85800, 114952, 117715, 115342, 105766, 80399, 66352, 77630, 106831, 148450, 193152, 230857, 267074, 294361, 290871, 282505, 277855, 257862, 242585, 250381, 279814, 316436, 328119, 293738, 245328, 223054, 218549, 231226, 241207, 221973, 176545, 128470, 105659, 117113, 123689, 119418, 117834, 124844, 165718, 220706, 270276, 327022]
14786C27022K5401m1684o6964l5160m924M052K1261L4054J8584J1213K9031L7905
14774C59791L6728M5537M5943L0105K0431J2614L373J2991N3001Q0471Q9040O3274
14762H53299N0467N1869J6346j8559j1710J8290J5945N434j6937o4437p2063l6886
14750G91058m142N011p234l1258m2424o5459q9033j07479j03489q0466n1332l6567
14738A77186m4138k5785J2718L5852K2315m44j1173j4772k0273l8009n8867p1217
14726c6607o7284l4720M176K5946K3427K617j2642r705O902J8766J3928K5413
14714c9783M8834M0608J7074N654J6414M1961L6842O104J611R59j635J3755M932
14701A93330k0700k5491j4789k7051l4048j4705k1718l2896m5913m3908k2329
$$ y = [327022, 352423, 310739, 243775, 208615, 203691, 207743, 229004, 263058, 281642, 292855, 321886, 359791, 396519, 442056, 487999, 518104, 538535, 551149, 554522, 567513, 620514, 700985, 790025, 853299, 903766, 955635, 971981, 953422, 941712, 960002, 975947, 981381, 964444, 900007, 827944, 791058, 786916, 791927, 784693, 753435, 711011, 645552, 556519, 449040, 345551, 265085, 213753, 177186, 133048, 107263, 119981, 155833, 178148, 177704, 166531, 151759, 131486, 93477, 34610, -36607, -103891, -138611, -134435, -108489, -85062, -82445, -95087, -104792, -97890, -79124, -65196, -39783, 9051, 49659, 66733, 72387, 88801, 130762, 167604, 173708, 175319, 176278, 174643, 188398, 193330, 172630, 147139, 132350, 105299, 71251, 56546, 34828, 1932, -43981, -87889, -110218]
14690a10218N752O0296R9014N4810p358n0776p1303n4845o936L5152P3039O9278
14678I5905M2897L3477M7054M6301M2163N3081L8040K6247m442o5098p9616m0292
14666B35717L563K4170J7914J2571K3406K6238j8919m6213l1938j7472R588K1377
14654B60002j1579l4705l6512m7384m6657k6115k1489l7419k2433J3925P3686
14643F3320R6286L5950o128L120J2713L8398L6777k8025n8398l9214k1913q248
14631A24638Q846J2326k3307o0490o6479l3385n783J2243L0929K0923L285k4325
14619e79k0235k11L642o862j3185r060k26L1915O5174L1888j8034m2938m6063
14606b4774m8581l7626o6M0437M5374J9574P58n469j0188j4289k2907m753K6692
$$ y = [-110218, -104466, -44170, 54844, 109654, 102296, 51520, -19783, -74628, -81564, -46412, 26627, 95905, 138802, 172279, 219333, 265634, 307797, 360878, 398918, 425165, 420723, 355625, 276009, 235717, 239280, 263450, 281364, 293935, 317341, 343579, 324660, 278447, 246509, 229037, 238625, 260002, 248423, 213718, 177206, 129822, 83165, 57050, 35561, -1858, -24291, -10366, 63320, 159606, 195556, 189428, 192548, 205261, 243659, 280436, 252411, 194013, 154799, 132886, 124638, 133484, 145810, 122503, 62013, -4466, -37851, -43634, -31391, -462, 20461, 23746, -579, -20814, -21025, -17383, -24245, -37430, -46490, -46716, -14801, 50373, 82261, 64227, 21289, -24774, -73355, -110981, -111047, -70610, -25236, -5662, -4904, -10373, -20561, -34850, -57757, -62510, -35818]
14593c5818K4535K057k0162k8232j1285J9333N485l9574o7947p6037m2434J2880
14581b57199N0698M6622K4401K0447J6066k338j4988j1167K5493N7709N0619P141
14569A3504m1829n3398m2001o596L4190L9210M0640P5859R6812R1278P5120M6212
14557C69001J5530l7914o9762m1910J585k963m0449o9568p6716o5564m9501j7152
14545h5383K5738M6890O0836O6590N4488M4487M3124K9973J5379O03l019N353
14533C05059j0166o3867p7586l3383J1899J0710p601L174N942j8401k9652k1424
14521G4704l7655p0490n1983M290L9431K6796j1605J079L9438O3840O4714L9097
14509A81656J5829J8340R409j1930m41J7735J297m5051o8599n4533n2347l1333
$$ y = [-35818, -11283, -9226, -29388, -57620, -68905, -49572, -44087, -83661, -151608, -227645, -270079, -257199, -206501, -159879, -135478, -115031, -98965, -101303, -116291, -127458, -101965, -44256, 6363, 13504, -28325, -81723, -123724, -130320, -96130, -56920, -16280, 59579, 156391, 247669, 322789, 369001, 384531, 346617, 276855, 234945, 236530, 233567, 193118, 123550, 46834, -18730, -68231, -85383, -59645, -12755, 48081, 114671, 169159, 213646, 256770, 286743, 302122, 302725, 299706, 305059, 294893, 231026, 153440, 120057, 131956, 142666, 135065, 138239, 144181, 125780, 96128, 74704, 37049, -33441, -85424, -81134, -41703, -14907, -26512, -25433, 14005, 77845, 142559, 181656, 197485, 215825, 225234, 213304, 212863, 230598, 231895, 186844, 118245, 63712, 11365, -19968]
14497a9968J417K8687N9823P3261L4209k8124n0968k8667J1269J2547k4739n0099
14485A8648j5556L8777L8556J0177j1065j4920j7632l1945j6571Q524L2587L7190
14473G6770K4259N7462P0641L4199J9153K1489j883l1533l0502M807K4542J305
14461B70709j3658k4549k9079J9006R2661R5559M4861J2779J3363J6098j2240
14450D85510l7838l8076p016J117l0309k2005K843M571J5208J6830l679j4584
14438C72572l0485n0043l8069j5502l2645m4162j2456R197O036J4713L3118L9322
14426B51596L5904L8395P2707R5169P7327K7062k1951m1031k0070l188N312J2242
14414E29474r71k7503m0778k7528Q752N2754M6384K4047M6268N1791K1090M477
$$ y = [-19968, -18551, 10136, 69959, 143220, 177429, 149305, 98337, 69670, 80939, 93486, 68747, 18648, 3092, 41869, 80425, 90602, 79537, 64617, 46985, 15040, -1531, 6993, 39580, 76770, 101029, 158491, 229132, 263331, 282484, 303973, 302090, 270557, 240055, 244862, 269404, 270709, 257051, 232502, 203423, 222429, 315090, 410649, 455510, 468289, 481652, 497750, 485510, 447672, 409596, 402580, 403697, 373388, 351383, 354226, 358797, 374005, 390835, 387156, 372572, 342087, 292044, 253975, 238473, 205828, 161666, 149210, 158407, 164443, 179156, 212274, 251596, 287500, 325895, 398602, 493771, 571098, 598160, 576209, 535178, 515108, 511920, 517232, 529474, 528503, 501000, 460222, 432694, 441446, 494200, 540584, 564631, 610899, 662690, 683780, 688257]
14402F88257L9966R0174J16813J29985R7197M4343L0070M0372N6906M3951N226
14391A383260O149M7347Q3868Q1450P4529O3751J8551j7298m3616m7228k0337
14380A630426j3575l7708n3926n4530n3185o6606q4191r3903p0161l0271j0827
14369A061543k1113k9908l3890n3794o5347p7718o2130l0579j2946k0491n1078
14358F02549n7452l0105m869N195O756j8539n1238n0457n1790m1783j0686J1078
14346C08659J2242q37j0735k215j0133n0163l5285J6223L4869J9695J4555K8976
14334C25851K2586q305m0179m6700l12M0990M5139J3757K355J2370J1783N898
14322C85233m468j8024l2670j5553J070K0343N6415O1435L1554L290r789k3388
$$ y = [688257, 728223, 818397, 935210, 1065195, 1162392, 1206735, 1236805, 1277177, 1334083, 1378034, 1383260, 1389409, 1436756, 1520624, 1602074, 1676603, 1740354, 1758905, 1741607, 1697991, 1650763, 1630426, 1616851, 1579143, 1525217, 1470687, 1417502, 1350896, 1266705, 1172802, 1102641, 1072370, 1061543, 1040430, 1010522, 976632, 922838, 857491, 779773, 717643, 687064, 674118, 653627, 602549, 545097, 514992, 510123, 515318, 522074, 503535, 452297, 401840, 350050, 308267, 297581, 308659, 320901, 320064, 309329, 307114, 296981, 246818, 211533, 227756, 262625, 282320, 296875, 325851, 348437, 340132, 299953, 253253, 252941, 293931, 339070, 352827, 355182, 367552, 379335, 385233, 380765, 362741, 330071, 314518, 315588, 335931, 392346, 453781, 485335, 488625, 478836, 455448]
14310D55448j0341J5139J0992j8207j8021J9354M6775N0498O3947Q6764O8511
14299G70859L4369J5990l767k6432m0452l2129N312L6483K0858k3285k5064j566
14287G31176p19k2381n1411n6430k9962r694J3302J6637J55M676K6618J6512J7030
14274F55509L6593K3630q199l850O762l3762o6171n2079N28L5776M4050J7451
14262F56238j2523k0093q448J4723M2063M2103j0762m1535j0281M0488O3190N1205
14250H06368K3657J3992K914p456M028o71n177J4869K9252j3320n4977m4863l7998
14237G30618l4006j0067K0485M9364M6047O338j0259k3873n2213n4814L53M5566
14225G13539L8310K8383K1920K56q241K6687M9853K9944J971l0297n9627m6160
$$ y = [455448, 445107, 460246, 471238, 453031, 435010, 454364, 501139, 551637, 615584, 702348, 770859, 805228, 821218, 817451, 791019, 750567, 718438, 723750, 760233, 781091, 757806, 732742, 731176, 730457, 708076, 656665, 600235, 570273, 560579, 573881, 590518, 590673, 595349, 621967, 638479, 655509, 692102, 715732, 707533, 703683, 710445, 676683, 610512, 558433, 558961, 594737, 638787, 656238, 643715, 623622, 615174, 629897, 671960, 714063, 703301, 661766, 651485, 691973, 755163, 806368, 830025, 844017, 846931, 839475, 843503, 842832, 837655, 852524, 881776, 868456, 813479, 768616, 730618, 696612, 686545, 707030, 756394, 802441, 808779, 798520, 774647, 722434, 667620, 667973, 713539, 751849, 780232, 802152, 802408, 794167, 820854, 870707, 900651, 902622, 872325, 812698, 766538]
14213G66538O935K8404K6959J2163n833J1196O5504P8952K5099l4426p3088p9309
14201H29094o5415l1006J8047N7519O0958K1161J0946K1447K787J5793K5878L505
14189I70714N338K1607K3342L3340L7244K5407K0239K3188K4267K0694K3036L5691
14177A264107M0814L2616J4029j9977k7343k2873j4499O48M330K1196j012m4033
14165A248003n1239n3660m4035j0295J0828M0440O0435O2127N8165N3787L6406
14154A410962J0066j2693k6921L702L9073N0921M2985J6158l643L48K500J2574
14142A546032M2982O2053M9156K2285L590j4006k7371j3225L1814R7873J49563
14131A950746J32914P5147N4718K7343l698K344K2232K9140K3324K1617J9343
$$ y = [766538, 773473, 801877, 828836, 840999, 835166, 846362, 911866, 990818, 1015917, 981491, 908403, 829094, 763679, 732673, 750720, 808239, 869197, 890358, 901304, 922751, 925538, 941331, 967209, 970714, 976052, 997659, 1021001, 1054341, 1091585, 1116992, 1137231, 1160419, 1184686, 1205380, 1228416, 1264107, 1304921, 1337537, 1351566, 1331589, 1304246, 1281373, 1266874, 1267522, 1271852, 1293048, 1292036, 1248003, 1196764, 1143104, 1099069, 1088774, 1099602, 1140042, 1200477, 1262604, 1320769, 1374556, 1410962, 1421028, 1408335, 1381414, 1385116, 1424189, 1475110, 1518095, 1534253, 1530610, 1530958, 1533458, 1546032, 1589014, 1651067, 1700223, 1722508, 1726098, 1712092, 1684721, 1671496, 1703310, 1801183, 1950746, 2083660, 2158807, 2213525, 2240868, 2237170, 2239514, 2261746, 2290886, 2314210, 2335827, 2355170]
14120B355170K1814L2008M5859M6788L8574K6276J1185L3634O7606R3337J03711
14109B875962P3872M0129L3965L6009J6475M626p825k1951L855O8612J02023P5009
14097C300761M2578K7377L7059J3388n7932q1671r1237j20648j24769r1602p6560
14086B776744n8426k1314m9812r1477r1065q7251n0855N657K7542J645n9003j06930
14074B195455j25113j10758p8522n7419m9205o9865j15807j48091j48931p4008
14064A217736J4277L6780j9121p3333p6527o6369l4472J5742L8878M5431M1317
14053A140339J1843k3864l8543m9395l2778K757K6054L8436K7991J2781L0365
14042A145986Q270l4645m1981n3822o4975k9405K8373L1418j1964k8425J3272
$$ y = [2355170, 2376984, 2408992, 2454851, 2501639, 2540213, 2566489, 2577674, 2611308, 2678914, 2772251, 2875962, 2949834, 2989963, 3023928, 3059937, 3076412, 3081038, 3073213, 3051262, 3055117, 3123729, 3225752, 3300761, 3343339, 3370716, 3407775, 3421163, 3363231, 3281560, 3190323, 3069675, 2944906, 2853304, 2776744, 2718318, 2697004, 2647192, 2555715, 2464650, 2377399, 2326544, 2332201, 2359743, 2361388, 2302385, 2195455, 2070342, 1959584, 1881062, 1823643, 1774438, 1704573, 1588766, 1440675, 1291744, 1217736, 1232013, 1268793, 1249672, 1176339, 1099812, 1033443, 998971, 1014713, 1053591, 1099022, 1140339, 1152182, 1128318, 1089775, 1040380, 1007602, 1010359, 1036413, 1074849, 1102840, 1115621, 1145986, 1154256, 1119611, 1077630, 1023808, 958833, 929428, 957801, 989219, 977255, 948830, 962102]
14031I62102L5789J7213J2446N4104J01695J28960J36865P7923K4476J7583J707
14020A570863Q443N0717O0966M6219M6897N5377O6456O5510L9491l3607q8421
14009A888911o3286J0946N0601M2938J0106n447q932k7897k9723r701l4000p2411
13997A752105o2274j4575J1441l1342p6917p7755k5354M6251N7786J2365k5324
13986A566407m6307n5915k9462K0063N2162O1521M8790L0979Q043l3038l4356
13975A588887R148J6770R353M8508Q1960P5715M5429K2767K7110N5384O7205N0301
13963B098537K3242o853k6233j8280P833M1619N8749M5213M5649R3848J33282
13952B496606Q3726J4010j7692j6728R220K6308K2274o178l24M5205O4029M5322
$$ y = [962102, 997891, 1015104, 1027550, 1081654, 1183349, 1312309, 1449174, 1527097, 1551573, 1569156, 1570863, 1579306, 1630023, 1690989, 1737208, 1784105, 1839482, 1905938, 1971448, 2010939, 1977332, 1888911, 1825625, 1836571, 1887172, 1930110, 1940216, 1934769, 1925837, 1897940, 1868217, 1858516, 1824516, 1752105, 1689831, 1675256, 1686697, 1655355, 1578438, 1500683, 1475329, 1521580, 1579366, 1591731, 1566407, 1520100, 1464185, 1434723, 1454786, 1506948, 1568469, 1617259, 1648238, 1656281, 1623243, 1588887, 1598035, 1614805, 1624158, 1672666, 1754626, 1830341, 1875770, 1898537, 1925647, 1981031, 2048236, 2098537, 2121779, 2114926, 2088693, 2070413, 2078246, 2119865, 2178614, 2223827, 2269476, 2363324, 2496606, 2580332, 2594342, 2576650, 2559922, 2569142, 2595450, 2617724, 2611546, 2611222, 2656427, 2720456, 2765778]
13940B765778K8446L3145L8250N3128M3850Q87K361M4589N2955L4259M2566O8517
13928C208731Q6330R4272P4354M8080O8279R7347J04651J11092J04280J00205
13918D097621Q3283N7698Q7574J21150J03421Q8513J00877J18368J38394J62686
13908E159585J79800J80929J88142K25931K26097J74625J19043Q8490P2896P6818
13898F692356J05164J40437J43375J07787J11974J37474J53048J65679J88521
13889G945815K10740K41485K77083L03324L01303K94501L12246L29275L47564
13880A0563336L97240M85427N47663N39437M99508M84966N42288O00583O00166
13871A5260614N92152O27612O95276P13720O88604O99159P70140Q68885R38735
$$ y = [2765778, 2794224, 2827369, 2865619, 2918747, 2962597, 2963484, 2965845, 3010434, 3063389, 3097648, 3140214, 3208731, 3295061, 3389333, 3463687, 3511767, 3580046, 3677393, 3782044, 3893136, 3997416, 4097621, 4180904, 4238602, 4326176, 4447326, 4550747, 4639260, 4740137, 4858505, 4996899, 5159585, 5339385, 5520314, 5708456, 5934387, 6160484, 6335109, 6454152, 6542642, 6615538, 6692356, 6797520, 6937957, 7081332, 7189119, 7301093, 7438567, 7591615, 7757294, 7945815, 8156555, 8398040, 8675123, 8978447, 9279750, 9574251, 9886497, 10215772, 10563336, 10960576, 11446003, 11993666, 12533103, 13032611, 13517577, 14059865, 14660448, 15260614, 15852766, 16480378, 17175654, 17889374, 18577978, 19277137, 20047277, 20916162, 21854897]
13862B1854897J006997J126208J274619J425570J570687J702303J856384K099775
13854C3917440K349882K583245K841907L152469L557869L999183M483997N081371
13846F1967363N789109O557965P395460Q378679R522980J0796929J2228177J3787854
13838A36424516J5383609J6900365J8162997J8963320J8989336J7923172J5512861
13831B58260176J1684622O699054J015441m715769r798231j3736950j6348721
13824B33059622j7703737j8033918j7646058j6757536j5541388j4193317j2808288
13817A20375380j1473237j0247319r108234q064268p142487o368098n682637n060814
13809E7228286m515034m019287l573545l177365k874178k643543k422237k202668
$$ y = [21854897, 22861894, 23988102, 25262721, 26688291, 28258978, 29961281, 31817665, 33917440, 36267322, 38850567, 41692474, 44844943, 48402812, 52401995, 56885992, 61967363, 67756472, 74314437, 81709897, 90088576, 99611556, 110408485, 122636662, 136424516, 151808125, 168708490, 186871487, 205834807, 224824143, 242747315, 258260176, 269944798, 276643852, 277659293, 272943524, 263145293, 249408343, 233059622, 215355885, 197321967, 179675909, 162918373, 147376985, 133183668, 120375380, 108902143, 98654824, 89546590, 81482322, 74339835, 67971737, 62289100, 57228286, 52713252, 48693965, 45120420, 41943055, 39068877, 36425334, 34003097, 31800429]
13801C1800429k010622j845391j698067j555591j380266j201498j084161j010203
13793B0014630r27433q40718p86676p37095o58440n82014n50818n57157n84912
13784A3789367o07300n95802n43252m63965m28215m58730m77362m41684l85641
13775I387416l29492k98059l06514l17802k87010k34298k11028k07651j97808
13766F997754j94015j69934j23616r9254r8362j15490j06816n1972m0029q4234
13756E914032j45529j69870j44626j18311j17049j23799j19982j39907j90547
13747D644412j99684j57498r2433m4023o1845p7820n3110j2893O308Q529J0809
13736C970752k5265n9916p8131r8340j11577r6094o1658n6419o7372r2356r3825
$$ y = [31800429, 29789807, 27944416, 26246349, 24690758, 23310492, 22108994, 21024833, 20014630, 19087197, 18246479, 17459803, 16722708, 16064268, 15482254, 14931436, 14374279, 13789367, 13182067, 12586265, 12043013, 11579048, 11150833, 10692103, 10214741, 9773057, 9387416, 9057924, 8759865, 8453351, 8135549, 7848539, 7614241, 7403213, 7195562, 6997754, 6803739, 6633805, 6510189, 6410935, 6312573, 6197083, 6090267, 6038295, 5998266, 5914032, 5768503, 5598633, 5454007, 5335696, 5218647, 5094848, 4974866, 4834959, 4644412, 4444728, 4287230, 4194797, 4150774, 4088929, 4011109, 3957999, 3945106, 3951414, 3959943, 3970752, 3945487, 3885571, 3807440, 3709100, 3597523, 3501429, 3439771, 3383352, 3315980, 3223624, 3129799]
13725C129799m2772R91J345o791k8275n5591m8912k9225q929k9838n9398o5310
13713B757094o0089m2810k0736j7032l5665m4910k9754m4692p2953o9376p5735
13702B243342q0805n0393k7500l3259l1867j9796r885R870K4786J2443j4793j0461
13690B011682J7635M384k9563m8858m8898p279K2533M276j2051k3996k4279k0326
13678A845260k1919k054J4648K1937L8517K4972l2701n4578j0602N0056Q7892
13667A961428O5249L2593k785n4095o1266m102O6498J02178R5734Q3281O9603
13656B354316L5265J9346K0759J1739J2193K3891K6601K6102j288k6225j8296
13645B484403J5769M1716K7732j2474m5638l3659R568L8849M3384Q718m3789n9664
$$ y = [3129799, 3087027, 3088018, 3089363, 3082572, 3054297, 2998706, 2949794, 2920569, 2911640, 2881802, 2822404, 2757094, 2697005, 2654195, 2633459, 2616427, 2580762, 2535852, 2506098, 2461406, 2388453, 2319077, 2243342, 2162537, 2112144, 2084644, 2051385, 2019518, 1999722, 1989837, 1999707, 2024493, 2036936, 2022143, 2011682, 2029317, 2033701, 2004138, 1955280, 1906382, 1899103, 1921636, 1925912, 1913861, 1889865, 1865586, 1845260, 1823341, 1821287, 1835935, 1857872, 1896389, 1921361, 1888660, 1834082, 1823480, 1873536, 1961428, 2026677, 2059270, 2056485, 2002390, 1941124, 1937022, 2003520, 2105698, 2201432, 2284713, 2354316, 2389581, 2408927, 2429686, 2441425, 2453618, 2477509, 2504110, 2530212, 2528924, 2502699, 2484403, 2500172, 2541888, 2569620, 2557146, 2511508, 2477849, 2487417, 2526266, 2569650, 2578368, 2534579, 2474915]
13633B474915o5008r1563q6753l3310L3857O2005M4359L0816M0467M1096J7325
13622B468206J3970M3375O7967P1868M2482J0449m735q756R029L2369N3087O1523
13610B860834O4709O9448P6699P0719O0452Q1321J05287R4228P3756J01871J60221
13599C819545K09824K49826K96512L30637L67848L99342M16914M39054M97393
13590G026895N72086O25083O46675N83165L93251J32814j28490l94857n78993
13581H877629o19438n86034n66836n79262n59992m86438m14547l67665l25567
13572D371850l05017k82678k27605j53902j07739j24435j70107j78086j28203
13563B694078q6182p6806q3465r8618j04372p6694o9872j01125j10301j00109
$$ y = [2474915, 2409907, 2318344, 2231591, 2198281, 2232138, 2294143, 2338502, 2369318, 2409785, 2450881, 2468206, 2482176, 2525551, 2593518, 2665386, 2707868, 2718317, 2713582, 2704826, 2713855, 2746224, 2799311, 2860834, 2925543, 2994991, 3071690, 3142409, 3202861, 3284182, 3389469, 3483697, 3557453, 3659324, 3819545, 4029369, 4279195, 4575707, 4906344, 5274192, 5673534, 6090448, 6529502, 7026895, 7598981, 8224064, 8870739, 9453904, 9847155, 9979969, 9851479, 9456622, 8877629, 8258191, 7672157, 7105321, 6526059, 5966067, 5479629, 5065082, 4697417, 4371850, 4066833, 3784155, 3556550, 3402648, 3294909, 3170474, 3000367, 2822281, 2694078, 2607896, 2531090, 2447625, 2349007, 2244635, 2167941, 2098069, 1996944, 1886643, 1786534]
13553A786534j03891p3781l9240k7505k466k054l9344m9492r717K6515N1651L8537
13541A555747r218m3313o2633o0130o5407p8076r1657p9218m6242k2815k4123
13530I72915l4039j4555P796l358j7292j1204k1755k6346j1212o173k9097l1751
13518G73929k6806m1110j8312J2377M145j2464l0611n3733m6925k8143l4789m2460
13506D55098k7076k341J3400J7568J3010j2279j7416J6982M0128K7058J701k8343
13494D97490o2141o7564m3686p149J6081r96l3478l2499j0744r018k1911l0969
13482A93416j7367K4672N7424O8163L9257k887k4188l677J3832j9294n4491l8034
13470B36826j4489l3983k4411R104K3583J7653Q258J6483L4161M1209R616l181
$$ y = [1786534, 1682643, 1608862, 1569622, 1542117, 1539651, 1537597, 1498253, 1448761, 1439044, 1465559, 1517210, 1555747, 1546529, 1503216, 1440583, 1380453, 1315046, 1236970, 1145313, 1066095, 1019853, 997038, 972915, 938876, 924321, 932117, 928759, 911467, 900263, 878508, 852162, 840950, 834777, 805680, 773929, 747123, 706013, 687701, 700078, 704223, 691759, 661148, 607415, 560490, 532347, 497558, 455098, 428022, 425681, 439081, 456649, 469659, 457380, 439964, 456946, 497074, 524132, 525833, 497490, 435349, 367785, 324099, 316950, 333031, 332035, 298557, 266058, 255314, 246296, 224385, 193416, 176049, 200721, 258145, 326308, 365565, 362678, 338490, 334813, 348645, 329351, 274860, 236826, 222337, 188354, 163943, 173047, 196630, 214283, 222541, 239024, 273185, 314394, 324010, 320829]
13458C20829J9014J1713q937K300L0165L8433K6640K4713J8414r370j9163L837
13446D58588J6356p747k3937j2739N322m222k2072k7863l0011m4155l6723j8607
13434B52190q968m0705p2253n8518m0526l8759k0583l659L7773O4420M4252M0918
13422A55582M3282J8677r963M678K2702J8559k755l4933n8334o7066n5558j6654
13410A8217L0836L5537P577K897J3850m99K4922P3623P7030L2678j2777l8269
13398B65622l1442J4737M3555J8615l4331o6879n4375j6062M808P64k4782k2039
13386I8191J9215L1775J598r002J4299J6113o284j7829k836M0957M7848R522k6311
13373B17256k4730J6116L7483K3871J0930L095k0397l9275m0405l2808l694J2623
$$ y = [320829, 339843, 351556, 342619, 344919, 375084, 413517, 440157, 464870, 483284, 473914, 454751, 458588, 474944, 467197, 443260, 430521, 435843, 431621, 409549, 381686, 351675, 307520, 270797, 252190, 243222, 202517, 130264, 71746, 31220, -7539, -28122, -31781, 5992, 70412, 114664, 155582, 198864, 217541, 207578, 212256, 234958, 253517, 250762, 215829, 157495, 90429, 34871, 18217, 49053, 84590, 92167, 95064, 108914, 108415, 133337, 206960, 283990, 316668, 303891, 265622, 234180, 248917, 292472, 311087, 276756, 209877, 155502, 139440, 144248, 145012, 120230, 98191, 117406, 149181, 150779, 141777, 156076, 172189, 165905, 148076, 145240, 186197, 234045, 243567, 217256, 192526, 208642, 246125, 269996, 280926, 284021, 263624, 224349, 183944, 151136, 147442, 160065]
13361A60065J6761k0k6060j7597J0666L1875J6668j0712J884J9140K7941L0596
13349B61207N689j8643k9617n5547p4430m2117L728O657O527q110l4285m6714
13337b5655m9806l2445j1724q828k4603j4223O266L5668N4663M5365L5197J1840
13325B1715k061j7656m9668o9545n1645k812M8792P3288O9661O0780L4158q942
13313A06065m5553p5380q3254n0276k0245j2184K2233M8264M1231N8432P3696
13302F3029N5444J7325q448k004o583n269K3111N5435P5401Q2426R4737R1233
13290E35837N2176O7478R6633R0169P3088L7331L0122M7237O0221P3622P2541
13279A236455O5333N3977L9551P002m0538o2955l5117j6739m1937p2488q0063
$$ y = [160065, 176826, 176806, 150746, 133149, 143815, 175690, 192358, 181646, 183530, 202670, 230611, 261207, 266896, 248253, 218636, 163089, 88659, 46542, 50270, 56927, 63454, 55344, 21059, -25655, -75461, -107906, -119630, -128458, -153061, -167284, -161018, -125350, -70687, -25322, 9875, 21715, 19654, 1998, -47670, -117215, -168860, -171672, -122880, -49592, 20069, 80849, 115007, 106065, 60512, -14868, -98122, -148398, -168643, -180827, -158594, -110330, -69099, -10667, 63029, 118473, 135798, 127350, 125346, 118763, 113494, 136605, 192040, 267441, 349867, 444604, 535837, 588013, 655491, 752124, 842293, 915381, 952712, 982834, 1030071, 1090292, 1163914, 1236455, 1301788, 1355765, 1395316, 1402318, 1361780, 1298825, 1263708, 1246969, 1205032, 1132544, 1052481]
13268A052481p4982n4212j1183J8743R630q325k7884l3849l4516m2785n7628p3611
13256F61879o3642m9644n2758m8806m5295n5753m2644k2232j7444k1272l9360
13245B03029o4451n0385j6307J114L019j1270l6606l9027l0728l6748k08O7096
13233a1472Q6022N0178K1230K652j1556j0985J6214N5480N3576K7224m093m7919
13221B26551o1772j1676N4966P6934O0427L5507K6458M9344N8628J5723m3165
13210D87925o0884n6319o3307n3695k2281O208L2574L5601Q338j5377J1770O6616
13198C77169O7085J5798k7335m1510k0637L4116Q3420Q1632L2535j3791n1268
13187E37214r2709r0582k7671K2686L6645J0804m0575n9490m5263j9974n743n980
$$ y = [1052481, 977499, 923287, 912104, 930847, 940477, 932152, 904268, 870419, 835903, 793118, 735490, 661879, 598237, 548593, 495835, 447029, 401734, 345981, 303337, 281105, 263661, 242389, 203029, 138578, 88193, 71886, 73000, 76019, 64749, 28143, -10884, -41612, -78360, -78568, -11472, 74550, 124728, 145958, 148610, 137054, 126069, 142283, 197763, 251339, 278563, 274470, 226551, 164779, 153103, 208069, 285003, 345430, 380937, 407395, 456739, 515367, 531090, 487925, 427041, 370722, 307415, 253720, 231439, 237647, 270221, 305822, 314160, 298783, 310553, 377169, 444254, 460052, 432717, 391207, 370570, 404686, 488106, 569738, 602273, 588482, 537214, 444505, 353923, 326252, 348938, 385583, 396387, 355812, 296322, 251059, 231085, 225342, 219362]
13175B19362J0360L8536L5591P289j6792l4228o3117q1991r5550q3564n9153l9513
13163a62770J798O4361J01791M9782l2077o5614o6050l8311M6745R7858N5311
13152E2824q446l6305j1987P142K3068N3941N7386N4837N0800M279o3040r6381
13140H8118j00725r9057r3223n8912R523P3141R3460Q5714N0986J7729J0210O018
13128H2982k081l275n858j0450l453m102l1358q9787j03158j3369Q2932J12793
13116A1816R1850M9401K0308L715k7258m4316k1321m805L056J3335l769j9922
13104G2090m226j185o187r562M907j912j731k278j4054j9136l0208m4392n1351
13091a09225m5038j5476J6115L3727J5189o3611j05091o1714L285J9784L346P072
$$ y = [219362, 229722, 268258, 303849, 311138, 294346, 260118, 197001, 115010, 19460, -64104, -123257, -162770, -160972, -96611, 5180, 54962, 22885, -42729, -108779, -147090, -100345, -2487, 52824, 44378, 8073, -3914, 3228, 26296, 80237, 137623, 192460, 243260, 247539, 184499, 88118, -12607, -111664, -204887, -263799, -254276, -181135, -87675, -1961, 49025, 66754, 76964, 82982, 80901, 77626, 71768, 61318, 57865, 53763, 22405, -67382, -170540, -183909, -100977, 11816, 103666, 153067, 173375, 177090, 149832, 105516, 84195, 79390, 82446, 95781, 92012, 72090, 67864, 66679, 60492, 50930, 55837, 53925, 52194, 49916, 35862, 16726, -13482, -57874, -109225, -154263, -169739, -153624, -119897, -104708, -168319, -273410, -335124, -331839, -312055, -308709, -301637]
13079c01637J7463J8709J1609r339k6970k8943J717M1360P7376Q6172O0874N0052
13067a557L8682K4377O976J960N642J256q647j9825l2905n5035m5917k0794J287
13054a04500M744j7409l6050m3549n2903k6226L9883O8828M2733J9636K3992L9777
13042d1044M720n0552p9070p8393j8130L8173M2757Q75m1054l7966n184K6695
13030b38173J5270K876M0505P4153O9933N0729M1281K5353l6605p6313n2655k7736
13018a11382j7254M805M3007O8792O3807L5244l84k7946j9331k0228l2188l5152
13006d8210l8737l206K7278R683J4022M5538L8335J2855k9207m0459p112K0930
12994A710J5210j5442j0562J7108J3687P585L803O828K7628L8773K3994L33k0292
$$ y = [-301637, -284174, -265465, -253856, -263195, -290165, -319108, -317391, -276031, -198655, -112483, -51609, -1557, 37125, 61502, 68478, 70438, 76080, 77336, 68689, 48864, 15959, -39076, -84993, -105787, -104500, -99756, -117165, -153215, -196764, -249667, -275893, -236010, -167182, -124449, -104813, -80821, -41044, -36324, -86876, -165946, -244339, -262469, -224296, -181539, -180664, -221718, -259684, -264868, -238173, -222903, -220027, -179522, -105369, -35436, 15293, 56574, 81927, 45322, -30991, -83646, -111382, -128636, -123831, -80824, -12032, 51775, 87019, 86635, 58689, 39358, 19130, -13058, -48210, -86947, -90153, -62875, -53192, -39170, 6368, 44703, 57558, 28351, -12108, -19220, 1710, 16920, 1478, -9084, 8024, 21711, 29296, 33099, 39927, 67555, 106328, 130322, 130655, 110363]
12981A10363k5481k5991n6109q1785o2929j7990J7679M9228O7755M6351J6437
12970C7528J0720n261m7969o1866l3240k350K4855L4879J5788L428K4297M2777
12958D3586L3760J2024K9970L1520j8865n8302l2372K287L844l780j2664j7858
12946A3150l570J1999l3226r7827j13223n9190K1501M6793L2467K648k9662k4060
12934b32200k8433l4451l0012j3222K2042N1164N9026O1986O7721O3315Q1097
12923F8033Q8095N8392L9969O0826P9323O4104L2237J773P729L9839N1340N5314
12911F46974L9207K4522J8909L1K05K6254K5173k142R062N3917L9861j5421n2926
12898H13626o1266l4076k4535o0067r7281p9805l5003N03K9034M0728J4176m1642
$$ y = [110363, 84882, 58891, 2782, -79003, -141932, -159922, -142243, -93015, -25260, 21091, 37528, 48248, 42987, -4982, -66848, -100088, -102438, -77583, -42704, -26916, -23488, 809, 43586, 77346, 89370, 119340, 150860, 131995, 73693, 41321, 43608, 47452, 43672, 31008, 13150, 9580, 21579, -11647, -109474, -222697, -281887, -260386, -213593, -181126, -178478, -208140, -232200, -260633, -295084, -325096, -338318, -316276, -265112, -206086, -144100, -76379, -13064, 68033, 156128, 214520, 254489, 315315, 394638, 458742, 490979, 492752, 500481, 540320, 591660, 646974, 686181, 710703, 729612, 729643, 729848, 756102, 781275, 779133, 788195, 842112, 881973, 866552, 813626, 752360, 718284, 693749, 633682, 536401, 456596, 421593, 422096, 451130, 491858, 506034, 464392]
12886D64392p0854o1967m8936j4441K1394K4372M7860R6338P4631K847n5212j07397
12874C73027j15337o8766p486K0529K2155M892k3271m8727n6758n5242p0577o3754
12862h9315k1192L1187R0622J33269J13312P7332M5230l9844r4954n0863n431
12851A89353j2114j3236K447M085j2643n2817l0154M3340Q7169O4572K3654j2083
12839B81573m7237k8600K540K451j8808m8318m7381n646j6023p0702r0974o2565
12827a49690j6576j2091l8910m1709o277L871J295L8133O5972K7948k4476m9182
12815b01692l2693p137K042K3335M1944N0278O6858L2497K32J9038K4454l244
12803A5912k2010l4686k9485J0896K6413J8141j1481j5154L821j5212l8046l1543
$$ y = [464392, 393538, 331571, 282635, 268194, 289588, 313960, 361820, 458158, 532789, 535636, 480424, 373027, 257690, 188924, 181438, 201967, 224122, 229014, 205743, 157016, 100258, 45016, -25561, -89315, -110507, -79320, 11302, 144571, 257883, 335215, 380445, 340601, 245647, 194784, 189353, 177239, 164003, 166450, 170535, 157892, 105075, 74921, 118261, 205430, 270002, 293656, 281573, 234336, 205736, 208276, 210727, 191919, 143601, 96220, 90574, 74551, 3849, -87125, -149690, -166266, -178357, -217267, -258976, -265253, -261382, -260087, -221954, -155982, -128034, -152510, -201692, -234385, -241522, -239480, -216145, -174201, -123923, -57065, -24568, -24336, -5298, 19156, 15912, -6098, -40784, -70269, -59373, -32960, -14819, -26300, -41454, -37633, -52845, -90891, -122434]
12791a22434q333J4311K4627J1626j218k0546m2665l322N6691O0153L9706M1796
12779E0392M8319K6665q477j2774j7145j8195J1103K3941N586J3321J1127P581
12767A41444j5847n5153n6133k7738o484j6826j4872O545J9350L2565L3150L0752
12755G0753M9193L2202l8318q1387o3704k6099Q744L6292N3379L6447J2039j532
12743H8009k1997m5329l3753j3931L648J4987J4333J9900J0362R817O6779J03617
12731B16442M5337k3050l1037k7398m0000j6943J4465J3424m71k4335o1106p2446
12719g118k9106m123K1337N8361O7401O7411O4486P3126M8405k3842o7738l7885
12707B30715R109K3259J090k0293j6841J475q169m7418p0024n0504k6791j1578
$$ y = [-122434, -130767, -116456, -91829, -80203, -81421, -101967, -144632, -147954, -91263, -31110, 8596, 50392, 98711, 125376, 116899, 104125, 86980, 68785, 79888, 103829, 109415, 122736, 133863, 141444, 125597, 70444, 14311, -13427, -19911, -36737, -51609, -45064, -25714, 6851, 40001, 70753, 119946, 152148, 113830, 32443, -31261, -57360, -48616, -12324, 41055, 77502, 89541, 88009, 66012, 20683, -13070, -27001, -23353, -8366, 5967, 25867, 36229, 46046, 112825, 216442, 261779, 238729, 207692, 180294, 140294, 123351, 137816, 151240, 150769, 126434, 65328, -7118, -36224, -40347, -19010, 39351, 106752, 174163, 238649, 311775, 360180, 336338, 268600, 230715, 239824, 263083, 264173, 243880, 227039, 228514, 220345, 172927, 102903, 52399, 25608, 14030]
12695A4030J7565O5391P9148M5433N550j1649m769l365k1041m0793m5166m7632
12683E2702o2468o2930l2877M950K1349j980l1396j2359N3108R1035Q7915M5864
12671A52913P987j8320k2360k1988m1866l9590l9403n1626o1976o1243l2888J2397
12659b17963M1584L0839M4058J02140J17275O9718J9523k8989p1464r1386q2793
12648f7458m0848M6238R8684O1522K9961J7693m675q051j1232j6019l251K4164
12636A26728L0080J8110J3167J6229K9559K5576m739k6800m7844n5748m3020m6372
12624C4926n0777l1282K2965O1569O5442N6925L2163j3131n8277n1640k9984l7884
12612A015k2367J8775K8060J1895J9142K8982J2779o411l2639m1096l181K2655
$$ y = [14030, 31595, 96986, 176134, 221567, 227117, 215468, 210699, 207334, 186293, 145500, 100334, 52702, -9766, -72696, -105573, -100623, -79274, -81254, -112650, -125009, -71901, 19134, 107049, 152913, 160900, 142580, 120220, 98232, 56366, 16776, -22627, -74253, -136229, -197472, -230360, -217963, -176379, -145540, -101482, 658, 117933, 187651, 207174, 178185, 106721, 15335, -67458, -108306, -62068, 36616, 98138, 128099, 145792, 141117, 133066, 121834, 105815, 102564, 126728, 156808, 174918, 188085, 204314, 233873, 259449, 254710, 227910, 180066, 124318, 81298, 34926, -15851, -47133, -24168, 37401, 102843, 159768, 191931, 178800, 120523, 68883, 38899, 1015, -21352, -2577, 25483, 37378, 56520, 85502, 98281, 91870, 59231, 18135, 14954, 37609]
12600C7609O486j8364l8585l8810n430L5688J0942m0763l6904j2130M089P928
12588h8244j1480L630K6554K1167K6428K0979J6614L8416L9145R500J1502N658
12576A19869l8212p3973m1860J4305K9127M6788Q3290Q5172M2733m2083q5144
12565A40012n3411j4198k0391p7620j01349n0435J9930P5011Q3392M5265K9861
12554G6067L1427J6629l62k1492j7678j80R468K1751M3943M9633L3744K1572q26
12541B63696j4997o381o250j5674k8018m1057k2517J4789M0469K5215l5607m7617
12529A26051n141p574m5365o0341l8470k4509k3790j0476n703n889M439R088J1363
12516g6317J7043O787M453K2919M017o4156n8028J182L3326L7660M3503L3867
$$ y = [37609, 44095, 25731, -12854, -51664, -57094, -21406, -10464, -51227, -88131, -100261, -96172, -88244, -99724, -96094, -69540, -48373, -21945, -966, 15648, 54064, 93209, 102709, 114211, 119869, 81657, 7684, -34176, -19871, 9256, 56044, 139334, 224506, 267239, 225156, 140012, 86601, 72403, 52012, -25608, -126957, -177392, -157462, -82451, 941, 46206, 76067, 107494, 124123, 123761, 102269, 84591, 84411, 93879, 115630, 159573, 209206, 242950, 264522, 263696, 248699, 242318, 236068, 220394, 192376, 151319, 128802, 143591, 184060, 209275, 173668, 126051, 120910, 113336, 67971, 7630, -30840, -55349, -79139, -89615, -95318, -101207, -96768, -87680, -76317, -59274, -52487, -48034, -25115, -21098, -85254, -143282, -142100, -108774, -71114, -27611, 6256]
12504F256K2949K9549O170L961J7818J5455Q739n343p027M848J1757O962J2627
12491A34721L2552K8445K853k6529o5260q1580o6195n4408n227L3153L9256L1158
12479B939J6363O522j9480m0785m6128k7425L587K4235K6516J4822l3049m5952
12467a17835K1071Q3087J00663P3873M5810K0037l6363p9527q8811o0481m0893
12456g9369o0377o6227l3265o305L3442O0698M7130L1586J1435k3115l6393k8437
12444a49197k0001k4816j8137K670l51N497K0697J6200J279K6741N0952K6584
12432f1882k625j9101l4867l6443j0424R217R643J18J3387M6953M0985M009p598
12419d8628j2038l2675j3835K5787L3665O260k7936o2568o3283k3059L1472M7843
$$ y = [6256, 29205, 58754, 64924, 68885, 86703, 102158, 110897, 105554, 98527, 103375, 115132, 122094, 134721, 167273, 195718, 198571, 172042, 106782, 25202, -40993, -95401, -100628, -67475, -28219, 2939, 19302, 25824, 6344, -34441, -80569, -107994, -104407, -80172, -53656, -38834, -71883, -117835, -96764, -13677, 86986, 160859, 206669, 226706, 190343, 110816, 22005, -38476, -79369, -139746, -205973, -239238, -245543, -212101, -151403, -104273, -72687, -61252, -84367, -120760, -149197, -169198, -194014, -212151, -209481, -209832, -204335, -183638, -167438, -166159, -139418, -88466, -61882, -64507, -83608, -118475, -154918, -165342, -156125, -146482, -146364, -132977, -86024, -45039, -41030, -48628, -60666, -93341, -107176, -81389, -47724, -41464, -69400, -131968, -195251, -218310, -186838, -138995]
12407a38995J8333j6040m0360n2544m9667k5693j5270p275K6366M9683N2365O5232
12395a33865P2645N0248K4764J2116P89K215P404j3161j8266J3690K8585K700
12383D9864m0583o0335l7192j2218l479R972N1262O3880M8270J7663L887J2323
12371A03314P468N505J3369j6281m0174k1663j0344k6036m6716n8518o4606m0003
12359a94685j7269l812M952j0627m3669p0214p1405q0994q1093k7286J7019L1341
12347e47742N1047N2041K5211q129k9345k8032K5994P6666P1114L0273j6461m9931
12335c47294k3433J9062j1571l9698j2130K9560N7733N1181L8283L7336K8270
12324a72701M5632M7029L0719J4523k8181o5939o9775l8831J3414N3513M1901
$$ y = [-138995, -120662, -136702, -177062, -229606, -279273, -304966, -320236, -327511, -301145, -251462, -199097, -133865, -61220, -10972, 13792, 25908, 26697, 28912, 36316, 23155, 4889, 18579, 47164, 49864, 9281, -51054, -88246, -100464, -103943, -93971, -42709, 21171, 69441, 87104, 90991, 103314, 110782, 116287, 129656, 113375, 73201, 51538, 41194, 15158, -31558, -90076, -154682, -194685, -211954, -215766, -210814, -221441, -265110, -335324, -406729, -487723, -568816, -596102, -579083, -547742, -496695, -444654, -419443, -427572, -456917, -484949, -458955, -382289, -311175, -280902, -297363, -347294, -370727, -351665, -363236, -402934, -415064, -385504, -327771, -276590, -238307, -200971, -172701, -127069, -80040, -49321, -34798, -62979, -128918, -198693, -237524, -224110, -170597, -128696]
12313a28696r040l6517k4676j28M798r486o219J424l3072o3059m2051j530L0475
12300c17777N2477O8350O4110L9432L905o043J2140M923k423K2300K9371P759
12288b1476k7769q2561j00317n8498j5212K0679K9266j530k390J6236K549k2176
12276b63199j5031K6123L8643L948j9232k5001j5078j492j5582k7049K985L7068
12264b72897K7371k674k5032r513K0747K2326K13l8586m0581L796L7283N1401
12252b26146P3053P1402L6449Q475j091K125M163l54O272J3680L056k8197n3834
12239i0947n1383j3343M9431O6503K7094J3380L8627K8861k465n600J5081J4610
12227H9849l0437n8675l7147k0672q131K532Q490J3828L8592M3145j4936o7074
$$ y = [-128696, -137736, -174253, -198929, -199057, -194259, -203745, -209964, -208540, -241612, -304671, -346722, -348252, -317777, -265300, -196950, -132840, -93408, -89503, -95546, -83406, -78483, -80906, -58606, -29235, -21476, -49245, -131806, -232123, -290621, -305833, -285154, -255888, -257418, -259808, -243572, -241023, -263199, -278230, -252107, -213464, -209516, -228748, -253749, -268827, -270319, -285901, -312950, -309965, -272897, -245526, -248200, -273232, -282745, -261998, -239672, -239459, -278045, -318626, -314830, -277547, -226146, -153093, -81691, -45242, -36767, -37858, -35733, -31570, -31924, -25652, -11972, -8916, -37113, -90947, -142330, -155673, -106242, -39739, -12645, 735, 39362, 68223, 65758, 60158, 75239, 89849, 59412, 737, -36410, -57082, -65213, -62681, -54191, -40363, -1771, 41374, 26438, -40636]
12215d0636r1007q4152m2716L330K8299K8302J2279L0047O0046L1239m4394p8767
12203a88130n2305j3785M949J0889L0555O7323Q2988M4779k3124n6950l1861J505
12191a23167M1554P6141M8437M446O937L5008L9870J2494o869j9401j5230M293
12179A04513J5836L7853M1725J9345j122K8437N6849K0634l8059p0474m0313Q383
12167A83607K2180J8936R823J5467O091j4469j1855j1148r59M3133O2648L1455
12155C54909j583r154k1449k5261n522L4674Q8225Q0853k271m4152R102L8908
12143D97279J4700J838J6963J7905n552k96N3288J00267Q9752L7664M846J88j3633
12130H15209m0386p2522p6007n5228m4292m0819l0403k5213m0012n0418l9598
$$ y = [-40636, -131643, -215795, -258511, -255181, -226882, -198580, -186301, -156254, -96208, -64969, -109363, -188130, -240435, -254220, -249271, -238382, -207827, -140504, -57516, -12737, -35861, -92811, -124672, -123167, -81613, -5472, 42965, 47411, 54348, 89356, 129226, 141720, 134851, 115450, 100220, 104513, 120349, 158202, 199927, 219272, 218150, 246587, 303436, 324070, 286011, 215537, 175224, 183607, 205787, 224723, 234546, 250013, 256104, 241635, 229780, 218632, 217673, 260806, 323454, 354909, 353326, 344172, 322723, 297462, 291940, 326614, 414839, 495692, 493421, 449269, 458371, 497279, 511979, 513817, 530780, 548685, 543133, 542837, 596125, 696392, 786144, 823808, 828654, 828842, 815209, 774823, 702301, 626294, 571066, 526774, 485955, 455552, 430339, 390327, 339909, 300311]
12119C00311l6131k3822Q229M0869O5645N0474J7153J6620M0998Q470p5196r2133
12107C21487m7325k7471k3686K3739N7707J5731m1614o5452l1217K9399Q4009
12096B95307R3974N4494N190k4704m1114n0882k4178K75n361k4480o6087j07043
12084A05391j16996n2053L4895N8549L1460J5449K6516J5565l3723o0987l4762
12073a0696q170K3319N3846O6944P2651P5861M5465K390j7865j4429j2703Q108
12061B84721M7472N5527K1938M744O771j0948m8215r4901j14449q6069j9181K6112
12049G3522L0678J4293P486R098J2647J807K0084N5422K8814l0836m2319k959
12037A77737J8226J5857L536k6959n4993l4894Q542l674k0438j03J9360O510M435
$$ y = [300311, 264180, 240358, 248587, 289456, 355101, 405575, 422728, 439348, 480346, 488816, 413620, 321487, 274162, 246691, 223005, 246744, 304451, 320182, 278568, 213116, 181899, 211298, 295307, 389281, 443775, 448965, 424261, 383147, 332265, 308087, 308362, 303001, 278521, 212434, 105391, -11605, -63658, -28763, 29786, 61246, 76695, 103211, 118776, 85053, 24066, -10696, -18866, 4453, 58299, 125243, 197894, 273755, 319220, 321610, 303745, 289316, 276613, 284721, 332193, 387720, 409658, 414402, 421173, 410225, 362010, 267109, 152660, 66591, 47410, 73522, 104200, 118493, 125979, 135077, 147724, 149531, 169615, 225037, 253851, 223015, 180696, 177737, 195963, 211820, 215356, 188397, 133404, 98510, 107052, 103378, 82940, 82837, 102197, 108707, 113142]
12024A13142K9431J4025l2635p9331n8512Q500K3924P901O809J1550R367j2123
12012D2048k5314k5376J3709N3669L2185J2959r34k4058l3217l4829m7563n5212
12000i1933p4922q2369m5789K376L0887J8609M820K6230O5246O0865L2986J1061
11988d1933K80K0690O1576R4349O1866j1540p7994r3135q0581l3514M5489P4062
11976A9615O9609N0730R508m6976p6624n1495m298L6501M1687L4419R401j8969
11964G3108k1580k1179m2322l3550Q283J7459J9748J4413K6339L5387J5478R11
11952I2495j8122l0134k0296j0600o24J8221K2408n595m1477l8028L582M0596
11940A2426M2072L064O933M2769L8613p69l3760l3274k8813k0583j0705o691J0530
$$ y = [113142, 142573, 156598, 123963, 44632, -13880, -5380, 18544, 26445, 33254, 44804, 54171, 42048, 16734, -8642, 5067, 58736, 90921, 103880, 102946, 78888, 45671, 10842, -36721, -91933, -166855, -249224, -295013, -292637, -261750, -243141, -238321, -212091, -146845, -85980, -52994, -41933, -41653, -20963, 40613, 134962, 196828, 185288, 107294, 14159, -66422, -99936, -54447, 19615, 89224, 139954, 149462, 102486, 25862, -25633, -29931, 6570, 48257, 82676, 92077, 73108, 51528, 30349, -11973, -45523, -37240, -19781, -33, 14380, 40719, 76106, 91584, 92495, 74373, 44239, 23943, 13343, 12719, 30940, 53348, 47753, 6276, -31752, -28170, 12426, 54498, 57562, 64495, 107264, 145877, 145108, 111348, 78074, 49261, 28678, 17973, 11282, 21812]
11927B1812M1303N9277N0298L2279L6418M4808L8993K816k9300p894L6853L5324
11915C62987J1552J128j4602l8869r7757j27878q3999k6398R114M3955N8478K6799
11903A24510j1766m4748n1131o603L5645K7344J6006K9747K2095q058k6114n4420
11891E2507r7178r1593o4072p5827q2719l0433L5149P6835P7031M1756j4641k9411
11879b02596J0478M8688N1787L5438Q183N876L8808P1181Q3949N9856J8358j7943
11867B12063l1147l2266j0185J5748J6145Q503K619j2770m666J6689N570N020
11855A91323J1610j4158m6383o1534k5461k801j8973j1918J1878N434N713K8979
11843G3709M5166M8159L3617J802l4040m6100k4570J061J7178L5426O1901O3072
$$ y = [21812, 63115, 122392, 172690, 204969, 241387, 286195, 325188, 328004, 298704, 290810, 327663, 362987, 374539, 375667, 361065, 322196, 224439, 96561, 12562, -13836, -4722, 39233, 97711, 124510, 112744, 67996, 16865, 10262, 45907, 73251, 89257, 119004, 141099, 133041, 106927, 52507, -44671, -136264, -200336, -276163, -358882, -389315, -354166, -277331, -200300, -158544, -173185, -202596, -192118, -143430, -91643, -56205, -48022, -42146, -3338, 67843, 151792, 211648, 230006, 212063, 180916, 148650, 138465, 154213, 170358, 178861, 181480, 168710, 164044, 180733, 186303, 191323, 202933, 188775, 142392, 80858, 55397, 52596, 33623, 21705, 33583, 39017, 44730, 73709, 118875, 167034, 200651, 202453, 168413, 122313, 97743, 98804, 115982, 151408, 213309, 276381]
11831B76381M2367J7075K187o279l6180n1614l0743k1673j3879J2673L5921J5409
11819B41645j5725p468p570l5110l3345J3067N7375N2528K8875n321j7140o15
11807B71196q462k9810l6726k0928n061j5445m9459o2750l6621K6337P8943N7860
11795A69074K261r791K7434K7538k9477m6529j0001J1477j3164k6496k2049k40
11783H0037K8276j872o0075n8258j4267P111k043L051L9670Q4975P0808K901l1556
11770A48758k6075m9140p9359p0403o3762n2901j1167K8327M3977L2872J5070
11759h3803J0047O577k7016m6527k0236L4253M1077K2179J3565q863k0061l9037
11747a17845n7139k2280K5259M9115N9918N2934R114m3764o6166q0324m7258L2189
$$ y = [276381, 318748, 335823, 338010, 331731, 295551, 243937, 213194, 191521, 177642, 190315, 226236, 241645, 225920, 218452, 210882, 175772, 142427, 155494, 212869, 265397, 294272, 288951, 271811, 271196, 262734, 232924, 196198, 175270, 170209, 154764, 105305, 42555, 5934, 32271, 111214, 169074, 171335, 161544, 188978, 216516, 187039, 140510, 130509, 141986, 128822, 102326, 80277, 80037, 108313, 106441, 46366, -11892, -26159, -19048, -21091, -18040, 21630, 106605, 177413, 180314, 148758, 122683, 73543, -5816, -76219, -139981, -192882, -204049, -175722, -131745, -98873, -83803, -73756, -67179, -94195, -140722, -160958, -126705, -85628, -63449, -49884, -58747, -78808, -117845, -174984, -197264, -172005, -122890, -62972, -10038, -924, -44688, -110854, -191178, -238436, -206247]
11735b06247R9396J17556R3086P4828L3388l2396n8529l1666l299L9643O1637
11724A87397K0632j4772k7733k8681m0576n8663m4700n884R934J1656J9434J6516
11712D4560K1808K0551P07n598r284l0029l0084j63J1892j0934n680J8099L2238
11699E8083j424o1721n4182Q716M3075L0622J1043M987K0223L1174K5365K1744
11687A37705M3599N5162L4080J6074l268j5959j7192k4233l0303n3155q3416p9416
11675b0322l7791K6652P8640O6116J1950l0449l1445Q147M5099L1433O682J879
11663A56591l8897q4807r8414p5866l4654J5782L3122J9349J8918k121j6690J0959
11651i6728J6943p850l301k245O299K7157M6762O5665N1144J9744P111K0870M4789
$$ y = [-206247, -106851, 10705, 103791, 178619, 212007, 179611, 121082, 89416, 86117, 125760, 187397, 208029, 193257, 165524, 136843, 96267, 37604, -7096, -12980, -3046, 8610, 28044, 44560, 66368, 86919, 87626, 82028, 72744, 42715, 12631, 12468, 24360, 13426, 7746, 25845, 58083, 56659, -5062, -59244, -50528, -7453, 23169, 34212, 39199, 59422, 90596, 115961, 137705, 181304, 236466, 270546, 286620, 283352, 267393, 250201, 225968, 195665, 142510, 59094, -20322, -58113, -31461, 47179, 113295, 125245, 94796, 63351, 71498, 116597, 148030, 154712, 156591, 117694, 32887, -65527, -141393, -176047, -160265, -127143, -107794, -88876, -90997, -107687, -96728, -79785, -87635, -90936, -93181, -86882, -59725, -12963, 52702, 103846, 123590, 130701, 151571, 196360]
11638A96360K8038k2012l7497k6056j3555j0234N024K3911L438m786Q402j2772
11626A38261j0181M2472O6970M5715J9457Q032J0143L3956M7872K0799k0655m4218
11614C58623m8473k5695j8201k4270j3637k22j5198k7254k9333m6334o3125n6098
11602i217m6150l7483J037N0898Q9369Q6350L0510k4851m1397j5567L1749L4608
11590A49856j2581m5596n8393n1618j3746K8593L1549L7036M0244J2870j4875
11579A03339m1029o2727n3442k0719j406j071J308R461L960p701p513L0355P0936
11566B3751M8742j6510m1431k4304k5103l4382l6649m1006j6395K0097L7952K8316
11554g6922j1318j4887J3621K2765J4948L35P102K7556L7474L1574o807m7933
$$ y = [196360, 224398, 202386, 164889, 138833, 125278, 115044, 120068, 143979, 147417, 142631, 151033, 138261, 128080, 170552, 237522, 283237, 302694, 310726, 320869, 354825, 402697, 423496, 402841, 358623, 310150, 284455, 266254, 241984, 228347, 228125, 212927, 185673, 156340, 110006, 46881, -9217, -55367, -92850, -91813, -40915, 48454, 134804, 165314, 140463, 99066, 83499, 115248, 149856, 137275, 91679, 33286, -18332, -32078, -3485, 28064, 65100, 105344, 118214, 103339, 62310, -417, -53859, -74578, -75984, -77055, -75747, -66286, -62326, -70027, -77540, -47185, 23751, 72493, 55983, 14552, -9752, -34855, -69237, -105886, -146892, -163287, -143190, -105238, -76922, -88240, -103127, -89506, -66741, -51793, -51458, -44356, -16800, 20674, 52248, 45441, -2492]
11542b492m0019l6693m0411j0720R001L0744O8871Q3391M8754J6905j016k9226
11530I7089m6267l1912j6259j3549o749J589j1660k3386o521J2135J6784P961
11518b0745l660j2421k0296k5487k1781k505K1038J2722k1485j3429J2947M5231
11506d9871O2259M7830L6002K2162n103l8239k7549J4736J2921j7168l3907n1957
11494b7884n8912j9982K2712J938m079K5458K2917l712j9889k1363m0946k2264
11482a46006M3874Q3393O1460L8387M3835J8101j6213m3278m1830j2680K4571
11471E3614N1030M2662M2164N6503M4661l423n9179o1919l6904k2207j5826j1223
11459G9953j3097j8291j8646k4415l3277m2944n7345p0119n5466j75N1342M8505
$$ y = [-2492, -42511, -79204, -119615, -130335, -121334, -90590, -21719, 61672, 110426, 127331, 126315, 97089, 50822, 18910, 2651, -10898, -17647, -16058, -27718, -51104, -57625, -45490, -28706, -20745, -24405, -36826, -57122, -82609, -104390, -106895, -85857, -73135, -94620, -108049, -95102, -49871, 12388, 60218, 96220, 118382, 113279, 75040, 47491, 62227, 75148, 57980, 24073, -27884, -86796, -106778, -84066, -82128, -86207, -60749, -37832, -41544, -61433, -82796, -123742, -146006, -102132, -18739, 42721, 81108, 124943, 143044, 126831, 83553, 41723, 29043, 53614, 104644, 147306, 189470, 245973, 290634, 287211, 228032, 166113, 129209, 107002, 91176, 79953, 66856, 48565, 29919, 5504, -27773, -70717, -128062, -198181, -253647, -253822, -202480, -153975]
11447a53975L6372M4687M0187K1201R400K5339L5688m079n2774m5944l464K9262
11435a8100N5488L9983n651k1109k8540m9023p5216l8432K7582L6106K0186J8630
11423c8096N02j6563j093N908q287j9043m1216n1289j7001J3731M5460N5752K8506
11410d2729K2983J3678j6976l2975k7244k0052k2963j4646K71J6781O146j6867
11398a34593k31J7468j932q714J3027K7276L5948L3087Q57k6310k2072K8665N9052
11385B1528L9496J7613o896l2348m7047n2472k4101M2191P9029P6116L4764j7998
11373A29875m2429n3250m5187o734M213j4892k518L8486L6926L7099M3251K5660
11361A50500m236l8134m4475k6097j152M0040M0403J4092L3605O3847M1161j3398
$$ y = [-153975, -117603, -72916, -32729, -11528, -2128, 23211, 58899, 54820, 2046, -43898, -47362, -18100, 37388, 77371, 71720, 50611, 22071, -26952, -102168, -140600, -113018, -76912, -56726, -38096, -37594, -54157, -55250, -49342, -57629, -76672, -117888, -169177, -186178, -172447, -126987, -71235, -42729, -19746, -6068, -23044, -56019, -83263, -103315, -126278, -140924, -140653, -123872, -117726, -134593, -134824, -117356, -119288, -128002, -114975, -87699, -51751, -18664, -17807, -44117, -66189, -37524, 21528, 61024, 78637, 71741, 39393, -7654, -60126, -84227, -42036, 36993, 113109, 147873, 129875, 87446, 34196, -10991, -17725, -13512, -28404, -30922, 7564, 44490, 81589, 124840, 150500, 146264, 108130, 63655, 37558, 36406, 76446, 116849, 130941, 164546, 228393, 269554, 256156]
11349B56156l4367o20L6868L7910p578l3607o597R603R341j9848o5901r6761q8806
11336d207m6396K2354M2086k830j9159K0056N4093K0733l373L0116O7182O0836
11324B41491J8617j9275k6284m247n700m2426n4871l6151j4830m511l8690m7780
11312c4657r975Q768J7037L0577K0250p193j3289j4507k1707K94K4444K3882L1924
11299E5848L3261R32k0394q630J9942K5414J455j2012q016k381R604Q381k4528
11286G8876n9797n5478j6320l287j0225l870K1203L3589M0114M1935K6680k1231
11274G2189n2566l8266m7523n4556r27N5291O8455O4810N4955L4910K3706K4019
11262B04497J0200j3158l0810n1927o5858l5070K5536J3976n1708n3553j9850
$$ y = [256156, 221789, 221169, 258037, 295947, 288369, 254762, 248165, 257768, 267109, 247261, 181360, 84599, -4207, -50603, -28249, 13837, 11007, -8152, 11904, 65997, 86730, 83357, 113473, 180655, 241491, 260108, 240833, 214549, 210302, 204602, 162176, 107305, 71154, 56324, 51813, 13123, -34657, -44632, -35864, -18827, 11750, 32000, 24807, 11518, -2989, -24696, -24402, 42, 23924, 55848, 89109, 90041, 69647, 61017, 80959, 106373, 107828, 95816, 87800, 85419, 95023, 103404, 78876, 19079, -36399, -52719, -56006, -66231, -70101, -48898, -15309, 24805, 66740, 93420, 72189, 19623, -18643, -66166, -120722, -121649, -66358, 2097, 66907, 121862, 156772, 180478, 204497, 214697, 201539, 170729, 118802, 52944, 17874, 43410, 57386, 5678, -47875, -67725]
11251f7725j2327j8700n831K482j4347k9026m311M4289O1158L4764m745m3536
11239e7855l9610L1542J01816J00062K8090j8856j4928K0059J7109q408j1835
11228A47186j7468j2641k143P865J19l0441m0211J6882M3352N333j4746j3512
11216H9575k4734l7873m1511k9198j1743k6341n7798m4526k4720N745O1175P7689
11204f4260Q1809P9708L2745l7281o7219m1655m71J6794N04K177R605J4090K7327
11191E3873K1517j7693n9234p6833q5646p8483n2020j5693J9770L2557L0146K2641
11179b05098n161k3484j2725L2430O8831Q7788R3334O2756J9308l0687o1046l5431
11167i185J6781M6848L9987K1351J8105m250l9012n6907n0538k6071k3361k4654
$$ y = [-67725, -80052, -98752, -104583, -102101, -116448, -145474, -149785, -105496, -44338, -9574, -14319, -57855, -97465, -65923, 35893, 135955, 164045, 145189, 130261, 150320, 167429, 159021, 147186, 129718, 117077, 114934, 122799, 122918, 92477, 52266, 69148, 112500, 117833, 103087, 89575, 64841, 26968, -14543, -43741, -55484, -81825, -139623, -184149, -208869, -203124, -141949, -64260, 17549, 97257, 130002, 92721, 25502, -16153, -16624, 170, 674, 2851, 12456, 26546, 53873, 75390, 57697, -1537, -78370, -164016, -242499, -294519, -310212, -290442, -257885, -227739, -205098, -210259, -233743, -246468, -214038, -145207, -57419, 35915, 98671, 117979, 87292, 26246, -9185, 7596, 54444, 94431, 115782, 133887, 129637, 90625, 33718, -16820, -42891, -66252, -90906]
11155i0906j7196l0128j8109J0447p978k5127k707J7718K6044N3921O4691J9235
11143i5k2608o2281p0025k8719J9723N4958O2873N0787L6439K4528O661j7835
11131E4406k6111l2899l7749k6719L083J2865k825q019j2426p716n92j5337k9136
11118a29175j5085L440J3528L5647O3167N5369K7328K1550M1317M8360K4835K316
11106A92597k0526m0847j9676L5863O6104L2657m2222o3659m4062n0652n7199
11095a1622j3568L9953N2281M0554M1229J6182n1594q7703q8791p3763o1400m1151
11083b39393o564K0082J9172R232J3963L4961N7887N2096K6842J3658J6650J8497
11071C7083o50j7340K177K1286L0711L4735J5233k0462l0410j9856j6623k1464
$$ y = [-90906, -108102, -138230, -156339, -145892, -153870, -178997, -181704, -163986, -137942, -84021, -19330, -95, -22703, -84984, -155009, -183728, -164005, -109047, -46174, 4613, 41052, 65580, 72241, 54406, 28295, -4604, -42353, -69072, -65989, -53124, -55949, -63968, -76394, -84110, -84702, -100039, -129175, -144260, -140820, -127292, -91645, -28478, 26891, 54219, 75769, 117086, 165446, 190281, 192597, 172071, 131224, 111548, 147411, 213515, 246172, 203950, 140291, 96229, 45577, -11622, -25190, 14763, 67044, 107598, 148827, 165009, 113415, 25712, -63079, -136842, -198242, -239393, -245957, -225875, -206703, -197471, -183508, -148547, -90660, -38564, -11722, 1936, 18586, 37083, 36433, 19093, 21270, 42556, 73267, 108002, 123235, 102773, 72363, 52507, 35884, 14420]
11059A4420k3946j2778M4704O1171J2517k2487n9791p4837l1538K3816K1929M662
11047d2158J7455K4228L4282L2642L2867N2146K5398j0321k2572k3302j0218j8723
11035I1724n0139p2693m8528l849M1137J00035J10040M1854l2958n6086n2164
11024F8373l7220k0674l0715k2138O07J781j0579k2327j0944J1871Q955j6405
11012g9415l3378k6979k3597k7299R799M1413L9469K9742K4879J9510r73l7050
11000f3879o5657o3309l9207j4780p287l820O280O567j011j7037k0970l438J7872
10987b69676P731P03M051J5068K7251R499j3058J0983N4346O5833K5066k8977
10975i1180p4081n4758n513k719l1055m8169l5776M622J0723k7301k9018L1104
$$ y = [14420, -9526, -22304, 22400, 83571, 96088, 73601, 13810, -61027, -92565, -68749, -46820, -42158, -24703, -475, 33807, 66449, 99316, 151462, 176860, 166539, 143967, 120665, 110447, 91724, 41585, -31108, -79636, -83485, -42348, 57687, 167727, 209581, 176623, 120537, 68373, 31153, 10479, -20236, -42374, -41767, -39986, -50565, -72892, -83836, -71965, -63010, -79415, -112793, -139772, -163369, -190668, -180869, -139456, -99987, -70245, -45366, -25856, -26829, -63879, -129536, -192845, -232052, -246832, -254119, -257939, -251659, -245092, -246103, -263140, -284110, -287548, -269676, -261945, -261242, -257191, -242123, -214872, -205373, -218431, -207448, -153102, -87269, -62203, -91180, -165261, -220019, -225532, -228251, -259306, -307475, -343251, -338629, -327906, -355207, -384225, -353121]
10963c53121Q3725R4849O9341M4940M9058L0198L690k3254n4073q0029o7470m864
10951b07010L6064K2922m319l2445l5710m680J6743N135J2146L7416J8837l0244
10939a65145j1270M2966P0463Q1735M3905O636m0766j12044j38088q3882j7156
10928c22646L0529M1968K678p252L1188M2478Q953l2497m1509k0704o718J2641
10916b60891L3298J9552K5674M7350J7109m4061n7804l0763k0054l3778l2382
10905c36750Q457M1809J9585m3936o9667m5621l1061m2070j5638J2683m315k5077
10893e31601j1080R476j6774l2335j324J5937k5453o6505n5490k7867j354J6406
10881g27964L3192O7265R4163Q9421N8056O3118J10947J46757J40495J24585R5862
$$ y = [-353121, -269396, -174547, -105206, -60266, -11208, 18990, 22680, -574, -54647, -134676, -202146, -207010, -170946, -148024, -152343, -184788, -220498, -225178, -208435, -203300, -191154, -153738, -134901, -165145, -176415, -133449, -62986, 18749, 62654, 69290, 28524, -83520, -221608, -305490, -322646, -292117, -250149, -247471, -254723, -223535, -181057, -172104, -204601, -246110, -266814, -273532, -260891, -227593, -208041, -182367, -135017, -117908, -161969, -219773, -250536, -270590, -304368, -336750, -328293, -286484, -266899, -310835, -380502, -426123, -457184, -499254, -514892, -502209, -506524, -531601, -542681, -533205, -549979, -582314, -583638, -567701, -593154, -659659, -715149, -743016, -744370, -727964, -694772, -627507, -533344, -443923, -385867, -322749, -211802, -65045, 75450, 200035, 295897]
10870B95897J6941m7821l2058L285n378k5399l5457j7290J843p875k5328j7799
10858A03561j954J3776K6076Q513k7197k1594J0664M656l7900l7874N709K2854
10846F9290J7371K4778K6566R600o058l490k6245p0671p6029l7050J6458N5172
10834c08P2736R6379R2701N2663J1764j8479j2433L313j5410j8024k2204k6027
10822B16671k3427k7308k1834k5373k4566k4072j8643p640j0508j5930j6179k5425
10810b4234k4355r609j1209j4474Q535M2799P9344P6272L2114p446m1386m7815
10798E8536J284N2828O6869P0779M0353M000j3516k3295k0217j7460k383J9214
10786B36992K1347K1061R160m2655o2892r201K6418k574k5147l387L4300M5062
$$ y = [295897, 312838, 265017, 232959, 236244, 230866, 205467, 170010, 152720, 154563, 146688, 121360, 103561, 101607, 115383, 141459, 149972, 122775, 101181, 111845, 116501, 78601, 40727, 46436, 69290, 86661, 111439, 138005, 147605, 141547, 138057, 111812, 41141, -34888, -71938, -55480, -308, 72428, 168807, 261508, 314171, 325935, 307456, 295023, 298336, 282926, 264902, 242698, 216671, 193244, 165936, 144102, 118729, 94163, 70091, 51448, 43808, 33300, 17370, 1191, -24234, -48589, -58198, -69407, -83881, -75346, -32547, 46797, 123069, 155183, 147737, 106351, 58536, 59820, 112648, 179517, 250296, 290649, 294649, 281133, 257838, 237621, 220161, 217778, 236992, 258339, 279400, 288560, 245905, 183013, 173812, 200230, 197656, 172509, 169122, 203422, 248484]
10774B48484L5105J7842Q554J3237j5075j19079j70889r6676k041Q6914J33299
10763A39675Q5474j109m6819k6477M00r568l6990l3207p320J1953K739k5433m6945
10750F373o6692m4865r192J8228L7305N7536O1812J8254k438K1823K2627j590
10738A19181r613J7261J8999j520k464n454j4838j0282O915o759l3238m9008l3957
10725d777Q168K4698K624n4497o9574j7660M5726O6801O1619J6443l0995p332
10713D1244M7278N2263K3023k4033n2570j6839J8680L0613M3965P8802J12100
10702C54526P8861j0420o6310o4919m3412l8097n1522n2707m7392m7811l3425
10691b2628k5562r216j2329k4553J0656O0637P9218P3788N6456N4610M0448l4105
$$ y = [248484, 283589, 301431, 309985, 323222, 308147, 189068, 18179, -78497, -80538, 6376, 139675, 225149, 224040, 177221, 150744, 151144, 141576, 104586, 71379, 64059, 76012, 78751, 53318, 6373, -60319, -105184, -114376, -96148, -58843, -1307, 60505, 78759, 76321, 98144, 120771, 119181, 109568, 126829, 145828, 144308, 141844, 136390, 121552, 111270, 118185, 111426, 78188, 29180, -4777, 3391, 28089, 30713, -23784, -93358, -111018, -65292, 1509, 63128, 79571, 48576, 41244, 88522, 140785, 163808, 139775, 87205, 70366, 89046, 119659, 163624, 242426, 354526, 433387, 422967, 356657, 291738, 248326, 210229, 158707, 106000, 58608, 10797, -22628, -48190, -57406, -69735, -94288, -83632, -22995, 56223, 130011, 186467, 241077, 281525, 247420]
10679B47420q3267p9208l8645J3549K8412K4652L2432j5989j05349j32048r5100
10668b03141m2957J654P576J4246P2659J25510R7768K0275j8167L132L416k0058
10656F1913l2731m5642j9984N415j4978l9826k1387L0382L7686J4246j947j7039
10644d3892n166L8555M5098j792l3622k8746j3961j4813q316O510K2447O1069
10632B3371R0059R4435P2226J4942l0197m2269j7082k9615n9905m0544k0149l1312
10620B3960k6397Q742K0700L2582M8474L3439o321l1288k9327l1111l7720l5172
10608b9439m4787n1962j0506L6836N8145N3389N5064N8606K3879m3480o7436l7556
10596G53k9994m3334m8871l7815j5980P98J8982L1052J7765J1096K6064L1179
$$ y = [247420, 164153, 84945, 46300, 59849, 88261, 112913, 145345, 129356, 24007, -108041, -203141, -246098, -244444, -236868, -222622, -149963, -24453, 73315, 93590, 75423, 78555, 81971, 61913, 29182, -16460, -36444, -31029, -46007, -85833, -107220, -76838, -39152, -24906, -26853, -43892, -49058, -10503, 34595, 32803, -819, -29565, -43526, -58339, -66655, -60145, -37698, 23371, 113430, 207865, 280091, 295033, 264836, 222567, 205485, 175870, 115965, 75421, 55272, 23960, -2437, 6305, 27005, 59587, 108061, 141500, 135179, 103891, 74564, 43453, 5733, -29439, -74226, -126188, -136694, -99858, -41713, 11676, 66740, 125346, 149225, 105745, 38309, 753, -29241, -72575, -121446, -159261, -175241, -174443, -155461, -124409, -106644, -95548, -69484, -38305]
10584c8305L078l6355l4468o479k147j834Q048L314j9625L523P4386J05021R2109
10571A50266M1971K6l806k5903n1498n3637j5424J4942P374j8313l4355M379J6439
10558C2461j7615k2070o826j3615l6387l9623j7310N237L0757M5161K0701j6329
10546c5458m968L6019M3430j1799o8525o3053k2930J2379K0346j0538m1378l9933
10534a86408j4657J8443M9435N9930L5942M085m142j6313l0072Q038O5248Q9578
10522G9107Q3190M1009k1224p6855r3848j00651r3577m8846j0010P443L4708K5660
10510a73894l697l992K0043J3424k4454m8349m3071l937L9827N3710M5744M8243
10498h0403N8752M9765L1155L1361L5558M2577K4175k573k2484l1155j9564k1466
$$ y = [-38305, -35227, -71582, -106050, -112529, -114676, -116510, -108462, -105148, -124773, -121250, -46864, 58157, 150266, 192237, 192263, 188457, 162554, 111056, 57419, 41995, 56937, 64311, 45998, 11643, 16022, 32461, 14846, -7224, -14050, -27665, -64052, -103675, -120985, -115748, -84991, -39830, -19129, -35458, -40426, -4407, 39023, 27224, -41301, -104354, -127284, -114905, -94559, -105097, -146475, -186408, -201065, -182622, -133187, -73257, -37315, -33230, -37372, -53685, -83757, -75719, -10471, 79107, 162297, 203306, 182082, 105227, 11379, -89272, -182849, -231695, -241705, -234262, -199554, -173894, -177591, -181583, -161540, -148116, -172570, -220919, -263990, -267927, -228100, -174390, -128646, -80403, -21651, 28114, 59269, 90630, 126188, 168765, 192940, 190367, 167883, 136728, 117164, 95698]
10486I5698k3395k3337l1081l2191j6407K6436P2496N9546J7295j4704k2416O851
10474A14791M9486M5867j9949q6415p9512k0514K9354J5691l0040l2332J565K8882
$$ y = [95698, 72303, 48966, 17885, -14306, -30713, -4277, 68219, 127765, 145060, 130356, 107940, 114791, 164277, 210144, 190195, 103780, 24268, 3754, 33108, 48799, 18759, -13573, -12008, 16874]
$$ [...]
##END NTUPLES=NMR SPECTRUM
##END=
