##TITLE=31P ikalashn
LR-794-O-C1(CHCl3)
20.12.2024
##JCAMPDX= 6.0         $$ Bruker NMR JCAMP-DX V2.0
##DATA TYPE= NMR SPECTRUM
##DATA CLASS= NTUPLES
##ORIGIN= UXNMR, Bruker Analytische Messtechnik GmbH
##OWNER= root
$$ TOPSPIN		Version 1.3
$$ 2024-12-20 14:14:25.656 +0400  Irina@DPX200
$$ Compression mode = diff/dup
##.OBSERVE FREQUENCY= 81.01967998063
##.OBSERVE NUCLEUS= ^31P
##.ACQUISITION MODE= SIMULTANEOUS
##.ACQUISITION SCHEME= undefined
##.AVERAGES= 64
##.DIGITISER RES= 17
##SPECTROMETER/DATA SYSTEM= spect
##.PULSE SEQUENCE= zgpg
##.SOLVENT NAME= D2O
##.SHIFT REFERENCE= INTERNAL, D2O, 1, 298.5841
##AUDIT TRAIL= $$ (NUMBER, WHEN, WHO, WHERE, WHAT)
$$ ##TITLE= Audit trail, TOPSPIN		Version 1.3
$$ ##JCAMPDX= 5.01
$$ ##ORIGIN= Bruker BioSpin GmbH
$$ ##OWNER= Irina
$$ $$ F:/spectra/data/iren/nmr/P31dec/1/pdata/1/auditp.txt
$$ ##AUDIT TRAIL=  $$ (NUMBER, WHEN, WHO, WHERE, VERSION, WHAT)
(   1,<2024-12-20 14:14:09.812 +0400>,<Irina>,<DPX200>,<TOPSPIN 1.3>,
      <created by zg
	started at 2024-12-20 14:12:26.562 +0400,
	POWCHK disabled, PULCHK disabled
       configuration hash MD5:
       BE 6D 3F 07 2A EA 11 49 91 17 2B D3 AF B3 58 0D
       data hash MD5: 32K
       B4 D0 28 E6 F7 1D DE A7 58 71 5E F4 88 C5 B5 84>)
(   2,<2024-12-20 14:14:10.140 +0400>,<Irina>,<DPX200>,<TOPSPIN 1.3>,
      <Start of raw data processing
       efp BC_mod = 2 LB = 10 FT_mod = 6 PKNL = 1 PHC0 = 152.9391 PHC1 = -134.1429 SI = 32K 
       data hash MD5: 32K
       BF 95 3A 3B C3 27 2E 7C FD 19 71 3F 7E B3 31 C6>)
(   3,<2024-12-20 14:14:12.296 +0400>,<Irina>,<DPX200>,<TOPSPIN 1.3>,
      <apk 
       data hash MD5: 32K
       E7 23 1D 41 53 D8 6F 4A 0D 30 95 7C 2E 97 ED 4E>)
(   4,<2024-12-20 14:14:14.609 +0400>,<Irina>,<DPX200>,<TOPSPIN 1.3>,
      <abs n ABSG = 5 
       data hash MD5: 32K
       CF 7D F8 35 3E 47 22 A5 FF 96 F2 79 1A 59 D0 15>)
$$ ##END=
$$ 
$$ $$ hash MD5
$$ $$ 5E 6B 57 32 A3 65 18 08 08 4E 68 BE A7 DD CE 8D
##$RELAX= 
##$RELAX= 
##$RELAX= 
##$RELAX= 
##$RELAX= 
##$RELAX= 
##$RELAX= 
##$RELAX= 
##$RELAX= 
##$RELAX= 
##$RELAX= 
$$ Bruker specific parameters
$$ --------------------------
##$DU= <F:/spectra>
##$EXPNO= 1
##$NAME= <P31dec>
##$PROCNO= 1
##$TYPE= <nmr>
##$USER= <iren>
##$AMP= (0..31)
100 100 100 100 100 100 100 100 100 100 100 100 100 100 100 100 100 100 
100 100 100 100 100 100 100 100 100 100 100 100 100 100 
##$ANAVPT= -1
##$AQSEQ= 0
##$AQ_mod= 1
##$AUNM= <au_zg>
##$AUTOPOS= <>
##$BF1= 81.014009
##$BF2= 200.13
##$BF3= 200.13
##$BF4= 200.13
##$BF5= 200.13
##$BF6= 200.13
##$BF7= 200.13
##$BF8= 200.13
##$BYTORDA= 1
##$CFDGTYP= 0
##$CFRGTYP= 5
##$CHEMSTR= <none>
##$CNST= (0..63)
1 1 145 1 1 1 1 1 1 1 1 1 1 1 1 1 1 1 1 1 1 1 1 1 1 1 1 1 1 1 1 1 1 1 
1 1 1 1 1 1 1 1 1 1 1 1 1 1 1 1 1 1 1 1 1 1 1 1 1 1 1 1 1 1 
##$CPDPRG= <waltz16>
##$CPDPRG1= <>
##$CPDPRG2= <waltz16>
##$CPDPRG3= <>
##$CPDPRG4= <mlev>
##$CPDPRG5= <mlev>
##$CPDPRG6= <mlev>
##$CPDPRG7= <mlev>
##$CPDPRG8= <mlev>
##$CPDPRGB= <>
##$CPDPRGT= <>
##$D= (0..63)
$$ [...]
##$SW_h= 37037.037037037
##$TD= 32768
##$TD0= 1
##$TE= 300
##$TE2= 300
##$TE3= 300
##$TEG= 300
##$TL= (0..7)
0 120 53 12 22 120 120 120 
##$TP= (0..7)
150 150 150 150 150 150 150 150 
##$TP07= 0
##$TPNAME0= <>
##$TPNAME1= <>
##$TPNAME2= <>
##$TPNAME3= <>
##$TPNAME4= <>
##$TPNAME5= <>
##$TPNAME6= <>
##$TPNAME7= <>
##$TPOAL= (0..7)
0.5 0.5 0.5 0.5 0.5 0.5 0.5 0.5 
##$TPOFFS= (0..7)
0 0 0 0 0 0 0 0 
##$TUNHIN= 0
##$TUNHOUT= 0
##$TUNXOUT= 0
##$USERA1= <user>
##$USERA2= <user>
##$USERA3= <user>
##$USERA4= <user>
##$USERA5= <user>
##$V9= 5
##$VALIST= <valist>
##$VCLIST= <CCCCCCCCCCCCCCC>
##$VD= 0
##$VDLIST= <DDDDDDDDDDDDDDD>
##$VPLIST= <PPPPPPPPPPPPPPP>
##$VTLIST= <TTTTTTTTTTTTTTT>
##$WBST= 1024
##$WBSW= 4
##$XGAIN= (0..3)
0 0 0 0 
##$XL= 0
##$YL= 0
##$YMAX_a= 6942
##$YMIN_a= -7003
##$ZGOPTNS= <>
##$ZL1= 120
##$ZL2= 120
##$ZL3= 120
##$ZL4= 120
##$ABSF1= 298.5841
##$ABSF2= -158.5842
##$ABSG= 5
##$ABSL= 5
##$ALPHA= 0
##$AQORDER= 0
##$ASSFAC= 0
##$ASSFACI= 0
##$ASSFACX= 0
##$ASSWID= 0
##$AUNMP= <proc_1d>
##$AXLEFT= 0
##$AXRIGHT= 0
##$AXTYPE= 0
##$AXUNIT= <>
##$AZFE= 0.1
##$AZFW= 0.5
##$BCFW= 0
##$BC_mod= 2
##$BYTORDP= 0
##$COROFFS= 0
##$CY= 12.5935478210449
##$DATMOD= 1
##$DC= 0
##$DFILT= <>
##$DTYPP= 0
##$F1P= 47.1127640792319
##$F2P= -24.0371245302204
##$FCOR= 0.5
##$FTSIZE= 32768
##$FT_mod= 6
##$GAMMA= 0
##$GB= 0
##$INTBC= 1
##$INTSCL= 7.269226e-011
##$ISEN= 30
##$LB= 10
##$LEV0= 0
##$LPBIN= 0
##$MAXI= 12.09355
##$MC2= 0
##$MEAN= 0
##$ME_mod= 0
##$MI= 0.7550151
##$NCOEF= 0
##$NC_proc= -12
##$NLEV= 6
##$NOISF1= 298.5841
##$NOISF2= 270.0111
##$NSP= 0
##$NTH_PI= 0
##$NZP= 0
##$OFFSET= 298.5841
##$PC= 1.4
##$PHC0= 87.38737
##$PHC1= 12.5932
##$PH_mod= 1
##$PKNL= yes
##$PPARMOD= 0
##$PPDIAG= 0
##$PPIPTYP= 0
##$PPMPNUM= 100
##$PPRESOL= 1
##$PSCAL= 0
##$PSIGN= 0
##$REVERSE= no
##$SF= 81.014009
##$SI= 32768
##$SIGF1= 270.0111
##$SIGF2= -158.5842
##$SINO= 77.54984
##$SIOLD= 32768
##$SREGLST= <31P.CDCl3>
##$SSB= 0
##$STSI= 32768
##$STSR= 0
##$SW_p= 37037.037037037
##$SYMM= 0
##$S_DEV= 0
##$TDeff= 32768
##$TDoff= 0
##$TI= <>
##$TILT= no
##$TM1= 0
##$TM2= 0
##$TOPLEV= 0
##$USERP1= <user>
##$USERP2= <user>
##$USERP3= <user>
##$USERP4= <user>
##$USERP5= <user>
##$WDW= 1
##$XDIM= 32768
##$YMAX_p= 473043954
##$YMIN_p= -24602171
$$ End of Bruker specific parameters
$$ ---------------------------------
##NTUPLES= NMR SPECTRUM
##VAR_NAME=  FREQUENCY,     SPECTRUM/REAL,   SPECTRUM/IMAG
##SYMBOL=    X,             R,               I
##VAR_TYPE=  INDEPENDENT,   DEPENDENT,       DEPENDENT
##VAR_FORM=  AFFN,          ASDF,            ASDF
##VAR_DIM=   32768,         32768,           32768
##UNITS=     HZ,            ARBITRARY UNITS, ARBITRARY UNITS
##FACTOR=    1.13031516577767, 1,            1
##FIRST=     37037.037037037, 5361845,       -16650278
##LAST=      0,             -52050,          -4181620
##MIN=       0,             -24602171,       0
##MAX=       37037.037037037, 473043954,     0
$$ Real data points
##PAGE= N=1
##DATA TABLE= (X++(R..R)), XYDATA
$$ [...]
16310b4143843m58328J093045L212196N022825N409554M289453K636318J337529
$$ -24143843 -24602171 -23509126 -20296930 -15274105 -9864551 -5575098 -2938780 -1601251
16302a601251O92805N89131P29869Q34703P62492N32811K78273J19808J05292
$$ -1601251 -908446 -319315 410554 1245257 2007749 2540560 2818833 2938641 3043933
16293C043933J78326J76652m1758m58092r07279j201689j227860r81821n79035
$$ 3043933 3222259 3398911 3357153 2899061 1991782 790093 -437767 -1419588 -1998623
16284a998623k10540J720R8848J96049L55593N51994P26817Q13075P21803M18523
$$ -1998623 -2209163 -2207443 -2108595 -1912546 -1556953 -1004959 -278142 534933 1256736 1675259
16274A675259J317l36073m18379k08887J60761M83234N74076L70872J6833k38100
$$ 1675259 1676576 1340503 922124 713237 873998 1357232 1931308 2302180 2319013 2080913
16264B080913k46678n0970K23980N16530Q10268J033945J090837R35835N73946
$$ 2080913 1834235 1783265 2007245 2523775 3334043 4367988 5458825 6394660 6968606
16255F968606P8904m04747p68079r83977j042949r47501p63913n93143m84725
$$ 6968606 7047510 6642763 5874684 4890707 3847758 2900257 2136344 1543201 1058476
16246A058476m22126l67797k61912p1427J03413J16951k5134k03985l39586m15329
$$ 1058476 636350 268553 6641 -64786 38627 155578 130444 -73541 -413127 -828456
16236h28456m15426k94146o3753J80350L79423N19685N58425M97139M22691L73278
$$ -828456 -1243882 -1538028 -1601781 -1421431 -1042008 -522323 36102 533241 955932 1329210
16226A329210L34945L56906M66010N64826N42867M13171L07292L42010M93227
$$ 1329210 1664155 2021061 2487071 3051897 3594764 4007935 4315227 4657237 5150464
16217E150464O32242O58173N85354M87351L54925J16942k23324n79178q39746
$$ 5150464 5782706 6440879 7026233 7513584 7868509 7985451 7762127 7182949 6343203
16208F343203r64294j021868j066892j058146r52458p96309o57041n02424k25432
$$ 6343203 5378909 4357041 3290149 2232003 1279545 483236 -173805 -676229 -901661
16199i01661K05309O64883R74355J066676R92485Q10167N51258K81821J17173
$$ -901661 -696352 -31469 942886 2009562 3002047 3812214 4363472 4645293 4762466
16190D762466J41466L35175N56983O12788M08983J7687l89929o65934p84141q31297
$$ 4762466 4903932 5239107 5796090 6408878 6817861 6835548 6445619 5779685 4995544 4164247
16180D164247r22124j096229j263780j266756j025052o11953j74484J44976K44794
$$ 4164247 3242123 2145894 882114 -384642 -1409694 -2021647 -2196131 -2051155 -1806361
16171a806361J38205m1975j83449k58149k29315q4152M8110J0264j74182l31056
$$ -1806361 -1668156 -1710131 -1893580 -2151729 -2381044 -2465196 -2417086 -2406822 -2581004 -2912060
16161b912060l35365k01021l1570R7910J75280J85217J27343O4216P6414J77067
$$ -2912060 -3247425 -3448446 -3480016 -3382106 -3206826 -3021609 -2894266 -2830050 -2753636 -2576569
16151b576569K98743L79695M32118N03055N89532O60848P35799Q50817J024405
$$ -2576569 -2277826 -1898131 -1466013 -962958 -373426 287422 1023221 1874038 2898443
16142B898443J220373J305604J137413P20388K08804k22049m47373m40261l20723
$$ 2898443 4118816 5424420 6561833 7282221 7491025 7268976 6821603 6381342 6060619
16133F060619k63206l22662m08249m24864l62378k71571j88239r3048J5024Q8729
$$ 6060619 5797413 5474751 5066502 4641638 4279260 4007689 3819450 3726402 3741426 3830155
16123C830155Q0858l2533k01240l12643l39573l63612m38053n70850p54765r26824
$$ 3830155 3911013 3878480 3677240 3364597 3025024 2661412 2223359 1652509 897744 -29080
16113b9080r96165r17106p12803m38338j43687J14399K95221M59741P04919R54640
$$ -29080 -1025245 -1942351 -2655154 -3093492 -3237179 -3122780 -2827559 -2367818 -1662899 -708259
16103g08259R75414O68800K02170j96505m13531m54312m06394l62168l63903m03582
$$ -708259 267155 935955 1138125 941620 528089 73777 -332617 -694785 -1058688 -1462270
16093a462270m20337l30086j47516j8516n9860k10887l06462k79019j78651n5132
$$ -1462270 -1882607 -2212693 -2360209 -2378725 -2438585 -2649472 -2955934 -3234953 -3413604 -3468736
16083c468736L2525p523j51882k42058k02032j41335j60113j77310m7112K57706
$$ -3468736 -3436211 -3443734 -3595616 -3837674 -4039706 -4181041 -4341154 -4518464 -4565576 -4307870
16073d307870O26756R24445J070501J036365Q24762M85207J76796Q5893K23135
$$ -4307870 -3681114 -2756669 -1686168 -649803 174959 660166 836962 922855 1145990
16064A145990M11266M71292L51799J21486r9474k26924k37051j23717J11855L91635
$$ 1145990 1557256 2028548 2380347 2501833 2402359 2175435 1938384 1814667 1926522 2318157
16054B318157N50760M78207J95131k05038o19411r20917r73368p56460l79848
$$ 2318157 2868917 3347124 3542255 3337217 2717806 1796889 823521 67061 -312787
16045c12787K693K43236K72988J41393l6859j75566k48300k06122J0850L21866
$$ -312787 -310094 -66858 206130 347523 310664 135098 -113202 -319324 -308474 13392
16035A3392N27697N09721L19900R5347m3052k7006J05869K18359K24498J70191
$$ 13392 541089 1050810 1370710 1466057 1423005 1395999 1501868 1720227 1944725 2114916
16025B114916J00505l331j44252k71755k77545j01582J67436L92045M72164L67941
$$ 2114916 2215421 2212090 2067838 1796083 1518538 1416956 1584392 1976437 2448601 2816542
16015B816542J36515j32569l79935n79329p49368r06795j018193j034834r42410
$$ 2816542 2953057 2820488 2440553 1861224 1111856 205061 -813132 -1847966 -2790376
16006b790376p54965n14568k84516p8533J46932M12084O37573O80867M98906K05463
$$ -2790376 -3545341 -4059909 -4344425 -4422958 -4276026 -3863942 -3226369 -2545502 -2046596 -1841133
15996a841133q0517l34903n35678o13541n61909m64749l49945j28301K53527O92963
$$ -1841133 -1921650 -2256553 -2792231 -3405772 -3967681 -4432430 -4782375 -4910676 -4657149 -3964186
15986c964186J030988J130155Q72276K98459l11811o46126o02957l21287j3029
$$ -3964186 -2933198 -1803043 -930767 -632308 -944119 -1590245 -2193202 -2514489 -2527518
15977b527518K27722M49916O88047Q52918Q14961N37757J00648l39910o15006
$$ -2527518 -2299796 -1849880 -1161833 -308915 506046 1043803 1144451 804541 189535
15968A89535o63941n41604l17993n3201J97792L85695M93991N40955N47246N28295
$$ 189535 -474406 -1016010 -1334003 -1387204 -1189412 -803717 -309726 231229 778475 1306770
15958A306770M80552M12698L64425L18329J87291n2763l04016m53304m43380k86395
$$ 1306770 1787322 2200020 2564445 2882774 3070065 3017302 2713286 2259982 1816602 1530207
15948A530207p0375J09477J97916J56688j7548k60516m82279o19614o39330n63103
$$ 1530207 1459832 1569309 1767225 1923913 1906365 1645849 1163570 543956 -95374 -658477
15938f58477m82183m74907m95926m06944j47987J88023M66639O02037N51684L32933
$$ -658477 -1140660 -1615567 -2111493 -2518437 -2666424 -2478401 -2011762 -1409725 -858041 -525108
15928e25108K7018k65019m55642n00357m41910l91133m26957n47182o97348q08030
$$ -525108 -498090 -763109 -1218751 -1719108 -2161018 -2552151 -2979108 -3526290 -4223638 -5031668
15918e031668q23049p18881n32761l39613j75486m0279Q0264K10035L16492L29732
$$ -5031668 -5854717 -6573598 -7106359 -7445972 -7621458 -7661737 -7581473 -7371438 -7054946 -6725214
15908f725214K40476J23960R8805K60149N79929Q91616J070547J120553J054220
$$ -6725214 -6484738 -6360778 -6261973 -6001824 -5421895 -4530279 -3459732 -2339179 -1284959
15899a284959Q59794N67615K29147p6970k24377j68195k0598O8708K3437j71702
$$ -1284959 -425165 142450 371597 294627 70250 -97945 -118543 -49835 -26398 -198100
15889a98100m79950q00824j009197j004665p56123l41875R0721M35980O76408
$$ -198100 -678050 -1478874 -2488071 -3492736 -4248859 -4590734 -4500013 -4064033 -3387625
15880c387625Q09149P67384M85877K1281m62070q06687r56522r89670j021728
$$ -3387625 -2578476 -1811092 -1325215 -1303934 -1766004 -2572691 -3529213 -4518883 -5540611
15871e540611j075779j056727q33777l85716J53357N92943Q15236Q23809P36589
$$ -5540611 -6616390 -7673117 -8506894 -8892610 -8739253 -8146310 -7331074 -6507265 -5770676
15862e770676P06950P84884R00632R60759R25423Q17094O46971L93894R9780j13229
$$ -5770676 -5063726 -4278842 -3378210 -2417451 -1492028 -674934 -27963 365931 465711 352482
15852C52482j62957n9695J17755K52417K78014K39548K17487K24159J89037M7095
$$ 352482 189525 129830 247585 500002 778016 1017564 1235051 1459210 1648247 1695342
15842A695342j59969l20518l54275k60451j12693p284j1956j33856l07779m15095
$$ 1695342 1535373 1214855 860580 600129 487436 480152 468196 334340 26561 -388534
15832c88534l91448k89231j80098o6410N5441J28318J03338r665j64744k89384
$$ -388534 -779982 -1069213 -1249311 -1315721 -1260280 -1131962 -1028624 -1038289 -1203033 -1492417
15822a492417l17643k70883k43940l02392m45742o20987p46290p42883n72441
$$ -1492417 -1810060 -2080943 -2324883 -2627275 -3073017 -3694004 -4440294 -5183177 -5755618
15813e755618k65565N6971K28939J74687l4561k05891j40469J60138M53077N09592
$$ -5755618 -6021183 -5964212 -5735273 -5560586 -5595147 -5801038 -5941507 -5781369 -5328292 -4818700
15803d818700L60457J87727Q5835L8500K9268Q3768K30051M61280P07826Q43476
$$ -4818700 -4458243 -4270516 -4184681 -4146181 -4116913 -4033145 -3803094 -3341814 -2633988 -1790512
15793a790512P94051O09888L98855K51258K34637L61440N16910N52575M41293
$$ -1790512 -996461 -386573 12282 263540 498177 859617 1376527 1929102 2370395
15784B370395K45744L5776j35385k61777l56878l99572l48554j77017R6524L95054
$$ 2370395 2616139 2651915 2516530 2254753 1897875 1498303 1149749 972732 1069256 1464310
15774A464310O36528P70507P44716N30040J88454j49415l81669n18343o29125
$$ 1464310 2100838 2871345 3616061 4146101 4334555 4185140 3803471 3285128 2656003
15765B656003p08426o72839m74295j84511P7713K87851M66898N81089O04887N61881
$$ 2656003 1947577 1274738 800443 615932 693645 981496 1448394 2029483 2634370 3196251
15755C196251M56269K76333K9907k69913n85102q19158q61260o94838m07284r0085
$$ 3196251 3652520 3928853 3958760 3688847 3103745 2284587 1423327 728489 321205 231120
15745B31120J72707K82427K36497J68738K13002L74372N17309M52428R9322m09410
$$ 231120 403827 686254 922751 1091489 1304491 1678863 2196172 2648600 2747922 2338512
15735B338512q26044r74258q15417m15843O3525M39455N98685N24435L10724Q5700
$$ 2338512 1512468 538210 -277207 -693050 -629525 -190070 408615 933050 1243774 1329474
15725A329474j17936l31330n28470o71988p81002q22997o78266l28862P0841L78319
$$ 1329474 1211538 880208 351738 -320250 -1101252 -1924249 -2602515 -2931377 -2860536 -2482217
15715b482217N87239P44522Q45212Q70324Q51251P92433N79601P6992o60168j339840
$$ -2482217 -1894978 -1150456 -305244 565080 1416331 2208764 2788365 2865357 2205189 865349
15705H65349j651321j493791r75721l23329J97694M04590L11916J09171k8730
$$ 865349 -785972 -2279763 -3255484 -3578813 -3381119 -2976529 -2664613 -2555442 -2584172
15696b584172p1600o6158m4531j2540K1957N1236R0799J48393K05399K46225K94943
$$ -2584172 -2655772 -2721930 -2766461 -2779001 -2757044 -2705808 -2615009 -2466616 -2261217 -2014992 -1720049
15685a720049L99562N54940O68856O65516N63219L74086M6570l72518o48441o03869
$$ -1720049 -1320487 -765547 -96691 568825 1132044 1506130 1552700 1180182 531741 -72128
15675g2128l40818q1917N4948P6282N2712N4505R8756J65459K24923K45042J92742
$$ -72128 -412946 -494863 -439915 -363633 -310921 -256416 -157660 7799 232722 477764 670506
15664F70506N8236j02765k44556l87346n38744o52961o71205n64953l50990q8748
$$ 670506 728742 625977 381421 -5925 -544669 -1197630 -1868835 -2433788 -2784778 -2873526
15654b873526J24119J89715J01015m9429j63512k10252k24189k38744k37080j62618
$$ -2873526 -2749407 -2559692 -2458677 -2508106 -2671618 -2881870 -3106059 -3344803 -3581883 -3744501
15644c744501O5338M75571R35596J230576J258959J073598P47232L02971j87936
$$ -3744501 -3679163 -3203592 -2267996 -1037420 221539 1295137 2042369 2345340 2157404
15635B157404n63541p02992o29457m22121j48617Q1709J68845J13213o2468l65704
$$ 2157404 1593863 890871 261414 -160707 -309324 -227615 -58770 54443 -8025 -373729
15625c73729p45161j060783j157711r61487n01185J06169O46317R25833R55767
$$ -373729 -1118890 -2179673 -3337384 -4298871 -4800056 -4693887 -4047570 -3121737 -2165970
15616b165970Q82959P53259N23642K38226K016j49838k41332k72725k19796j17697
$$ -2165970 -1283011 -529752 -6110 232116 234132 84294 -157038 -429763 -649559 -767256
15606g67256m3351K2903J39822K17168R1705k18403m72066m56353k29981n5984
$$ -767256 -810607 -787704 -647882 -430714 -339009 -557412 -1029478 -1485831 -1715812 -1771796
15596a771796j21037l82094o19288o10068k97171J99440O83237J004191J104027
$$ -1771796 -1892833 -2274927 -2894215 -3504283 -3801454 -3602014 -2918777 -1914586 -810559
15587h10559R70541O33122K03019j66119l74322m27537m29659m97028o30241o99819
$$ -810559 159982 793104 996123 830004 455682 28145 -401514 -898542 -1528783 -2228602
15577b228602n72090k56420J00259L57015M71969N32022O68361Q96827J105123
$$ -2228602 -2800692 -3057112 -2956853 -2599838 -2127869 -1595847 -927486 -30659 1074464
15568A074464J177444J104498R73529Q57346P61689O88214O82378P35536O90239
$$ 1074464 2251908 3356406 4329935 5187281 5948970 6637184 7319562 8055098 8745337
15559H745337L97245o2796m88099q05446j045230j170740j097708q24860m75308
$$ 8745337 9142582 9079786 8591687 7786241 6741011 5570271 4472563 3647703 3172395
15550C172395k12523j09138j26314j47955m4818K15591N05333N94755L71329R118
$$ 3172395 2959872 2850734 2724420 2576465 2531647 2747238 3252571 3847326 4218655 4227773
15540D227773j93383j24818O2861J56410P0821j69860m92805p82314r28800q89209
$$ 4227773 4034390 3909572 3972433 4128843 4199664 4029804 3536999 2754685 1825885 936676
15530I36676p00379m81739l77716m12758m77171m95305n09967n89886p35598q81008
$$ 936676 236297 -245442 -623158 -1035916 -1513087 -2008392 -2518359 -3108245 -3843843 -4724851
15520d724851r04657o88581k32512L32636Q20875J080824J096109R96295R06970
$$ -4724851 -5629508 -6318089 -6550601 -6217965 -5397090 -4316266 -3220157 -2223862 -1316892
15511a316892Q32926P48425O67051N67643M02036J61062j56002n45469r39278
$$ -1316892 -483966 264459 931510 1499153 1901189 2062251 1906249 1360780 421502
15502D21502j208643j253705j072247p32569l29797K3863K43728L15188K98659
$$ 421502 -787141 -2040846 -3113093 -3845662 -4175459 -4151596 -3907868 -3592680 -3294021
15493c294021L03354L97053N28004N85179N25334L97372K82295K27102K22326
$$ -3294021 -2990667 -2593614 -2065610 -1480431 -955097 -557725 -275430 -48328 173998
15484A73998K23092J83678Q8075n5454k34640m22585n46327n22043l38722q1335
$$ 173998 397090 580768 668843 613389 378749 -43836 -590163 -1112206 -1450928 -1532263
15474a532263J45893L15643M67095O07741O73247O31017N59895N25457M81434
$$ -1532263 -1386370 -1070727 -603632 4109 677356 1308373 1868268 2393725 2875159
15465B875159L71610K28950J13688L0293l8975r7544j29332j12975p4027n3654
$$ 2875159 3246769 3475719 3589407 3619700 3580725 3483181 3353849 3240874 3166847 3113193
15455C113193m5790l9276n9489j26054k51929m47685o80578q67001r08423p71940
$$ 3113193 3067403 3028127 2968638 2842584 2590655 2142970 1462392 595391 -313032 -1084972
15445a084972n31883k87690m2681K76594O89513J108583J385955J410595J185896
$$ -1084972 -1616855 -1904545 -1947226 -1670632 -981119 127464 1513419 2924014 4109910
15436D109910P90472L02073k03127o12465q07454p61361n76217l91146k80200
$$ 4109910 4900382 5202455 4999328 4386863 3579409 2818048 2241831 1850685 1570485
15427A570485k54633k93570l37600l08541j63898N3328K32755K95659K63420J99585
$$ 1570485 1315852 1022282 684682 376141 212243 265571 498326 793985 1057405 1256990
15417A256990J40199J03642R8428J10771J18774J22030J23639Q2048o0419k90427
$$ 1256990 1397189 1500831 1599259 1710030 1828804 1950834 2074473 2156521 2096102 1805675
15407A805675n09543o10535n64808m46641l56709k75552j00475J35463K55506
$$ 1805675 1296132 685597 120789 -325852 -682561 -958113 -1058588 -923125 -667619
15398f67619J77428K0808l6929N5636J74283J98381J52883J18457J23708J62678
$$ -667619 -490191 -469383 -506312 -450676 -276393 -78012 74871 193328 317036 479714
15388D79714K27057K84411L01764K76250K06784R9865L900p241Q6066K17261K87959
$$ 479714 706771 991182 1292946 1569196 1775980 1875845 1879745 1872504 1958570 2175831 2463790
15377B463790K64017K19529J93653Q6450j86713n38026p77721q07486p02068o31530
$$ 2463790 2727807 2947336 3140989 3227439 3040726 2502700 1724979 917493 215425 -416105
15367d16105p18787r28243j129576j216864j127682q42987l59918K66622Q28686
$$ -416105 -1134892 -2063135 -3192711 -4409575 -5537257 -6380244 -6740162 -6473540 -5644854
15358e644854J086067R75005O17955J99713j57557m09231n14140m41186k58201
$$ -5644854 -4558787 -3583782 -2965827 -2766114 -2923671 -3332902 -3847042 -4288228 -4546429
15349d546429q8705L8129J70746L26146M77635O04640P01139P68182P97920P66991
$$ -4546429 -4635134 -4597005 -4426259 -4100113 -3622478 -3017838 -2316699 -1548517 -750597 16394
15339A6394O80444N67726M45181L13678J60930k3939j78890j95905q8532O084
$$ 16394 696838 1264564 1709745 2023423 2184353 2160414 1981524 1785619 1697087 1703171
15329A703171L7404J06695K89069M91944N53396M09547J16930j88244l48969l35209
$$ 1703171 1740575 1847270 2136339 2628283 3181679 3591226 3708156 3519912 3170943 2835734
15319B835734k77947l02965m37968o51841q77005j019206j020765q79835o07888
$$ 2835734 2557787 2254822 1816854 1165013 288008 -731198 -1751963 -2631798 -3239686
15310c239686k46163Q4104K31411J93509J67011L24215O17124Q62501R42938Q90561
$$ -3239686 -3485849 -3401745 -3170334 -2976825 -2809814 -2485599 -1868475 -1005974 -63036 827525
15300H27525Q22032P85827P13299N19577J89893j99526n05395o27755o11337n94628
$$ 827525 1649557 2435384 3148683 3668260 3858153 3658627 3153232 2525477 1914140 1319512
15290A319512o83542q65285j010331j015509q92982o96666m53298j51871K05152
$$ 1319512 635970 -229315 -1239646 -2255155 -3148137 -3844803 -4298101 -4449972 -4244820
15281d244820N36101O85342N50459J87560k53570o27277q37965q33217o00335
$$ -4244820 -3708719 -3023377 -2472918 -2285358 -2538928 -3166205 -4004170 -4837387 -5437722
15272e437722k32690O2731J67385J74123K19906L62206O05771Q95269J115157
$$ -5437722 -5670412 -5607681 -5440296 -5266173 -5046267 -4684061 -4078290 -3183021 -2067864
15263b067864J191069J161895J071818Q86125O10388L36240J25957k1101j32597
$$ -2067864 -876795 285100 1356918 2243043 2853431 3189671 3315628 3294527 3161930
15254C161930k50228l85580m86688m79942l27842q9131R9175J92758K90637M77972
$$ 3161930 2911702 2526122 2039434 1559492 1231650 1142519 1241694 1434452 1725089 2203061
15244B203061P27213R42045J026700R30679O58816K61464j55338m70411o00906
$$ 2203061 2930274 3872319 4899019 5829698 6488514 6749978 6594640 6124229 5523323
15235E523323m92560j56003K83586O42062P88389P36132O07790N10892M65967
$$ 5523323 5030763 4874760 5158346 5800408 6588797 7324929 7932719 8443611 8909578
15226H909578L97871J99835j43409n25244q25569r98311j049113r69223p48509
$$ 8909578 9307449 9507284 9363875 8838631 8013062 7014751 5965638 4996415 4247906
15217D247906m31904j05819J70828L84488N39667N95944M72628J85623j12486
$$ 4247906 3816002 3710183 3881011 4265499 4805166 5401110 5873738 6059361 5946875
15208E946875k53418j48592J33909L29937J67903l56125r35995j236555j139699
$$ 5946875 5693457 5544865 5678774 6008711 6176614 5820489 4884494 3647939 2508240
15199B508240p14428j12039N04783J001479J317820J490101J561736J491673J203817
$$ 2508240 1793812 1681773 2186556 3188035 4505855 5995956 7557692 9049365 10253182
15190A0253182P16875J63562l12134o19228p18683o53945n46497m77642m34565
$$ 10253182 10970057 11133619 10821485 10202257 9483574 8829629 8283132 7805490 7370925
15181G370925l59405k16786m5750Q4185J22169L4476j71948m22638o31071p74285
$$ 7370925 7011520 6794734 6748984 6833169 6955338 6989814 6817866 6395228 5764157 4989872
15171D989872q81614r73849j020444r79023q45794o14495k90864M8075L20601
$$ 4989872 4108258 3134409 2113965 1134942 289148 -325347 -616211 -568136 -247535
15162b47535N26715O99825Q24473Q48453P51124O09496N64914O55191P35639O48700
$$ -247535 279180 979005 1803478 2651931 3403055 4012551 4577465 5232656 5968295 6616995
15152F616995M07025J34371p4641j81968j49171L4675K88928N35177P52408R09862
$$ 6616995 7024020 7158391 7083750 6901782 6752611 6787286 7076214 7611391 8363799 9273661
15142I273661R95492J028043R64851P23178L14959j24684m34704n02367k79167
$$ 9273661 10269153 11297196 12262047 12985225 13300184 13175500 12740796 12238429 11959262
15133A1959262J78421O89238J041445J131808R89948P00484L70271J25992N3112
$$ 11959262 12137683 12826921 13868366 15000174 15990122 16690606 17060877 17186869 17239981
15124A7239981J33727K72814L92542M90331O13980P98811J041479J315501J569625
$$ 17239981 17373708 17646522 18039064 18529395 19143375 19942186 20983665 22299166 23868791
15115B3868791J761208J889469J975260K030558K047541K012060J946363J922091
$$ 23868791 25629999 27519468 29494728 31525286 33572827 35584887 37531250 39453341
15107C9453341J974195K016847J898071J578431J188183Q98346Q45325J070969
$$ 39453341 41427536 43444383 45342454 46920885 48109068 49007414 49852739 50923708
15099E0923708J458544J874868K336873K933483L671809M470895N295006O229025
$$ 50923708 52382252 54257120 56593993 59527476 63199285 67670180 72965186 79194211
15091G9194211P379181Q746499J0251814J1835369J3501798J5291355J7209860
$$ 79194211 86573392 95319891 105571705 117407074 130908872 146200227 163410087
15084A63410087J9249141K1442617K3750018K5902480K7390232K7598324K5986350
$$ 163410087 182659228 204101845 227851863 253754343 281144575 308742899 334729249
15077C34729249K2290493J6809907J0516272M711966M39847j847366k241791j259182
$$ 334729249 357019742 373829649 384345921 389057887 389497734 387650368 385408577 384149395
15069C84149395L05740J592951J831926M03567k952711p860508j3399752j8506727
$$ 384149395 384455135 386048086 387880012 388283579 385330868 377470360 364070608 345563881
15061C45563881k2354617k4573774k5229640k4678120k3390679k1704232j9743038
$$ 345563881 323209264 298635490 273405850 248727730 225337051 203632819 183889781
15054A83889781j7622254j5557922j3710540j2085600j0655898r444450q477414
$$ 183889781 166267527 150709605 136999065 124913465 114257567 104813117 96335703
15047I6335703p693596o932763o105200n283030m535340l822992l133718k567983
$$ 96335703 88642107 81709344 75604144 70321114 65785774 61962782 58829064 56261081
15039E6261081k223632k086911k088032k177620k300589k376855k325461k092237
$$ 56261081 54037449 51950538 49862506 47684886 45384297 43007442 40681981 38589744
15031C8589744j710860j339592j135466j087419j050677q95471o03031k90562
$$ 38589744 36878884 35539292 34403826 33316407 32265730 31370259 30767228 30476666
15023C0476666j35460k46058o10057j106676j540616j771172j802883j717049
$$ 30476666 30341206 30095148 29485091 28378415 26837799 25066627 23263744 21546695
15015B1546695j607361j568528j640053j766643j875351j929964j820230j324923
$$ 21546695 19939334 18370806 16730753 14964110 13088759 11158795 9338565 8013642
15007H013642m05955N71884J121622J069135O05519M3165l57632m54215k76614
$$ 8013642 7607687 8179571 9301193 10370328 10975847 11019012 10661380 10207165 9930551
14998I930551l3295M0848j08696l53803n42300n85105m74273k82104j22421p0042
$$ 9930551 9897256 9938104 9829408 9475605 8933305 8348200 7873927 7591823 7469402 7399360
14988G399360j08981j62323j26118M1035K36769L47653M01344M95619O10319N88399
$$ 7399360 7290379 7128056 7001938 7042973 7279742 7627395 8028739 8524358 9134677 9723076
14978I723076L60873P2360j04911j49098j01174M3973K55872M03805L28598k5178
$$ 9723076 10083949 10156309 10051398 9902300 9801126 9845099 10100971 10504776 10833374 10808196
14968A0808196n37327r77130j162987j106691r55780q10515o72687n20988l97037
$$ 10808196 10270869 9293739 8130752 7024061 6068281 5257766 4585079 4064091 3667054
14959C667054l66455m20374m85640m93832m32552l31094k00668k3512J76932L27378
$$ 3667054 3300599 2880225 2394585 1900753 1468201 1137107 936439 912927 1089859 1417237
14949A417237L59903K16839j01106m80634p66839q58576p43218n01988k49213
$$ 1417237 1777140 1993979 1892873 1412239 645400 -213176 -956394 -1458382 -1707595
14940a707595j4151K43193M99857O83630P80770Q37636Q91436R07692Q16434O58627
$$ -1707595 -1721746 -1478553 -978696 -295066 485704 1323340 2214776 3122468 3938902 4597529
14930D597529N52881N33268N76282O82215Q26343R27105R02098P38412N08988
$$ 4597529 5150410 5683678 6259960 6942175 7768518 8695623 9597721 10336133 10845121
14921A0845121K94829Q8563j63469m73875q20731j131172j304708j338151j342664
$$ 10845121 11139950 11228513 11065044 10591169 9770438 8639266 7334558 5996407 4653743
14912D653743j396523j478750j524172j456272j237323r05708n44351k33222P621
$$ 4653743 3257220 1778470 254298 -1201974 -2439297 -3345005 -3889356 -4122578 -4114957
14903d114957K11399L63732L71665J82847j16015l46991l71780k04144L3800K73997
$$ -4114957 -3903558 -3539826 -3168161 -2985314 -3101329 -3448320 -3820100 -4024244 -3990444 -3716447
14893c716447N28200P59751Q38336P01778M30885J43525m8932o1858Q9996L18053
$$ -3716447 -3188247 -2428496 -1590160 -888382 -457497 -313972 -362904 -424762 -334766 -16713
14883a6713N34144O75766P50467Q22351R26072J038750J069573Q76213M40301
$$ -16713 517431 1193197 1943664 2766015 3692087 4730837 5800410 6676623 7116924
14874G116924l5678l24773l71379k58522j02950M738L3461k030o3778j10450j22861
$$ 7116924 7081246 6756473 6385094 6126572 6023622 6028360 6061821 6059791 5996013 5885563 5762702
14863E762702j28489j69948k49885l63532m92534n43726m18072j24030J95858
$$ 5762702 5634213 5464265 5214380 4850848 4358314 3814588 3396516 3272486 3468344
14854C468344L49099K64969M0096k13075m68082o93066p89977p63874p84202r11535
$$ 3468344 3817443 4082412 4122508 3909433 3441351 2748285 1958308 1194434 410232 -501303
14844e01303r69738q12130n19083k40194j4945J86613L72420N38708O82606Q04264
$$ -501303 -1471041 -2283171 -2802254 -3042448 -3057393 -2870780 -2498360 -1959652 -1277046 -472782
14834d72782Q85583Q55490O58495L53691O7120j58717l39454m26881m06877l75199
$$ -472782 412801 1268291 1926786 2280477 2347597 2188880 1849426 1422545 1015668 640469
14824F40469l64390k89518j15061Q2417K24908L22272M16258M65453M04970K68149
$$ 640469 276079 -13439 -128500 -46083 178825 501097 917355 1382808 1787778 2055927
14814B055927J21947j9542j58852k61698k71673j46436J22912M67871P53850R02539
$$ 2055927 2177874 2158332 1999480 1737782 1466109 1319673 1442585 1910456 2664306 3566845
14804C566845R06462P54357M67452J40716q2436p3714J68737N11025P99260R16834
$$ 3566845 4473307 5227664 5695116 5835832 5753396 5679682 5848419 6359444 7158704 8075538
14794H075538P80273L96137r2946n03623p44276q31345q07939p34989p16541p81844
$$ 8075538 8855811 9251948 9159002 8655379 7911103 7079758 6271819 5536830 4820289 4038445
14784D038445q24383p31300n22862l42956l23024m56038n99994o20720n26018
$$ 4038445 3214062 2482762 1959900 1616944 1293920 837882 237888 -382832 -908850
14775i08850m18168l40972k73843k37367k73491l51040l72047k42141N1499L89188
$$ -908850 -1327018 -1667990 -1941833 -2179200 -2452691 -2803731 -3175778 -3417919 -3366420 -2977232
14765b977232N70040M65905J38238k22076m62005n24783l98129j01683K69997
$$ -2977232 -2407192 -1941287 -1803049 -2025125 -2487130 -3011913 -3410042 -3511725 -3241728
14756c241728N63956O66587N60144L20150O3467j46343l01135l88759m41179n45355
$$ -3241728 -2677772 -2011185 -1451041 -1130891 -1067424 -1213767 -1514902 -1903661 -2344840 -2890195
14746b890195p18704q78625r25168q24790o12991k93765J14442M81142O90349
$$ -2890195 -3608899 -4487524 -5412692 -6237482 -6850473 -7144238 -7029796 -6548654 -5858305
14737e858305P55827P76573Q53126J005525J143811J116079Q46992M67436K21953
$$ -5858305 -5102478 -4325905 -3472779 -2467254 -1323443 -207364 639628 1107064 1329017
14728A329017J99077K43215J86862P4531P0102K23952M07034M64757M11823L84854
$$ 1329017 1528094 1771309 1958171 2032702 2102804 2326756 2733790 3198547 3610370 3995224
14718C995224L88809K78368K0949k38090l65877l50418k64853k00040j79103j45334
$$ 3995224 4384033 4662401 4683350 4445260 4079383 3728965 3464112 3264072 3084969 2939635
14708B939635p2823l9566j17632k70024m39019o05899p18551o80913m42091r9706
$$ 2939635 2866812 2827246 2709614 2439590 2000571 1394672 676121 -4792 -446883 -546589
14698e46589J29381J12499p0785k80718m85833o79365p93783p90913o97100n25535
$$ -546589 -417208 -304709 -375494 -656212 -1142045 -1821410 -2615193 -3406106 -4103206 -4628741
14688d628741k55017R9348M49214O97284P97507Q03074Q36494R45696J070484
$$ -4628741 -4883758 -4784410 -4335196 -3637912 -2840405 -2037331 -1200837 -255141 815343
14679H15343J140471J111824R40577O25803K23719k12788o15865q98567j037369
$$ 815343 1955814 3067638 4008215 4634018 4857737 4644949 4029084 3130517 2093148
14670B093148j061283r99865r13298q43597p13256l95967R0353N66004Q76078
$$ 2093148 1031865 32000 -881298 -1724895 -2438151 -2834118 -2743765 -2177761 -1301683
14661a301683R87088R44704Q35991P28578N91071L66972Q8347j90708m21805n17739
$$ -1301683 -314595 630109 1466100 2194678 2785749 3152721 3241068 3050360 2628555 2110816
14651B110816m56737l56692l33366l61631l70989l98265n08253o53509p40893
$$ 2110816 1654079 1297387 964021 602390 231401 -166864 -675117 -1328626 -2069519
14642b069519p35130o61812n83493n61520o06453o58860o32876m70364j71929
$$ -2069519 -2804649 -3466461 -4049954 -4611474 -5217927 -5876787 -6509663 -6980027 -7151956
14633g151956K22016O67953J070310J279804J203807R16283N94078L27543Q0947
$$ -7151956 -6929940 -6261987 -5191677 -3911873 -2708066 -1791783 -1197705 -870162 -789215
14624g89215j81713m30130o05831o65161n87109l73432r7724Q3521O3557j12756
$$ -789215 -970928 -1401058 -2006889 -2672050 -3259159 -3632591 -3730315 -3646794 -3583237 -3695993
14614c695993l48133n68551o91515o57504m65086j51872K05481M85868N69370
$$ -3695993 -4044126 -4612677 -5304192 -5961696 -6426782 -6578654 -6373173 -5887305 -5317935
14605e317935M19089J40033n6715l7490J01371J88719J99109J70356J04653N9533
$$ -5317935 -4898846 -4758813 -4815528 -4853018 -4751647 -4562928 -4363819 -4193463 -4088810 -4029277
14595d029277J11812J91059J46995m8012k79005l85787k73282O86K79485M62299
$$ -4029277 -3917465 -3726406 -3579411 -3627423 -3906428 -4292215 -4565497 -4564811 -4285326 -3823027
14585c823027N68689O42775O55646N62628L82449J62988o6049k99558n15822o26249
$$ -3823027 -3254338 -2611563 -1955917 -1393289 -1010840 -847852 -913901 -1213459 -1729281 -2355530
14575b355530n41554l11973q4317R2974K90742N37408P70035R62115J151038J316350
$$ -2355530 -2897084 -3209057 -3293374 -3200400 -2909658 -2372250 -1602215 -640100 510938 1827288
14565A827288J356928J176588P82194L02472j12155m05299o05336o96459o26804
$$ 1827288 3184216 4360804 5142998 5445470 5333315 4928016 4322680 3626221 2999417
14556B999417m34461k23483q6390j16855l51627p02324j021504j177736j131501
$$ 2999417 2564956 2341473 2255083 2138228 1786601 1084277 62773 -1114963 -2246464
14547b246464r93641r02729q47713p24840n20067l33112k52252k95708m06232
$$ -2246464 -3240105 -4142834 -4990547 -5715387 -6235454 -6568566 -6820818 -7116526 -7522758
14538g522758m54836l05474Q8492O25883J106445J377761J402366J200618Q52759
$$ -7522758 -7977594 -8283068 -8194576 -7568693 -6462248 -5084487 -3682121 -2481503 -1628744
14529a628744N38881M42217N57994P05691P53627O97868N27980J94777k75796
$$ -1628744 -1089863 -647646 -89652 616039 1369666 2067534 2595514 2790291 2514495
14520B514495p34280j003156j018527q28189m88892o3211L24784N29806M99222
$$ 2514495 1780215 777059 -241468 -1069657 -1558549 -1621760 -1296976 -767170 -267948
14511b67948L05417R4551K3978J49368L59885N01947N77346P24214R93543J276815
$$ -267948 37469 132020 155998 305366 665251 1167198 1744544 2468758 3462301 4739116
14501D739116J449683J437966J194111P45531K01418l25424p43280r74878r87735
$$ 4739116 6188799 7626765 8820876 9566407 9767825 9442401 8699121 7724243 6736508
14492F736508q37074o61731n59541n10746m64850m20782m05738m07847l33286
$$ 6736508 5899434 5237703 4678162 4167416 3702566 3281784 2876046 2468199 2134913
14483B134913j01406K65609P20417J220968J661189J913303J972001J936219J874806
$$ 2134913 2033507 2299116 3019533 4240501 5901690 7814993 9786994 11723213 13598019
14474A3598019J781783J589580J238433P82463L52201J6384k19050l49344l90011
$$ 13598019 15379802 16969382 18207815 18990278 19342479 19358863 19139813 18790469 18400458
14465A8400458m01010m48015n13932n15298m24525k93190j79023r0696j6445M0731
$$ 18400458 17999448 17551433 17037501 16522203 16097678 15804488 15625465 15534769 15518324 15559055
14455A5559055O7793N7237L7439M9169J00674K05773L95482O52307Q65847Q88397
$$ 15559055 15626848 15684085 15721524 15770693 15871367 16077140 16472622 17124929 17990776 18879173
14445A8879173O89220L68237Q970l50323o46667q23237q66013p63021n38688l05205
$$ 18879173 19568393 19936630 19945600 19595277 18948610 18125373 17259360 16496339 15957651 15652446
14435A5652446j55749q2890n9601j03260k13240l26123l83247l76024l35732l06410
$$ 15652446 15496697 15413807 15354206 15250946 15037706 14711583 14328336 13952312 13616580 13310170
14425A3310170k89750k33801j08661N1864J87909K27601Q6281k32505n44147o38524
$$ 13310170 13020420 12786619 12677958 12729822 12917731 13145332 13231613 12999108 12454961 11816437
14415A1816437n01970k81578j05692J4369J28587K42642L47776M28672L91943
$$ 11816437 11314467 11032889 10927197 10941566 11070153 11312795 11660571 12089243 12481186
14406A2481186J72580j51558m62836o85139p67993p29706o44393n54756m83574
$$ 12481186 12653766 12502208 12039372 11354233 10586240 9856534 9212141 8657385 8173811
14397H173811m74473n55246p09610q79623r71196r25084p72252n70610l42619
$$ 8173811 7699338 7144092 6434482 5554859 4583663 3658579 2886327 2315717 1973098
14388A973098j06088N5677L4690j70477m32408o03554o14045m77091k55621m3802
$$ 1973098 1867010 1922687 1957377 1786900 1354492 750938 136893 -340198 -595819 -639621
14378f39621J14937K66461M27898N32837N28625M19279K06587q4893l29140l70379
$$ -639621 -524684 -258223 169675 702512 1231137 1650416 1857003 1772110 1442970 1072591
14368A072591k23845p6194n1399j41585l23597n40470o60153n62821k46518J29535
$$ 1072591 848746 772552 721153 579568 255971 -284499 -944652 -1507473 -1753991 -1624456
14358a624456L65338L99778L27774K80534L20058M43821O01709O81033N91399
$$ -1624456 -1259118 -859340 -531566 -251032 69026 512847 1114556 1795589 2386988
14349B386988L58902O3801k10909l46520k81670j28679o0543j12544j72354j27192
$$ 2386988 2745890 2809691 2598782 2252262 1970592 1841913 1781370 1668826 1496472 1369280
14339A369280L5516K50643M48519N51760M77181K27421n0283j77451j27279k3090
$$ 1369280 1404796 1655439 2103958 2655718 3132899 3360320 3310037 3132586 3005307 2982217
14329B982217N1278J47179L19618N01280N72573M83275K55149o4154m19424p26832
$$ 2982217 3033495 3180674 3500292 4001572 4574145 5057420 5312569 5248415 4828991 4102159
14319D102159q77944q10653n51625j76999K04991M94226O61879P21158O94992
$$ 4102159 3224215 2413562 1861937 1684938 1889929 2384155 3046034 3767192 4462184
14310D462184N95021M04565J34408j52842l80378m98155m94142l88320k45316
$$ 4462184 5057205 5461770 5596178 5443336 5062958 4564803 4070661 3682341 3437025
14301C437025j41961j05461j10640j36936j94867k78255l46511l60315k95233
$$ 3437025 3295064 3189603 3078963 2942027 2747160 2468905 2122394 1762079 1466846
14292A466846j47500N4339J92371J07200j97861n38426p49751p82029o42633l57432
$$ 1466846 1319346 1373685 1566056 1673256 1475395 936969 187218 -594811 -1237444 -1594876
14282a594876K7720M03812O25609O67369O27617N76809N35433N16970M97453M25818
$$ -1594876 -1567156 -1163344 -537735 129634 757251 1334060 1869493 2386463 2883916 3309734
14272C309734L05694K15015J95518J49424l9763l42765o46055q67039r50313q82097
$$ 3309734 3615428 3830443 4025961 4175385 4135622 3792857 3146802 2279763 1329450 447353
14262D47353p18152n04675k52501j7198R2416K8398j09385j76010j28262l983
$$ 447353 -270799 -775474 -1027975 -1045173 -952757 -924359 -1033744 -1209754 -1338016 -1341999
14252a341999J32074K00079J76111Q8784n3559k31122l87515m77872m97139n00727
$$ -1341999 -1209925 -1009846 -833735 -744951 -798510 -1029632 -1417147 -1895019 -2392158 -2892885
14242b892885n35115n37805m04295j25397J84289L96363M63556M06443K99323
$$ -2892885 -3428000 -3965805 -4370100 -4495497 -4311208 -3914845 -3451289 -3044846 -2745523
14233b745523K28815K58926M44641P54256J014905J033119P38938K39783k25606
$$ -2745523 -2516708 -2257782 -1813141 -1058885 -43980 989139 1728077 1967860 1742254
14224A742254m44452l89209k04082n7004L89N0646J58068K88368L82076M29840
$$ 1742254 1297802 908593 704511 647507 647896 698542 856610 1144978 1527054 1956894
14214A956894M56161M67107M53057L99039K76902L7615l40901p65978j104886
$$ 1956894 2413055 2880162 3333219 3732258 4009160 4046775 3705874 2939896 1835010
14205A835010j350616j542957j606185j448901j100334o43878j59140K49560N06188
$$ 1835010 484394 -1058563 -2664748 -4113649 -5213983 -5857861 -6017001 -5767441 -5261253
14196e261253O15805O35801O48529O94502P41815P81749Q31256Q13631O09768
$$ -5261253 -4645448 -4009647 -3361118 -2666616 -1924801 -1143052 -311796 501835 1111603
14187A111603K35344j97898o02550q86403r36891o97555k26544K87618N91284
$$ 1111603 1346947 1149049 546499 -339904 -1276795 -1974350 -2200894 -1913276 -1321992
14178a321992N53576K53272j30570m28337n40771m75188l07952q9530K16541O56142
$$ -1321992 -768416 -515144 -645714 -1074051 -1614822 -2090010 -2397962 -2487492 -2270951 -1614809
14168a614809J170888J600236J787271J652506J195110N22231j61549o84789r70918
$$ -1614809 -443921 1156315 2943586 4596092 5791202 6313433 6151884 5467095 4496177
14159D496177r76880o92551j88468L58043P31476Q24314P17712N98031N73700
$$ 4496177 3519297 2826746 2638278 2996321 3727797 4552111 5269823 5867854 6441554
14150F441554N81117M79071K28566n4626k34667k65570j66641N535J54190K01918
$$ 6441554 7022671 7501742 7730308 7675682 7441015 7175445 7008804 7014339 7168529 7370447
14140G370447J54952Q1638J0492j19922l24515m89844n15676m09520k77843k86682
$$ 7370447 7525399 7607037 7617529 7497607 7173092 6683248 6167572 5758052 5480209 5193527
14130E193527m88866p56641r59952j066060j047922q53037m88663m3302L69613
$$ 5193527 4704661 3948020 2988068 1922008 874086 21049 -467614 -510916 -141303
14121a41303O40957P08996O17456M62339K90484J04337r9535l02346m41457m74499
$$ -141303 499654 1208650 1826106 2288445 2578929 2683266 2583731 2281385 1839928 1365429
14111A365429m13080k89693j22170R0653L19009N41085P72926R68165R97966P95769
$$ 1365429 952349 662656 540486 631139 950148 1491233 2264159 3232324 4230290 5026059
14101E026059M49368R5049k08432m91828p97768j064060j154692j043711q57582
$$ 5026059 5475427 5570476 5362044 4870216 4072448 3008388 1853696 809985 -47597
14092d7597o98425n49251l75254k13024j06347m1322j0344j4698j5019K8540P9672
$$ -47597 -746022 -1295273 -1670527 -1883551 -1989898 -2031220 -2041564 -2056262 -2071281 -2042741 -1963069
14081a963069M3040q4746j39036L0186L74448P14739Q99332Q62014N96091J78851
$$ -1963069 -1920029 -2004775 -2143811 -2113625 -1739177 -1024438 -125106 736908 1332999 1511850
14071A511850k37347n24299o53341p05423p90218r14982r75368q98162p31683
$$ 1511850 1274503 750204 96863 -608560 -1398778 -2313760 -3289128 -4187290 -4918973
14062d918973n53231l89753k24159r125K48751M52814N40918N95880P18807Q85412
$$ -4918973 -5472204 -5861957 -6086116 -6095241 -5846490 -5393676 -4852758 -4256878 -3538071 -2652659
14052b652659J008421J028293R40840P89946O42380N60112N35421M66104K51213
$$ -2652659 -1644238 -615945 324895 1114841 1757221 2317333 2852754 3318858 3570071
14043C570071r8962m77658p87543r79582j035082r63525p86515n08010j41249
$$ 3570071 3471109 2993451 2205908 1226326 191244 -772281 -1558796 -2066806 -2208055
14034b208055K16559M01576L40308J54933K7791k2534q0778j08193J8243K97555
$$ -2208055 -1991496 -1589920 -1249612 -1094679 -1066888 -1089422 -1170200 -1278393 -1260150 -962595
14024i62595N76058P04786O64956N40877M09047K76863J44237N8298P5814K26187
$$ -962595 -386537 318249 983205 1524082 1933129 2209992 2354229 2412527 2488341 2714528
14014B714528M44685N90728N86649M28194J30741k42828n81450p95095q39826
$$ 2714528 3159213 3749941 4336590 4764784 4895525 4652697 4071247 3276152 2436326
14005B436326p28338n64946m93968n54524o38115o18313m87668l45152k38417
$$ 2436326 1707988 1143042 649074 94550 -543565 -1161878 -1649546 -1994698 -2233115
13996b233115j21659J6472J22764J65849J40129K4742j73404l47205l43824j24770
$$ -2233115 -2354774 -2338302 -2215538 -2049689 -1909560 -1884818 -2058222 -2405427 -2749251 -2874021
13986b874021J55966K50370M2187l13611n21026l91795L3451N53608R51228J092536
$$ -2874021 -2718055 -2467685 -2425498 -2739109 -3260135 -3651930 -3618479 -3064871 -2113643 -1021107
13976a021107R98725Q20385O82364N97434N15621L91692K23102M8392p9383j08023
$$ -1021107 -22382 798003 1480367 2077801 2593422 2985114 3208216 3256608 3177225 3069202
13966C069202J1293K60043N10268O19958N52021L82324K17749J21610J03550J27483
$$ 3069202 3080495 3340538 3850806 4470764 5022785 5405109 5622858 5744468 5848018 5975501
13956E975501J40593J03836n078j44408k27443k33912k06948j86311k09248l23992
$$ 5975501 6116094 6219930 6214852 6070444 5843001 5609089 5402141 5215830 5006582 4682590
13946D682590n14416o43447o18680n16279m74319n60752o93331o65571l41573
$$ 4682590 4168174 3524727 2906047 2389768 1915449 1354697 661366 -4205 -345778
13937c45778K24757Q61028J351861J528543J368854R94204O01177L42746K03904
$$ -345778 -121021 740007 2091868 3620411 4989265 5983469 6584646 6927392 7131296
13928G131296N0611j63733l58612m90714n80213n97049m84821k73637o3063N1919
$$ 7131296 7181907 7018174 6659562 6168848 5588635 4991586 4506765 4233128 4170065 4221984
13918D221984k5034l43085p77374j106994j215970j102908p84232k98776K13591
$$ 4221984 4196950 3853865 3076491 1969497 753527 -349381 -1133613 -1432389 -1218798
13909a218798N45258N76358L39696j0224k36104j84762M2669J96506J20351j34083
$$ -1218798 -673540 -97182 242514 232290 -3814 -188576 -145907 50599 170950 36867
13899C6867l70912m38296l33392j48640K6870J80485L35288M48099M47008L60212
$$ 36867 -334045 -772341 -1105733 -1254373 -1227503 -1047018 -711730 -263631 183377 543589
13889E43589K89472L01713L90363M65237M17690K14623p7139l27113m34634m21562
$$ 543589 833061 1134774 1525137 1990374 2408064 2622687 2545548 2218435 1783801 1362239
13879A362239l77829l42689l16433l10741l11476k65942j77437j49059k48257
$$ 1362239 984410 641721 325288 14547 -296929 -562871 -740308 -889367 -1137624
13870a137624m04347m91809m66509l80125k71757j28786P8587L40374N61471O83976
$$ -1137624 -1541971 -2033780 -2500289 -2880414 -3152171 -3280957 -3202370 -2861996 -2300525 -1616549
13860a616549P71991Q34519P64577N66303M00122L86740M59739M00832P6425l81735
$$ -1616549 -844558 -10039 754538 1320841 1720963 2107703 2567442 2968274 3044699 2662964
13850B662964p04869p51501n68814l07926j16271k3634l309p6092k36734l96150
$$ 2662964 1958095 1206594 637780 329854 213583 189949 186640 110548 -126186 -522336
13840e22336m38032l28708j60234m2498N6J2245L6545Q4018J26722J09355J7631
$$ -522336 -960368 -1289076 -1449310 -1491808 -1491752 -1479507 -1442962 -1358944 -1232222 -1122867 -1105236
13829a105236j04187k03702k41032j68665N0392L46439N63213O36540O22317N37403
$$ -1105236 -1209423 -1413125 -1654157 -1822822 -1772430 -1425991 -862778 -226238 396079 933482
13819I33482L31390K2776k44213k95386n4946M00298R08513J353885J646612J662905
$$ 933482 1264872 1287648 1043435 748049 693103 1093401 2001914 3355799 5002411 6665316
13809F665316J381141R69527O07070L52306K07930J40313P8395j3504j12033k01699
$$ 6665316 8046457 9015984 9623054 9975360 10183290 10323603 10401998 10388494 10276461 10074762
13799A0074762k90787l52508l52466k90729j63104k8340l6224k24675m26598m77466
$$ 10074762 9783975 9431467 9079001 8788272 8625168 8596828 8560604 8335929 7909331 7431865
13789G431865l80619k07955P096K53380M90383O13647M85117O1971n01925r57376
$$ 7431865 7051246 6843291 6850387 7103767 7594150 8207797 8692914 8754885 8252960 7295584
13779G295584j169226j147451r30873n72538j87144R8676K27702K15123J13996
$$ 7295584 6126358 4978907 4048034 3475496 3288352 3387028 3614730 3829853 3943849
13770C943849j8772j71996l66856n83965p44998p79643o96015n52940l90899k48077
$$ 3943849 3925077 3753081 3386225 2802260 2057262 1277619 581604 28664 -362235 -610312
13760f10312j53324l9140K06374N39468P53912P37102N59814L39261J73564J10532
$$ -610312 -763636 -802776 -596402 -56934 696978 1434080 1993894 2333155 2506719 2617251
13750B617251J22053J94925L57666N60199O90025O80413M87909J06834l17269
$$ 2617251 2739304 2934229 3291895 3852094 4542119 5222532 5710441 5817275 5500006
13741E500006n50305m92579k54298j4305J45310K42809K77956J90543m3309k90277
$$ 5500006 4949701 4457122 4202824 4188519 4333829 4576638 4854594 5045137 5001828 4711551
13731D711551l68615l07713k83219l43224l96479l90668l51157k84142j49837
$$ 4711551 4342936 4035223 3752004 3408780 3012301 2621633 2270476 1986334 1836497
13722A836497N9723K81504M54134O01902Q09758J084408J326417J460773J459027
$$ 1836497 1896220 2177724 2631858 3233760 4043518 5127926 6454343 7915116 9374143
13713I374143J320952J091336Q49395O75502N94269N65745N19798M04059K38808
$$ 9374143 10695095 11786431 12635826 13311328 13905597 14471342 14991140 15395199 15634007
13704A5634007Q5249l9172j46996k57259m41219p59290j121231j316002j203006
$$ 15634007 15719256 15680084 15533088 15275829 14834610 14075320 12954089 11638087 10435081
13695A0435081q53623m70502k06468j01980p3554L2789K91008O13312Q34255Q80696
$$ 10435081 9581458 9110956 8904488 8802508 8728954 8761743 9052751 9666063 10500318 11381014
13685A1381014Q36399Q38121R13460R52893Q41624N87493L28027K36283L57465
$$ 11381014 12217413 13055534 13968994 14921887 15763511 16351004 16679031 16915314 17272779
13676A7272779N05880M46399J84399k8790J7524K73816N04060N34316M33245M17924
$$ 17272779 17778659 18225058 18409457 18380667 18398191 18672007 19176067 19710383 20143628 20561552
13666B0561552N98694Q95797J152257J239470J139338J008970J016149J122417
$$ 20561552 21160246 22056043 23208300 24447770 25587108 26596078 27612227 28734644
13658B8734644J202458J251093J314017J351376J290002J142727J013045R92735
$$ 28734644 29937102 31188195 32502212 33853588 35143590 36286317 37299362 38292097
13650C8292097J111908J361295J677046J956225K134765K185124K130901K093730
$$ 38292097 39404005 40765300 42442346 44398571 46533336 48718460 50849361 52943091
13642E2943091K175482K363618K632024K993801L396224L712758L906380M066844
$$ 52943091 55118573 57482191 60114215 63108016 66504240 70216998 74123378 78190222
13634G8190222M268801M495871M722892N021769N500534O165032O948455P821199
$$ 78190222 82459023 86954894 91677786 96699555 102200089 108365121 115313576 123134775
13626A23134775Q783780R803500J0810591J1713262J2461983J3118043J3752964
$$ 123134775 131918555 141722055 152532646 164245908 176707891 189825934 203578898
13619B03578898J4322253J4774166J5215945J5831471J6661732J7570048J8415037
$$ 203578898 217901151 232675317 247891262 263722733 280384465 297954513 316369550
13612C16369550J9124022J9566468J9534187J8914633J7756547J6172540J4254949
$$ 316369550 335493572 355060040 374594227 393508860 411265407 427437947 441692896
13605D41692896J2033135R469318O541096L307509r8758l477675o599316r316693
$$ 441692896 453726031 463195349 469736445 473043954 472945196 469467521 462868205 453551512
13597D53551512j1593095j3401900j4718813j5598177j6143083j6448994j6612986
$$ 453551512 441958417 428556517 413837704 398239527 382096444 365647450 349034464
13590C49034464j6709409j6735606j6616968j6254330j5595157j4712454j3799733
$$ 349034464 332325055 315589449 298972481 282718151 267122994 252410540 238610807
13583B38610807j3033347j2434795j1907072j1324655j0595259r744882q895924
$$ 238610807 225577460 213142665 201235593 189910938 179315679 169570797 160674873
13576A60674873q143597p534026p094888o768946o400096n873710n231852m629716
$$ 160674873 152531276 144997250 137902362 131133416 124733320 118859610 113627758 108998042
13568A08998042m204588l973324l856934l769018l624261l370451l078847k901157
$$ 108998042 104793454 100820130 96963196 93194178 89569917 86199466 83120619 80219462
13560H0219462k903113k997970l044291k970775k815264k629540k402693k126830
$$ 80219462 77316349 74318379 71274088 68303313 65488049 62858509 60455816 58328986
13552E8328986j844630j575406j304446j095515j071956j226660j376119j371979
$$ 58328986 56484356 54908950 53604504 52508989 51437033 50210373 48834254 47462275
13544D7462275j251749j105139r19172o31558k73107L6773K32675L06358K26937
$$ 47462275 46210526 45105387 44186215 43554657 43281550 43318323 43550998 43857356 44084293
13535D4084293m9901n13128j036200j436572j613587j592679j451871j262069
$$ 44084293 44034392 43521264 42485064 41048492 39434905 37842226 36390355 35128286
13527C5128286j096621j010663j003568j044903j097482j111095j014134p69661
$$ 35128286 34031665 33021002 32017434 30972531 29875049 28763954 27749820 26980159
13519B6980159m80474k91495k03610j36466p9525n7875m1719n489Q278n7200k16961
$$ 26980159 26499685 26208190 26004580 25868114 25788589 25730714 25688995 25683506 25691784 25634584 25417623
13508B5417623m52223o98731q35616q09916p01053n98525n18188m21158k57908
$$ 25417623 24965400 24266669 23431053 22621137 21920084 21321559 20803371 20382213 20124305
13499B0124305k8127K18172M30035N79267O49552O31320N42988M23533L00129
$$ 20124305 20096178 20314350 20744385 21323652 21973204 22604524 23147512 23571045 23871174
13490B3871174J92967J03277l5439k74393n20056n95714m32781j60466J694o9332
$$ 23871174 24064141 24167418 24131979 23857586 23337530 22741816 22309035 22148569 22150263 22080931
13480B2080931l23022o17187q32915r08304q57963p55564o35850m85228l03697
$$ 22080931 21757909 21140722 20307807 19399503 18541540 17785976 17150126 16664898 16361201
13471A6361201j26444l3962r0760k45769l64368l50329j75821J30214M47369O50833
$$ 16361201 16234757 16200795 16110035 15864266 15499898 15149569 14973748 15103962 15551331 16202164
13461A6202164P43042P98139Q50537Q98745R36833R06145O98598L25061r949r9264
$$ 16202164 16945206 17743345 18593882 19492627 20429460 21335605 22034203 22359264 22349315 22250051
13451B2250051M0744J96427K06161P7660j10488k97725m49666n64181o62131p37972
$$ 22250051 22290795 22487222 22693383 22771043 22660555 22362830 21913164 21348983 20686852 19948880
13441A9948880p52207o57479m41425j68872Q0606L02316N02237O00498N04121
$$ 19948880 19196673 18539194 18097769 17928897 18009503 18311819 18814056 19414554 19918675
13432A9918675K28045j13334l87802n20184n37805n16744m97169n03384n74875
$$ 19918675 20146720 20033386 19645584 19125400 18587595 18070851 17573682 17070298 16495423
13423A6495423p38215r69521j175750j266075j209356r92617o38417k59772j5034
$$ 16495423 15757208 14787687 13611937 12345862 11136506 10143889 9505472 9245700 9230666
13414I230666L6556j4680m8788l2679j3264k3089m8979p9538r7558n7339N3763
$$ 9230666 9267222 9252542 9203754 9171075 9157811 9134722 9085743 9006205 8908647 8851308 8905071
13403H905071J59535J65002N4356j03148k29157k85208k43693p9961K04969N70657
$$ 8905071 9064606 9229608 9283964 9180816 8951659 8666451 8422758 8342797 8547766 9118423
13393I118423R18377J093972R93957O97210M18246L13722L81152N04481N87543
$$ 9118423 10036800 11130772 12124729 12821939 13240185 13553907 13935059 14439540 15027083
13384A5027083O16399N66006L60517q414m11390p06751q57134q86110q24885p01802
$$ 15027083 15643482 16209488 16570005 16561591 16150201 15443450 14586316 13700206 12875321 12173519
13374A2173519n40032l88454k98620k76263l00327l31044l19877k65505j93629
$$ 12173519 11633487 11245033 10946413 10670150 10369823 10038779 9718902 9453397 9259768
13365I259768j27178j54249l59480o42611p78512o93469n56164n58113o87344
$$ 9259768 9132590 8978341 8618861 7976250 7197738 6504269 5948105 5389992 4702648
13356D702648p67962o97750n34563l47557j70358n5715k3950m0129o1559n3565
$$ 4702648 3934686 3236936 2702373 2354816 2184458 2128743 2104793 2064664 2003105 1949540
13346A949540J1454J74325M61968P98325J017008J001577P89889N24061L19041
$$ 1949540 1960994 2135319 2597287 3395612 4412620 5414197 6204086 6728147 7047188
13337G047188K24925K48189L32023L63375K19111j33655n59764q52607r28886
$$ 7047188 7272113 7520302 7852325 8215700 8434811 8301156 7741392 6888785 5959899
13328E959899q80431p92567n93828k01448K93498O82493Q14518P10278M81901
$$ 5959899 5079468 4286901 3693073 3491625 3785123 4467616 5282134 5992412 6474313
13319F474313J92296j33416m52197p31858r38092j001679q72772n60872j59245
$$ 6474313 6666609 6533193 6080996 5349138 4411046 3409367 2536595 1975723 1816478
13310A816478J73888L39636L62080L09588K38131J76100J07006L4104J7459J01034
$$ 1816478 1990366 2330002 2692082 3001670 3239801 3415901 3522907 3557011 3574470 3675504
13300C675504K84931M51748M10929J67280r6507k54453k55969o2545K68984N27936
$$ 3675504 3960435 4412183 4823112 4990392 4893885 4639432 4383463 4320918 4589902 5117838
13290E117838N20343K67657m5523k91482m87044o87506q95744j058546j077496
$$ 5117838 5638181 5905838 5860315 5568833 5081789 4394283 3498539 2439993 1362497
13281A362497q78219m95235m2838L46947N69829O24454O10913O01033N63933M32712
$$ 1362497 484278 -10957 -53795 293152 862981 1487435 2098348 2699381 3263314 3696026
13271C696026J85139j30088l91042m67234l38874j13455J33788M16742O58912
$$ 3696026 3881165 3751077 3360035 2892801 2553927 2440472 2574260 2991002 3649914
13262C649914O62569L31216j99200o79660r28919q68212m99624N0333N50727Q16263
$$ 3649914 4312483 4643699 4444499 3764839 2835920 1967708 1468084 1518417 2069144 2885407
13252B885407Q10432O15421L69902K01678J82701K62719K37247o5664n83718j054122
$$ 2885407 3695839 4311260 4681162 4882840 5065541 5328260 5565507 5499843 4916125 3862003
13242C862003j218970j038192o80393l26270p9284K3156J4152l2565o6830r5503
$$ 3862003 2643033 1604841 924448 598178 518894 542050 556202 523637 456807 361304
13232C61304j53003k29532k66646k21613o9831J86558M53398O04296O35325O39876
$$ 361304 208301 -21231 -287877 -509490 -579321 -392763 60635 664931 1300256 1940132
13222A940132O44170O04238N10312L95441K78925J56395K8838p0237o9341Q8963
$$ 1940132 2584302 3188540 3698852 4094293 4373218 4529613 4558451 4488214 4418873 4507836
13212D507836L77609O78726Q63171Q83714P94079O82798N63314L34095q3910o07674
$$ 4507836 4885445 5564171 6427342 7311056 8105135 8787933 9351247 9685342 9601432 8993758
13202H993758j077328j393537j523036j494986j404896j353574j359940j373734
$$ 8993758 7916430 6522893 4999857 3504871 2099975 746401 -613539 -1987273
13194a987273j358600j278327j058012o67357j74168L11694O92875R22998J019377
$$ -1987273 -3345873 -4624200 -5682212 -6349569 -6523737 -6212043 -5519168 -4596170 -3576793
13185c576793J028339R78135Q69784P11584N58754M83496M77577M29616K82694
$$ -3576793 -2548454 -1570319 -700535 11049 569803 1053299 1530876 1960492 2243186
13176B243186J40277J10817J91528L50867N46692O77375O42592M53196K42564
$$ 2243186 2383463 2494280 2685808 3036675 3583367 4260742 4903334 5356530 5599094
13167E599094J30522J02144O5519m2013k32760m63899o75861q60315j016006j071143
$$ 5599094 5729616 5831760 5897279 5855266 5622506 5158607 4482746 3622431 2606425 1535282
13157A535282r25705n63339j24374K21727M46125N65280N68231N36314O12311
$$ 1535282 609577 46238 -78136 143591 589716 1154996 1723227 2259541 2871852
13148B871852Q04492R48777Q78666N96276K34842j00714l73416n47786n90091
$$ 2871852 3676344 4625121 5503787 6100063 6334905 6234191 5860775 5312989 4722898
13139D722898n65275o00247p24844q48149q59327p39341n80525m78958m41339
$$ 4722898 4157623 3557376 2832532 1984383 1125056 385715 -194810 -673768 -1115107
13130a115107m07666l39594k41330j07688P9263K98657M66983N21133M93599M70331
$$ -1115107 -1522773 -1862367 -2103697 -2211385 -2132122 -1833465 -1366482 -845349 -351750 118581
13120A18581M79120M48936L23330J54682N6935J36602M35330Q72304J289260J549717
$$ 118581 597701 1046637 1369967 1524649 1581584 1718186 2153516 3025820 4315080 5864797
13110E864797J590576J453398J272262J147406J046831Q73722N99017L16362J58685
$$ 5864797 7455373 8908771 10181033 11328439 12375270 13248992 13848009 14164371 14323056
13101A4323056J76722L19042N17978P43740R10129Q46600N02660M4576k74310
$$ 14323056 14499778 14818820 15336798 16080538 16990667 17837267 18339927 18384503 18110193
13092A8110193l04856j40730L592K3922l2980q7392j10012r8227l7541Q9418K56358
$$ 18110193 17805337 17664607 17668199 17692121 17659141 17571749 17461737 17363510 17325969 17415387 17671745
13081A7671745M19785N73800P04100P53274O50248L47688j33088o74355j090423
$$ 17671745 18091530 18665330 19369430 20122704 20772952 21120640 20987552 20313197 19222774
13072A9222774j219701j024578o07439j18302L42972P32701J014545J147205J135867
$$ 19222774 18003073 16978495 16371056 16252754 16595726 17328427 18342972 19490177 20626044
13063B0626044J053364R74320R27004R05560R15505R95240J162992J395148J618964
$$ 20626044 21679408 22653728 23580732 24486292 25401797 26397037 27560029 28955177 30574141
13054C0574141J709777J595189J342468J073974Q87926Q72741J051455J323291
$$ 30574141 32283918 33879107 35221575 36295549 37183475 38056216 39107671 40430962
13046D0430962J543247J615424J515011J310673J143866J124105J241567J396608
$$ 40430962 41974209 43589633 45104644 46415317 47559183 48683288 49924855 51321463
13038E1321463J479692J421874J226323R84902Q26973Q21787R41805J082335J106492
$$ 51321463 52801155 54223029 55449352 56434254 57261227 58083014 59024819 60107154 61213646
13029F1213646R20065N52518J28088k62472o10807r26206j189403j387897j544674
$$ 61213646 62133711 62686229 62814317 62551845 61941038 61014832 59825429 58437532 56892858
13020E6892858j706863j913046k128562k256570k237539k099157j947449j852186
$$ 56892858 55185995 53272949 51144387 48887817 46650278 44551121 42603672 40751486
13012D0751486j726867j438106r94851n22808j18720J54521K16045M0855k74072
$$ 40751486 39024619 37586513 36591662 36068854 35950134 36104655 36320700 36361555 36087483
13003C6087483o02432q93967j158809j410580j614039j669723j501678j137301
$$ 36087483 35485051 34591084 33432275 32021695 30407656 28737933 27236255 26098954
12995B6098954o60357j62669K58415N56209P69440R24211R60527Q37772N99739
$$ 26098954 25438597 25275928 25534343 26090552 26859992 27784203 28744730 29582502 30182241
12986C0182241K78641j25658n85228j026460j329741j387880j199409q45063m02788
$$ 30182241 30460882 30335224 29749996 28723536 27393795 26005915 24806506 23961443 23558655
12977B3558655L0363K94768K78627O0293j07881J8875M72158J052034J501839
$$ 23558655 23589018 23883786 24162413 24222706 24114825 24133700 24605858 25657892 27159731
12968B7159731J684661J624809J458656J329323J280766J286628J296856J228994
$$ 27159731 28844392 30469201 31927857 33257180 34537946 35824574 37121430 38350424
12960C8350424J032922P32963L82265K0818k93575m50299l81510j48778R6081
$$ 38350424 39383346 40116309 40498574 40519392 40225817 39775518 39394008 39245230 39341311
12951C9341311J61722n2396m35896p87692j002364j092424j119868j114365j024082
$$ 39341311 39503033 39450637 39014741 38227049 37224685 36132261 35012393 33898028 32873946
12942C2873946p83244m39001j40465J9880M0758l2123j36314k74748n11168q50094
$$ 32873946 32090702 31651701 31511236 31531116 31571874 31539751 31403437 31128689 30617521 29767427
12932B9767427j205907j480871j639977j723404j770476j765571j671527j481818
$$ 29767427 28561520 27080649 25440672 23717268 21946792 20181221 18509694 17027876
12924A7027876j243814j034782r08415q61374q13596o52256l69466q8976N2853
$$ 17027876 15784062 14749280 13840865 12979491 12165895 11513639 11144173 11055197 11108050
12915A1108050J402j56756k29581j42096j0094P6721J24437J25824M8696j24503
$$ 11108050 11109452 10952696 10723115 10581019 10570925 10647646 10772083 10897907 10946603 10822100
12905A0822100l78217o41515q00721p83917o33851m74178m21618n19496o74745
$$ 10822100 10443883 9802368 9001647 8217730 7583879 7109701 6688083 6168587 5493842
12896E493842p02763n24955k37872M8409L10207N16160N50182L06712j10199m17666
$$ 5493842 4791079 4266124 4028252 4076661 4386868 4903028 5453210 5759922 5649723 5232057
12886E232057m58362l16276j55959j03553k21001m73630p09711p66677o15983
$$ 5232057 4773695 4457419 4301460 4197907 3976906 3503276 2793565 2026888 1410905
12877A410905l45366l6265K90620O30319R40681J128711J111320R20467O91415
$$ 1410905 1065539 1029274 1319894 1950213 2890894 4019605 5130925 6051392 6742807
12868F742807N62012O21533Q71378J169050J284010J037948M19568l66342j043199
$$ 6742807 7304819 7926352 8797730 9966780 11250790 12288738 12708306 12341964 11298765
12859A1298765j482960j685999j649542j365251q74319l30927K0177L8668j89111
$$ 11298765 9815805 8129806 6480264 5115013 4240694 3909767 3929944 3968612 3779501
12850C779501m80963p11782q05611o96732l62507J25029N92862Q80058R47641
$$ 3779501 3298538 2586756 1781145 1084413 721906 846935 1439797 2319855 3267496
12841C267496Q55855O79106M43115J41114j61643l11125k34879m1873R4614Q4770
$$ 3267496 4123351 4802457 5245572 5386686 5225043 4913918 4679039 4637166 4731780 4816550
12831D816550l7829j54754j61916q2378l5517p6067j49031j84776j80123j76129
$$ 4816550 4778721 4623967 4462051 4379673 4344156 4268089 4119058 3934282 3754159 3578030
12821C578030j80973k01272k93427m71547o20996o03824m03896j15998J60386
$$ 3578030 3397057 3195785 2902358 2430811 1809815 1205991 802095 686097 846483
12812H46483L59780M27830L36223J28891p7261j71946j43692m9801P3664J79190
$$ 846483 1206263 1634093 1970316 2099207 2021946 1850000 1706308 1656507 1730171 1909361
12802A909361J39870j08864m25723o09756n68744l03816J18804N50082Q16453
$$ 1909361 2049231 1940367 1514644 904888 336144 32328 151132 701214 1517667
12793A517667Q34198O58179M16834K12539P7327j2968j11311k48104l81741m50536
$$ 1517667 2351865 3010044 3426878 3639417 3716744 3703776 3592465 3344361 2962620 2512084
12783B512084m20847k86975o6362K20445N62135Q96151J070737R95034P49485
$$ 2512084 2091237 1804262 1737900 1958345 2520480 3416631 4487368 5482402 6231887
12774F231887M53395J60386p3622j69072j05057N1304K06029L07027L60268L73635
$$ 6231887 6685282 6845668 6772046 6602974 6497917 6549221 6755250 7062277 7422545 7796180
12764G796180L06675R4517k88496p77631j225684j507755j602655j533856j308968
$$ 7796180 8102855 8197372 7908876 7131245 5905561 4397806 2795151 1261295 -47673
12755d7673r75857o39045l81160k13439j10641o9560q2201r0147l8525N0217J14236
$$ -47673 -1023530 -1662575 -2043735 -2257174 -2367815 -2437375 -2519576 -2609723 -2648248 -2598031 -2483795
12744b483795J36837J56172K26246L50186M80033N89453O44952N55434K69177
$$ -2483795 -2346958 -2190786 -1964540 -1614354 -1134321 -544868 100084 655518 924695
12735I24695j13408m20812n71249n66495l96965n0172L97233P68624Q97155P60543
$$ 924695 811287 390475 -180774 -747269 -1144234 -1194406 -797173 -28549 868606 1629149
12725A629149N01380K90735J58390J3416j88379l97230n17497m67310k67070k1332
$$ 1629149 2130529 2421264 2579654 2593070 2404691 2007461 1489964 1022654 755584 734252
12715G34252K10190M38836O55163P65364O76884M27936J45751p2928j94539k35182
$$ 734252 944442 1383278 2038441 2803805 3480689 3908625 4054376 3981448 3786909 3551727
12705C551727k27977k33844l26717m69929n35142m78126l93561m14522o06853
$$ 3551727 3323750 3089906 2763189 2293260 1758118 1279992 886431 471909 -134944
12696a34944q89660j073663j051168q57474n61595k23581R6963L74811N95974
$$ -134944 -1024604 -2098267 -3149435 -4006909 -4568504 -4792085 -4695122 -4320311 -3724337
12687c724337P06515O57604M92791L38506K80640L15684M33863O00240P19309
$$ -3724337 -3017822 -2360218 -1867427 -1528921 -1248281 -932597 -498734 101506 820815
12678H20815P39483P14450P10790P07485O32479M69291K46444k8807l38727o29272
$$ 820815 1560298 2274748 2985538 3693023 4325502 4794793 5041237 5012430 4673703 4044431
12668D044431q25529q69710p70965o04937m82087m74928n14621m53917k55946
$$ 4044431 3218902 2349192 1578227 973290 491203 16275 -498346 -952263 -1208209
12659a208209J996K54305M70065O01455N74895L64559N7579k07800l26824k62739
$$ -1208209 -1206213 -951908 -481843 119612 694507 1059066 1116645 908845 582021 319282
12649C19282r6550k264r8220l53054o52018q86823r73264q50672n48511k01380
$$ 319282 222732 220468 122248 -230806 -882824 -1769647 -2742911 -3593583 -4142094 -4343474
12639d343474O9922K39681L22079L23270K86031K77759K99875L06277K97703L23132
$$ -4343474 -4273552 -4033871 -3711792 -3388522 -3102491 -2824732 -2524857 -2218580 -1920877 -1597745
12629a597745L86817L81783K44300P4715l3884r0527j11166q0429J1098J26742
$$ -1597745 -1210928 -829145 -584845 -510130 -544014 -634541 -745707 -826136 -815038 -688296
12619f88296K22746L15786M28136N26053N32379L72910N9163k74812m81850n09923
$$ -688296 -465550 -149764 278372 804425 1336804 1709714 1768877 1494065 1012215 502292
12609E02292l83255j93132p3286p0484p5503N2606K98609M83761M50015K48250
$$ 502292 119037 -74095 -147381 -217865 -293368 -240762 57847 541608 991623 1239873
12599A239873P9892L7539O1662J03662J62342J84064O6483j94364m66167o20487
$$ 1239873 1319765 1357304 1418966 1522628 1684970 1869034 1935517 1741153 1274986 654499
12589F54499o26229n16038l24732j03893L7721M1423K0037J00703K66743M70544
$$ 654499 28270 -487768 -812500 -916393 -878672 -837249 -817212 -716509 -449766 20778
12579B0778O88748Q53778R05735Q73317P83795N69086J79052k76228o11089p50097
$$ 20778 709526 1563304 2469039 3342356 4126151 4695237 4874289 4598061 3986972 3236875
12569C236875p42694o83365o39883o07454n46643m82405m94331n88706o51455
$$ 3236875 2494181 1810816 1170933 563479 16836 -465569 -959900 -1548606 -2200061
12560b200061n69767l39239l7636J97900K31360N8311j86809l41589l17345j70255
$$ -2200061 -2769828 -3109067 -3146703 -2948803 -2717443 -2659132 -2845941 -3187530 -3504875 -3675130
12550c675130l7425L0095P9209J53554K76881M38695N49130N31121M19592L06740
$$ -3675130 -3712555 -3682460 -3603251 -3449697 -3172816 -2734121 -2184991 -1653870 -1234278 -927538
12540i27538K79125L74884N49609O99844P10865N48636L39693K31735K28105K19861
$$ -927538 -648413 -273529 276080 975924 1686789 2235425 2575118 2806853 3034958 3254819
12530C254819J04490j22593l91702o52628q99005j118369j265722j283414j132533
$$ 3254819 3359309 3236716 2845014 2192386 1293381 175012 -1090710 -2374124 -3506657
12521c506657q14973l61336J60001N98140P68109O26811L42761J07832m6681j76516
$$ -3506657 -4321630 -4682966 -4522965 -3924825 -3156716 -2529905 -2187144 -2079312 -2125993 -2302509
12511b302509k76951k99080j96189O8689M57881Q36669J049113J005853P54681
$$ -2302509 -2579460 -2878540 -3074729 -3006040 -2548159 -1711490 -662377 343476 1098157
12502A098157M63909K73705J92038J50260J09117Q8883J21603K02862K87484L41779
$$ 1098157 1562066 1835771 2027809 2178069 2287186 2376069 2497672 2700534 2988018 3329797
12492C329797L69626L59865K70264R3516r7665k25824l05351m17157n92446p30486
$$ 3329797 3699423 4059288 4329552 4423068 4325403 4099579 3794228 3377071 2784625 2054139
12482B054139o64432l55885J0725J75330N862m26046r18678j276643j399412j322671
$$ 2054139 1389707 1033822 1044547 1219877 1225739 799693 -118985 -1395628 -2795040 -4117711
12472d117711j181121j065997r73971q93525q52527q56639q34829o97614m17638
$$ -4117711 -5298832 -6364829 -7338800 -8232325 -9084852 -9941491 -10776320 -11473934 -11891572
12463a1891572n8533K43311M19676N56059P56352J008021J195733J238834J187833
$$ -11891572 -11950105 -11706794 -11287118 -10731059 -9974707 -8966686 -7770953 -6532119 -5344286
12454e344286J157504J176105J157916J051215Q74360O26028K99427r4250n04891
$$ -5344286 -4186782 -3010677 -1852761 -801546 72814 698842 998269 904019 399128
12445C99128p92167q37978o78344l88595l756L81512O18816O46664N27404L57202
$$ 399128 -393039 -1231017 -1909361 -2297956 -2301712 -1920200 -1301384 -654720 -127316 229886
12435B29886K51984L27106N34282O45662M98301J49725k43653n71437p56379p33468
$$ 229886 481870 808976 1343258 1988920 2487221 2636946 2393293 1821856 1065477 332009
12425C32009m88958j15541J89049K99288K92779K80854K76570K41448J17796j02939
$$ 332009 -156949 -272490 -83441 215847 508626 789480 1066050 1307498 1425294 1322355
12415A322355l51878n83357p85185q93574q12122n41064k37776p2470m2468p688
$$ 1322355 970477 387120 -398065 -1291639 -2103761 -2644825 -2882601 -2955071 -2997539 -3005227
12405c005227J48315M37767P45690Q87463P75370M89628J92438M5263J01430K27074
$$ -3005227 -2856912 -2419145 -1673455 -785992 -10622 479006 671444 716707 818137 1045211
12395A045211K53678K01357K18889L74685N83457O80280N42087J41839m11808
$$ 1045211 1298889 1500246 1719135 2093820 2677277 3357557 3899644 4041483 3629675
12386C629675q71999j044820r61598p82248o37680n96732o38478o28198m10408
$$ 3629675 2757676 1712856 751258 -30990 -668670 -1265402 -1903880 -2532078 -2942486
12377b942486K1415M74443P32790P55109O20190L75406O6103j82951k39668q0468
$$ -2942486 -2921071 -2446628 -1713838 -958729 -338539 36867 102970 -79981 -319649 -400117
12367d00117K13713N21650P14365O84510M22203M7850k76567m47590m56661l44673
$$ -400117 -186404 335246 1049611 1734121 2156324 2204174 1927607 1480017 1023356 678683
12357F78683j19932K23865O15874Q86078Q89351O56630L62632J38892k2049j77962
$$ 678683 558751 782616 1398490 2284568 3173919 3830549 4193181 4332073 4310024 4132062
12347D132062l41820m90309n95327o18971n27404l27888r2939Q3006J57554J33896
$$ 4132062 3790242 3299933 2704606 2085635 1558231 1230343 1137404 1220410 1377964 1511860
12337A511860K8338j34429l21863m98217o28885o79569o40498n34622l73471j27001
$$ 1511860 1540198 1405769 1083906 585689 -43196 -722765 -1363263 -1897885 -2271356 -2398357
12327b398357K08293N22209O68315N79735L21188J00649R2402K47137L95977M53832
$$ -2398357 -2190064 -1667855 -999540 -419805 -98617 2032 94434 341571 737548 1191380
12317A191380M52445M33528L93950L10344J55145m1861j57963q1678J85427N68582
$$ 1191380 1643825 2077353 2471303 2781647 2936792 2894931 2736968 2655290 2840717 3409299
12307C409299R90377J355618J544607J468060J104293M85671k82168j015934j578229
$$ 3409299 4399676 5755294 7299901 8767961 9872254 10357925 10075757 9059823 7481594
12298G481594j951567k094996j903804j409609q38582l86461r2615N8490Q8665
$$ 7481594 5530027 3435031 1531227 121618 -716964 -1103425 -1196040 -1137550 -1048885
12289a048885O0833L0323j7044j06909k29388l65730n07318o39874o84825n01699
$$ -1048885 -988052 -957729 -974773 -1081682 -1311070 -1676800 -2184118 -2823992 -3508817 -4010516
12279d010516l7059O03248J237517J661160J730473J487024J102606O98893K99071
$$ -4010516 -4047575 -3444327 -2206810 -545650 1184823 2671847 3774453 4473346 4772417
12270D772417p9346l84845n88969o85444o35320m25728j49049M6416N2160j32928
$$ 4772417 4693071 4308226 3719257 3033813 2398493 1972765 1823716 1870132 1922292 1789364
12260A789364l93003n66555n55457l81420j52707K4236J06290J01516L9209j4934
$$ 1789364 1396361 829806 274349 -107071 -259778 -235542 -129252 -27736 11473 -3461
12250c461Q140Q9426J57680J84103J61184Q0165m1256j48823j71200r7432k4928
$$ -3461 4679 94105 251785 435888 597072 677237 635981 487158 315958 218526 193598
12239A93598p2051k63595m98586o09221n11697l13726k12269k67902l42043l10318
$$ 193598 121547 -142048 -640634 -1249855 -1761552 -2075278 -2287547 -2555449 -2897492 -3207810
12229c207810k11764j13842j8964Q4138J84604K67192L33550L65149L16061J86336
$$ -3207810 -3419574 -3533416 -3552380 -3468242 -3283638 -3016446 -2682896 -2317747 -2001686 -1815350
12219a815350M1722m6701l5607P9395K35309L64185M69818N55664O02681O02292
$$ -1815350 -1773628 -1820329 -1855936 -1776541 -1541232 -1177047 -707229 -151565 451116 1053408
12209A053408N32612L88742K15499N1922j11741k81474l99730m02183l35978l21634
$$ 1053408 1586020 1974762 2190261 2242183 2130442 1848968 1449238 1047055 711077 389443
12199C89443m20051n71916o38014n20689k00069K77952P65337J081282J130541
$$ 389443 -30608 -602524 -1240538 -1761227 -1961296 -1683344 -918007 163275 1293816
12190A293816R34121O14573L54876K92209L99020N38402O02168N14680K37552
$$ 1293816 2227937 2842510 3197386 3489595 3888615 4427017 5029185 5543865 5781417
12181E781417j41295m79469p10531q14927p98983p10480n63739l11826R033K74161
$$ 5781417 5640122 5160653 4450122 3635195 2836212 2125732 1561993 1250167 1259200 1533361
12171A533361M50855N97892P01119O56903L94705l4847m64435p19321p43440o27272
$$ 1533361 1984216 2582108 3283227 3940130 4334835 4299988 3835553 3116232 2372792 1745520
12161A745520n11111m41248l40911j18134K18485N54288P45727P20781N50935
$$ 1745520 1234409 793161 452250 334116 552601 1106889 1852616 2573397 3124332
12152C124332L67104K38645J62737R4308l084j00323j21826p2327p3708k04853
$$ 3124332 3491436 3730081 3892818 3987126 3984042 3883719 3761893 3689566 3615858 3411005
12142C411005l95481n12795n17606m94615n08733n25543m99074m47420m07842
$$ 3411005 3015524 2502729 1985123 1490508 981775 456232 -42842 -490262 -898104
12133h98104l87776l72069l36282l01341l45882m99844o53597o53538m84744k64686
$$ -898104 -1285880 -1657949 -1994231 -2295572 -2641454 -3141298 -3794895 -4448433 -4933177 -5197863
12123e197863j03476n7253j08195j35189l5637J39225K42106K31444K13404K44212
$$ -5197863 -5301339 -5358592 -5466787 -5601976 -5637613 -5498388 -5256282 -5024838 -4811434 -4567222
12113d567222K70820K82230L35568M28567M82740M45354L20101J24185j13206
$$ -4567222 -4296402 -4014172 -3678604 -3250037 -2767297 -2321943 -2001842 -1877657 -1990863
12104a990863l10945l56666k27362l0139R2596P6156m5106k09404l34072l13116
$$ -1990863 -2301808 -2658474 -2885836 -2915975 -2823379 -2747223 -2792329 -3001733 -3335805 -3648921
12094c648921j11267J50308K67764J73243J9307k9929O57J5267J7174M0314M2597
$$ -3648921 -3760188 -3609880 -3342116 -3168873 -3149566 -3179495 -3178838 -3163571 -3146397 -3106083 -3063486
12083c063486m4937k18330l66943l42455r8178K71676O22921Q48730R43396R95509
$$ -3063486 -3108423 -3326753 -3693696 -4036151 -4134329 -3862653 -3239732 -2391002 -1447606 -452097
12073d52097J045220J009152Q49980O75327N92905N96103O12886N87450N11594
$$ -452097 593123 1602275 2452255 3127582 3720487 4316590 4929476 5516926 6028520
12064F028520M09704L04811K12304J35368L7828j26675l61293o04266p50693p33279
$$ 6028520 6438224 6743035 6955339 7090707 7128535 7001860 6640567 6036301 5285608 4552329
12054D552329n78580l88061k69070k63153l03815k84798j96127j24738j42838
$$ 4552329 3973749 3585688 3316618 3053465 2749650 2464852 2268725 2143987 2001149
12045B001149k34826l03274k56585p4592K18193N38623P19198O28455K94773j31461
$$ 2001149 1766323 1463049 1206464 1131872 1350065 1888688 2607886 3236341 3531114 3399653
12035C399653m72034n77225l81434M4104N04527P61417O88010L75638K0338k54973
$$ 3399653 2927619 2350394 1968960 2013064 2517591 3279008 3967018 4342656 4362994 4108021
12025D108021m25230n17580n76545n96553n34318m29254l82191l96095l82322
$$ 4108021 3682791 3165211 2588666 1992113 1457795 1028541 646350 250255 -132067
12016a32067k84123j11401Q7388K51772L09053K03855l5911l08273n18360o23571
$$ -132067 -416190 -527591 -440203 -188431 120622 324477 288566 -19707 -538067 -1161638
12006a161638o25651n70574m91302l53592j12851K03102M63951N02232K73037
$$ -1161638 -1787289 -2357863 -2849165 -3202757 -3315608 -3112506 -2648555 -2146323 -1873286
11997a873286o7270l05495l73695l45255l19922l73803n48888q12742r88980q69511
$$ -1873286 -1940556 -2246051 -2619746 -2965001 -3284923 -3658726 -4207614 -5020356 -6009336 -6878847
11987f878847m56237J7566L09306L53885K32672M7297j08228j24783K7738K43495
$$ -6878847 -7335084 -7317518 -7008212 -6654327 -6421655 -6374358 -6482586 -6607369 -6579631 -6336136
11977f336136M04567M96859N75742O26016N44872L21710R2495l0202m7915J6226
$$ -6336136 -5931569 -5434710 -4858968 -4232952 -3688080 -3366370 -3273875 -3304077 -3351992 -3335766
11967c335766J56239L33028N07330O89294Q57658Q85202O77378L53042J42441
$$ -3335766 -3179527 -2846499 -2339169 -1649875 -792217 92985 770363 1123405 1265846
11958A265846J33896K24979K53464J41643m7329j73158j51144m1466K4636J74
$$ 1265846 1399742 1624721 1878185 2019828 1972499 1799341 1648197 1606731 1631367 1631541
11948A631541n2911p2561n7360o2372j66814l98112o43537p08409n41758k91486
$$ 1631541 1578630 1506069 1448709 1386337 1219523 821411 177874 -530535 -1072293 -1363779
11938a363779j49590k00917l74084n37837o15303n89068m64393k45887J8131K17526
$$ -1363779 -1513369 -1714286 -2088370 -2626207 -3241510 -3830578 -4294971 -4540858 -4522727 -4305201
11928d305201K74940K13402J21805J03725K41761M96792O90036O79724M92735
$$ -4305201 -4030261 -3816859 -3695054 -3591329 -3349568 -2852776 -2162740 -1483016 -990281
11919i90281K57466O6626o0756j30948j12545P4986M58579R11257J239809J344543
$$ -990281 -732815 -666189 -726945 -857893 -970438 -895452 -436873 474384 1714193 3058736
11909C058736J240958R90691O47122K43201j94887o15975r45991j109564j072434
$$ 3058736 4299694 5290385 5937507 6180708 5985821 5369846 4423855 3314291 2241857
11900B241857q82941o06487l13720j11977l5483O117R0786J85353K17004J66865
$$ 2241857 1358916 752429 438709 326732 291249 297366 388152 573505 790509 957374
11890I57374O2508k9446m4652J4145J24401K48661K95995J93128l5871k89284
$$ 957374 1019882 990436 945784 959929 1084330 1332991 1628986 1822114 1786243 1496959
11880A496959m43376l88339j01328K58492M31624L04198n4338n24101r61322j216272
$$ 1496959 1053583 665244 563916 822408 1254032 1558230 1503892 979791 18469 -1197803
11870a197803j220058j022239o75881j63907M48852R74296J288162J392335J330137
$$ -1197803 -2417861 -3440100 -4115981 -4279888 -3831036 -2856740 -1568578 -176243 1153894
11861A153894J160870R59364P97387P23397P23613P19279O40240M73510K78817
$$ 1153894 2314764 3274128 4071515 4794912 5518525 6237804 6878044 7351554 7630371
11852G630371J60586J31923P1368j20077m13297p19008r35173r41394o99437l31566
$$ 7630371 7790957 7922880 7994248 7874171 7460874 6741866 5806693 4865299 4165862 3834296
11842C834296l5160O6562K6576k670N1326J48282K01758J32543o0573k97881n21842
$$ 3834296 3799136 3865698 3892274 3889604 3940930 4089212 4290970 4423513 4362940 4065059 3543217
11831C543217p30854q87804r07137p65617n61153m22490m18848n43547p17619
$$ 3543217 2812363 1924559 1017422 251805 -309348 -731838 -1150686 -1694233 -2411852
11822b411852q59924r22668q56813o14823k11127K46536O19682Q17176Q22978
$$ -2411852 -3271776 -4194444 -5051257 -5666080 -5877207 -5630671 -5010989 -4193813 -3370835
11813c370835O78153M59406K50130J01770R946o5372j52652k11801j58259M492
$$ -3370835 -2692682 -2233276 -1983146 -1881376 -1871430 -1936802 -2089454 -2301255 -2459514 -2455022
11803b455022J52875J60177k466k66105n09556o32130o26496n29261l43649m8303
$$ -2455022 -2302147 -2141970 -2144436 -2410541 -2920097 -3552227 -4178723 -4707984 -5051633 -5099936
11793e099936L28168O37879P39154O67944N41865L84593J88861L3814J8960J48852
$$ -5099936 -4771768 -4133889 -3394735 -2726791 -2184926 -1800333 -1611472 -1577658 -1558698 -1409846
11783a409846L11102L73513K74224J4766l37704o40162p43366o05700k92169R7881
$$ -1409846 -1098744 -725231 -451007 -436241 -773945 -1414107 -2157473 -2763173 -3055342 -2957461
11773b957461M39690N98879N14685K48791p3672l57189n83624p56723q44017q08243
$$ -2957461 -2517771 -1918892 -1404207 -1155416 -1229088 -1586277 -2169901 -2926624 -3770641 -4578884
11763d578884o58642m45259k20955o3139n8436j61109k14385j78011j56199j95186
$$ -4578884 -5237526 -5682785 -5903740 -5966879 -6025315 -6186424 -6400809 -6578820 -6735019 -6930205
11753f930205k15905j32576P2407L72489P08294R96094J138246J036660O76650
$$ -6930205 -7146110 -7278686 -7206279 -6833790 -6125496 -5129402 -3991156 -2954496 -2277846
11744b277846J73291k90365n70012o36609n42534l57058j41408Q0611K97191M40894
$$ -2277846 -2104555 -2394920 -2964932 -3601541 -4144075 -4501133 -4642541 -4561930 -4264739 -3823845
11734c823845M25460K32900o4008l08389l34233j27001J30500K13522N8465j88313
$$ -3823845 -3398385 -3165485 -3229493 -3537882 -3872115 -3999116 -3868616 -3655094 -3596629 -3784942
11724c784942l33170k91045q4811K05521M66873N94357N44319L53448J13016j12180
$$ -3784942 -4118112 -4409157 -4493968 -4288447 -3821574 -3227217 -2682898 -2329450 -2216434 -2328614
11714b328614l12536m36009l99447k44144r6351L0023K11278M43003O32281P05688
$$ -2328614 -2641150 -3077159 -3476606 -3720750 -3817101 -3787078 -3575800 -3132797 -2500516 -1794828
11704a794828O74907O09848N14203L34532J21600K8738J67494N05990Q62948J010362
$$ -1794828 -1119921 -510073 4130 338662 460262 489000 656494 1162484 2025432 3035794
11694C035794Q32925M28175J5531k86928n28697p43458q76956r17990r34893r64004
$$ 3035794 3868719 4296894 4312425 4025497 3496800 2753342 1876386 958396 23503 -940501
11684i40501r52779q46293o37726l22363P4877M52734O95483P73389P79748Q44247
$$ -940501 -1893280 -2739573 -3377299 -3699662 -3624785 -3172051 -2476568 -1703179 -923431 -79184
11674g9184R95971J151881J218500J150419R59823P18874N23844L96043K45655
$$ -79184 916787 2068668 3287168 4437587 5397410 6116284 6640128 7036171 7281826
11665G281826n6846n66528j156120j575326j646355j366070q50520k28992L96089
$$ 7281826 7224980 6658452 5502332 3927006 2280651 914581 64061 -164931 231158
11656B31158R03184J158902J121868Q82024N71818K93076J11892K7911l1255j18520
$$ 231158 1134342 2293244 3415112 4297136 4868954 5162030 5273922 5301833 5270578 5152058
11646E152058k27086l59119n20739o60308o99091o04400m03629j66813J6962J01456
$$ 5152058 4924972 4565853 4045114 3384806 2685715 2081315 1677686 1510873 1527835 1629291
11636A629291J05364Q0241Q7844J35099J29126j0226k12250l38148l25380j83257
$$ 1629291 1734655 1814896 1902740 2037839 2166965 2156739 1944489 1606341 1280961 1097704
11626A097704M6839K95664M53339M04554J10970l52967q27747j154717j274235
$$ 1097704 1144543 1440207 1893546 2298100 2409070 2056103 1228356 73639 -1200596
11617a200596j226189j047433p33688l46890m9488L6958o7140k24444k40646r119
$$ -1200596 -2426785 -3474218 -4207906 -4554796 -4604284 -4567326 -4634466 -4858910 -5099556 -5108675
11607e108675L54134O35452P21240O23417M33093K67685K03829K36020K63836
$$ -5108675 -4754541 -4119089 -3397849 -2774432 -2341339 -2073654 -1869825 -1633805 -1369969
11598a369969J48539j43847m94489p62201r00862r22881q33062o38376l81234
$$ -1369969 -1221430 -1365277 -1859766 -2621967 -3522829 -4445710 -5278772 -5917148 -6298382
11589f298382j52373k4783K3050P1336J56223K20898K07949J81228K53861M44923
$$ -6298382 -6450755 -6475538 -6452488 -6381152 -6224929 -6004031 -5796082 -5614854 -5360993 -4916070
11579d916070P04852R96195J234190J216414P93756J04026n26865q90238j007469
$$ -4916070 -4211218 -3215023 -1980833 -764419 29337 133363 -393502 -1283740 -2291209
11570b291209r98319r49549r04140q78817q47263p60318o05240m44418l90260
$$ -2291209 -3289528 -4239077 -5143217 -6022034 -6869297 -7629615 -8234855 -8679273 -9069533
11561i069533m89044o40979p17301o93837n69441l13212J3693K63068L77067M09215
$$ -9069533 -9558577 -10199556 -10916857 -11610694 -12180135 -12493347 -12479654 -12216586 -11839519 -11430304
11551a1430304M25849N07711P47615J112898J383250J379800J173426R62021Q14928
$$ -11430304 -11004455 -10496744 -9749129 -8636231 -7252981 -5873181 -4699755 -3737734 -2922806
11542b922806O77517N33080M20190L53490L32162L88953N23007O45187O64514
$$ -2922806 -2245289 -1712209 -1292019 -938529 -606367 -217414 305593 950780 1615294
11533A615294O00965N54904N50769M94345L22896J02129o1350j14218o7199M1397
$$ 1615294 2216259 2771163 3321932 3816277 4139173 4241302 4179952 4065734 3998535 4039932
11523D039932J66292K06474O9997j74573l90776n64864p42160q77123q92428q13414
$$ 4039932 4206224 4412698 4482695 4308122 3917346 3352482 2610322 1733199 840771 27357
11513B7357p29545p04834p76438r31940j030339q84980m47805J58286P52857J184096
$$ 27357 -702188 -1407022 -2183460 -3115400 -4145739 -5030719 -5478524 -5320238 -4567381 -3383285
11503c383285J368941J326344J116195P55347K64689k56129o71139r02124j012555
$$ -3383285 -2014344 -688000 428195 1183542 1448231 1192102 520963 -381161 -1393716
11494a393716j093527j091185q93715m82174M9375N58280R41172J155860J156356
$$ -1393716 -2487243 -3578428 -4472143 -4954317 -4904942 -4346662 -3405490 -2249630 -1093274
11485a093274R15626N16739J33658q6969j23472q8339j21198k44318l67943m29477
$$ -1093274 -177648 339091 472749 385780 262308 173969 52771 -191547 -559490 -988967
11475i88967m74582n57026o32354o09874m19666m3133M10919P09164O67522L03198
$$ -988967 -1463549 -2020575 -2652929 -3262803 -3682469 -3725602 -3314683 -2605519 -1937997 -1634799
11465a634799k00172o31809q96790j051733j139868j091042q42108m54428r0893
$$ -1634799 -1834971 -2466780 -3363570 -4415303 -5555171 -6646213 -7488321 -7942749 -8033642
11456h033642R6469Q5514R206J4026P6345M7982j15135k82813l39936l16253k83573
$$ -8033642 -7937173 -7851659 -7842453 -7828427 -7752082 -7704100 -7819235 -8102048 -8441984 -8758237 -9041810
11445i041810k50734j88195j09149p7243j18275j96248k58949k20844J6952M50836
$$ -9041810 -9292544 -9480739 -9589888 -9667131 -9785406 -9981654 -10240603 -10461447 -10444495 -9993659
11435i993659R07012J170901J216154J178220J121578R91053P70437N38586L89683
$$ -9993659 -9086647 -7915746 -6699592 -5521372 -4399794 -3408741 -2638304 -2099718 -1710035
11426a710035L83177N27018P58602R49719R58452P41337M12829J34758n1751k29791
$$ -1710035 -1326858 -799840 -41238 908481 1866933 2608270 3021099 3155857 3104106 2874315
11416B874315m53994o84006q51281r07929q36615o60503m28018j95502k5477P1129
$$ 2874315 2420321 1736315 885034 -22895 -859510 -1520013 -1948031 -2143533 -2169010 -2097881
11406b097881J67297L39052N89071Q26310R41374R08693P81726O47330N71677
$$ -2097881 -1930584 -1591532 -1002461 -176151 765223 1673916 2455642 3102972 3674649
11397C674649N38129M83148M22409M57607O09957P31799O35664L10477m4706k39345
$$ 3674649 4212778 4695926 5118335 5575942 6185899 6917698 7553362 7863839 7819133 7579788
11387G579788k42645j49809j05372j99272m17859o68380q30371q82941r05975
$$ 7579788 7337143 7187334 7081962 6882690 6464831 5796451 4966080 4083139 3177164
11378C177164r38198r51060q97483p32216m70122k34377j50096j78019j59745
$$ 3177164 2238966 1287906 390423 -341793 -811915 -1046292 -1196388 -1374407 -1534152
11369a534152q620K03832L40734L47408K62810J37927p277j66788k95538l31712
$$ -1534152 -1542772 -1338940 -998206 -650798 -387988 -250061 -257338 -424126 -719664 -1051376
11359a051376k92701k48600k20550j82591j16152j8148R8588J75430J16772p1163
$$ -1051376 -1344077 -1592677 -1813227 -1995818 -2111970 -2130118 -2031530 -1856100 -1739328 -1810491
11349a810491k30502k16649k9110K16492M22342N63765O13580N56679M65829M33238
$$ -1810491 -2040993 -2257642 -2286752 -2070260 -1647918 -1084153 -470573 86106 551935 985173
11339I85173N01231O85010R43947J150794J171076R77501O35057K29688j44209
$$ 985173 1486404 2171414 3115361 4266155 5437231 6414732 7049789 7279477 7135268
11330G135268l78780l72153j35103J37570K10026K4400k86145n53721o83716o60642
$$ 7135268 6756488 6384335 6249232 6386802 6596828 6621228 6335083 5781362 5097646 4437004
11320D437004n12394k81696k0010K16868L77590M04970K83448J14198J5687l1953
$$ 4437004 3924610 3642914 3622904 3839772 4217362 4622332 4905780 5019978 5035665 5003712
11310E003712j30573k95204m47045n20097m65921k51808O3059L44762N14652N57471
$$ 5003712 4873139 4577935 4130890 3610793 3144872 2893064 2956123 3300885 3815537 4373008
11300D373008M52765K18671l9297j92558k10685j61425r9577n7876o6429j15198
$$ 4373008 4825773 5044444 5005147 4812589 4601904 4440479 4340902 4283026 4216597 4101399
11290D101399j71774k00462j20080J29818M44766O19915N75843L75673R3385k01747
$$ 4101399 3929625 3729163 3609083 3738901 4183667 4803582 5379425 5755098 5848483 5646736
11280E646736m13354m29582k02224J50974L89575L55849J10399j29304j87591
$$ 5646736 5233382 4803800 4601576 4752550 5142125 5497974 5608373 5479069 5291478
11271E291478m8085K19425N23210P61500Q85634R25588Q93116P47968M73696Q2091
$$ 5291478 5243393 5462818 5986028 6747528 7633162 8558750 9451866 10199834 10673530 10755621
11261A0755621l85495q33804j165571j353089j417923j367424j220588j016260
$$ 10755621 10370126 9536322 8370751 7017662 5599739 4232315 3011727 1995467
11253A995467p92678n98625m41790k73762o8816J70418M37976O98944Q74570Q69920
$$ 1995467 1202789 604164 162374 -111388 -180204 -9786 428190 1127134 2001704 2871624
11243B871624O44284K69211j02244l43165m34515m31253l82675k88734j12612
$$ 2871624 3515908 3785119 3682875 3339710 2905195 2473942 2091267 1802533 1689921
11234A689921J30531L69052N84016P75498Q76842Q11845N69701K52853O8365J51305
$$ 1689921 1820452 2189504 2773520 3549018 4425860 5237705 5807406 6060259 6128624 6279929
11224F279929M12070O26283O44353N04716L68193L33922L49354L24451K31563
$$ 6279929 6691999 7318282 7962635 8467351 8835544 9169466 9518820 9843271 10074834
11215A0074834P1963j47160l98005o13610p11090o94439o64064o91878p72517
$$ 10074834 10146797 9999637 9601632 8988022 8276932 7582493 6918429 6226551 5454034
11206E454034q67328r53257j049147j168415j260650j225374r99306o30058k40158
$$ 5454034 4586706 3633449 2584302 1415887 155237 -1070137 -2069443 -2699501 -2939659
11197b939659N7858J83930J04532j25421l89739n90436o64052n58767k92925J1683
$$ -2939659 -2881801 -2697871 -2593339 -2718760 -3108499 -3698935 -4362987 -4921754 -5214679 -5202996
11187e202996K02963J77245m7557l12820m41047l85634k59230j90156j69328r9988
$$ -5202996 -5000033 -4822788 -4870345 -5183165 -5624212 -6009846 -6269076 -6459232 -6628560 -6728548
11177f728548Q2287L51864N92844O96986O75674O21148N48042L93361J50651j40226
$$ -6728548 -6646261 -6294397 -5701553 -5004567 -4328893 -3707745 -3159703 -2766342 -2615691 -2755917
11167b755917m26514o09603o02005m02257p3488L33772P97497J230186J458958
$$ -2755917 -3182431 -3792034 -4394039 -4796296 -4869784 -4536012 -3738515 -2508329 -1049371
11158a049371J384234J096833P67183M98526L00625J26731j4665n027K01948M31725
$$ -1049371 334863 1431696 2198879 2697405 2998030 3124761 3110096 3105069 3307017 3738742
11148C738742M91665M10732L65270M43787N34149M47970J54886j42403k20455
$$ 3738742 4230407 4641139 5006409 5450196 5984345 6432315 6587201 6444798 6224343
11139F224343n9880J81569L22525K71984Q0061j34986l19540m66311n28155m45900
$$ 6224343 6164463 6346032 6668557 6940541 7020602 6885616 6566076 6099765 5571610 5125710
11129E125710k51602j18573k00214m64680p49337r05251q77235p03201n13580
$$ 5125710 4874108 4755535 4555321 4090641 3341304 2436053 1558818 855617 342037
11120C42037m48522m97435n32289m84939l61555j45228J62995M72964O82807P56577
$$ 342037 -106485 -603920 -1136209 -1621148 -1982703 -2127931 -1964936 -1491972 -809165 -52588
11110e2588O82431M52781J28476j77268m09486n65574o03560n06112l58173k50491
$$ -52588 629843 1082624 1211100 1033832 624346 58772 -544788 -1050900 -1409073 -1659564
11100a659564k32294l51026o01602r01066j114489j108363q62657m52149M5438
$$ -1659564 -1891858 -2242884 -2844486 -3745552 -4860041 -5968404 -6831061 -7283210 -7237772
11091g237772N53992R87575J258234J311659J199944J050393R00245O89584M11223
$$ -7237772 -6683780 -5696205 -4437971 -3126312 -1926368 -875975 24270 713854 1125077
11082A125077Q9711k73164o11007p99904p58973m80262m3158L82194O39872P13711
$$ 1125077 1214788 941624 330617 -469287 -1228260 -1708522 -1751680 -1369486 -729614 -15903
11072a5903P21271P70681Q25565P23536L67714j07019m60227n57502l76441K6843
$$ -15903 705368 1476049 2301614 3025150 3392864 3285845 2825618 2268116 1891675 1918518
11062A918518M85883P52173O68956L21072l4296j86930r8041J61110M84756P84274
$$ 1918518 2404401 3156574 3825530 4146602 4112306 3925376 3827335 3988445 4473201 5257475
11052E257475J029604J173293J112359Q24674M29371N0043k76432n38471p26585
$$ 5257475 6287079 7460372 8572731 9397405 9826776 9876819 9600387 9061916 8335331
11043H335331q58958r85218j159687j348260j427253j320177j045169o80704l55440
$$ 8335331 7476373 6491155 5331468 3983208 2555955 1235778 190609 -490095 -845535
11034h45535j47553j719J46343K86560L69451L33448J92012M5329l6134l9832
$$ -845535 -993088 -994807 -848464 -561904 -192453 140995 333007 378336 342202 302370
11024C02370n920m9311k54130n51293p88217q86859q56137o99093m41514j67041
$$ 302370 296450 247139 -6991 -558284 -1346501 -2233360 -3089497 -3788590 -4230104 -4397145
11014d397145O2306K17734K88736L23592L84594M55117M64554L92819L07788L01138
$$ -4397145 -4334839 -4117105 -3828369 -3504777 -3120183 -2665066 -2200512 -1807693 -1499905 -1198767
11004a198767L83859M98140O11041P05243P33160O44058M26674J34517j05156
$$ -1198767 -814908 -316768 294273 999516 1732676 2376734 2803408 2937925 2832769
10995B832769j75327r4297L3693J41188J80365J29304M4369j1755k9537l4284
$$ 2832769 2657442 2563145 2596838 2738026 2918391 3047695 3092064 3080309 3050772 3016488
10985C016488q1041j93161l07763l44471k84835j74904j04305j11608j18988l2936
$$ 3016488 2935447 2742286 2434523 2090052 1805217 1630313 1526008 1414400 1295412 1262476
10975A262476J07135J34439o4147l95824o28614o35842n32226n26700o74772q52982
$$ 1262476 1369611 1504050 1439903 1044079 415465 -220377 -752603 -1279303 -1954075 -2807057
10965b807057r35592q77660o58106k73729K11767O76192J005177J146030J133556
$$ -2807057 -3742649 -4620309 -5278415 -5552144 -5340377 -4664185 -3659008 -2512978 -1379422
10956a379422J053192R70141Q70111O79312L80251N2359k00865l14541k92083
$$ -1379422 -326230 643911 1514022 2193334 2573585 2625944 2425079 2110538 1818455
10947A818455k02390j37777j52911k35461l50838m87878o44063p88861q67809
$$ 1818455 1616065 1478288 1325377 1089916 739078 251200 -392863 -1181724 -2049533
10938b049533q70049q74935r39009r64157p68065k75891L77499R30116J187497
$$ -2049533 -2919582 -3794517 -4733526 -5697683 -6465748 -6741639 -6364140 -5434024 -4246527
10929d246527J168700J047158R20385P22354M03205N8885j70626k57623k97726
$$ -4246527 -3077827 -2030669 -1110284 -387930 15275 74160 -96466 -354089 -651815
10920f51815l74157m67822n07988m51214l18568j78751p6734j3129m565p4983
$$ -651815 -1025972 -1493794 -2001782 -2452996 -2771564 -2950315 -3027049 -3040178 -3044743 -3119726
10910c119726j79697k49555k78523k88342k33678K1865N24447J054428J316654
$$ -3119726 -3299423 -3548978 -3827501 -4115843 -4349521 -4327656 -3803209 -2748781 -1432127
10901a432127J253414J053220R21079R06708R35780R31664Q55867P21226O09271
$$ -1432127 -178713 874507 1795586 2702294 3638074 4569738 5425605 6146831 6756102
10892F756102N88735N94655M85420K18061j12993l84562n31971n63741n63216
$$ 6756102 7344837 7939492 8424912 8642973 8529980 8145418 7613447 7049706 6486490
10883F486490o49159q80220j170087j330332j236397r17130n19785k35181j89229
$$ 6486490 5837331 4957111 3787024 2456692 1220295 303165 -216620 -451801 -641030
10874f41030l33873m79020n20864n56359o85262q26173q26206o60584m29201k07825
$$ -641030 -974903 -1453923 -1974787 -2531146 -3216408 -4042581 -4868787 -5529371 -5958572 -6166397
10864f166397K927K24576M76091P51871R95291J104128R66754N93661J78983j17744
$$ -6166397 -6163470 -5938894 -5462803 -4710932 -3715641 -2611513 -1644759 -1051098 -872115 -989859
10854i89859l22589m88762n68191n05242l27932j30637R303J02471K21033M05110
$$ -989859 -1312448 -1801210 -2369401 -2874643 -3202575 -3333212 -3323909 -3221438 -3000405 -2595295
$$ [...]
##END NTUPLES=NMR SPECTRUM
##END=
