##TITLE=31P ikalashn
LR-794-K-O-C2(CHCl3)
18.12.2024
##JCAMPDX= 6.0         $$ Bruker NMR JCAMP-DX V2.0
##DATA TYPE= NMR SPECTRUM
##DATA CLASS= NTUPLES
##ORIGIN= UXNMR, Bruker Analytische Messtechnik GmbH
##OWNER= root
$$ TOPSPIN		Version 1.3
$$ 2024-12-18 10:09:17.359 +0400  Irina@DPX200
$$ Compression mode = diff/dup
##.OBSERVE FREQUENCY= 81.01967998063
##.OBSERVE NUCLEUS= ^31P
##.ACQUISITION MODE= SIMULTANEOUS
##.ACQUISITION SCHEME= undefined
##.AVERAGES= 32
##.DIGITISER RES= 17
##SPECTROMETER/DATA SYSTEM= spect
##.PULSE SEQUENCE= zgpg
##.SOLVENT NAME= D2O
##.SHIFT REFERENCE= INTERNAL, D2O, 1, 298.5841
##AUDIT TRAIL= $$ (NUMBER, WHEN, WHO, WHERE, WHAT)
$$ ##TITLE= Audit trail, TOPSPIN		Version 1.3
$$ ##JCAMPDX= 5.01
$$ ##ORIGIN= Bruker BioSpin GmbH
$$ ##OWNER= Irina
$$ $$ F:/spectra/data/iren/nmr/P31dec/1/pdata/1/auditp.txt
$$ ##AUDIT TRAIL=  $$ (NUMBER, WHEN, WHO, WHERE, VERSION, WHAT)
(   1,<2024-12-18 10:08:05.187 +0400>,<Irina>,<DPX200>,<TOPSPIN 1.3>,
      <acquisition in progress>)
(   2,<2024-12-18 10:09:00.375 +0400>,<Irina>,<DPX200>,<TOPSPIN 1.3>,
      <Start of raw data processing
       efp BC_mod = 2 LB = 5 FT_mod = 6 PKNL = 1 PHC0 = 354.2755 PHC1 = 0.2778015 SI = 32K 
       data hash MD5: 32K
       C2 D7 1D DA C3 24 2A 29 5F C0 D4 FE 49 CE E7 54>)
(   3,<2024-12-18 10:09:03.281 +0400>,<Irina>,<DPX200>,<TOPSPIN 1.3>,
      <apk 
       data hash MD5: 32K
       8E 66 52 E2 3F 6C 1A 13 B4 94 28 09 73 BE 59 82>)
(   4,<2024-12-18 10:09:05.500 +0400>,<Irina>,<DPX200>,<TOPSPIN 1.3>,
      <abs n ABSG = 5 
       data hash MD5: 32K
       91 72 DE D2 7E 90 6C 42 CA FF 88 86 6E E0 95 DC>)
$$ ##END=
$$ 
$$ $$ hash MD5
$$ $$ CB B3 A3 CE 79 0E 87 B7 38 25 E1 46 0D 21 DD E0
##$RELAX= 
##$RELAX= 
##$RELAX= 
##$RELAX= 
##$RELAX= 
##$RELAX= 
##$RELAX= 
##$RELAX= 
##$RELAX= 
##$RELAX= 
##$RELAX= 
$$ Bruker specific parameters
$$ --------------------------
##$DU= <F:/spectra>
##$EXPNO= 1
##$NAME= <P31dec>
##$PROCNO= 1
##$TYPE= <nmr>
##$USER= <iren>
##$AMP= (0..31)
100 100 100 100 100 100 100 100 100 100 100 100 100 100 100 100 100 100 
100 100 100 100 100 100 100 100 100 100 100 100 100 100 
##$ANAVPT= -1
##$AQSEQ= 0
##$AQ_mod= 1
##$AUNM= <au_zg>
##$AUTOPOS= <>
##$BF1= 81.014009
##$BF2= 200.13
##$BF3= 200.13
##$BF4= 200.13
##$BF5= 200.13
##$BF6= 200.13
##$BF7= 200.13
##$BF8= 200.13
##$BYTORDA= 1
##$CFDGTYP= 0
##$CFRGTYP= 5
##$CHEMSTR= <none>
##$CNST= (0..63)
1 1 145 1 1 1 1 1 1 1 1 1 1 1 1 1 1 1 1 1 1 1 1 1 1 1 1 1 1 1 1 1 1 1 
1 1 1 1 1 1 1 1 1 1 1 1 1 1 1 1 1 1 1 1 1 1 1 1 1 1 1 1 1 1 
##$CPDPRG= <waltz16>
##$CPDPRG1= <>
##$CPDPRG2= <waltz16>
##$CPDPRG3= <>
##$CPDPRG4= <mlev>
##$CPDPRG5= <mlev>
##$CPDPRG6= <mlev>
##$CPDPRG7= <mlev>
##$CPDPRG8= <mlev>
##$CPDPRGB= <>
##$CPDPRGT= <>
##$D= (0..63)
0 1 0 0 0 0 0 0 0 0.06 0 0.03 2e-005 3e-006 0 0 0.0002 0 0 0 0 0 0 0 0 
0 0 0 0 0 0 0 0 0 0 0 0 0 0 0 0 0 0 0 0 0 0 0 0 0 0 0 0 0 0 0 0 0 0 0 
0 0 0 0 
##$DATE= 1734502136
##$DBL= (0..7)
120 120 120 11 120 120 24 19 
##$DBP= (0..7)
$$ [...]
##$SW_h= 37037.037037037
##$TD= 32768
##$TD0= 1
##$TE= 300
##$TE2= 300
##$TE3= 300
##$TEG= 300
##$TL= (0..7)
0 120 53 12 22 120 120 120 
##$TP= (0..7)
150 150 150 150 150 150 150 150 
##$TP07= 0
##$TPNAME0= <>
##$TPNAME1= <>
##$TPNAME2= <>
##$TPNAME3= <>
##$TPNAME4= <>
##$TPNAME5= <>
##$TPNAME6= <>
##$TPNAME7= <>
##$TPOAL= (0..7)
0.5 0.5 0.5 0.5 0.5 0.5 0.5 0.5 
##$TPOFFS= (0..7)
0 0 0 0 0 0 0 0 
##$TUNHIN= 0
##$TUNHOUT= 0
##$TUNXOUT= 0
##$USERA1= <user>
##$USERA2= <user>
##$USERA3= <user>
##$USERA4= <user>
##$USERA5= <user>
##$V9= 5
##$VALIST= <valist>
##$VCLIST= <CCCCCCCCCCCCCCC>
##$VD= 0
##$VDLIST= <DDDDDDDDDDDDDDD>
##$VPLIST= <PPPPPPPPPPPPPPP>
##$VTLIST= <TTTTTTTTTTTTTTT>
##$WBST= 1024
##$WBSW= 4
##$XGAIN= (0..3)
0 0 0 0 
##$XL= 0
##$YL= 0
##$YMAX_a= 3377
##$YMIN_a= -3789
##$ZGOPTNS= <>
##$ZL1= 120
##$ZL2= 120
##$ZL3= 120
##$ZL4= 120
##$ABSF1= 298.5841
##$ABSF2= -158.5842
##$ABSG= 5
##$ABSL= 5
##$ALPHA= 0
##$AQORDER= 0
##$ASSFAC= 0
##$ASSFACI= 0
##$ASSFACX= 0
##$ASSWID= 0
##$AUNMP= <proc_1d>
##$AXLEFT= 0
##$AXRIGHT= 0
##$AXTYPE= 0
##$AXUNIT= <>
##$AZFE= 0.1
##$AZFW= 0.5
##$BCFW= 0
##$BC_mod= 2
##$BYTORDP= 0
##$COROFFS= 0
##$CY= 12.5935478210449
##$DATMOD= 1
##$DC= 0
##$DFILT= <>
##$DTYPP= 0
##$F1P= 47.1127640792319
##$F2P= -24.0371245302204
##$FCOR= 0.5
##$FTSIZE= 32768
##$FT_mod= 6
##$GAMMA= 0
##$GB= 0
##$INTBC= 1
##$INTSCL= 7.269226e-011
##$ISEN= 30
##$LB= 5
##$LEV0= 0
##$LPBIN= 0
##$MAXI= 12.09355
##$MC2= 0
##$MEAN= 0
##$ME_mod= 0
##$MI= 0.7550151
##$NCOEF= 0
##$NC_proc= -9
##$NLEV= 6
##$NOISF1= 298.5841
##$NOISF2= 270.0111
##$NSP= 0
##$NTH_PI= 0
##$NZP= 0
##$OFFSET= 298.5841
##$PC= 1.4
##$PHC0= 42.1449
##$PHC1= -30.68563
##$PH_mod= 1
##$PKNL= yes
##$PPARMOD= 0
##$PPDIAG= 0
##$PPIPTYP= 0
##$PPMPNUM= 100
##$PPRESOL= 1
##$PSCAL= 0
##$PSIGN= 0
##$REVERSE= no
##$SF= 81.014009
##$SI= 32768
##$SIGF1= 270.0111
##$SIGF2= -158.5842
##$SINO= 77.54984
##$SIOLD= 32768
##$SREGLST= <31P.CDCl3>
##$SSB= 0
##$STSI= 32768
##$STSR= 0
##$SW_p= 37037.037037037
##$SYMM= 0
##$S_DEV= 0
##$TDeff= 32768
##$TDoff= 0
##$TI= <>
##$TILT= no
##$TM1= 0
##$TM2= 0
##$TOPLEV= 0
##$USERP1= <user>
##$USERP2= <user>
##$USERP3= <user>
##$USERP4= <user>
##$USERP5= <user>
##$WDW= 1
##$XDIM= 32768
##$YMAX_p= 344166128
##$YMIN_p= -2895780
$$ End of Bruker specific parameters
$$ ---------------------------------
##NTUPLES= NMR SPECTRUM
##VAR_NAME=  FREQUENCY,     SPECTRUM/REAL,   SPECTRUM/IMAG
##SYMBOL=    X,             R,               I
##VAR_TYPE=  INDEPENDENT,   DEPENDENT,       DEPENDENT
##VAR_FORM=  AFFN,          ASDF,            ASDF
##VAR_DIM=   32768,         32768,           32768
##UNITS=     HZ,            ARBITRARY UNITS, ARBITRARY UNITS
##FACTOR=    1.13031516577767, 1,            1
##FIRST=     37037.037037037, 682070,        787419
##LAST=      0,             216614,          -905096
##MIN=       0,             -2895780,        0
##MAX=       37037.037037037, 344166128,     0
$$ Real data points
##PAGE= N=1
##DATA TABLE= (X++(R..R)), XYDATA
$$ [...]
19264 -35840 -204150 -301571 -350707 -214212 109207 406693 621605 772741 771663 679345 652309
19253 652309 534244 287932 156870 186892 252987 217662 -40534 -431441 -609054 -539639
19243 -539639 -427366 -328389 -267900 -300269 -325090 -179363 43811 98725 66637 150858 280788
19232 280788 386064 392407 199652 -115356 -402186 -623194 -679631 -408582 -37521 231119
19222 231119 372146 302364 94075 942 102678 230471 361706 645804 1043133 1257797
19212 1257797 1156341 890456 656273 401354 -564 -449201 -785969 -953335 -972776 -975747
19202 -975747 -937517 -788689 -597084 -455750 -365911 -301336 -241982 -168606 -55536 76702
19192 76702 127428 98889 56968 -38183 -120705 -170294 -259395 -319272 -310266 -318240 -312035 -318318
19180 -318318 -510178 -834483 -1068124 -992911 -652445 -318993 -70325 168437 475809 771368
19170 771368 1011806 1083523 934106 694206 314332 -159987 -503998 -609735 -416728 -146243
19160 -146243 -76327 -147587 -249967 -395686 -563591 -616973 -520585 -467347 -515805 -427194 -124178
19149 -124178 110081 113869 84779 155921 399772 649084 627360 455789 330866 301995 245435
19138 245435 41558 -284111 -610235 -753772 -730173 -613864 -407047 -100772 242507 471538
19128 471538 550795 586930 604034 604567 591866 527742 433328 357627 181837 -63491 -115381
19117 -115381 18655 198389 270528 147159 -42732 -104994 -13322 18559 68067 180500
19107 180500 124381 49741 177615 349686 366735 300155 299141 276276 197012 47570 -210175
19096 -210175 -561343 -876496 -1007756 -949617 -800524 -719573 -732644 -796474 -856574 -873423 -680627
19085 -680627 -317868 -162234 -339411 -642386 -799886 -796935 -711247 -570374 -363543 -127436
19075 -127436 1539 -15819 -132587 -255759 -289761 -262930 -132330 75433 300136 409401
19065 409401 415412 450846 416975 351832 326782 305451 275865 225563 246067 320813 403772 501458
19053 501458 546641 436494 235208 138572 260178 337497 222022 90809 85083 143748 255530
19042 255530 496902 750834 818031 688920 517816 385167 447859 663130 754041 579240
19032 579240 312827 64822 -94002 -132461 -193590 -308540 -398564 -441001 -400662 -307610 -182185
19021 -182185 -16585 174563 368216 458442 441188 470896 525137 475678 365214 206802
19011 206802 -75681 -346496 -423509 -414787 -365824 -212843 24777 218893 219435 91424 23005
19000 23005 20336 -9871 6886 163159 357273 371996 194867 -138706 -580499 -931692 -932739
18989 -932739 -734901 -588097 -479078 -437529 -432771 -315376 -126260 -90684 -177219 -145034 -72553
18978 -72553 -28492 46867 -13861 -149264 -210307 -167600 11516 172364 166103 -30047 -187167
18967 -187167 -163721 -152734 -263691 -309793 -205463 -70858 -64256 -174797 -280373 -283456 -161915
18956 -161915 -44791 44830 70280 -47804 -257405 -432153 -450186 -294862 -181076 -256046
18946 -256046 -403109 -413821 -240576 9784 178308 207315 210157 277735 399623 444297 312638
18935 312638 77643 -115419 -212318 -247053 -235703 -208902 -209865 -196869 -74531 66131 121171
18924 121171 43969 -175830 -395351 -518497 -522605 -532527 -533657 -497150 -443752 -368659 -380912
18913 -380912 -375119 -230190 -153477 -220813 -327816 -375227 -250343 -62028 97351 309876
18903 309876 575104 646613 395842 112060 49510 85877 -19306 -262460 -533190 -697084
18893 -697084 -656933 -474317 -352948 -405721 -458000 -303739 -113362 -133509 -234944 -118852
18883 -118852 92579 87889 -86932 -323650 -480995 -545382 -620902 -604073 -364253 -127805
18873 -127805 -158732 -258031 -201571 -93213 -77720 -147909 -256585 -420031 -444700 -194345 44312
18862 44312 113622 89917 3238 -126962 -167699 -147506 -194619 -157187 4263 66279 -47360
18851 -47360 -194239 -221491 -157481 -60407 34841 140431 334429 529777 702517 878492
18841 878492 1018555 1078724 1018641 803779 530569 268628 -55438 -365495 -501554 -457987
18831 -457987 -392765 -321606 -262241 -237519 -226197 -305437 -476693 -645213 -672687 -558121 -403537
18820 -403537 -196070 -15724 52755 30905 -99215 -207147 -197856 -2529 336299 576796
18810 576796 705814 762372 731646 631868 486430 411114 381103 341772 321496 216259 19665
18799 19665 -102218 -60858 113924 266998 178121 -82877 -308934 -474580 -527337 -521728 -555215
18788 -555215 -565652 -445236 -237922 -208130 -411528 -623055 -746160 -812177 -849217 -858348 -827899
18777 -827899 -744236 -474463 -106055 162079 307039 395879 499461 481162 307842 201850
18767 201850 175234 105891 68600 123021 257433 399623 403624 163025 -251597 -601028 -700176
18756 -700176 -618502 -499276 -353134 -140053 130827 441957 671681 625059 303246 -86190
18746 -86190 -336518 -388181 -393253 -399205 -300443 -119453 72872 218450 183431 -47500 -252927
18735 -252927 -276608 -241644 -146845 20564 104697 30645 -103319 -131284 -7977 214011 477012
18724 477012 636452 595761 449334 304928 131332 -49841 -149272 -177553 -190631 -124313
18714 -124313 21399 203615 374456 396881 296451 160772 55776 48370 112603 130409
18704 130409 114758 55809 -55812 -50348 100072 198892 109514 -79952 -210389 -231545 -111410
18693 -111410 -16986 -138668 -328543 -414167 -440059 -428368 -274025 -61468 36596 -26404 -162148
18682 -162148 -241019 -146326 -36452 -141768 -332768 -435504 -434369 -424644 -515942 -673631 -739954
18671 -739954 -566727 -254971 20836 168458 163144 154651 194553 226503 308767 378200 402489
18660 402489 387253 255701 111320 -4041 -105774 -198446 -197713 -5821 240084 416008
18650 416008 472147 417090 247773 55250 -36526 -10907 114653 321052 476884 429758
18640 429758 212578 -102798 -428526 -585659 -536193 -444764 -298298 -88219 94063 155169
18630 155169 149393 168306 126314 -57028 -298327 -448816 -398100 -265656 -288421 -414158 -412594
18619 -412594 -162948 153712 267397 141266 -89035 -181738 -96678 -3849 -57278 -141494
18609 -141494 -259315 -438794 -501144 -304975 74185 410845 600419 672189 599217 378883
18599 378883 159704 106104 143487 195152 254742 258657 295359 388219 485946 526749 347260
18588 347260 61387 -78327 -54506 71423 220836 408364 528166 417063 161057 -60237
18578 -60237 -217471 -397368 -517817 -459105 -383425 -429859 -486364 -446790 -456101 -487897 -456288
18567 -456288 -357598 -256349 -256932 -346287 -499158 -669415 -771952 -787962 -730558 -634463 -539126
18556 -539126 -426682 -397778 -524788 -735821 -883863 -956947 -945092 -798807 -618480 -460903
18546 -460903 -294411 -144169 -79054 -1395 101671 171124 148608 87622 -4361 -115515 -185919
18535 -185919 -295008 -412835 -405478 -358798 -360043 -364828 -382176 -353280 -262198 -195972 -111687 6382
18523 6382 11620 -60444 -190286 -264130 -165197 16699 156814 255895 261313 281007 310382 229683
18511 229683 91390 -56240 -164593 -121401 119588 401887 457560 290736 145022 174407
18501 174407 282744 325285 307833 270941 197066 82442 -78268 -229430 -375499 -508513
18491 -508513 -552543 -479291 -238091 36264 218945 440616 642540 609162 322000 24700
18481 24700 -129604 -92498 25531 155644 279070 278802 196024 99166 4016 -166649 -297796
18470 -297796 -361977 -456376 -600269 -628935 -460546 -281782 -185635 -136194 -117943 -65420 83393
18459 83393 286230 412378 396051 304556 221127 187032 201729 217111 283976 402830 438774
18448 438774 336854 197367 35395 -128438 -209690 -162054 -36093 48722 97019 210216
18438 210216 336582 271358 22179 -188117 -228490 -213696 -262507 -404284 -554781 -610789
18428 -610789 -557978 -391883 -238571 -218091 -336407 -436086 -321844 -53875 226307 412347
18418 412347 452263 411961 341042 240095 250841 418624 551222 537688 341245 79809
18408 79809 -90055 -104964 -89529 -182860 -244408 -149771 -63654 -51915 -133144 -348810 -561366
18397 -561366 -656463 -596947 -422084 -243029 -177234 -218204 -128801 53181 102622 51115 42386
18386 42386 64433 80493 94709 72850 -1976 -67705 -45718 -18436 -65200 -156537 -313721
18375 -313721 -477472 -566296 -539143 -425324 -332557 -344301 -417116 -518640 -601293 -567438 -458005
18364 -458005 -480317 -552998 -514440 -406249 -365565 -396470 -413402 -427745 -394212 -312105 -274299
18353 -274299 -247870 -222485 -215322 -236668 -289724 -376417 -513493 -611513 -639058 -529129 -381381
18342 -381381 -234999 -96098 -63025 -100855 -131705 -87560 -64616 -157849 -286253 -366827 -428923
18331 -428923 -526870 -639954 -682648 -533851 -175977 65252 69251 68853 78930 -15049 -276505
18320 -276505 -647980 -955362 -1043364 -921869 -643356 -340573 -136895 81101 452547 849095
18310 849095 960845 751766 477433 422382 566067 654457 674440 638543 610039 728983
18300 728983 940210 1060554 1027748 844630 554230 231947 -58097 -197945 -178548 -83281
18290 -83281 26174 113543 167104 136168 12674 -39756 110060 269433 305692 149603 -160706
18279 -160706 -405424 -443937 -391569 -376557 -336446 -257430 -328216 -543706 -623463 -467195 -258969
18268 -258969 -73155 173775 445680 539113 496339 403301 311219 176410 -114958 -376038
18258 -376038 -412409 -281168 -138329 -100225 -107118 -70124 -106670 -336641 -663811 -874226 -899893
18247 -899893 -870734 -854153 -728299 -489755 -223415 -10069 120563 142426 126851 146304
18237 146304 179965 261543 346380 389020 368280 200382 -10161 -118536 -100183 28317 121246
18226 121246 66600 -66329 -198933 -336941 -454361 -529449 -483250 -352070 -276916 -293627
18216 -293627 -250355 -72587 124098 278393 385339 497120 471584 230261 -63852 -321751
18206 -321751 -360523 -214364 -110989 -47355 347 4451 -7207 -98494 -223307 -316693 -407707
18195 -407707 -499974 -488193 -300636 10694 425540 834483 1071542 1113020 1051020 1012273
18185 1012273 1009894 830393 345123 -218146 -584264 -673256 -620345 -534631 -429049 -307167
18175 -307167 -246556 -272218 -248603 -219638 -275854 -306054 -251162 -141188 -12575 103159 242768
18164 242768 392563 518700 653486 672511 539689 468580 565916 686327 681298 625162 620383
18153 620383 741835 1047168 1331581 1397913 1189623 862339 688236 673133 760154 893986
18143 893986 1013369 1056296 1016109 863782 590461 139498 -307182 -502430 -453172 -301279
18133 -301279 -119991 67268 139882 68582 -6345 -33182 -56779 -83889 -75014 -82359 -99404
18122 -99404 -71559 -12020 -62305 -153808 -215994 -272559 -355225 -531492 -707049 -793165 -744667
18111 -744667 -562443 -425338 -454835 -592929 -681996 -596153 -367705 -119068 80693 207222
18101 207222 219453 209695 200715 169599 122158 62786 39976 119718 194101 176333 131708 107892
18089 107892 160782 316300 493052 726802 943758 868174 635891 456926 365331 325725
18079 325725 292171 293395 261143 193829 152705 60131 -1965 82206 185446 221119 331763
18068 331763 544827 746342 944838 1037988 934655 760024 618996 522141 426273 270647
18058 270647 60209 -92017 -217924 -356980 -438130 -415079 -268136 -21142 233497 311717
18048 311717 147555 -197659 -513909 -525084 -338883 -146201 6264 -5818 -150430 -267053
18038 -267053 -335309 -323329 -144389 26881 27739 -105554 -220598 -290476 -412027 -503494 -434350
18027 -434350 -284996 -213827 -137772 11989 171489 305325 376424 370224 372640 361186 278968
18016 278968 104248 -144666 -350927 -353401 -140814 122992 268863 313645 393769 414964
18006 414964 364978 359285 267297 115503 70937 69041 -45202 -215765 -301610 -336369 -319879
17995 -319879 -213676 -104230 31272 215413 332743 369002 545474 889086 1169237 1191236
17985 1191236 939411 556353 198901 -86230 -347363 -493782 -482079 -297843 59712 378437
17975 378437 475616 427190 343851 266849 247010 335699 369084 280957 163941 103654 129940
17964 129940 117208 49102 54108 189388 279553 241618 213160 239899 362955 549719 618054
17953 618054 538636 445315 465915 551764 600780 583818 526943 464922 416444 349809 244934
17942 244934 181946 268993 472324 625428 608043 451679 112795 -374914 -808408 -1004756
17932 -1004756 -863930 -551911 -434198 -629328 -854047 -957701 -926232 -799938 -688357 -599324
17922 -599324 -502054 -397258 -289440 -220690 -202123 -213681 -236773 -242150 -220841 -167560 -138636
17911 -138636 -237833 -322973 -346694 -434981 -624106 -789493 -940765 -907353 -688758 -550482
17901 -550482 -592921 -626670 -453019 -119235 190825 265780 85422 -131606 -215138 -113000
17891 -113000 26845 66003 51186 51478 46527 -49700 -288345 -515719 -534677 -368459 -126130
17880 -126130 75171 137517 16238 -179557 -319693 -171104 246048 628051 825817 938084
17870 938084 1009462 872532 558541 235494 -87726 -350324 -422399 -245284 37348 174924
17860 174924 194395 187501 102723 -75570 -241135 -196996 46258 149525 -11466 -266931
17850 -266931 -346981 -176030 63514 138865 33672 -18613 61811 136400 15481 -253681
17840 -253681 -469206 -516388 -346921 -32228 198868 262917 236180 167790 133356 165596 258123
17829 258123 423286 552250 528510 391314 296665 251051 220537 267276 348327 315381 221128
17818 221128 228799 315892 442686 524201 549873 528489 326511 -29729 -329620 -405723 -296143
17807 -296143 -100959 12498 40566 50208 48564 47370 87977 117413 67663 18158 31582 46741
17795 46741 98108 343881 592136 719529 821766 863770 673311 274365 -88464 -281366
17785 -281366 -348416 -399461 -502348 -574850 -543572 -434677 -173256 176953 476838 689844
17775 689844 816310 820864 756709 583623 326059 174606 217303 387417 514411 564690
17765 564690 606521 629478 596708 553938 584917 631193 547354 350814 154549 -31623 -161923
17754 -161923 -220475 -230707 -246737 -233249 -278287 -518247 -776303 -881344 -922650 -1020908 -1133557
17743 -1133557 -1199575 -1077538 -845832 -730344 -693358 -559327 -302416 -47537 76362 135588
17733 135588 265081 350720 297051 229176 246291 352235 415711 261969 -86944 -479236
17723 -479236 -732840 -762206 -675412 -582070 -519751 -457987 -399207 -346714 -168587 74361 172571
17712 172571 92513 -29043 -202973 -363559 -342314 -273255 -180506 -71782 -13530 73958 197698
17701 197698 218806 93229 -149056 -446217 -645199 -689968 -742728 -866940 -896772 -750401
17691 -750401 -563213 -448736 -367098 -292537 -315182 -470108 -725651 -994293 -1112886 -1139645
17681 -1139645 -1153408 -1025997 -766998 -514206 -273447 -29612 236422 535139 751031 752106
17671 752106 689158 666390 502030 261129 63093 -89645 -221945 -339548 -368095 -362117
17661 -362117 -452879 -668998 -842488 -900361 -871526 -758994 -660437 -493202 -254873 -120964
17651 -120964 -138185 -180973 -257970 -413165 -584246 -788070 -1023266 -1162364 -1196193 -1190822 -1165478
17640 -1165478 -1139061 -979322 -643816 -234266 81392 251264 368737 363322 202797 9928
17630 9928 -137492 -134602 -18780 -17858 -126496 -184961 -122461 3217 150632 283380 316035
17619 316035 299610 251761 250842 297404 291956 147505 -8517 -60916 -94041 -72991 91440
17608 91440 259523 258417 163547 51479 -79420 -297962 -534600 -541557 -289888 -74606 8618
17597 8618 32209 -73373 -396102 -744942 -866753 -734540 -492989 -370594 -451826 -616623
17587 -616623 -764306 -786290 -580308 -344107 -320094 -502453 -634953 -540814 -273012 -14812
17577 -14812 83277 -12747 -174673 -266520 -324550 -329056 -243412 -228495 -348317 -489300 -548378
17566 -548378 -620276 -689116 -627273 -490115 -428819 -413213 -362170 -234103 -53777 60818 57841
17555 57841 -4363 -22791 15825 -29622 -184470 -383407 -539126 -526957 -356113 -134127 140535
17544 140535 387845 517396 583034 577547 467207 285749 103389 -42028 -189159 -379246
17534 -379246 -583234 -725007 -783594 -732891 -664952 -625417 -534524 -455059 -333343 -121671 71749
17523 71749 200709 205470 83886 115317 322625 447706 373415 274817 420258 754785 1078746
17512 1078746 1202842 966854 446241 -112532 -469543 -554656 -329808 123867 565585 746961
17502 746961 673506 451185 248928 194257 84697 -176886 -477219 -679201 -715064 -567816
17492 -567816 -276967 4994 177855 193962 46393 -212883 -382262 -299762 -156042 -38057
17482 -38057 169930 314609 245327 37166 -154063 -226036 -107444 162380 551956 983534
17472 983534 1178052 1130819 998240 750371 356073 -109332 -476920 -591628 -545311 -494234
17462 -494234 -472585 -447484 -430191 -375566 -305344 -253188 -157403 -113106 -260357 -373880 -416348
17451 -416348 -473604 -483714 -523015 -536751 -413108 -111607 224345 340790 161856 -78290
17441 -78290 -217749 -467454 -808976 -1046657 -1082294 -941694 -758047 -517885 -405957 -557279
17431 -557279 -764374 -826119 -819338 -766281 -669797 -549495 -459910 -464820 -479576 -423817 -424940 -507255
17419 -507255 -543641 -441995 -295607 -153252 -30637 -14049 -143103 -350517 -556266 -691386
17409 -691386 -739383 -713786 -678401 -726307 -761863 -719860 -685312 -729600 -775788 -633184 -420129
17398 -420129 -221535 40848 330393 596802 739662 705128 526835 326211 198672 59774
17388 59774 -71391 -87498 -43692 -42785 -80483 -110769 -177829 -300868 -385198 -416219 -469659 -500828
17376 -500828 -356828 -125669 -48155 -62557 -49097 -36378 -109550 -241671 -370540 -474335
17366 -474335 -460540 -300148 -114370 12358 28927 -30647 -145095 -285971 -390066 -406391
17356 -406391 -383958 -435567 -444685 -307619 -71848 259707 622183 775402 602653 328851
17346 328851 143484 13765 -50009 26827 149582 149518 96275 124533 110416 -44193 -239089
17335 -239089 -332666 -263294 -73279 67271 19576 -146960 -256196 -240740 -223732 -289868 -416382
17324 -416382 -506823 -533058 -522498 -490217 -481109 -502812 -469480 -344439 -237674 -188518 -100421
17313 -100421 31856 78192 69186 94174 217949 440709 655086 731733 744227 808118 805350
17302 805350 635987 325432 -4562 -148634 -111387 -31459 39245 120254 65751 -144215
17292 -144215 -213924 -7805 267645 404687 508919 611734 621430 635416 699738 611284 355770
17281 355770 116985 -101961 -200538 -70939 111431 200430 271869 330014 323486 317027 410392
17270 410392 531739 601178 622465 571757 533255 435879 273539 266751 391855 435346 311209
17259 311209 131239 33266 -15371 -24921 -9291 -2881 -12929 -75013 -136100 -167283 -159596 -149602
17247 -149602 -179416 -162302 -108468 -71657 51402 122043 -46486 -253266 -341949 -478991 -666698
17236 -666698 -740717 -804795 -793595 -616037 -411140 -244906 -150242 -190983 -372802 -574792
17226 -574792 -691509 -775968 -857188 -943437 -1038470 -1087537 -1125400 -1039531 -835708 -596563 -201400
17215 -201400 242756 448011 412524 269979 77987 -84568 -82904 -19458 -12144 -41837 -120265
17204 -120265 -220184 -212329 -124826 -139034 -231064 -372873 -603678 -694041 -549336 -370998 -326424
17193 -326424 -403299 -537365 -669071 -702016 -544997 -215824 16621 -35179 -288733 -402418
17183 -402418 -173581 75491 96088 -47724 -137236 -78520 27233 122197 115783 -36517 -184261
17172 -184261 -37680 311644 607714 777718 864023 928427 1007270 1122636 1175360 1128889
17162 1128889 1041881 898839 629148 225189 -44171 -10073 122432 118634 -43961 -259745
17152 -259745 -347545 -294453 -179517 11018 247433 445557 518641 424112 253378 123753
17142 123753 28826 -81781 -194804 -184726 -127868 -55692 69468 108270 17775 -75622 -80442
17131 -80442 -13128 -18538 -42500 -21979 -198076 -469112 -617212 -616474 -430816 -190620 -42875
17120 -42875 101632 168815 55360 39157 133316 133945 84169 52958 30968 39980 132364 232044
17108 232044 242421 258768 399350 583989 719846 764110 724970 633566 502940 241135
17098 241135 -135048 -448284 -515737 -286587 -3451 105487 51325 -135275 -333750 -449173
17088 -449173 -384261 -79205 297002 557795 603252 425832 84211 -301562 -527240 -637889
17078 -637889 -695571 -627343 -525826 -532149 -533723 -363881 -68245 216089 449394 704608 839342
17067 839342 674061 361348 3359 -400394 -650056 -645626 -466301 -261000 -74383 67710
17057 67710 211818 396212 487199 414212 221440 111939 143586 162007 165893 166355 216529
17046 216529 266818 276162 292126 326794 409039 510416 624475 658829 634648 638364 604075
17035 604075 469809 368444 443054 528146 510920 528088 572016 471458 227244 -24150
17025 -24150 -181328 -149845 35143 216049 368754 440348 306489 -31146 -425745 -723675
17015 -723675 -787095 -609449 -349131 -62520 157908 160128 12547 -131179 -245933 -282141
17005 -282141 -243199 -229528 -203737 -254657 -409619 -435199 -312513 -185745 -19883 247615
16995 247615 538035 770499 923015 1074874 1384186 1719987 1820213 1690281 1473606 1151539
16985 1151539 768752 507944 349651 200488 138984 99094 303 -175324 -375895 -492082
16975 -492082 -500266 -453580 -442882 -487020 -611962 -751484 -805079 -759436 -740806 -759345 -798546
16964 -798546 -852702 -861764 -786731 -718372 -641655 -457641 -226282 -145692 -215214 -258119 -152628
16953 -152628 16266 85240 91516 138954 238483 445844 762318 1143481 1431580 1449980 1257322
16942 1257322 989851 741262 636907 701238 736180 671042 583096 544291 504877 444010 376122
16931 376122 325755 314232 254598 125706 5809 -80641 -134477 -176564 -263577 -349420 -327102
16920 -327102 -233311 -206124 -276456 -296911 -237302 -140263 -19332 123773 253902 357776 493571
16909 493571 720756 831499 662047 350765 161715 114473 125676 203585 200620 47006
16899 47006 -237986 -444046 -391992 -217327 -143744 -189135 -141553 35588 210548 350096
16889 350096 454547 469214 431217 522388 694038 767759 745581 685495 606342 493020 439091
16878 439091 467607 416841 291640 175307 30335 -209643 -447790 -602613 -641388 -563296
16868 -563296 -392613 -189058 2250 115658 144731 238938 314774 289778 263970 187652 115657
16857 115657 274533 517906 562243 500314 484085 418913 259686 136465 159126 328551
16847 328551 627702 872608 961129 904766 767420 696946 626915 497457 430459 550908
16837 550908 717577 716751 561817 404942 319828 402721 658534 884112 1045981 1158534
16827 1158534 1118718 963952 843053 724527 602032 436045 112628 -205882 -401756 -509928
16817 -509928 -559277 -633026 -813901 -1021014 -1135727 -1270597 -1475512 -1655455 -1852559 -1986945
16807 -1986945 -1852812 -1530027 -1347059 -1447793 -1489437 -1262689 -1023895 -855351 -733820 -655010
16797 -655010 -629459 -622842 -660377 -697901 -683362 -601935 -444356 -330007 -279718 -268613 -243418
16786 -243418 -147443 -65803 -32848 47218 199687 309226 364064 341263 238415 134325 -1709
16775 -1709 -101611 -162499 -295158 -448633 -517093 -463934 -375653 -362781 -309540 -256656 -313161
16764 -313161 -394431 -331823 -147392 102156 290915 392256 460199 520299 558800 526379 421753
16753 421753 233542 25213 -185301 -414287 -548547 -564953 -509346 -460893 -331252 -40974
16743 -40974 190771 339419 417886 345498 116530 -148696 -307045 -247907 -62103 58174
16733 58174 207735 528449 868899 980015 769037 544878 542699 615998 555956 249731
16723 249731 -139287 -357723 -428269 -461178 -463879 -450158 -437002 -337144 -164189 101174 383434
16712 383434 441187 360545 364842 472743 594031 725928 813025 773471 680268 645260 527028
16701 527028 220893 -132811 -493527 -602427 -410960 -185041 20826 31257 -193789 -388803
16691 -388803 -353689 -161850 14545 206321 424968 552922 538881 424700 370235 436344
16681 436344 576753 717879 691631 445987 151037 -118249 -192756 -39063 149343 297341
16671 297341 369850 448126 518134 470128 359924 365487 505229 585682 622554 677940 667140
16660 667140 567863 471680 438615 430298 437477 485490 491612 329806 117685 36204 9489 14681
16648 14681 51906 118303 263309 301278 217161 193847 319577 633174 926844 932250 718554
16637 718554 535367 491432 550873 600414 535047 306192 117805 78813 159117 260653 161083
16626 161083 -109460 -307586 -381664 -418414 -537159 -761152 -850104 -720533 -443094 -179428
16616 -179428 -121946 -205008 -296913 -312239 -357879 -494189 -544503 -458157 -359418 -450224 -701189
16605 -701189 -842733 -769500 -733038 -746486 -727397 -720961 -702191 -744411 -861529 -897651 -826773
16594 -826773 -670538 -357603 -105657 -63147 -87897 -174362 -354199 -473147 -521943 -486862
16584 -486862 -408979 -471342 -668308 -879023 -1056665 -1117867 -1073785 -985945 -944484 -998835 -958161
16573 -958161 -675423 -231556 120058 218929 135336 114773 170354 195866 98782 -191538 -455118
16562 -455118 -476564 -423268 -451014 -402813 -140070 225309 557601 755985 820450 829958 733423
16551 733423 505918 283244 194246 268547 424270 585463 610050 510805 451493 382342 272952
16540 272952 231649 327440 448425 449787 376015 298290 262350 318710 511648 812489 1091374
16529 1091374 1255649 1195204 980572 823392 760987 750649 808045 952423 1087225 1105966
16519 1105966 1001069 838168 675406 588218 644544 771966 735147 570165 462262 428490
16509 428490 422627 417181 442757 509261 468091 222749 -204652 -540802 -506119 -201227 117993
16498 117993 414804 595940 482348 138066 -223320 -321447 -128063 220026 544970 623035
16488 623035 475841 219295 -16578 -130834 -281328 -473371 -525409 -502383 -523260 -594265
16478 -594265 -571750 -399580 -215061 -193006 -298494 -426176 -593114 -820929 -1074557 -1121405
16468 -1121405 -896477 -560140 -237514 -104283 -118347 -270647 -820689 -1989816 -2895780
16459 -2895780 -2760560 -2146863 -1499236 -1013355 -653835 -394511 -353124 -469942 -577653 -628284
16449 -628284 -632166 -628298 -641581 -719650 -846516 -902942 -789964 -596857 -515190 -508904 -436660
16438 -436660 -239203 43035 323859 454725 378505 149628 -57785 -83384 -26601 -92752
16428 -92752 -419213 -812769 -948018 -834824 -626246 -351332 -88325 -38261 -152479 -267017
16418 -267017 -448206 -642753 -640984 -542886 -510778 -417404 -298457 -278261 -388682 -523485 -556313
16407 -556313 -473989 -471265 -569466 -692542 -821220 -841514 -871239 -950452 -967893 -907501 -751846
16396 -751846 -581823 -455815 -385553 -328204 -191923 -22359 74288 70773 -62121 -275907
16386 -275907 -448652 -563126 -653178 -670746 -582897 -447783 -354901 -301489 -204893 -16028 202734
16375 202734 377670 382128 239332 202458 264135 268317 263280 364008 413823 348111 198402
16364 198402 -47963 -286136 -483464 -646377 -693068 -602119 -508588 -517030 -625712 -801675
16354 -801675 -895141 -778576 -508018 -184899 95214 338283 429698 262479 -7222 -217732
16344 -217732 -326257 -408348 -406868 -265922 -152894 -226938 -417846 -487714 -341800 -116363
16334 -116363 46394 123510 118614 119467 196779 176031 83217 108416 180920 177143 132608 109049
16322 109049 92008 46841 -94554 -194310 -165273 -61175 138619 413939 611849 556012
16312 556012 309024 78046 -152304 -571735 -1212391 -1713827 -1779626 -1620831 -1557406 -1495965
16302 -1495965 -1198406 -817892 -534894 -353704 -242644 -178404 -115415 -6416 182464 402857
16292 402857 520078 453720 274362 18912 -301146 -640439 -849895 -879306 -841901 -820404
16282 -820404 -811212 -755644 -670869 -592082 -433977 -215208 -38978 88697 195153 247191 185027
16271 185027 73420 -22795 -108764 -58277 140111 372146 528258 603854 680486 707447 678624
16260 678624 619752 544095 499591 499898 445315 274619 25812 -356215 -829667 -1120113 -1064198
16249 -1064198 -737252 -355630 -182882 -230268 -382267 -587247 -766658 -850373 -812589 -735424
16239 -735424 -704617 -714115 -805112 -915236 -990161 -1013775 -792183 -404293 -98771 99329 234769
16228 234769 335361 289320 106242 9260 62123 102399 -23613 -245138 -534076 -825328
16218 -825328 -1065778 -1169253 -1134590 -1047326 -934739 -878746 -884796 -850640 -725735 -628659 -666543
16207 -666543 -817197 -974920 -1062965 -972781 -792580 -601680 -321762 -90377 29959 157108
16197 157108 282098 353155 306991 151985 -48176 -234169 -356922 -354653 -160511 36619
16187 36619 -34279 -272498 -436338 -457196 -391068 -382943 -364819 -381691 -279942 -49574 83750
16176 83750 85189 -66947 -278230 -379136 -365022 -345723 -287865 -185295 -28668 195705 293055
16165 293055 232493 234795 452969 635094 626382 559027 496728 441282 318083 198841 152438
16154 152438 140817 132372 163569 190278 128646 17642 -108680 -244189 -256838 -153756 -129509
16143 -129509 -142447 -25020 212885 388943 447519 479283 525959 541000 419415 236376
16133 236376 70640 -28260 -72509 -154746 -345819 -424042 -253041 -36070 117414 183991
16123 183991 200737 254317 392759 553598 568037 408512 286563 312762 379082 274601
16113 274601 92157 46396 157241 293848 329897 346578 333616 313099 297436 244275 117661
16102 117661 41071 28249 -135314 -533498 -871437 -884987 -729599 -646981 -599976 -460868
16092 -460868 -273288 -175790 -274228 -433341 -492640 -450866 -332342 -96884 80393 13546
16082 13546 -154779 -206515 -133240 -57603 9040 57791 86551 172928 243545 69377 -219774
16071 -219774 -274197 -61083 200299 431768 616607 694352 604024 429579 360461 425678
16061 425678 582753 700718 722828 798812 834979 656407 453783 462732 561361 670801 814432
16050 814432 811192 561382 217640 -20493 -145407 -200895 -341111 -534515 -631742 -651679
16040 -651679 -710131 -785742 -802492 -686964 -501246 -377501 -304952 -254843 -315792 -386276 -247833
16029 -247833 23746 251938 406222 522289 541166 362540 70281 -112723 -63624 172058
16019 172058 398631 534996 625347 638061 577370 452631 243779 79433 16465 70202
16009 70202 123834 85559 43652 68288 167642 247522 301857 414737 552975 599089 567383
15998 567383 544958 537828 558718 599489 643149 646558 612542 597521 669013 806983 887029 907737
15986 907737 823325 524867 135798 -198021 -408008 -471820 -387044 -122300 203741 440933
15976 440933 589197 746745 934804 1054458 1058914 957149 772180 587828 414954 297309
15966 297309 356691 529216 663117 697793 751750 870474 910020 724554 431269 196272
15956 196272 51515 -6603 11353 -12267 -350513 -843010 -1197293 -1361864 -1276642 -1119907
15946 -1119907 -1000217 -868498 -695057 -540922 -480901 -512365 -481772 -333600 -232263 -199381
15936 -199381 -137833 -73145 -80789 -132672 -279624 -415493 -372373 -150594 134805 397921 530912
15925 530912 391840 53049 -197909 -393752 -570677 -668881 -623118 -525050 -468702 -417825
15915 -417825 -450710 -529092 -518274 -415005 -363046 -459155 -525554 -443119 -328315 -261459 -302179
15904 -302179 -432115 -526898 -500524 -397838 -364034 -354245 -322169 -324849 -297054 -199619 -77207
15893 -77207 97832 407359 760926 906054 754979 479823 223404 111967 237611 461092
15883 461092 567766 555419 548415 655597 895739 1192595 1394692 1427627 1348980 1181733
15873 1181733 951684 727656 513305 351180 352918 583774 886200 1030456 893731 567854
15863 567854 287947 42436 -172585 -165094 46110 180061 158974 109921 79218 32647 -33312
15852 -33312 -184804 -332134 -338069 -175008 49054 133496 145993 226358 418469 675174 862198
15841 862198 907770 895750 830544 626253 304174 96228 140386 304191 302039 42009 -215375
15830 -215375 -272467 -260785 -256544 -135359 72372 246109 232744 128870 121156 198371 375632
15819 375632 605529 787093 881436 899820 853457 687017 457098 371208 427213 397872 195755
15808 195755 64616 201959 469256 601291 532256 311825 86116 17463 212850 462146
15798 462146 575262 640208 652222 556122 432495 306720 185980 191952 288215 350172 253388
15787 253388 29308 -110897 -51807 128905 346224 538880 733260 895110 939831 964778
15777 964778 997763 926226 809803 791826 756983 600288 403005 236718 205223 222199 55984
15766 55984 -231787 -452113 -583572 -579906 -435116 -300199 -99034 140094 161849 70633
15756 70633 82998 160406 232422 255754 262465 366952 491922 503714 576027 700089 692371
15745 692371 580494 371097 141361 16725 8345 122689 114756 -125678 -292652 -259959
15735 -259959 -183446 -138424 -86086 -78966 -195195 -282016 -140119 46500 70840 90719 159652
15724 159652 172056 110138 2917 -48901 28999 81593 76975 78596 -39740 -100036 111397
15713 111397 411683 472303 338012 209501 132441 72632 -2708 -124759 -230176 -253550
15703 -253550 -181050 -106449 -110827 -171394 -215222 -182531 -37920 147584 249692 227889 71898
15692 71898 -25330 67699 183405 217343 253683 328946 329505 337537 551054 740765 690788 571306
15680 571306 595292 727355 799037 831428 836442 787303 763414 709491 504681 186988 -47559
15669 -47559 -60524 25576 14840 -151131 -347281 -413327 -508812 -664311 -560925 -214242 35948
15658 35948 110210 103354 16202 -134219 -244461 -325753 -410567 -410182 -283828 -84427 36264
15647 36264 36597 59402 143096 108632 -80442 -222998 -269391 -308717 -339164 -331329 -311644 -215212
15635 -215212 -103780 -78424 -94583 -168623 -310580 -399955 -353096 -225246 -212067 -282320 -260113
15624 -260113 -197737 -156835 -147121 16812 435174 846819 938216 793625 658142 494383
15614 494383 219381 -14500 -22119 159619 426318 634667 823701 1069700 1347535 1532915
15604 1532915 1610398 1602018 1489634 1258612 946338 766939 764199 853733 986845 1054913 999325
15593 999325 891925 731976 647980 695166 809443 955784 1034841 867825 493063 152798
15583 152798 -66136 -143354 -118617 -62501 100752 290696 274914 136470 32970 31391 182338
15572 182338 334927 389867 370139 373571 552214 805378 911351 755801 465906 271965
15562 271965 234740 273637 247400 132686 -75656 -203026 -129446 15608 132053 164777
15552 164777 133558 69244 -22742 -138867 -290553 -444122 -451227 -358504 -308437 -322834 -354101
15541 -354101 -275842 -95605 25925 37915 -421 -27145 -25305 13900 128034 74999 -165783
15530 -165783 -306648 -287914 -217570 -60913 196823 361791 297929 30333 -231004 -326918
15520 -326918 -211094 -7633 140663 319769 510068 652053 717002 733736 656550 439591
15510 439591 155316 -56587 13228 339325 624052 564143 306249 64353 -214080 -451158
15500 -451158 -452348 -206670 100241 275141 260780 76354 -150406 -290735 -372036 -300664
15490 -300664 -84283 27233 -30865 -36383 113665 275031 287092 110725 -219693 -450993
15480 -450993 -351162 -155194 -136956 -145069 -59129 -10151 -52068 -21329 77398 67397 -14932
15469 -14932 -57422 -43019 14776 26684 65626 197037 323699 341396 211126 2761 -176950
15458 -176950 -247211 -265272 -278167 -244772 -203263 -247531 -290395 -327637 -317198 -249098 -188075
15447 -188075 -231222 -271010 -215256 -213369 -165380 15155 226427 317751 270556 281998 396038
15436 396038 402000 167547 -82655 -130268 6145 294493 453627 287529 75644 135554
15426 135554 389926 608061 808731 986614 1007461 838997 556764 211703 -149645 -415459
15416 -415459 -484770 -392885 -329310 -427755 -424907 -112305 184199 239446 185640 89304 28198
15405 28198 150945 510859 869305 1046004 1059716 920299 651734 373649 205010 212048
15395 212048 316648 439813 575241 793816 971003 889049 629973 429507 359871 337138
15385 337138 228966 138519 119025 80387 87047 114942 99635 6124 -171198 -323782 -363341
15374 -363341 -241941 -30226 163596 275263 297321 243614 97704 -88165 -155495 60348
15364 60348 520284 814373 672364 353187 152036 128086 229141 372502 380978 261898
15354 261898 69508 -182594 -417457 -705846 -1008026 -1129928 -1019996 -799081 -626615 -609406
15344 -609406 -609715 -563744 -560385 -558995 -523561 -353443 -37744 241852 488444 760696 998196
15333 998196 1268528 1582466 1803378 2003997 2235576 2528703 2991077 3364615 3449167 3359784
15323 3359784 3245284 3072391 2821533 2627472 2575148 2626513 2649884 2576834 2332743 2150746
15313 2150746 2129551 1991742 1713891 1418960 1244374 1088536 938362 898643 877188 799692
15303 799692 729665 750183 865854 955965 843784 529161 166352 -82286 -118144 -77462
15293 -77462 -68963 -108625 -122533 -53343 11611 34832 22903 -9078 -32460 -112955 -258048 -377766
15281 -377766 -378699 -314255 -49411 365457 687020 852917 850718 746891 563283 405359 428229
15270 428229 585043 795598 992979 1051418 891507 654541 532563 494577 407716 313532
15260 313532 276945 291182 338327 339553 172691 -126214 -416685 -572722 -575746 -553123 -517894
15249 -517894 -433971 -308848 -234236 -251813 -321620 -359963 -442975 -646330 -724879 -607970 -398696
15238 -398696 -124876 147725 395967 531311 480127 309995 211130 126789 -48759 -140391
15228 -140391 -108547 -108358 -121221 -118080 -35176 151118 327620 548674 693581 657255 509801
15217 509801 429474 536147 702454 819241 808540 651148 519988 561361 679892 738989
15207 738989 707773 748286 846938 815093 527407 176810 2749 53396 177588 173806 154922
15196 154922 247824 326471 329098 339443 311095 226533 50273 -151736 -265429 -301669 -286152
15185 -286152 -281977 -264799 -232385 -291311 -397321 -421030 -328709 -217186 -157567 -159079 -149884 -38116
15173 -38116 75305 129958 152855 134359 114451 128191 128844 36359 -131388 -246781 -281250
15162 -281250 -326756 -358967 -260810 -45599 172135 302268 243479 72445 -42434 -46975 -80016
15151 -80016 -248921 -417168 -508287 -451957 -213738 -78571 -157583 -329043 -494269 -581372
15141 -581372 -619333 -617971 -594269 -507461 -374485 -332532 -358914 -335077 -199466 8786 168110
15130 168110 242127 293714 287683 164319 10912 -120590 -210105 -231526 -202742 -172039 -218626
15119 -218626 -387991 -566833 -626899 -678343 -732038 -709959 -552672 -354865 -305977 -334205 -340051
15108 -340051 -297776 -209210 -216377 -413528 -710434 -959522 -1060505 -882561 -543155 -302224
15098 -302224 -156752 7903 218994 283566 14123 -351653 -389035 -99246 225471 330646
15088 330646 233055 193587 284893 465975 606833 549420 404011 329192 339083 397958 429643
15077 429643 336526 142262 -35847 -162718 -195179 -59036 136099 230894 181381 -27052
15067 -27052 -254408 -459569 -631959 -622351 -429562 -230158 -118254 -34751 35113 19055 -10491
15056 -10491 27249 154657 348689 442036 423953 375421 330201 398334 577203 754826 856117
15045 856117 849925 727033 453268 194070 18748 -123662 -185999 -200582 -271366 -383722
15035 -383722 -438457 -389115 -284242 -195346 -285397 -502545 -508615 -280220 -137899 -106806 -69132
15024 -69132 6702 62113 56786 10006 19786 199539 396464 417657 399728 467350 435687 254824
15012 254824 44938 -156964 -276096 -249032 -93991 113596 295591 466854 639023 766818
15002 766818 729434 569825 499320 493961 546283 623531 588468 538636 608229 787292 907613
14991 907613 870844 733894 551652 376245 274096 264394 252036 246620 328891 426420 389479
14980 389479 167671 -135130 -371134 -512892 -595832 -719133 -860775 -890626 -773941 -565915
14970 -565915 -261562 117932 381838 369107 183767 7325 -87150 -69003 -36458 -138365
14960 -138365 -194218 -84750 24047 54518 -2973 -168926 -360200 -468047 -487534 -458584
14950 -458584 -496687 -634072 -786086 -788275 -634900 -482451 -385095 -318546 -327461 -424449 -446130
14939 -446130 -298805 -181353 -267909 -345935 -286280 -268908 -259562 -81548 160899 369855 503132
14928 503132 490008 421496 425522 515004 558610 520827 563093 715931 758847 581551 283259
14917 283259 -10217 -220218 -434444 -713976 -885700 -890226 -839596 -875754 -972129 -988472 -1052030
14906 -1052030 -1166878 -1133413 -933394 -678629 -477497 -377388 -283977 -187329 -163426 -175695
14896 -175695 -187141 -291410 -367664 -229875 -61835 -70007 -137791 -235595 -489022 -735022 -797637
14885 -797637 -654338 -417543 -297688 -340987 -539230 -766420 -865084 -848712 -817344 -719761
14875 -719761 -579913 -430799 -247016 -174625 -249535 -378447 -430618 -427627 -457069 -459176 -360564
14864 -360564 -203802 -90933 -163048 -429586 -700589 -784627 -606607 -344371 -150748 44910
14854 44910 158298 104671 26815 -4829 -22663 -30169 -165710 -422412 -619590 -608384 -430206
14843 -430206 -210172 -35233 -19502 -63939 6353 221118 499012 603316 384229 59446
14833 59446 -162643 -267882 -333438 -435107 -447481 -392796 -368797 -390902 -489683 -574644 -537360
14822 -537360 -435830 -351653 -329213 -262482 -50099 261733 496123 589852 579804 479353
14812 479353 227986 -118034 -387748 -463429 -337478 -115656 137978 297441 370700 420849
14802 420849 395398 381642 314860 136959 50191 147195 309829 490969 749571 1112934
14792 1112934 1449551 1647654 1652471 1597734 1548119 1436340 1204085 846052 630208 696045
14782 696045 955564 1147026 1080275 884571 696077 613205 622085 581337 578948 648761 765589
14771 765589 893297 907031 821933 797700 951990 1236807 1435589 1348848 976215 537633
14761 537633 196424 -56472 -197563 -247017 -188706 -6523 293623 528476 524267 286275
14751 286275 -31706 -225700 -170896 75307 326317 422330 306986 76147 -112360 -149448
14741 -149448 -141845 -158175 -132546 -120341 -117294 -58239 52963 208741 367559 488429 554519
14730 554519 604324 703942 902178 1082081 1049321 774211 396791 123090 -120707 -323934
14720 -323934 -331823 -243559 -153445 -77863 76606 280655 447015 519186 465180 338595 253182
14709 253182 147665 -69437 -340527 -553846 -550040 -435492 -417651 -521491 -658796 -768588
14699 -768588 -800351 -788570 -846349 -936633 -973416 -877147 -799882 -838198 -844366 -811543 -760365 -599114
14687 -599114 -413968 -382074 -486967 -619054 -644545 -548033 -520049 -617874 -808060 -991258
14677 -991258 -994883 -910937 -1009000 -1245308 -1402238 -1338400 -1066325 -698527 -336733 -97617
14667 -97617 -27784 -73409 -136902 -120227 -41145 40283 -4327 -146357 -251548 -185058 -41132
14656 -41132 -86905 -306450 -537203 -728908 -945461 -1025372 -845063 -617700 -468602 -282620
14646 -282620 -96254 -80136 -217110 -467910 -749690 -931670 -895584 -719416 -516358 -270472
14636 -270472 -98939 -33769 157162 484132 641455 643918 681877 694403 596847 379149 144528
14625 144528 78286 165336 175478 -16360 -214960 -306209 -302246 -174503 -9776 175986 374016
14614 374016 409399 373786 437932 493491 435235 307673 177414 127454 142739 87182 -54286
14603 -54286 -207850 -316715 -303703 -92228 213125 454156 540989 486885 409926 351487 302399
14592 302399 245338 108399 -116574 -376917 -494431 -397143 -254885 -218133 -230086 -205547
14582 -205547 -131133 -61221 -134806 -330614 -467090 -486257 -372642 -111947 184652 321946
14572 321946 290350 290302 309254 304878 391962 493198 505133 519057 511802 328923 -26014 -194563
14560 -194563 -65539 109797 275564 393116 428954 487208 542373 632714 746851 779323
14550 779323 823042 963748 1050007 1003559 943586 805310 496086 159854 42516 158787
14540 158787 240114 208308 141525 115877 367623 813531 1097946 1140232 1000681 833168
14530 833168 701325 561039 429276 285008 189004 310781 605868 848312 831824 620277
14520 620277 416251 301632 262400 234825 248120 368821 476592 530004 585071 607655 483041
14509 483041 197361 -6782 7505 188603 363946 501544 706524 980576 1262134 1497614
14499 1497614 1607790 1666120 1720692 1610205 1264431 867073 640265 563894 531535 485395
14489 485395 544729 766777 1039602 1217118 1244932 1209963 1116700 873137 559060 197473
14479 197473 -323292 -797975 -1049155 -1037130 -795929 -512109 -217267 -65897 -9443 105921
14469 105921 218396 331101 520363 766120 1052015 1304926 1387653 1247989 870973 505560
14459 505560 304380 131446 13896 82346 232604 326657 398742 453237 526454 651275
14449 651275 712716 684704 676661 769613 898786 1018060 1113895 1300790 1557906 1665863 1590366
14438 1590366 1503435 1348176 1260508 1463981 1799939 2120490 2368462 2402153 2174733 1854990
14428 1854990 1541910 1384136 1513738 1689326 1732412 1728164 1661398 1536945 1495879 1652754
14418 1652754 1924037 2124975 2122427 2018626 1825639 1567938 1445068 1531058 1692774 1792919
14408 1792919 1888848 1909182 1710385 1457545 1284179 1224937 1274802 1347618 1316830 1204163
14398 1204163 1049885 800504 568510 459224 492617 565052 494235 346588 298228 335518
14388 335518 274403 152122 165079 372233 658995 813896 767814 676976 730186 840771
14378 840771 762635 472110 191472 63089 88250 143644 159162 178308 258656 336641 333880
14367 333880 337738 316772 267388 287606 419686 623008 822846 934336 932412 905091 779507
14356 779507 594408 544366 559570 607692 746552 891399 985408 1053755 1117350 1107375 1003949
14345 1003949 808540 559212 426571 489511 593513 632223 634847 642953 654672 782689 1015802
14334 1015802 1085327 987170 901752 855245 828109 805932 666693 339410 58757 148092 608753
14323 608753 1044600 1178866 1146176 1131073 1153179 1196593 1252677 1282716 1278410 1311300 1447612
14312 1447612 1604308 1637422 1602023 1603380 1640839 1621487 1573086 1674559 1850000 1850560 1741444
14301 1741444 1673062 1677917 1642033 1524811 1412885 1293892 1171569 1084364 948056 835973
14291 835973 796977 775806 772682 759663 708162 633213 560550 671393 903619 1052344 1200961
14280 1200961 1273648 1181354 1030014 892660 685044 491455 474234 633048 894329 1140268
14270 1140268 1261702 1235072 1144714 1067493 975963 846486 667374 460750 278833 276971
14260 276971 486333 769311 971890 1003050 895134 700635 539036 521007 579976 697453
14250 697453 815271 833072 747502 682567 704324 697195 625874 641961 821411 1029857 1169288
14239 1169288 1331103 1471091 1385704 1235560 1254719 1271689 1312156 1464438 1604237 1613243
14229 1613243 1497472 1362881 1310270 1282463 1160015 1071159 1132211 1326268 1597280 1713665
14219 1713665 1589190 1425434 1409821 1452304 1466291 1488106 1551475 1614931 1714055 1926590 2228565
14208 2228565 2408086 2362701 2238532 2205827 2181765 1976994 1657135 1527574 1723295 1900377
14198 1900377 1893624 1842960 1860211 1895583 1951365 2067140 2153362 2258630 2297311 2119899 1830900
14187 1830900 1567730 1437449 1500805 1643017 1749796 1857972 2039353 2213934 2307786 2411362
14177 2411362 2623840 2864572 2961766 2874083 2675613 2467599 2360132 2305650 2268742 2339728
14167 2339728 2462529 2593410 2767745 3052827 3356625 3403235 3212791 2979230 2861202 2872858
14157 2872858 2929527 3026254 3071512 3028056 2935407 2918175 3020771 3106137 3095067 3083004 3127647
14146 3127647 3240374 3381743 3493274 3596729 3754027 3864290 3866071 3893825 3979105 4131307
14136 4131307 4359894 4591221 4711716 4646120 4568460 4564783 4642464 4771205 4797908 4657769
14126 4657769 4402205 4113854 3811052 3470005 3270563 3257311 3359835 3399527 3258311 3050766
14116 3050766 2900794 2769688 2552190 2335712 2258669 2315692 2417675 2444400 2470751 2604700
14106 2604700 2715440 2694434 2574856 2423773 2351834 2262952 2174590 2257404 2347559 2203877
14096 2203877 1926328 1695841 1504578 1407039 1468837 1653746 1962301 2318888 2474627 2366952
14086 2366952 2135052 1937871 1878146 1895044 1858264 1698846 1453809 1236507 1131246 988611
14076 988611 776854 698448 727890 718766 739345 940204 1280956 1620084 1843930 1933185 1908708
14065 1908708 1862618 1845018 1764316 1541953 1332361 1196819 1133785 1165790 1346867 1601944
14055 1601944 1730927 1774339 1835753 1910088 2028787 2084282 2043348 2081291 2118463 2063000 1991097
14044 1991097 1993430 2062656 2205270 2430505 2548822 2503319 2477599 2567949 2804873 3118587
14034 3118587 3333876 3395776 3406072 3480189 3446008 3190060 2875040 2619055 2530604 2536898 2543718
14023 2543718 2432675 2279184 2270391 2292499 2276090 2306920 2413981 2544781 2613482 2594045 2614077
14012 2614077 2685007 2682765 2616345 2487954 2338674 2206078 2147695 2192996 2364375 2599413
14002 2599413 2733047 2693554 2511123 2324651 2240108 2183610 2085385 2080471 2214538 2348711
13992 2348711 2464089 2619866 2694022 2649301 2584358 2570423 2635139 2695873 2758679 2866952 2987069
13981 2987069 3077789 3086307 3106150 3202120 3363411 3566811 3827641 4046077 4097462 4053857 4044686
13970 4044686 4119616 4258768 4332002 4323775 4315625 4342549 4327972 4192254 4048885 4042344 4172858
13959 4172858 4331011 4397458 4371076 4438473 4667930 4827556 4823946 4731845 4611899 4608280 4917172
13948 4917172 5446778 5855690 5938824 5785372 5642457 5742853 6132218 6736275 7350723 7736139
13938 7736139 7950002 8098473 8170208 8270535 8345087 8332362 8289173 8242413 8363399 8704493
13928 8704493 9141013 9575033 9892420 10105792 10310182 10556070 10908146 11379999 11825297
13919 11825297 12155826 12440880 12708213 13045880 13403513 13774434 14274989 14926675 15677800
13910 15677800 16414781 17123291 17861499 18462556 18819286 19128654 19719429 20625196 21624150
13901 21624150 22722200 23850400 24892342 25987788 27367365 29091700 30934855 32813239
13893 32813239 34983688 37590677 40502447 43593620 46954346 50772508 55090880 59832861
13885 59832861 65127390 71077619 77841309 85661340 94727115 105271913 117432801 131246613
13877 131246613 146803359 164319981 184035532 206103827 230179968 255357142 280378246
13870 280378246 303631125 323260709 337323638 344166128 342997357 334200940 319081372
13863 319081372 299368703 276801015 253090330 229651081 207265603 186362872 167330124
13856 167330124 150389503 135373005 122072885 110364671 100043336 90897935 82756279
13849 82756279 75440797 68780125 62844110 57761413 53218170 49120361 45558634 42364551
13841 42364551 39467421 37045285 34974281 32818394 30656127 28712838 26930111 25303470
13833 25303470 23962579 22920838 22015580 21121432 20231054 19372704 18629394 18038897 17479188
13824 17479188 16860897 16189865 15496692 14855477 14131872 13255674 12386396 11667522 11172826
13815 11172826 10861336 10645726 10472290 10246538 10015864 9763117 9364768 8845832 8307118
13806 8307118 7850855 7441842 7040397 6730935 6595515 6588902 6574244 6573848 6659924 6795045 6979270
13795 6979270 7140250 7184695 7142449 7039032 6835283 6558296 6271369 6005513 5740669 5473601
13785 5473601 5225043 5122382 5122092 5077052 5102293 5241488 5336341 5193420 4807928 4425457
13775 4425457 4185060 4106163 4181484 4309716 4332512 4267821 4070590 3772363 3561155 3503076
13765 3503076 3611471 3787714 3915794 3963478 3954462 3987857 4074813 4053201 3842726 3573114
13755 3573114 3360783 3286123 3416020 3558624 3586487 3485027 3293789 3190016 3204966 3272027
13745 3272027 3353298 3414160 3459405 3504343 3521527 3505699 3416875 3249733 2987159 2637551 2313487
13734 2313487 2113977 2043906 2045568 2135230 2259573 2236451 2141694 2192847 2390398 2643160 2800744
13723 2800744 2803953 2666949 2415382 2122264 1800211 1570759 1597453 1791594 1922171 2014997
13713 2014997 2217501 2528839 2695740 2626525 2442164 2294343 2184564 2055491 1936636 1876563
13703 1876563 1873972 1802183 1717656 1758163 1785993 1615072 1385272 1320465 1445712 1639820 1826854
13692 1826854 2057967 2429838 2812682 3034453 3108623 3067098 2937009 2880426 2949112 3039410
13682 3039410 3068421 2950137 2584560 2067638 1660805 1508935 1660525 2044487 2343979 2475325
13672 2475325 2652861 2950869 3110847 3047403 2894193 2797633 2801160 2824234 2809839 2616226
13662 2616226 2338716 2210138 2295959 2510021 2677901 2727805 2824707 3051799 3282655 3379427
13652 3379427 3315633 3204220 3146513 3210914 3425150 3650101 3639031 3368983 3134246 3084905
13642 3084905 3091023 3130046 3201005 3263528 3423950 3733981 4018546 4260980 4565523 4870318
13632 4870318 5058270 5188852 5512947 5940520 6310865 6673267 7063851 7458185 7911111
13623 7911111 8413469 8837073 9113164 9213985 9098148 8630387 7780559 6830951 6056967
13614 6056967 5514915 5089971 4684564 4333417 4038026 3683911 3354323 3139123 3016979
13605 3016979 3010663 2963655 2760038 2603120 2588077 2530340 2364391 2195993 2083135 2042238
13595 2042238 2141507 2310509 2411435 2458270 2485948 2398347 2131418 1783206 1456821 1264596
13585 1264596 1229019 1196690 1228458 1351319 1451930 1518385 1531563 1489707 1461417 1455559 1426839
13574 1426839 1370064 1407968 1514923 1501434 1314553 1089199 926076 844589 780679 657932
13564 657932 524485 451775 484599 568989 640081 729271 846731 867042 755821 709704 807782
13553 807782 1027011 1292769 1576198 1790907 1770351 1569397 1296123 1089292 1071962 1171069
13543 1171069 1090888 844740 635197 522653 419148 281880 107709 -67579 -45030 43554
13533 43554 40663 121314 275760 457797 596362 609567 579489 564570 605562 717568 806099
13522 806099 743317 643361 617137 542227 437066 359174 309770 273471 229385 280106 375897
13511 375897 339547 136149 -97276 -165856 -128913 -104324 -78447 -53996 -120622 -263094 -314845
13500 -314845 -242490 -114281 418 102425 75089 -13175 -98442 -226842 -221928 -48111 -39860
13489 -39860 -216499 -408489 -522014 -472289 -303828 -175264 -240106 -366072 -338426 -254414
13479 -254414 -162140 -11428 119138 191816 257171 331254 373642 421043 493733 584796 730559
13468 730559 900209 1006205 1038675 971592 828522 708406 568105 368038 183993 6180
13458 6180 -201198 -323067 -426167 -642164 -797281 -699993 -419157 -148193 2468 60236
13448 60236 84634 129745 203125 278507 432575 651314 763710 690455 520969 339876 264218
13437 264218 304810 441072 668503 863788 861826 703707 482860 296689 218927 167804
13427 167804 75714 18364 21704 68408 213472 416214 660718 802908 647032 405263
13417 405263 368069 435113 461877 584008 819944 989432 955741 776403 605348 591065
13407 591065 784164 989734 943602 743310 591567 575415 614186 641374 667883 685459 636021
13396 636021 534310 409944 165970 -91484 -212156 -163861 -10336 153614 303401 515420
13386 515420 767581 924410 957379 948636 921809 782493 538688 277646 138072 165430
13376 165430 343865 619071 849448 981789 964541 766681 536966 388028 245336 70600
13366 70600 -33064 38906 265094 486788 604316 612920 600819 524870 363472 217000 28934
13355 28934 -188834 -170246 118825 352909 410361 485610 647452 658936 427353 168342
13345 168342 74282 191469 439101 654170 783762 784578 647675 504400 529417 592879 563805
13334 563805 488009 419123 377503 364456 349165 300502 239728 325834 637026 1078932 1441917
13323 1441917 1637946 1729796 1796234 1882532 2003448 2179410 2372769 2536988 2627588 2614900
13313 2614900 2541188 2482600 2528923 2655003 2779983 2794079 2600963 2289008 2011699 1779893
13303 1779893 1685575 1659792 1521273 1442152 1475855 1456621 1419242 1456539 1483201 1416973 1365622
13292 1365622 1363293 1260663 1113898 1210141 1511486 1857574 2088423 2115059 2015171 1882538
13282 1882538 1696821 1499384 1335610 993411 572936 418714 546835 785483 1076857
13273 1076857 1311382 1270888 1033097 760977 530111 438555 405246 473281 688206 912528
13263 912528 1092391 1175884 1069102 881471 781892 810093 907673 989971 1030178 1037161 1033615
13252 1033615 1027333 1025454 1075159 1130670 1111684 1015486 840254 631125 516178 557872 648740
13241 648740 626071 505598 421864 410398 425480 542379 705392 915497 1292569 1706905
13231 1706905 1899962 1769606 1468914 1371731 1433278 1473579 1466728 1383517 1190519 975797
13221 975797 947866 1110125 1346209 1613910 1870237 2029024 2058560 2032491 1980398 1945465
13211 1945465 2046085 2328394 2706833 3038660 3334110 3509090 3490404 3482865 3697663 4094406
13201 4094406 4452216 4704939 4930760 5311104 5864426 6484907 7098399 7681405 8456222
13192 8456222 9454039 10547183 11575923 12482429 13387982 14248332 14890663 15164968 14897840
13183 14897840 14115316 13138913 12156390 11208728 10371677 9647220 8941436 8184617 7389688
13174 7389688 6660949 6123945 5712739 5327414 4957856 4678533 4487110 4360560 4311176 4284457
13164 4284457 4226001 4075010 3911599 3792382 3683194 3687329 3866523 4055122 4202071 4460056
13154 4460056 4903025 5346004 5597096 5747729 6037061 6536217 7090843 7651303 8259879
13145 8259879 8895344 9580393 10255264 10768966 11139494 11523705 11854261 11927906 11630903 11010949
13135 11010949 10187872 9231244 8283275 7443538 6726968 6035638 5384783 4923602 4650188
13126 4650188 4450939 4200745 3821283 3264194 2592396 2170351 2107699 2202263 2219719 2110936
13116 2110936 2016675 1976002 1938437 1872318 1763070 1625510 1592922 1684661 1803753 1855146 1866387
13105 1866387 1927533 2004089 1928190 1735064 1538757 1337518 1101345 858932 658839 411782
13095 411782 230621 179054 253616 447545 530092 548605 569737 537675 436047 340196 337772
13084 337772 368630 414031 411129 351966 304127 306831 142655 -269152 -469512 -272835 22732
13073 22732 256326 440361 509238 476671 384083 219704 48094 -10909 43391 103994 229722
13062 229722 436229 594203 727761 805027 806214 767127 677553 516707 299617 103961
13052 103961 -41691 -128328 -156688 -166223 -180267 -209254 -304872 -380273 -418619 -422670 -387727 -264078
13040 -264078 -43003 126180 207189 253266 266027 190278 155080 215044 390178 570494 509777
13029 509777 149642 -230938 -279648 -106056 15555 101606 182368 270939 407390 535127
13019 535127 574486 591846 672473 661757 422927 74934 -195055 -366809 -422790 -449521 -450671
13008 -450671 -329471 -169484 -98842 -132284 -272351 -468442 -585796 -544467 -333661 -51257
12998 -51257 221234 419165 405930 205680 -6487 -149276 -226636 -173738 -50873 50822
12988 50822 94375 32539 -129453 -315147 -453615 -479960 -431395 -393774 -348439 -259736 -122421
12977 -122421 39963 66557 -161880 -481846 -569143 -474061 -331963 -188695 -86653 -19867
12967 -19867 23463 48002 -19105 -33732 221982 646920 1006443 1165771 1122364 1042981 966285
12956 966285 844149 795799 954900 1117498 1068680 819661 484103 277834 240442 206315
12946 206315 207009 367119 628353 875301 1053745 1096347 1022564 859855 676389 523682
12936 523682 378818 350615 356691 321528 293859 265357 348743 617714 996081 1225449 1254391
12925 1254391 1154418 983445 874002 872204 889138 881121 836363 654375 471116 573011 896430
12914 896430 1083932 1075004 1106164 1221699 1238307 1112941 982898 1026426 1141523 1108756 979459
12903 979459 986394 1072147 1103804 1050788 931323 860302 873569 1029552 1241655 1278853 1233748
12892 1233748 1305955 1443089 1525142 1500389 1335740 1143082 1070770 1135664 1224392 1211856 1088536
12881 1088536 938343 886123 945074 1171126 1436387 1503527 1491092 1454256 1271545 862729
12871 862729 451655 341339 469218 588585 600953 534777 435942 306287 237410 250129
12861 250129 268318 204129 -56679 -258274 -235540 -81178 102956 147570 49832 -66590
12851 -66590 -117510 -72233 17986 191691 421405 597073 558809 297713 -29175 -309534
12841 -309534 -466433 -423553 -197414 103831 330329 396038 265846 -30857 -301991 -403098
12831 -403098 -391065 -371146 -365160 -349046 -227257 -2647 153139 144822 -14429 -276735 -560698
12820 -560698 -628003 -383526 -153491 -155824 -231760 -244268 -224083 -316027 -510460 -673774 -747483
12809 -747483 -628136 -411815 -367793 -461537 -470973 -327138 -147856 -47994 7700 154221 240874
12798 240874 109449 -108040 -252820 -415467 -617867 -822643 -966706 -857742 -588708 -397561
12788 -397561 -350251 -408136 -389268 -251830 -135060 -93229 -79162 2520 54226 19464 -15387
12777 -15387 9271 28178 -81098 -282194 -496824 -641600 -715235 -791240 -780747 -605424 -444371
12766 -444371 -430282 -470753 -417906 -263557 -50154 174857 266034 168601 9419 -19068 82689
12755 82689 84254 -12544 -12384 73219 163388 151504 -149679 -475663 -526529 -450007 -470152 -622642
12743 -622642 -757413 -783244 -712900 -626265 -589487 -683724 -861268 -949795 -906451 -872959 -808834
12732 -808834 -546266 -198780 -63267 -37016 168362 475961 696299 735827 622187 518367
12722 518367 386869 225911 119208 70104 13746 -41650 -45320 64667 281724 475786
12712 475786 548632 568386 715911 896608 871894 643692 275172 -129401 -363065 -432706
12702 -432706 -479045 -499654 -396284 -206990 -17292 134012 185249 105303 48970 205879
12692 205879 498167 684558 634345 445906 276080 241580 245798 254767 290628 334242 329948
12681 329948 330588 392564 483453 580518 591403 493430 400745 439326 609064 718517 554231
12670 554231 210819 -140709 -386708 -503811 -522541 -433244 -297897 -217675 -159319 -148834
12660 -148834 -209595 -207957 -241490 -471710 -862565 -1227708 -1378099 -1453986 -1613859 -1575016 -1255676
12649 -1255676 -878299 -516800 -186526 27068 116596 162694 141842 69025 -132757 -400074
12639 -400074 -563744 -573985 -520165 -457505 -444528 -515702 -636648 -654911 -516077 -431695 -490261
12628 -490261 -492893 -399477 -279033 -117732 43455 252604 519306 759034 902752 907334
12618 907334 745232 493500 163807 -158588 -318978 -318958 -250763 -210555 -205661 -166247 -141036
12607 -141036 -204004 -422616 -655153 -688386 -654668 -667087 -675926 -634722 -460997 -170354 117081
12596 117081 274716 204203 -6643 -218023 -371706 -407928 -274427 -75016 -100040 -388342
12586 -388342 -578215 -611080 -623783 -564505 -450326 -429751 -601346 -799144 -842136 -646218
12576 -646218 -364533 -234135 -200637 -115186 99097 460003 795151 937974 909502 810371
12566 810371 789071 865758 903436 862086 750799 651035 531388 320297 145238 73695 105752
12555 105752 228884 325611 280412 104649 -126208 -229906 -165373 -35206 -1490 -160682
12545 -160682 -440169 -658997 -734242 -822765 -946854 -961328 -848753 -694061 -469924 -210433
12535 -210433 -43 196131 392230 592309 712267 663557 546416 441575 250235 -63143
12525 -63143 -404012 -657220 -745867 -714446 -501902 -130105 184413 316314 358901 438968
12515 438968 516202 388901 100426 -68032 -65030 -19324 -65375 -211454 -391735 -506311
12505 -506311 -527126 -493596 -458304 -393448 -272779 -173907 -149813 -208717 -333861 -370647 -274486
12494 -274486 -82081 169887 339678 362251 296698 217999 156963 153694 182230 186417 204776
12483 204776 182792 82199 -45201 -224598 -500427 -810884 -952918 -824307 -586713 -353563
12473 -353563 -168880 -37447 101547 175158 164256 167292 337975 634346 910275 1093928
12463 1093928 1159038 1041846 747057 339720 -36995 -297918 -497008 -675359 -730040 -617564
12453 -617564 -447727 -362490 -349882 -270339 -66896 83051 171109 307823 385978 379337 327533
12442 327533 288410 280972 183507 379 -122090 -218771 -303233 -349412 -373660 -462553 -620251
12431 -620251 -727861 -686286 -598093 -538257 -487712 -367349 -284835 -374671 -516790 -590229 -615309
12420 -615309 -661710 -703151 -675527 -641298 -706276 -849822 -900032 -780854 -547475 -262989 -176495
12409 -176495 -249846 -250871 -301613 -413458 -439320 -360331 -280944 -274852 -287706 -383536 -519024
12398 -519024 -513822 -400053 -366063 -388861 -279562 -122224 -39587 -81568 -247275 -451482 -475076
12387 -475076 -302429 -127095 -118371 -343487 -724885 -1105802 -1199780 -932325 -619878 -489682
12377 -489682 -361091 -8278 419887 619270 559027 358608 194334 248940 394308 493492
12367 493492 497352 339571 90318 -88445 -153542 -267689 -565697 -822448 -807679 -647563
12357 -647563 -490434 -416221 -317652 -84309 126286 138247 24555 -93165 -129638 -99590
12347 -99590 -44880 -3666 45292 77305 41251 13074 25926 25441 -4799 61988 188435 138065
12335 138065 -93202 -320412 -459695 -534636 -643269 -756577 -783634 -753852 -692094 -673012
12325 -673012 -668877 -640009 -625229 -591699 -529689 -446365 -337644 -216455 -141754 -153276 -240733
12314 -240733 -353081 -405817 -345482 -157676 17132 7883 -124424 -201808 -198279 -207853 -190419
12303 -190419 -174306 -218243 -283891 -439087 -640045 -770332 -738389 -533574 -296185 -134358
12293 -134358 8592 178407 260783 232953 89200 -170542 -473307 -717274 -895114 -949219
12283 -949219 -720153 -284885 20837 127823 244012 422445 607685 788815 873406 877829
12273 877829 847893 775823 735004 680020 535446 354497 208026 63224 -127993 -315566
12263 -315566 -367858 -293510 -171697 -73131 -61665 -99603 -89614 -2951 130833 138695 -26607
12252 -26607 -143943 -50543 201101 449069 644236 706692 524873 259384 77033 -131843
12242 -131843 -333337 -391032 -350669 -391374 -519802 -605275 -755407 -879881 -755507 -391291
12232 -391291 11333 331448 567747 683922 708407 614159 436046 180902 -113943 -216737
12222 -216737 -186828 -273064 -370359 -353759 -271952 -98373 61328 69637 83999 200878 352007
12211 352007 428538 442386 359937 256022 305689 403485 379659 234977 111534 5598 -83635
12200 -83635 -127617 -61667 200357 559704 728723 628634 407134 210543 98876 33465
12190 33465 -123898 -322617 -394157 -287058 -111499 57661 299203 697408 1188555 1494812
12180 1494812 1575005 1548304 1421801 1245250 1136915 1174638 1272216 1262401 1102893 902624
12170 902624 784924 649477 479986 392430 321913 113970 -333998 -777333 -1033467 -1083302
12160 -1083302 -985670 -900406 -818699 -806596 -915282 -943238 -803053 -588150 -346383 -123987
12150 -123987 -54594 -213659 -469030 -632959 -718600 -806826 -851234 -865362 -821956 -718915 -696120
12139 -696120 -771732 -835774 -896834 -1010795 -1151056 -1248006 -1276790 -1188247 -962157 -582836 -160195
12128 -160195 28365 -84658 -187128 -30373 193526 212168 -19728 -371861 -607273 -595849
12118 -595849 -403415 -148661 4506 1657 -62638 -110120 -115603 -259488 -655363 -1031197 -1096827
12107 -1096827 -934888 -657724 -306285 -63999 4365 -25876 10194 173852 330634 491331
12097 491331 651993 633811 380943 25778 -259553 -474669 -507594 -347478 -215609 -275748
12087 -275748 -402309 -521641 -672925 -858051 -977858 -925227 -815549 -769551 -759688 -782916
12077 -782916 -838618 -910566 -833102 -535278 -338167 -297804 -166219 103757 330045 350888
12067 350888 298978 454859 685855 718641 694413 715432 643271 395578 32384 -212831
12057 -212831 -343900 -493516 -572888 -654347 -706465 -649364 -662819 -751637 -717026 -556823 -332297
12046 -332297 -91795 132569 347258 435493 380308 306026 345173 498045 569804 425531
12036 425531 202822 -6352 -176432 -182282 90737 345982 332754 311257 403468 359795 185983
12025 185983 56106 -75385 -331226 -631423 -822626 -895850 -881204 -811116 -664232 -401224
12015 -401224 -82909 242446 544938 688893 648867 509934 377068 287449 102271 -76502
12005 -76502 -17280 221362 347176 215867 2325 -55939 -19655 52105 193900 333788
11995 333788 441879 575196 818743 1070400 1131367 1031675 833988 585458 345142 184310
11985 184310 144456 193351 197986 120970 80751 58073 26547 28184 -10794 -81219 -128969 -266799
11973 -266799 -496526 -707966 -859657 -836185 -584512 -385210 -348032 -404414 -491934 -552852
11963 -552852 -537624 -449404 -475753 -578235 -544065 -400712 -248233 -153482 -190055 -219093 -101239
11952 -101239 1311 -28265 -75147 -212763 -453564 -669447 -808306 -802295 -688835 -607089
11942 -607089 -643875 -708602 -653343 -510981 -300961 -30401 239482 500051 812111 989832
11932 989832 817862 429615 46781 -187703 -312296 -400906 -361669 -313118 -395456 -493358
11922 -493358 -516372 -470879 -441067 -426565 -376195 -290476 -163296 -15436 -10145 -91981 11786
11911 11786 230453 323497 260934 166258 246595 430525 475278 384488 350268 457088 645586
11900 645586 812624 931386 979673 1000069 1089077 1136648 1064553 969777 827207 536180 218620
11889 218620 34796 -40008 -66324 -43310 85039 276077 495851 662919 712061 711244 664963
11878 664963 594063 485079 293031 76137 -126157 -326365 -443989 -447172 -326697 -154836
11868 -154836 -62575 -50173 -74147 -173156 -351682 -506244 -528942 -408802 -86365 318989
11858 318989 544193 553334 462566 341723 248757 242123 369956 629183 864428 970312 904170
11847 904170 655762 384976 235025 250054 373894 312233 -12141 -274866 -306045 -311797
11837 -311797 -362764 -337104 -366565 -531898 -708888 -853248 -977687 -1050906 -1150523 -1299178
11827 -1299178 -1416840 -1510034 -1437795 -1157642 -903645 -818704 -886578 -1007268 -1106974 -1143621
11817 -1143621 -1048659 -834004 -655955 -537295 -464277 -504101 -533561 -498820 -458775 -411711 -331044
11806 -331044 -162267 -1023 69981 80391 -30867 -168329 -201580 -205254 -248966 -350701 -504531
11795 -504531 -534556 -465767 -385626 -283686 -214450 -192928 -209616 -284267 -410166 -565816 -688032
11784 -688032 -694215 -680757 -647766 -537329 -473107 -459606 -403962 -376606 -420202 -436361 -446458
11773 -446458 -479014 -445919 -267373 -176653 -269027 -413577 -548721 -680422 -714733 -592805
11763 -592805 -419523 -322468 -365697 -536735 -644952 -625679 -470222 -158400 101184 181929
11753 181929 113273 -53344 -170325 -201864 -148636 -47844 71008 263857 391777 381842
11743 381842 332927 222989 132729 186925 269079 192842 -62616 -379339 -568313 -501956 -322921
11732 -322921 -169125 -57245 -26571 -572 138132 331879 423818 361061 248883 101954
11722 101954 -73251 -251574 -454485 -694764 -903855 -988201 -920444 -703495 -489831 -350125
11712 -350125 -158236 53268 170718 237373 272864 249322 166123 90240 141424 288531 361087
11701 361087 255151 80384 -28611 -25452 42995 179789 295700 338021 324443 236936 233876
11690 233876 315235 305800 261667 232509 19981 -339699 -525979 -520024 -418632 -238140 7570
11679 7570 188953 226682 198954 74288 -132440 -336487 -431102 -368713 -274224 -202462 -72172
11668 -72172 89665 197818 378427 549351 526491 341982 143931 170497 375600 580883
11658 580883 724087 662807 460408 200564 -124726 -450201 -753996 -877577 -730274 -492747
11648 -492747 -230197 60763 238169 254771 204655 80884 -29285 103128 458296 786865
11638 786865 975360 966634 701541 297320 -19169 -174161 -181903 -113381 -103085 -167480 -194799
11627 -194799 -111672 99053 344848 483220 495884 375127 214201 56672 -44663 47739
11617 47739 234755 367562 443597 478539 427544 356730 346538 467349 668494 707080 562128
11606 562128 452111 481397 609556 748376 855385 937597 1022547 1041307 975585 830669
11596 830669 555414 290815 20297 -214165 -185866 97853 500651 845479 962301 837507
11586 837507 567127 247807 81791 135916 255700 285230 154963 -109148 -420089 -650089
11576 -650089 -736506 -634118 -334513 -61014 11388 -35459 -218538 -433403 -538265 -493697
11566 -493697 -331103 -201477 -78565 144045 277049 198428 -1516 -208075 -344384 -465993
11556 -465993 -613677 -678872 -588935 -432230 -281055 -54185 246652 445540 410904 213978
11546 213978 69001 -24366 -74640 -12557 78332 142690 198630 289827 398136 457301 423707
11535 423707 346810 314152 349689 361841 313380 329012 438268 501585 494433 459026 371126
11524 371126 294096 90694 -388802 -978439 -1398275 -1542144 -1495313 -1444031 -1453957 -1429822 -1377018
11513 -1377018 -1281966 -1102685 -832347 -530110 -354463 -399156 -601379 -702086 -499733 -186084
11503 -186084 -100275 -204739 -333356 -444097 -477661 -366466 -304880 -416045 -571364 -649343
11493 -649343 -569220 -406835 -258447 -167251 -172999 -285692 -416300 -470679 -470423 -360346 -171843
11482 -171843 22914 184392 290424 405946 537934 621700 614019 546917 483629 445830 398353
11471 398353 407949 554860 674255 548989 342507 204933 84087 -43088 -260103 -550195
11461 -550195 -808245 -992086 -1036751 -922764 -813350 -790079 -750072 -689002 -701962 -759158 -725663
11450 -725663 -553901 -425284 -440458 -416220 -358483 -361212 -387623 -374282 -228331 63881 386478
11439 386478 499937 408780 334172 312025 221594 38447 -171197 -385752 -444455 -306796
11429 -306796 -290175 -518981 -728273 -649673 -374746 -126582 66986 193185 353087 610148
11419 610148 815084 845870 745101 623359 542245 508911 410576 230466 208063 396179
11409 396179 554889 628555 724179 786781 741745 624505 451105 278809 135516 46573
11399 46573 7560 -65256 -122732 -71867 -25438 -54751 -1025 124884 145443 102427 141570
11388 141570 181771 41262 -276448 -498544 -555221 -592643 -598184 -507073 -361055 -187091 97795
11377 97795 375237 392144 286164 340084 567734 703579 637220 542401 476141 379053 272899
11366 272899 192290 232827 402740 556303 514109 287366 -15461 -136989 71854 407684
11356 407684 588312 534785 346810 133731 -115031 -324416 -322820 -175169 -82420 -182998
11346 -182998 -428286 -688905 -927476 -1026870 -865362 -547236 -232058 -21089 126773 202079
11336 202079 95321 -102395 -265759 -362589 -437757 -434640 -298973 -167687 -71660 53472
11326 53472 198698 297256 434138 647399 789440 746718 645161 689163 879709 884082 617200
11315 617200 359540 223306 220989 277117 320185 395222 463239 352728 129200 -98840 -164808
11304 -164808 -14928 212923 354877 372293 324673 204647 12708 -212663 -360644 -325788
11294 -325788 -102605 185337 496104 825969 1012940 949277 732316 418183 127566 -55946
11284 -55946 -71719 92973 304864 386066 405514 520926 660314 621127 466300 384203 367907
11273 367907 354673 269715 189651 246775 396478 501849 439857 280404 115746 -85311
11263 -85311 -336754 -509612 -543402 -503004 -426860 -369613 -259533 -30608 232238 436153
11253 436153 527133 528943 445257 251893 55769 8031 84059 87715 -92116 -269568 -355452
11242 -355452 -495202 -794479 -991666 -944890 -790157 -556072 -263288 -66930 -29401 -48657
11232 -48657 -101143 -143308 -187124 -303416 -400270 -338188 -184874 -163929 -318875 -426828 -339098
11221 -339098 -199410 -250478 -398698 -377657 -187696 -61080 -162560 -420242 -571311 -624805
11211 -624805 -700722 -682040 -499468 -197608 148398 442187 630054 731227 771702 777391
11201 777391 748221 769898 922462 1109570 1123228 885292 611159 435313 285548 164080
11191 164080 -1763 -104742 -88318 -84668 -35409 18823 -85670 -346928 -693006 -949736
11181 -949736 -972261 -857164 -761855 -737149 -807847 -970496 -1109739 -1282231 -1527172 -1605259
11171 -1605259 -1442731 -1154304 -793555 -508108 -281408 20664 273714 394072 418941 275733
11161 275733 43475 -189723 -433551 -605307 -562517 -355056 -329250 -568712 -773887 -921893
11151 -921893 -1104051 -1226641 -1218760 -1073732 -776654 -453647 -242516 -230645 -401431 -646770
11141 -646770 -842976 -802105 -464412 -97913 48238 26970 57530 142989 129142 -32243
11131 -32243 -198202 -270099 -268543 -284951 -480780 -685858 -854985 -1073996 -1146868 -959137 -562888
11120 -562888 -169112 44653 35227 -11513 1098 53437 161216 244323 307317 301803 264008
11109 264008 219614 136725 121313 192849 223776 139576 -17042 -151336 -215306 -187429 -36992
11098 -36992 81377 -12898 -161573 -101437 112616 120780 18745 113134 448590 800671 952133
11087 952133 996633 894319 626251 402577 303928 305900 430018 619935 776744 910185
11077 910185 983606 913713 736431 590124 554336 472299 246207 -1121 -135511 -151511
11067 -151511 -89743 -79275 -114059 -130749 -223152 -429117 -698269 -932554 -1062409 -1108793 -1039465
11056 -1039465 -850665 -666276 -565343 -443079 -256540 -138125 -84693 -163069 -435840 -692494
11046 -692494 -749710 -653805 -554391 -562999 -634089 -595408 -379292 -144085 -58765 -79656 -96063
11035 -96063 -66657 -32314 -100768 -258782 -399319 -418483 -398414 -391090 -360797 -368138 -353946 -314522
11023 -314522 -442574 -748115 -935080 -897087 -795427 -742456 -754075 -901626 -1033028 -933259
11013 -933259 -662037 -479425 -593891 -821458 -846931 -629499 -395441 -279046 -236432 -197315
11003 -197315 -258955 -396074 -508915 -581974 -638293 -674177 -683170 -670578 -600808 -467751 -462734
10992 -462734 -560378 -507180 -277455 -69225 77156 119119 43976 -93250 -174077 -128536 -4558
10981 -4558 196892 385602 548506 681385 741616 651097 329399 -67316 -253180 -218742
10971 -218742 -143698 -82369 -19295 -130589 -458873 -730831 -743321 -571983 -370009 -230254
10961 -230254 -135182 -69201 13602 68616 -21203 -178039 -267638 -215855 -27083 168816 315420
10950 315420 476653 698562 815994 773547 640460 443498 200985 -24291 -90086 -32976
10940 -32976 -20840 -131658 -332486 -495204 -461547 -261321 -33109 134660 204736 129986
10930 129986 -72003 -288649 -470965 -577238 -521356 -440887 -507109 -662186 -759666 -789638
10920 -789638 -759289 -631960 -441025 -323297 -309102 -324997 -295324 -208332 -105545 86194
10910 86194 292205 425424 503483 502937 461205 440150 475437 516152 517046 504803 545803 709470
10898 709470 902299 1027697 1074690 953806 712064 566611 596961 640123 547353 376769
10888 376769 288678 325730 382444 305010 133834 72960 38503 -30076 1235 86991 165553
10877 165553 246347 303813 345794 398436 440305 454399 410428 355694 339287 288209 176809
10866 176809 62235 114732 382138 722810 977427 1041869 871364 616118 485120 345202
10856 345202 164534 61726 -46368 -207663 -300515 -281532 -199427 -70396 46739 119518
10846 119518 163442 120872 51276 49117 70210 111814 142906 53500 -109645 -147815 -56160
10835 -56160 -34587 -145015 -244287 -258798 -138250 88131 324040 361420 135317 -120491
10825 -120491 -195776 -142330 -23307 127669 245383 351073 451487 509435 438892 291537
10815 291537 199315 100607 31188 72042 156375 300676 490908 622675 630116 492046 317494
10804 317494 174832 95531 6876 -113319 -108525 13494 116992 121857 -10593 -260489 -522054
10793 -522054 -645407 -577318 -410536 -359022 -418849 -450912 -472072 -530711 -618329 -790765 -983630
10782 -983630 -1023420 -818457 -467879 -198294 -153148 -354654 -715380 -1024410 -1143458 -1100428
10772 -1100428 -966620 -836668 -547132 119435 700319 790902 698243 639262 600303 591374
10762 591374 588534 544111 440808 356385 402351 480149 540680 475008 188879 -62735 -129161
10751 -129161 -50593 44945 53843 46204 130377 197278 138446 50911 3070 42233 69978 1250
10739 1250 -28738 67356 246900 430712 494293 413354 282036 171085 97998 102046 157449
10728 157449 164582 238919 387457 434603 353417 257948 331659 616629 1020012 1259471 1164000
10717 1164000 949982 838061 721780 457620 152463 -72655 -191547 -221751 -216693 -171320
10707 -171320 -105791 -93239 -107249 -79085 46830 186222 234261 209733 99118 -63013 -198379
10696 -198379 -366163 -536334 -631260 -689085 -647966 -351161 120430 437501 567489 569753
10686 569753 401743 263516 389634 697231 942076 973620 744775 371853 107779 13924
10676 13924 20271 53390 87023 157878 280123 346529 380320 428520 493664 477152 382085 276675
10664 276675 199998 117630 129605 277650 413530 389070 262111 136625 -5741 -157773
10654 -157773 -261624 -333768 -367037 -344292 -219783 -38177 46198 43797 -18603 -75891 -18461
10643 -18461 46245 63322 201430 393693 436685 384749 374888 401168 427809 430458 402507 279125
10631 279125 65968 -176267 -341611 -384403 -264249 -137685 -146670 -193570 -147781 -18403
10621 -18403 124848 181225 111817 -117016 -411345 -550661 -533377 -452706 -305719 -120261
10611 -120261 45187 225564 451755 679376 813478 745750 533859 322171 166204 127053
10601 127053 177844 202578 192857 238575 296106 272934 151108 62188 110010 229496 281310
10590 281310 164514 -53516 -124447 60357 323159 494928 623593 757398 834300 807328
10580 807328 760746 792753 769567 596017 461220 492687 586748 683165 676637 609694 644012
10569 644012 730214 721778 610387 509824 367901 60746 -165857 -172049 -66838 51748
10559 51748 56061 -132734 -321617 -435733 -536065 -519054 -399462 -336386 -339652 -334333 -237956
10548 -237956 3443 230545 169779 -122356 -409568 -553731 -540682 -413266 -268692 -176320
10538 -176320 -52325 77726 172858 327305 528148 672020 727551 776759 827544 795562
10528 795562 695875 599124 582496 593397 637630 793593 1003000 1066129 895417 602926 372421
10517 372421 247007 154187 109753 153877 254497 239422 96798 54627 78999 48586 -108787
10506 -108787 -344609 -514725 -572532 -534194 -495500 -439553 -262866 -3194 165868 84069
10496 84069 -288590 -677974 -842496 -762234 -479801 -177874 29454 193793 382714 490909
10486 490909 438183 409580 535196 630709 583309 475809 354430 150646 -37618 -60242
10476 -60242 74847 232275 294187 337032 381975 364373 340506 358978 313005 217616 102622
10465 102622 56124 154069 355659 664258 1032382 1313284 1365593 1202765 927356 577353
10455 577353 121068 -422135 -849580 -962401 -871574 -687997 -462020 -198171 33998 139217
10445 139217 221417 248231 138383 119094 328923 628145 771446 634359 318165 48290
10435 48290 28073 201496 356085 367288 251589 228416 379918 504386 500412 420811 364882
10424 364882 494070 681650 668274 474013 162627 -81921 -126879 -147250 -275825 -446883
10414 -446883 -526868 -518881 -459593 -331530 -145387 -28502 -125913 -320452 -449800 -493142 -493689
10403 -493689 -529912 -438413 -106421 262315 499566 569199 428497 248951 213305 206956 126372
10392 126372 35211 77204 211833 241177 140554 72017 179292 457793 740514 875576
10382 875576 939865 908259 752088 615481 640764 734695 638984 402888 233122 203484 235531
10371 235531 210321 96163 -57710 -117639 -53779 45541 219804 382435 390847 284148 199457
10360 199457 96677 -62753 -136888 -83267 14875 68395 -3084 -142999 -344601 -517443
10350 -517443 -466488 -248823 -83617 54492 187217 166344 34184 -103469 -263945 -342838
10340 -342838 -326722 -297117 -329658 -396222 -457987 -617823 -882373 -1001118 -809001 -506679
10330 -506679 -302681 -141961 -504 -4306 -180345 -416731 -539495 -540511 -579222 -697318
10320 -697318 -742040 -645590 -452947 -70183 423579 693549 632870 354887 -59770 -502711
10310 -502711 -782158 -774573 -611204 -404920 -216202 -149935 -71124 124482 369353 552283
10300 552283 603014 578283 531322 431210 336660 315647 263595 200415 185720 195228 276674
10289 276674 410621 537351 687152 815434 894863 930292 865603 665390 394374 238885
10279 238885 252418 265646 287214 424011 579175 708702 802189 845470 768102 685803 648147
10268 648147 428920 -31551 -535746 -836146 -933348 -904724 -793180 -605715 -283967 -16553
10258 -16553 77308 89347 65126 98792 254070 416071 471093 523179 555579 481607 327846
10247 327846 215630 275866 434525 473702 330917 101310 -72255 -246866 -462345 -661248
10237 -661248 -807221 -927831 -1055521 -1141242 -1134350 -1090262 -1102297 -1002712 -671785 -389171 -404763
10226 -404763 -605157 -713365 -573683 -400054 -395767 -486539 -562557 -606766 -494461 -146419
10216 -146419 302565 619532 599958 302956 -28126 -243481 -356036 -404720 -470315 -598797
10206 -598797 -755273 -892102 -928153 -772910 -573632 -467755 -395114 -337568 -263085 -101542
10196 -101542 38216 -2424 -229128 -625542 -985045 -1157723 -1201320 -1166082 -1024401 -880716
10186 -880716 -809194 -763786 -661233 -485443 -331267 -247537 -157791 -25603 131724 365037
10176 365037 655318 892184 977804 891678 808089 826470 791224 525684 230277 104428
10166 104428 33061 66575 273700 516817 632957 561037 415424 223142 34352 -7721
10156 -7721 77529 190966 384896 649312 851684 911754 953810 1002855 930899 707244 379246
10145 379246 114382 88635 177592 163448 63665 5477 24104 88328 128119 138369 175078
10134 175078 193905 286451 384390 317935 187035 64786 -61826 -197502 -371177 -456144
10124 -456144 -427834 -360735 -224578 -43635 134638 344018 555746 584759 397919 287243
10114 287243 240960 12614 -349265 -653158 -801832 -785430 -635535 -370972 -134283 -59042
10104 -59042 7594 141078 195854 195328 248134 304474 298554 313486 423310 540499 568979 604999
10092 604999 666273 603917 463797 318275 173630 91009 -48983 -230459 -205734 -68960
10082 -68960 82604 285058 431935 444813 381439 228357 -14686 -148625 -70678 134380
10072 134380 257008 90821 -188105 -317624 -301666 -254575 -205270 -144818 -98397 -68905 -25296
10061 -25296 101651 318914 454738 504524 541100 554013 494020 348485 171784 69993
10051 69993 55697 -6691 -142937 -291716 -352155 -404601 -470610 -457557 -389540 -289478 -223935
10040 -223935 -193876 -26333 222273 337648 293543 255862 326472 385903 331029 219503 170909
10029 170909 113321 137697 254096 198424 -21779 -252075 -349808 -289135 -244454 -268793 -300809
10018 -300809 -262005 -169751 -73081 -24285 -25294 -24063 -36082 -91259 -261853 -353864 -290057 -223234
10006 -223234 -198634 -115251 15889 159953 275537 313344 139822 -213290 -472907 -556539
9996 -556539 -647845 -795822 -757236 -469668 -234902 -264011 -370115 -348210 -233555 -132150
9986 -132150 -135211 -123084 -57656 -87358 -153527 -180262 -252419 -358611 -407550 -504468 -570712 -411340
9974 -411340 -155907 -98414 -138966 -17 258724 455870 555911 575250 537378 452345 258773
9963 258773 44838 -114905 -230386 -245847 -179931 -191497 -460773 -895803 -1249110 -1426522
9953 -1426522 -1391323 -1114729 -757951 -520010 -385453 -159336 159915 399590 470933 462846
9943 462846 422148 311401 219021 240571 360726 468543 446302 333139 193537 60730
9933 60730 74621 226268 263906 126734 -13501 -121835 -218270 -261106 -257088 -317634 -446954
9922 -446954 -549023 -646633 -826126 -993606 -1049860 -955594 -651113 -270431 -60815 -83284
9912 -83284 -388097 -895913 -1300491 -1554274 -1660946 -1586771 -1446674 -1380812 -1315965 -1113582
9902 -1113582 -776218 -387893 -119491 -2844 74865 103200 102526 193906 278356 292232 249253
9891 249253 73138 -171383 -404164 -619178 -799653 -981134 -1110608 -1115484 -1023970 -949520
9881 -949520 -894453 -729197 -548568 -465812 -425151 -424576 -431387 -328063 -145922 -22349 -46788
9870 -46788 -65713 -8435 -21775 -148862 -298992 -358287 -164647 143516 241309 103680 -116551
9859 -116551 -301817 -320460 -228517 -256945 -445807 -612238 -721085 -779660 -706278 -662171 -793406
9848 -793406 -1002685 -1130838 -1167703 -1127034 -926969 -599217 -353077 -259713 -209747 -72770
9838 -72770 -13624 -167977 -388798 -493354 -444998 -364140 -388289 -426098 -397834 -373756 -394425
9827 -394425 -384211 -267304 2537 276555 364932 284521 121311 -118161 -463716 -857542
9817 -857542 -1060526 -936773 -665428 -346029 -106409 -187248 -433125 -519240 -388791 -148541
9807 -148541 15925 35775 6369 28023 36588 -89620 -216264 -172010 -7393 155395 247226
9796 247226 215064 175794 323379 601804 727037 642643 610229 665498 652678 552666 497133
9785 497133 481461 353331 8940 -345270 -542065 -575681 -466028 -377184 -316904 -280433 -351898
9774 -351898 -510855 -741533 -1030433 -1254154 -1240627 -997972 -696131 -450710 -319538 -166005
9764 -166005 3326 91502 223501 342729 252166 -39612 -324534 -427013 -345088 -122917
9754 -122917 55078 74834 47808 105860 325925 563806 622345 552103 480902 364730 179181
9743 179181 43475 8735 6504 71357 163129 173559 55989 -172575 -342285 -259913 97710
9732 97710 469656 595833 432235 174374 6900 -91790 -101941 -17027 116329 339661
9722 339661 625408 755472 729823 836573 1043450 1082076 917035 695910 589388 594700
9712 594700 662026 668977 562036 441458 175869 -308619 -650950 -644131 -494351 -463754 -608051
9701 -608051 -754564 -700257 -401650 -132504 45735 239725 370518 339718 203838 164359
9691 164359 317745 545096 645072 654586 689004 749605 795321 899668 1126607 1392688 1590148
9680 1590148 1643750 1426244 1049523 731056 546925 485030 467230 439318 473538 526137 576396
9669 576396 670635 717666 682323 547065 329186 60594 -161345 -291227 -396621 -431459
9659 -431459 -417452 -402729 -384422 -394014 -298399 -106907 159194 534735 855555 953810 779562
9648 779562 580226 499378 536736 618099 695172 821800 930460 953830 967475 992818 919700
9637 919700 622019 239617 36794 81498 241350 308087 206426 95259 87218 134984 269294
9626 269294 492413 590084 471026 386153 504534 674452 693017 636997 636115 607863 571798
9615 571798 551829 492000 386154 222295 56983 -48409 -170347 -356260 -541865 -560261
9605 -560261 -377199 -193187 -23088 115307 158347 239655 304906 245904 144801 61090 -5587
9594 -5587 -10112 79335 127861 -7513 -276721 -481144 -560990 -647990 -779206 -860135 -797449
9583 -797449 -645496 -472971 -290579 -211196 -185879 -143684 -82393 55836 149954 112174 149162
9572 149162 209644 73601 -56019 7527 238903 447533 548946 605736 572273 462113
9562 462113 404877 390144 286025 80675 -114045 -237743 -346362 -340355 -306629 -298417 -252073
9551 -252073 -223975 -151869 -18548 145736 317946 449305 534198 583568 625070 593934 415534
9540 415534 225332 200976 298108 436772 470028 246393 -32905 -82006 20503 72000 10102
9529 10102 -128599 -269121 -321817 -339265 -366353 -365892 -453770 -606348 -550255 -290911 -150476
9518 -150476 -288655 -471084 -655165 -832339 -872532 -744250 -507503 -246674 -66778 29358
9508 29358 131198 185157 124852 -15202 -128296 -116786 -7022 112809 169755 148548 123751
9497 123751 18685 -141361 -227135 -215222 -190584 -219619 -224227 -144346 -36994 -73148 -229619
9486 -229619 -231524 -63834 28327 49166 134838 299644 472052 624557 720233 738164 628979
9475 628979 408718 311395 451558 641379 727534 749465 700706 567684 371376 86556
9465 86556 -178524 -310101 -340036 -320067 -300178 -256707 -133360 5660 9215 -50681 5412
9454 5412 109377 79772 -120037 -359485 -512234 -561196 -476083 -225465 11372 69654 157211
9443 157211 236177 233506 257872 319992 346527 274658 138535 -75199 -384621 -701811 -906248
9432 -906248 -1088925 -1271801 -1373029 -1407093 -1332027 -1219478 -1115226 -992537 -858588 -712645
9422 -712645 -571952 -436283 -344888 -195250 79422 355310 526053 472012 215037 -110662
9412 -110662 -332791 -373727 -363726 -317281 -282918 -316987 -384974 -392556 -326749 -252699 -216972 -149491
9400 -149491 -23969 80483 112139 71826 53174 107956 224585 332412 467871 536617 461392
9389 461392 320722 193986 91355 -95791 -410331 -628981 -645401 -593814 -519406 -404214
9379 -404214 -234504 -63112 70648 159798 165149 101439 116710 233297 249887 104942 -10675
9368 -10675 525 -53362 -209688 -305743 -308238 -311909 -449785 -664118 -767785 -791873 -828157
9357 -828157 -698002 -485892 -395513 -409576 -479594 -534655 -527136 -512438 -431160 -196979 26705
9346 26705 49837 -103103 -342153 -504618 -451150 -296677 -276209 -323704 -323653 -416237 -411632 -210374
9334 -210374 -113381 -160994 -206467 -152660 -8934 120032 162659 172520 168364 203495 268435 228046
9322 228046 53996 -35692 80600 305161 448282 345948 110770 -87403 -263641 -320267
9312 -320267 -248139 -205141 -161131 9086 244060 380540 313105 141278 81803 193471 352367
9301 352367 400518 366566 271337 102114 25520 100711 148591 110383 150229 238087 122744
9290 122744 -125116 -237322 -203321 -129796 42901 218856 325183 499317 746529 840079
9280 840079 719008 486226 163278 -165876 -346733 -389774 -355429 -271926 -98536 243457
9270 243457 650021 946226 1046370 914822 653956 437015 359022 215019 24592 -37332
9260 -37332 -88512 -163818 -358931 -642364 -768581 -716664 -553630 -387548 -345083 -377466 -405667
9249 -405667 -410190 -524166 -665048 -515609 -187734 -11624 -24338 -42416 -35692 72424 133399
9238 133399 -33303 -261941 -488467 -728035 -869612 -840264 -649060 -449534 -421733 -421721 -392604
9227 -392604 -403184 -459626 -575293 -679955 -780691 -955411 -1144109 -1105133 -854086 -525873
9217 -525873 -140258 25525 -155939 -395344 -378550 -182260 -49156 30052 28302 -1167 69895
9206 69895 259398 487319 654677 748033 740723 679196 645123 554669 378747 249220 275210
9195 275210 313214 222337 95930 24193 6752 -36697 -135727 -113968 122367 403939 526024
9184 526024 523467 532046 472116 363375 286183 229591 258965 307512 180648 -67844 -225170
9173 -225170 -265254 -257340 -247273 -262516 -261438 -170710 -84018 -116991 -184257 -187155 -160808 -197312
9161 -197312 -196191 -44342 168867 360439 459729 519634 669689 792610 735447 620706 579516
9150 579516 558746 492963 478758 465797 431544 441195 407599 347589 241116 121554 91932
9139 91932 88097 47807 -80154 -267513 -333485 -292151 -200131 -69307 -37824 -171549 -384578
9128 -384578 -560684 -660798 -661528 -623718 -630127 -639735 -563649 -440269 -326849 -181729 -27206
9117 -27206 78743 87698 -74775 -366802 -598198 -631340 -556395 -535944 -583632 -741464 -937164
9106 -937164 -914511 -715938 -545007 -418824 -312455 -291189 -298591 -248286 -157435 -143020 -326121
9095 -326121 -570248 -608178 -361675 -4063 385046 655006 703779 623615 495714 348578
9085 348578 275261 411574 658093 877119 1043310 1141745 1168894 1173385 1249245 1389229 1354235
9074 1354235 1170486 1028843 942961 919831 838874 667016 536789 445191 328779 207842
9064 207842 112879 87803 196834 387934 566671 588466 375239 24117 -277827 -359730
9054 -359730 -238911 -14512 287065 583653 874089 1091109 1062591 806513 441565 33497
9044 33497 -330027 -521016 -496593 -380820 -315715 -311085 -331333 -364216 -444743 -536808 -633128
9033 -633128 -684647 -656014 -491613 -208840 101228 354832 520857 573656 527315 507850 419265
9022 419265 320277 307227 288366 227913 73041 -162251 -302863 -378636 -504330 -581325 -556824
9011 -556824 -457918 -324012 -263380 -296444 -225016 -79997 17735 128276 231929 205630 136520
9000 136520 129981 49228 -124359 -192495 -56523 261255 596600 722560 548179 262570
8990 262570 40435 -65544 -45234 28941 127159 142231 2380 -105229 -76915 64617 214521
8979 214521 299505 267657 212806 222323 325585 437946 453868 392959 322692 183039 45416
8968 45416 13337 7927 -21341 56674 212000 238613 103986 -36436 -26634 -30611 -193129 -353633
8956 -353633 -411441 -365772 -174144 43643 41910 -38535 54017 202430 206443 161144 159662 89785
8944 89785 61882 251234 456642 425702 241147 95014 21951 -51991 -112385 -179731 -245968
8933 -245968 -268241 -266845 -274046 -342850 -418070 -346024 -183850 6803 209383 347910 398255
8922 398255 469898 503570 359287 106280 -163689 -286664 -171923 115299 327712 312433
8912 312433 194905 105097 179146 364811 567425 620500 410641 346932 503383 490461 308906
8901 308906 95954 -118784 -292957 -468110 -718504 -938716 -1051622 -1011553 -860935 -930657
8891 -930657 -1212353 -1415227 -1514322 -1496003 -1229035 -796989 -426666 -257273 -168721 -48813
8881 -48813 102494 273423 359576 356852 273367 152233 27483 -63295 -60630 55186 275432
8870 275432 447449 421451 202912 -13091 -39985 -38969 -117717 -133063 33259 206761 178017
8859 178017 68768 30219 -36448 -253244 -516283 -746059 -904630 -898219 -741007 -715582 -930928
8848 -930928 -1089731 -991091 -798416 -701206 -670360 -522269 -215258 61596 288921 526936
8838 526936 739724 918538 951347 650602 182462 -82877 -99571 -44924 -79449 -238253
8828 -238253 -379023 -289863 100826 505398 736666 842509 871371 819725 639881 362412
8818 362412 144603 91341 110222 164502 263192 432515 595298 652451 670732 590771 388202
8807 388202 153378 50009 53152 -11995 -149538 -175535 -12371 170050 264477 351645 466895
8796 466895 549840 585122 676458 835255 933837 879603 705423 537216 428269 362092 372917
8785 372917 491838 663198 720911 634153 426996 167827 -16259 14395 161440 209397
8775 209397 195924 238736 308444 349175 318236 143558 -144243 -488834 -847004 -994724 -816385
8764 -816385 -506108 -299832 -129189 -29636 -85123 -263158 -421527 -413743 -341353 -303061 -293915
8753 -293915 -342114 -375083 -310652 -290798 -385765 -524418 -679468 -768883 -728276 -619825 -549634
8742 -549634 -495196 -391063 -226851 45981 270791 313079 176100 -65056 -190472 -170460
8732 -170460 -58179 141080 380627 606629 737192 743912 693421 543698 427380 559948
8722 559948 790860 859502 724826 590053 524060 325553 -60933 -408890 -511703 -394951
8712 -394951 -295018 -416336 -670359 -784605 -685536 -537406 -455649 -377540 -281170 -294990 -493874
8701 -493874 -628005 -562422 -447310 -329479 -223094 -204567 -259142 -280730 -333148 -512649 -672048
8690 -672048 -660503 -572454 -468512 -397783 -328547 -237167 -191303 -223251 -348998 -461496 -443069
8679 -443069 -332494 -230396 -225171 -273072 -223316 -118136 -96561 -249797 -486319 -671228 -720178
8668 -720178 -549428 -265862 71351 376076 457786 322005 112849 -17821 -46084 -26787
8658 -26787 17491 34432 -70383 -115461 -52640 24506 82347 66998 -86708 -277709 -397605
8647 -397605 -440088 -543162 -787824 -1071881 -1241842 -1209947 -1069559 -821822 -449145 -180924
8637 -180924 -47209 35229 72163 216667 354398 205249 -97884 -278127 -339172 -381208
8627 -381208 -356955 -342777 -413797 -400905 -263140 -182928 -201116 -193735 -68166 155973 351429
8616 351429 432141 503643 606054 586018 481585 344092 156307 -64830 -330964 -536087
8606 -536087 -571733 -573856 -577148 -572891 -595836 -555495 -353887 -160446 -107140 -50782 102796 271511
8594 271511 374390 472700 560838 553415 404194 289150 294604 364024 441729 427748 303966
8583 303966 235815 188031 82683 -23657 -175132 -439121 -697920 -778994 -695742 -628964 -695511
8572 -695511 -791832 -730778 -513830 -340582 -359877 -411831 -408217 -356923 -234327 -207419 -278319
8561 -278319 -195804 -48357 1946 -83013 -286972 -389951 -244672 -81804 -124531 -263891
8551 -263891 -343527 -312054 -246771 -163099 -124996 -230305 -421676 -592953 -561331 -368221 -126255
8540 -126255 170934 371849 458860 561308 663801 685373 635729 530344 338579 128454
8530 128454 60901 102297 131971 206181 337925 552086 757694 809670 715620 510611 331412
8519 331412 287598 342262 371387 440019 543201 614937 739173 818432 615972 209951 -131147
8508 -131147 -370250 -437026 -274902 -93928 3233 91106 59450 -67311 -105857 62617 265354
8497 265354 308125 175237 -55690 -289200 -496933 -555302 -413160 -322196 -364946 -405533 -341908
8486 -341908 -130581 24474 46844 149176 276816 179251 27229 -123477 -361940 -522531
8476 -522531 -473760 -319981 -308311 -455094 -614575 -650165 -455504 -258330 -301620 -465018
$$ [...]
##END NTUPLES=NMR SPECTRUM
##END=
