##TITLE=31P ikalashn
LR-794-BO-C3-H(H2O)
18.12.2024
##JCAMPDX= 6.0         $$ Bruker NMR JCAMP-DX V2.0
##DATA TYPE= NMR SPECTRUM
##DATA CLASS= NTUPLES
##ORIGIN= UXNMR, Bruker Analytische Messtechnik GmbH
##OWNER= root
$$ TOPSPIN		Version 1.3
$$ 2024-12-18 10:06:29.203 +0400  Irina@DPX200
$$ Compression mode = diff/dup
##.OBSERVE FREQUENCY= 81.01967998063
##.OBSERVE NUCLEUS= ^31P
##.ACQUISITION MODE= SIMULTANEOUS
##.ACQUISITION SCHEME= undefined
##.AVERAGES= 64
##.DIGITISER RES= 17
##SPECTROMETER/DATA SYSTEM= spect
##.PULSE SEQUENCE= zgpg
##.SOLVENT NAME= D2O
##.SHIFT REFERENCE= INTERNAL, D2O, 1, 298.5841
##AUDIT TRAIL= $$ (NUMBER, WHEN, WHO, WHERE, WHAT)
$$ ##TITLE= Audit trail, TOPSPIN		Version 1.3
$$ ##JCAMPDX= 5.01
$$ ##ORIGIN= Bruker BioSpin GmbH
$$ ##OWNER= Irina
$$ $$ F:/spectra/data/iren/nmr/P31dec/1/pdata/1/auditp.txt
$$ ##AUDIT TRAIL=  $$ (NUMBER, WHEN, WHO, WHERE, VERSION, WHAT)
(   1,<2024-12-18 10:04:23.093 +0400>,<Irina>,<DPX200>,<TOPSPIN 1.3>,
      <acquisition in progress>)
(   2,<2024-12-18 10:06:04.906 +0400>,<Irina>,<DPX200>,<TOPSPIN 1.3>,
      <Start of raw data processing
       efp BC_mod = 2 LB = 5 FT_mod = 6 PKNL = 1 PHC0 = 171.7626 PHC1 = 368.4687 SI = 32K 
       data hash MD5: 32K
       9A 2E 8F 51 B4 E3 6E F4 1F 78 72 3D 6E 6D 08 C6>)
(   3,<2024-12-18 10:06:07.062 +0400>,<Irina>,<DPX200>,<TOPSPIN 1.3>,
      <apk 
       data hash MD5: 32K
       53 2A B3 87 8A CD F6 8A 6A 9A 4A 59 8B 2E 9F C8>)
(   4,<2024-12-18 10:06:09.515 +0400>,<Irina>,<DPX200>,<TOPSPIN 1.3>,
      <abs n ABSG = 5 
       data hash MD5: 32K
       45 2D 30 A7 0A 52 41 7B 03 CC FB F3 D9 68 C0 A2>)
(   5,<2024-12-18 10:06:18.781 +0400>,<Irina>,<DPX200>,<TOPSPIN 1.3>,
      <pk fgphup PHC0 = 109.2349 PHC1 = -182.4 
       data hash MD5: 32K
       B0 0D E9 BE BD C4 54 45 14 23 15 9C 00 35 52 3F>)
(   6,<2024-12-18 10:06:20.546 +0400>,<Irina>,<DPX200>,<TOPSPIN 1.3>,
      <abs n ABSG = 5 
       data hash MD5: 32K
       A5 10 78 E4 0D 63 54 67 D8 84 F3 CC 51 DA 91 2B>)
$$ ##END=
$$ 
$$ $$ hash MD5
$$ $$ C7 2A 2C 2A EF 3D 80 E9 5A 5B F8 A1 C0 62 EE D7
##$RELAX= 
##$RELAX= 
##$RELAX= 
##$RELAX= 
##$RELAX= 
##$RELAX= 
##$RELAX= 
##$RELAX= 
##$RELAX= 
##$RELAX= 
##$RELAX= 
$$ Bruker specific parameters
$$ --------------------------
##$DU= <F:/spectra>
##$EXPNO= 1
##$NAME= <P31dec>
##$PROCNO= 1
##$TYPE= <nmr>
##$USER= <iren>
##$AMP= (0..31)
100 100 100 100 100 100 100 100 100 100 100 100 100 100 100 100 100 100 
100 100 100 100 100 100 100 100 100 100 100 100 100 100 
##$ANAVPT= -1
##$AQSEQ= 0
##$AQ_mod= 1
##$AUNM= <au_zg>
##$AUTOPOS= <>
##$BF1= 81.014009
##$BF2= 200.13
##$BF3= 200.13
##$BF4= 200.13
##$BF5= 200.13
##$BF6= 200.13
##$BF7= 200.13
##$BF8= 200.13
##$BYTORDA= 1
##$CFDGTYP= 0
##$CFRGTYP= 5
##$CHEMSTR= <none>
##$CNST= (0..63)
1 1 145 1 1 1 1 1 1 1 1 1 1 1 1 1 1 1 1 1 1 1 1 1 1 1 1 1 1 1 1 1 1 1 
1 1 1 1 1 1 1 1 1 1 1 1 1 1 1 1 1 1 1 1 1 1 1 1 1 1 1 1 1 1 
##$CPDPRG= <waltz16>
##$CPDPRG1= <>
##$CPDPRG2= <waltz16>
##$CPDPRG3= <>
$$ [...]
##$SW_h= 37037.037037037
##$TD= 32768
##$TD0= 1
##$TE= 300
##$TE2= 300
##$TE3= 300
##$TEG= 300
##$TL= (0..7)
0 120 53 12 22 120 120 120 
##$TP= (0..7)
150 150 150 150 150 150 150 150 
##$TP07= 0
##$TPNAME0= <>
##$TPNAME1= <>
##$TPNAME2= <>
##$TPNAME3= <>
##$TPNAME4= <>
##$TPNAME5= <>
##$TPNAME6= <>
##$TPNAME7= <>
##$TPOAL= (0..7)
0.5 0.5 0.5 0.5 0.5 0.5 0.5 0.5 
##$TPOFFS= (0..7)
0 0 0 0 0 0 0 0 
##$TUNHIN= 0
##$TUNHOUT= 0
##$TUNXOUT= 0
##$USERA1= <user>
##$USERA2= <user>
##$USERA3= <user>
##$USERA4= <user>
##$USERA5= <user>
##$V9= 5
##$VALIST= <valist>
##$VCLIST= <CCCCCCCCCCCCCCC>
##$VD= 0
##$VDLIST= <DDDDDDDDDDDDDDD>
##$VPLIST= <PPPPPPPPPPPPPPP>
##$VTLIST= <TTTTTTTTTTTTTTT>
##$WBST= 1024
##$WBSW= 4
##$XGAIN= (0..3)
0 0 0 0 
##$XL= 0
##$YL= 0
##$YMAX_a= 13406
##$YMIN_a= -11989
##$ZGOPTNS= <>
##$ZL1= 120
##$ZL2= 120
##$ZL3= 120
##$ZL4= 120
##$ABSF1= 298.5841
##$ABSF2= -158.5842
##$ABSG= 5
##$ABSL= 5
##$ALPHA= 0
##$AQORDER= 0
##$ASSFAC= 0
##$ASSFACI= 0
##$ASSFACX= 0
##$ASSWID= 0
##$AUNMP= <proc_1d>
##$AXLEFT= 0
##$AXRIGHT= 0
##$AXTYPE= 0
##$AXUNIT= <>
##$AZFE= 0.1
##$AZFW= 0.5
##$BCFW= 0
##$BC_mod= 2
##$BYTORDP= 0
##$COROFFS= 0
##$CY= 12.5935478210449
##$DATMOD= 1
##$DC= 0
##$DFILT= <>
##$DTYPP= 0
##$F1P= 47.1127640792319
##$F2P= -24.0371245302204
##$FCOR= 0.5
##$FTSIZE= 32768
##$FT_mod= 6
##$GAMMA= 0
##$GB= 0
##$INTBC= 1
##$INTSCL= 7.269226e-011
##$ISEN= 30
##$LB= 5
##$LEV0= 0
##$LPBIN= 0
##$MAXI= 12.09355
##$MC2= 0
##$MEAN= 0
##$ME_mod= 0
##$MI= 0.7550151
##$NCOEF= 0
##$NC_proc= -7
##$NLEV= 6
##$NOISF1= 298.5841
##$NOISF2= 270.0111
##$NSP= 0
##$NTH_PI= 0
##$NZP= 0
##$OFFSET= 298.5841
##$PC= 1.4
##$PHC0= 354.2755
##$PHC1= 0.2778015
##$PH_mod= 1
##$PKNL= yes
##$PPARMOD= 0
##$PPDIAG= 0
##$PPIPTYP= 0
##$PPMPNUM= 100
##$PPRESOL= 1
##$PSCAL= 0
##$PSIGN= 0
##$REVERSE= no
##$SF= 81.014009
##$SI= 32768
##$SIGF1= 270.0111
##$SIGF2= -158.5842
##$SINO= 77.54984
##$SIOLD= 32768
##$SREGLST= <31P.CDCl3>
##$SSB= 0
##$STSI= 32768
##$STSR= 0
##$SW_p= 37037.037037037
##$SYMM= 0
##$S_DEV= 0
##$TDeff= 32768
##$TDoff= 0
##$TI= <>
##$TILT= no
##$TM1= 0
##$TM2= 0
##$TOPLEV= 0
##$USERP1= <user>
##$USERP2= <user>
##$USERP3= <user>
##$USERP4= <user>
##$USERP5= <user>
##$WDW= 1
##$XDIM= 32768
##$YMAX_p= 322012600
##$YMIN_p= -934052
$$ End of Bruker specific parameters
$$ ---------------------------------
##NTUPLES= NMR SPECTRUM
##VAR_NAME=  FREQUENCY,     SPECTRUM/REAL,   SPECTRUM/IMAG
##SYMBOL=    X,             R,               I
##VAR_TYPE=  INDEPENDENT,   DEPENDENT,       DEPENDENT
##VAR_FORM=  AFFN,          ASDF,            ASDF
##VAR_DIM=   32768,         32768,           32768
##UNITS=     HZ,            ARBITRARY UNITS, ARBITRARY UNITS
##FACTOR=    1.13031516577767, 1,            1
##FIRST=     37037.037037037, 115183,        -371391
##LAST=      0,             63532,           400502
##MIN=       0,             -934052,         0
##MAX=       37037.037037037, 322012600,     0
$$ Real data points
##PAGE= N=1
##DATA TABLE= (X++(R..R)), XYDATA
$$ [...]
19304 -18185 -65447 -107158 -192150 -272146 -285947 -206218 -103197 -4015 83976 130568 116724
19293 116724 67131 22649 10372 39707 76691 89957 66993 33601 24798 48830 53353 5900
19281 5900 -83539 -195049 -256670 -236497 -192546 -179864 -192167 -186143 -107679 31539 148529
19270 148529 195696 203834 244919 291414 294448 246374 197002 175524 173200 196853 216202 192925
19258 192925 151057 117336 95401 55046 -15740 -69778 -44832 55217 187056 232991 154739
19247 154739 60663 49557 112932 183804 219946 257877 326735 362309 376074 392543 386518 359207
19235 359207 320571 267629 182105 92987 67023 47333 -37776 -136541 -210024 -229601 -195714
19224 -195714 -121212 -65188 -51205 -67794 -74198 -66293 -42427 -11523 -29318 -63890 -46974 51255
19212 51255 173583 199650 114773 -653 -79607 -145125 -186918 -140671 -36987 29080 -13446
19201 -13446 -108871 -162016 -149526 -121789 -89775 -33848 -2597 -43987 -122170 -185317 -176484 -90668
19189 -90668 8569 46586 -21017 -126183 -189646 -216674 -203301 -169349 -139897 -87269 -25564
19178 -25564 24105 34870 46927 89101 128446 130049 105316 117794 139475 123999 99737 56348
19166 56348 -27958 -104484 -101513 -57886 -79394 -157331 -229737 -264999 -253694 -200915 -104241 49873
19154 49873 202279 297504 299999 231399 146202 67434 16617 -9618 -58667 -120734 -124891 -80561
19142 -80561 -59354 -116582 -231175 -292045 -275170 -227288 -188887 -197737 -241419 -281038 -297659 -304793
19130 -304793 -270834 -183362 -109503 -72380 -51344 -38716 -24620 -29501 -58425 -45893 6541 22967
19118 22967 4472 -5099 -7369 -28058 -85217 -158734 -232059 -290772 -324089 -304604 -214477 -64393
19106 -64393 64587 93310 33418 -25173 -3273 83982 167626 197010 158983 60392 -37845
19095 -37845 -81277 -63446 -26998 -27281 -52311 -70143 -84101 -76785 -28522 18940 86685 205647
19083 205647 295456 290294 221246 158779 189270 280011 312117 294454 288255 300449 321752 300666
19071 300666 214073 105083 -9662 -118737 -189560 -229425 -255917 -243234 -206422 -192037 -201184
19060 -201184 -187735 -188663 -212655 -197205 -158263 -143398 -159911 -185986 -209214 -213426 -219421 -231763
19048 -231763 -254600 -272356 -243144 -202902 -227263 -254311 -226842 -188825 -138681 -72526 15204
19037 15204 130078 238055 279596 273097 266843 249156 215179 186491 180400 211028 261893 309803
19025 309803 346475 381356 414412 402235 354026 282411 203081 138034 95174 82329 86800 95439
19013 95439 98552 74107 30956 -10499 -7781 54765 116252 156185 143687 50991 -55811 -115442
19001 -115442 -110048 -70329 -50847 -58526 -75472 -94675 -86244 -45357 21020 88511 137912 108057
18989 108057 14242 -46408 -44757 -33396 -48122 -93534 -130715 -129855 -122310 -84792 -39204 -12450
18977 -12450 46997 81827 35038 -34385 -82508 -98155 -59688 -7035 32866 83697 104820 84751
18965 84751 37173 -35825 -100605 -113843 -64729 26091 109549 155688 177235 171833 147288 118970
18953 118970 82811 38635 3595 -45209 -117764 -169908 -208749 -240235 -228259 -198872 -173858
18942 -173858 -108653 -14841 67790 121134 128034 97092 33229 -57973 -119933 -105440 -38211 12313
18930 12313 14406 -31747 -97816 -148338 -217341 -319267 -369319 -325063 -211425 -99333 -35404
18919 -35404 2757 33722 61563 95925 101245 83760 70445 41980 -7499 -36646 -26720 5480
18907 5480 48027 91656 121613 135108 114171 48810 -58018 -186948 -291661 -330015 -317158
18896 -317158 -277871 -180124 -32770 97213 156901 138372 83032 57627 72266 74138 67907
18885 67907 80909 110623 137407 140885 130560 131679 151874 168187 157002 127856 94530 37431
18873 37431 -36245 -93998 -96150 -45515 17400 63057 90961 122548 138140 129260 113386 79631
18861 79631 60412 84570 119506 135608 104379 1891 -119728 -193378 -198079 -148851 -104939
18850 -104939 -55617 -900 -5215 -46524 -83738 -112421 -159203 -207511 -191410 -149316 -118759 -79438
18838 -79438 -31092 -6180 -25592 -25196 54067 148424 193734 225707 267725 306049 324458 322178
18826 322178 302824 255941 186505 102345 20540 -42483 -67453 -36659 36648 87187 68582
18815 68582 22277 19157 54520 84570 73022 47526 58855 83725 72746 34570 -13074 -65083
18803 -65083 -120423 -162101 -155203 -97578 -18073 43586 64988 46118 29232 23115 -6506 -53636
18791 -53636 -117887 -138860 -99751 -37411 46856 148060 257673 338250 325612 260239 197777
18780 197777 153114 91510 20039 -35606 -67102 -106128 -135810 -120244 -88279 -43019 3621
18769 3621 549 -41101 -74943 -69146 3401 87943 128897 121713 74862 -6177 -76913 -117191
18757 -117191 -124953 -96118 -53737 -64403 -134901 -183264 -146275 -40545 33333 16323 -91840
18746 -91840 -252956 -363404 -394335 -350182 -226403 -75835 6999 3523 7444 43653 57075
18735 57075 58492 66659 49880 2274 -13434 -23193 -86343 -168124 -226158 -258641 -288046 -300937
18723 -300937 -306758 -329655 -370913 -412590 -425089 -405647 -378083 -362120 -316778 -229043 -127296
18712 -127296 -60559 -57670 -74457 -68687 -44117 -5261 32207 82191 163928 260144 355059 426545
18700 426545 443892 410577 384954 388545 362591 279832 185750 118588 68530 15158 21363 76368
18688 76368 76191 30437 -9830 -36045 -52188 -47235 -54425 -73722 -68565 -24228 34809 48866 53624
18675 53624 79767 86576 81132 58630 30752 29870 45011 59348 56909 18327 -47272 -121378 -177856
18662 -177856 -208032 -195940 -141016 -53139 12955 -12791 -19250 98235 205283 205897 133194 50243
18650 50243 -16981 -78140 -94372 -51850 -19879 -26188 -36342 -59229 -67471 -67359 -75612 -61979 -47245
18637 -47245 -65587 -92771 -79347 -22329 26065 64248 126309 218546 291731 344817 393617 446771
18625 446771 500160 476056 362809 239184 181288 186996 194982 198894 222617 236659 231847 211833
18613 211833 191387 166200 145840 142188 152716 156713 141573 100436 17096 -95573 -180457 -199520
18601 -199520 -158026 -72584 -10310 -7655 -30570 -51958 -38358 34386 119982 163801 205559 227839
18589 227839 180118 86618 35805 45323 62237 39003 -28467 -100254 -133287 -150156 -198281 -244910
18577 -244910 -249226 -203785 -143263 -87075 -42536 -28074 -27347 -16943 -27886 -74638 -126028 -179240
18565 -179240 -248283 -312242 -326240 -272784 -180129 -111782 -106649 -138938 -175856 -195934 -156978 -68427
18553 -68427 24384 94331 102585 94551 117786 108918 61360 34301 30191 34834 34459 15697 17016
18540 17016 51836 88713 109690 77883 -25311 -125541 -172863 -178342 -147077 -87078 -2335
18529 -2335 82831 137247 205131 280487 293520 246148 150987 16972 -105488 -157811 -148980 -126844
18517 -126844 -121378 -91031 -40910 6351 85347 164013 185278 135369 52980 16732 79284 205662
18505 205662 292719 285307 260585 287454 330974 366658 350119 279966 209463 134289 54785 16703
18493 16703 9924 -14432 -56709 -65578 -18454 50175 82215 20147 -120676 -237929 -268359 -257653
18481 -257653 -255493 -267150 -288043 -321484 -345941 -328680 -301885 -309251 -339516 -360291 -374803 -381842
18469 -381842 -376839 -346852 -288085 -227207 -183390 -148853 -160901 -227702 -275162 -294032 -327923 -366647
18457 -366647 -403042 -387478 -303604 -199307 -98593 -21770 4318 -14069 -72660 -132312 -155466
18446 -155466 -149097 -127442 -68542 -17932 -55440 -159142 -196213 -149038 -134932 -171940 -207123
18435 -207123 -219643 -216470 -197047 -143966 -71218 9087 89150 164124 220983 238499 245684 280654
18423 280654 309536 275061 190542 84843 5853 -51898 -110201 -138747 -120304 -61781 -19483
18412 -19483 -15240 15099 82925 157658 208748 200594 138554 69043 -191 -74264 -129131 -158206
18400 -158206 -149223 -112590 -79452 -35944 6139 20529 43154 89519 92118 32897 -51355 -103081
18388 -103081 -95710 -52363 4458 85195 169006 217539 216343 165927 59967 -58569 -142351
18377 -142351 -145698 -57002 61696 109472 55231 -15061 -44711 -48095 -69500 -139483 -194821 -166247
18365 -166247 -112675 -122307 -199828 -285871 -283694 -177362 -69432 -8991 9960 -13259 -53819
18354 -53819 -72929 -42032 16726 83885 126908 113312 44832 -41786 -76626 -36792 11485 16352
18342 16352 16180 49251 83978 40650 -52198 -90370 -74532 -62373 -78024 -112561 -132899 -128522
18330 -128522 -118934 -114051 -99540 -107581 -127807 -110176 -62177 -5149 20217 -8368 -12383 26290
18318 26290 46612 49854 38103 -20493 -119977 -174446 -142276 -87429 -59834 -86354 -136400 -173191
18306 -173191 -176012 -122618 -18890 78314 100249 80694 42269 -8787 -10439 49542 122316 142507
18294 142507 83641 47526 98707 152407 134777 95931 76513 78586 118717 204134 291511 324334
18282 324334 280875 167454 56938 7155 494 32271 90430 128468 134300 128581 128150 117313
18270 117313 104881 111189 142326 228657 329184 391339 400054 363510 296095 203463 95224
18259 95224 -4434 -63706 -94806 -114857 -124564 -97704 -61945 -48839 -43598 -30061 -41485 -95293
18247 -95293 -129541 -102789 -75543 -112879 -178885 -213913 -203458 -162612 -113663 -79173 -106745 -158049
18235 -158049 -155951 -79701 23061 84394 80813 27273 -59798 -140172 -231731 -343766 -405567
18224 -405567 -407866 -382281 -366319 -359561 -339050 -303096 -267108 -243369 -229502 -230757 -208664 -154352
18212 -154352 -107462 -112868 -131656 -104568 -66511 -36642 -27862 -58896 -95573 -122007 -163632 -217626
18200 -217626 -246205 -230706 -196119 -175683 -165071 -144314 -117685 -106601 -146240 -213814 -258127
18189 -258127 -278180 -290257 -269309 -221421 -153564 -86933 -48337 -15003 19268 27047 -2558 -44959
18177 -44959 -59154 -14799 113790 263028 367462 394415 361649 319029 262302 180099 132882
18166 132882 160344 235992 276307 241377 205549 238988 276573 251857 205348 172262 137563
18155 137563 96486 55214 39189 51972 19434 -48054 -84333 -93479 -110193 -156080 -199267 -191464
18143 -191464 -127328 -38287 38983 70970 51979 22975 17884 371 -34227 -49597 -40139 -14062
18131 -14062 12312 6210 -13962 -6818 14844 24022 59958 158380 261494 262052 150227 36536
18119 36536 -12096 -15018 -29570 -63089 -76356 -48158 -37362 -70477 -126120 -170403 -179079 -167725
18107 -167725 -172838 -205832 -225384 -166919 -54134 47045 129115 126837 18392 -59242 -28076
18096 -28076 66426 154513 197559 190360 174182 156000 109640 66394 87090 160505 223287 230147
18084 230147 165126 62787 -23935 -29881 5278 9854 -20364 -40789 -28039 6469 52235 77949
18072 77949 41403 -60129 -148400 -174061 -128041 -26457 72279 115921 137807 160786 176293
18061 176293 173014 123529 41602 -47595 -123017 -183750 -203015 -176307 -169514 -222385 -293192 -302786
18049 -302786 -294674 -306023 -285960 -226787 -201223 -218096 -199907 -143073 -134253 -149263 -101231 -38092
18037 -38092 -33077 -71378 -109795 -130872 -120145 -56783 6170 10517 -64261 -145543 -166450 -115391
18025 -115391 -39649 49823 124577 100881 30232 1013 4657 31635 83680 118914 139709 163193
18013 163193 183094 205774 198158 126899 58126 42849 58788 64229 43143 9501 5837 23412
18001 23412 39209 77483 107017 117098 142944 143664 122134 100065 67664 12739 -68453 -154159
17989 -154159 -189874 -150885 -78538 -12181 42623 80115 99422 115930 100416 30694 -6592
17978 -6592 24779 80998 115364 120165 115604 152696 200898 228559 267065 303597 271917 186853
17966 186853 64828 -72632 -182879 -235530 -208342 -147200 -119600 -135473 -160780 -177341 -184305
17955 -184305 -176747 -162401 -131655 -54632 27200 53930 -19002 -170252 -307055 -354944 -292933
17944 -292933 -146218 22484 162448 211052 171684 124872 109698 78897 26081 -33984 -73411
17933 -73411 -67528 -43751 6378 86507 146398 151843 110545 45111 -30689 -92117 -111361 -92906
17921 -92906 -82761 -86090 -86467 -71792 -53604 -59661 -107401 -176068 -207890 -173449 -97969 -31966
17909 -31966 27159 61580 53975 34506 25676 7180 -61761 -159650 -227759 -232615 -204777 -197327
17897 -197327 -206113 -195938 -170019 -165544 -177255 -231787 -325492 -401968 -408293 -357090 -315476 -331415
17885 -331415 -404857 -468453 -485736 -491902 -478427 -457765 -453991 -444490 -425792 -367086 -250949 -142936
17873 -142936 -73339 11372 89890 130481 164370 161194 92652 -8562 -150455 -306793 -421272
17862 -421272 -460134 -423049 -366137 -317499 -250378 -164562 -77227 -27694 24947 101462 140717
17851 140717 151206 174195 213506 238024 218990 167405 135803 151633 182553 222428 271097
17840 271097 302650 314656 357542 396419 389680 371312 337041 276550 216637 148832 46769
17829 46769 -61819 -144142 -168397 -130910 -100751 -118608 -162525 -194484 -196005 -209812 -249547 -217956
17817 -217956 -136208 -94668 -69792 -18355 50661 107128 145196 155811 150614 115962 80341 58250
17805 58250 31625 -28108 -98780 -107410 -66922 -19402 -19365 -49773 -34944 30997 86108 98306
17793 98306 103657 113005 102232 61945 -725 -85813 -186486 -273683 -331727 -363804 -413449 -489556
17781 -489556 -553820 -562897 -487951 -421340 -475522 -569019 -595148 -532306 -386223 -224676 -110583
17770 -110583 -46857 -7343 -19281 -80471 -133396 -161077 -159478 -121889 -78752 -66136 -74500 -55352
17758 -55352 -27610 -14618 -14586 -15652 -2739 11801 31835 4777 -53964 -87050 -88174 -75565 -72040
17745 -72040 -49836 -4022 13681 -12604 -54966 -70340 -82884 -101864 -116528 -89785 -7816 18426
17733 18426 -58954 -105949 -41837 39085 98361 163639 208820 203775 156460 137257 181562 234449
17721 234449 274688 285060 280541 316162 378216 361721 232905 61357 -75809 -145996 -193860
17710 -193860 -273961 -347337 -375937 -364995 -326126 -294973 -285020 -286463 -280979 -270538 -298790 -306645
17698 -306645 -242559 -161654 -134160 -154476 -210501 -263202 -258288 -218471 -207109 -214387 -225763 -214197
17686 -214197 -169272 -116528 -82836 -81069 -76936 -43109 456 25080 31599 31203 41563 76255
17674 76255 135141 172801 151692 68987 -48883 -118145 -124924 -109803 -93642 -52018 27214 73890
17662 73890 71463 20663 -67336 -132365 -146517 -122813 -75920 -32461 -2085 47547 107948 170525
17650 170525 246132 284758 257439 215955 202088 199314 211455 245639 232477 128295 -6088
17639 -6088 -78804 -95706 -98185 -85988 -92153 -124540 -110565 -69466 -88282 -160140 -204347 -188366
17627 -188366 -169686 -196448 -254754 -300761 -344188 -364728 -360858 -346128 -309721 -271602 -234227 -188313
17615 -188313 -133230 -96911 -72600 -30482 -1562 -44886 -184392 -326262 -389004 -409833 -391585
17604 -391585 -314769 -185060 -42644 42387 58424 18118 -97372 -243172 -340723 -385322 -364544
17593 -364544 -269035 -201950 -193415 -189103 -223196 -284047 -304621 -279298 -257681 -237879 -219074 -199094
17581 -199094 -156134 -95941 -30710 8960 14431 -2972 -42438 -83875 -105552 -103906 -37579 85481
17569 85481 207867 272240 243403 198223 227600 290629 346583 407747 443814 447635 421811 360027
17557 360027 235286 55045 -136218 -273892 -349631 -385145 -378069 -329458 -279501 -242074 -211863
17546 -211863 -193951 -206618 -202837 -139034 -64904 -34307 -37398 -55236 -84703 -83004 -54973 -15840
17534 -15840 33776 75912 115948 175442 240472 290312 308045 292701 252759 165132 47476
17523 47476 -47927 -103214 -118846 -107580 -54821 26811 71124 66526 81863 162911 243442 242898
17511 242898 176877 92784 43926 60114 78995 33959 -21948 -26057 -16605 492 19936 27659
17499 27659 37298 71095 108511 131100 177693 266935 352357 367242 324321 240870 138803 81705
17487 81705 88236 110370 110284 71755 7413 -71475 -138937 -162287 -130661 -63090 -360 56045
17475 56045 118360 157432 122384 44232 -6506 36 29309 45703 31354 33795 97959 176847
17463 176847 190508 147866 105279 99835 125234 130201 107764 134614 217016 270535 221163 86119
17451 86119 -57912 -155933 -185777 -199738 -221285 -247144 -278966 -306505 -308097 -263495 -190053 -148490
17439 -148490 -170301 -223721 -272480 -308338 -318185 -297518 -274467 -269231 -268461 -231428 -127965 -15794
17427 -15794 25589 -3716 -65183 -124430 -131221 -110200 -116014 -154132 -209343 -257977 -239946 -162203
17415 -162203 -71164 -10718 3691 5716 46030 89332 78538 46039 27700 61429 120035 132562
17403 132562 105483 77345 53891 69643 100779 103107 106460 115436 99779 26094 -46684 -47344
17391 -47344 -24986 -66778 -96545 -64422 -18754 33998 105946 154195 147180 110151 83213 79311
17379 79311 83320 107120 133348 170649 244916 327601 359449 321237 251468 204836 170505 165160
17367 165160 220788 269616 248276 207914 172882 150220 139936 114859 93592 108965 160649
17356 160649 226660 276584 281601 255295 227485 186614 119986 65154 44673 67343 92282 114961
17344 114961 176374 251527 272029 239177 165016 79175 27603 -4892 -37290 -62399 -58605 -32719
17332 -32719 -25743 -59067 -119401 -168951 -154208 -122479 -122542 -134620 -124889 -91060 -31337 50190 136427
17319 136427 194411 213254 204644 146347 71177 13794 -37889 -40892 33039 140139 221227 231948
17307 231948 172058 87174 17965 -31619 -66882 -93791 -112144 -147641 -211432 -247427 -233927
17296 -233927 -198379 -141191 -100547 -77827 -14667 109371 246022 358694 400609 343874 273150
17285 273150 203572 88906 -30226 -62900 -5332 39834 18273 -13644 6496 41103 58793
17274 58793 81740 83364 53930 15122 -5969 3789 29136 57219 104610 173017 216790 204109
17262 204109 139249 48347 -26641 -75603 -136559 -151284 -111814 -90704 -72036 -15199 20869
17251 20869 -21748 -66023 -96873 -151653 -198673 -216978 -198033 -139911 -83095 -100194 -176469 -223626
17239 -223626 -233788 -260594 -289106 -263054 -174363 -81838 -4103 35769 2161 -49294 -114384
17228 -114384 -173891 -196403 -194876 -173261 -149587 -156892 -193593 -230686 -230562 -195147 -156067 -101582
17216 -101582 -73282 -90763 -127388 -158132 -172453 -178769 -172677 -159308 -148855 -151598 -158494 -183816
17204 -183816 -231530 -275770 -314364 -330494 -310445 -257522 -167580 -95215 -86843 -129625 -170473 -171160
17192 -171160 -111569 -61833 -89010 -173867 -247202 -255456 -171841 -55949 -3134 12783 54759
17181 54759 118811 203224 312145 421221 476029 427989 343505 285020 231668 161032 94990
17170 94990 48818 21576 26009 43440 51565 50999 81450 153626 210578 199759 116211 19158
17158 19158 -23368 -13027 24253 42654 17323 -33216 -94434 -138605 -139356 -94661 -49117 -8889
17146 -8889 42671 55479 11456 -45599 -98503 -142401 -176361 -163724 -91430 -45614 -38494 -6962
17134 -6962 53295 95875 95847 49397 -25504 -95207 -161390 -218448 -259096 -277119 -281113 -270116 -252492
17121 -252492 -197817 -80371 4917 -5540 -46151 -52991 -26698 1676 39258 83634 128779
17110 128779 142839 135759 143614 184552 229886 236707 195511 126123 73084 52648 46123 50858
17098 50858 46354 -21003 -102646 -127619 -99937 -84413 -90831 -123571 -173883 -234892 -283815 -282513
17086 -282513 -233752 -172980 -117241 -39158 56138 129683 179792 181247 97391 -8398 -71635
17075 -71635 -80881 -55009 -25524 -9276 -45813 -119799 -150075 -134450 -148746 -177888 -168147 -148390
17063 -148390 -146057 -148588 -146751 -158272 -171259 -148142 -75328 7313 67919 72866 28496 -23283
17051 -23283 -49700 -36390 -42567 -62631 -36224 27433 60055 18913 -55864 -119641 -159502 -143362
17039 -143362 -80883 -59249 -68864 -4713 138207 295494 353693 252744 76165 -75090 -138008
17028 -138008 -122387 -67902 -50961 -87338 -163556 -253396 -309301 -332678 -335905 -303962 -248759 -212077
17016 -212077 -223022 -259558 -262907 -232171 -186608 -119504 -51197 -3384 46576 81824 77430 44359
17004 44359 17418 2922 -11546 -4264 44653 107401 138466 119881 65287 -17899 -125807 -204821
16992 -204821 -230695 -242100 -259438 -251658 -243480 -250368 -238531 -188764 -120271 -52488 -3436 -9367
16980 -9367 -55102 -109422 -149051 -166728 -147796 -109614 -115838 -139644 -121893 -90068 -67323 -45066
16968 -45066 -17302 34945 98677 115762 90222 76453 85082 83482 48813 -28671 -117795 -176545
16956 -176545 -220289 -261814 -298432 -336838 -398271 -433162 -383747 -271667 -122610 -5101 25242
16945 25242 9957 -39103 -133364 -198361 -200626 -168740 -108939 -43699 -578 14821 20975 39019
16933 39019 74305 85304 69939 68058 95358 135802 191490 267017 321804 374729 416405 404725
16921 404725 349771 289892 264631 279923 304542 313400 289397 220232 150711 104210 106445 126506
16909 126506 112618 120368 163633 199436 217879 253787 255146 222556 234058 285546 351367 401554
16897 401554 400522 328056 231049 156489 114724 89304 83492 110736 162573 236894 287158 297708
16885 297708 303194 318100 294789 230438 163736 92301 27263 -37888 -108789 -173406 -255551 -316861
16873 -316861 -339090 -360247 -371975 -335405 -236384 -99789 9019 74547 114468 109052 63018
16862 63018 22632 3976 -46014 -137432 -203304 -196361 -147429 -94874 -59900 -36603 -8067 58663
16850 58663 147280 177557 128906 42912 -29055 -32824 -1496 26895 59210 61440 47770 38374
16838 38374 17030 17781 45687 59561 41806 -8300 -28572 -2586 36821 68385 115195 156657
16826 156657 152825 112043 62289 20850 18026 61248 109058 165962 225125 255867 222194 86955
16814 86955 -134609 -283902 -301583 -256991 -215381 -205426 -215463 -244306 -253430 -211230 -146457 -109654
16802 -109654 -132914 -187765 -225273 -259133 -267594 -224141 -186012 -160772 -108509 -56389 -64157 -144629
16790 -144629 -222067 -230963 -203725 -179337 -184957 -228826 -274656 -279180 -232852 -157186 -41900 92540
16778 92540 199393 241090 208741 147677 109582 106250 114982 120468 142695 101307 -27292 -143085
16766 -143085 -210615 -253006 -286038 -291118 -249001 -166505 -116425 -121370 -141204 -154102 -160959 -197923
16754 -197923 -277577 -322484 -307118 -254599 -215427 -217657 -233780 -230150 -222785 -243143 -249430 -213562
16742 -213562 -158064 -131830 -150641 -151712 -56582 79531 176994 186663 129022 69493 58316 65718
16730 65718 33958 -21334 -79768 -126205 -137679 -128549 -98265 -28040 90523 241783 400956
16719 400956 501002 493059 407687 286195 195310 156534 125332 93836 66833 63287 93819
16708 93819 83070 27844 -4478 -2467 46472 142573 247969 276186 222737 134890 67964 93227
16696 93227 133546 121786 81610 44300 65108 143802 182123 136621 29902 -54367 -105575
16685 -105575 -149230 -172555 -158677 -86370 38024 169681 257525 325133 367171 381296 385526
16674 385526 349946 282500 195210 118980 83379 76190 89764 147506 216570 251330 250747 230246
16662 230246 213634 257430 328686 339727 304073 269557 280453 326560 344926 357673 440949
16651 440949 560865 676978 782959 839214 819674 735507 605528 441944 312192 253306
16641 253306 257052 312548 384992 433720 396071 291178 190403 106213 -36474 -286298 -533471
16630 -533471 -668777 -680762 -623095 -546922 -495603 -472880 -475171 -481006 -428752 -307749 -217767
16619 -217767 -217135 -269016 -314940 -332880 -331879 -326021 -321380 -351821 -378095 -370040 -387366 -417001 -375929
16606 -375929 -281903 -200142 -140402 -113194 -145983 -206224 -216873 -153907 -66966 -19367 -12323 -10310
16594 -10310 -4710 -4777 12772 30355 -5399 -71810 -136661 -201880 -210849 -138974 -66184 -56875 -98843
16581 -98843 -125702 -123165 -145367 -201444 -231541 -228680 -204372 -155452 -108102 -85969 -118409 -172314
16569 -172314 -200136 -185049 -140800 -97660 -70235 -65312 -78943 -106868 -154008 -219306 -293321 -348697
16557 -348697 -385962 -388134 -346314 -289131 -258286 -282627 -315828 -301996 -272575 -257851 -272270 -278311
16545 -278311 -269199 -295599 -375722 -436120 -416298 -365898 -335792 -329467 -321404 -288133 -267037 -275882
16533 -275882 -265342 -221947 -201328 -210962 -233411 -251093 -254873 -270048 -318769 -384922 -433737 -419925
16521 -419925 -365958 -327209 -297511 -225692 -117055 -41141 -16082 -18560 -50782 -114540 -163967
16510 -163967 -145687 -127271 -172446 -225896 -247020 -266293 -297595 -333635 -355998 -337952 -304570
16499 -304570 -331964 -400429 -424277 -414978 -397757 -352106 -271868 -222267 -245587 -309372 -325564 -255030
16487 -255030 -144817 -76288 -58025 -72055 -121958 -160095 -146965 -87152 -22886 13169 -2653
16476 -2653 2239 53813 81348 50445 34076 63705 143829 260886 395417 505543 571600
16465 571600 618015 661356 734879 798980 635499 323539 136678 31600 -60156 -121566 -110308
16454 -110308 -53359 -28286 -52020 -81535 -102090 -123178 -182523 -238888 -239963 -210992 -213285 -244292
16442 -244292 -284767 -303604 -309362 -344588 -361349 -363674 -400601 -421640 -401447 -355621 -346409 -385186
16430 -385186 -388357 -288492 -108354 17524 47616 23907 -28294 -112315 -195369 -185651 -98689
16419 -98689 -47257 -49642 -53924 -62616 -107571 -190054 -278311 -346034 -393274 -446764 -463016 -387918
16407 -387918 -278778 -213584 -221132 -272495 -290204 -239409 -195411 -215824 -271333 -333381 -388857
16396 -388857 -430649 -403304 -281879 -136475 -34593 -14354 -117142 -317769 -537912 -731259
16386 -731259 -867702 -831606 -586677 -314447 -157420 -94154 -107009 -130597 -65431 26080 53865
16375 53865 79123 136950 158178 138769 150147 214741 273013 215745 87193 -23072 -89915
16364 -89915 -108567 -94331 -82818 -51847 -24167 -35616 -61109 -65821 -19914 47175 80410 68882
16352 68882 41750 26733 -2362 -10820 45045 102949 118837 140752 194210 210942 182370 150048
16340 150048 121744 55839 -43806 -128181 -185444 -223425 -253209 -272194 -271870 -242821 -183490 -150683
16328 -150683 -151022 -140339 -56032 80118 184597 247792 294344 329163 350670 380991 421015
16317 421015 419281 349991 272487 234313 227446 192817 104474 6099 -98679 -306507 -526733
16306 -526733 -544509 -458661 -386397 -315347 -242810 -163908 -93179 -47282 -13358 13938 41666
16295 41666 84926 130813 147677 110268 56752 42972 38528 13189 -7942 -21077 -77713 -155273
16283 -155273 -217952 -256926 -239180 -165575 -97615 -80766 -111076 -121954 -105793 -93510 -96947 -97229
16271 -97229 -69221 -29417 10397 46219 62690 42777 -21492 -103816 -176412 -215378 -226236 -261954
16259 -261954 -322076 -353865 -318627 -223810 -107818 11973 93920 113452 74911 19307 -68411
16248 -68411 -154638 -173223 -169969 -173936 -171377 -149336 -121342 -78200 -45296 -59860 -115815 -175396
16236 -175396 -211907 -255763 -320800 -350945 -309502 -228852 -185882 -188703 -188544 -173599 -174864 -184381
16224 -184381 -163436 -77689 29216 83143 112041 144965 168027 158171 146767 142954 126462 102699
16212 102699 66277 19756 -18019 -20574 22970 61466 64818 55009 69001 67277 -702 -77570
16200 -77570 -126998 -158019 -202568 -264871 -318400 -333922 -354967 -395882 -403342 -386604 -371529 -359074
16188 -359074 -348650 -314243 -285369 -279483 -268086 -292096 -333251 -336262 -312933 -294793 -273354 -208249
16176 -208249 -156516 -161452 -196394 -215429 -188822 -142520 -109677 -70191 -36247 -25172 -16794 -42878
16164 -42878 -144218 -234964 -193415 -75204 1709 15720 -17868 -53826 -104001 -196831 -274186
16153 -274186 -304236 -303731 -305152 -339346 -361138 -294152 -225693 -191556 -139126 -72870 -41031 -57255
16141 -57255 -104276 -132399 -113059 -80007 -82180 -147507 -217419 -217602 -129337 8488 115855 150726
16129 150726 127693 81380 50174 59004 122903 243621 364420 390636 331536 241496 150418
16118 150418 85270 46709 13672 3524 12607 -14603 -56830 -57353 -37127 1111 52733 75493
16106 75493 20003 -66390 -148087 -215122 -198499 -113731 -27466 26703 -12434 -106927 -133640 -95346
16094 -95346 -66729 -59526 -75307 -140466 -227897 -305013 -363894 -385085 -354275 -277501 -163296 -68892
16082 -68892 -63830 -122748 -188961 -241743 -275512 -276006 -240221 -166504 -63264 25110 106357 187173
16070 187173 195158 96947 -52352 -189714 -295956 -366919 -402870 -416732 -419178 -417579 -414642 -409253
16058 -409253 -382676 -324312 -229514 -105929 -11219 30514 16259 -31480 -55856 -64833 -79725
16047 -79725 -83381 -84837 -131707 -184757 -221847 -231199 -195401 -204505 -272039 -317264 -329767 -332541 -362862
16034 -362862 -404479 -394757 -324186 -222601 -147717 -133805 -160381 -218497 -260773 -273979 -314878
16023 -314878 -385486 -423179 -393862 -339953 -282277 -235241 -181710 -116710 -69998 -43941 -64827
16012 -64827 -146500 -222513 -275917 -361712 -439264 -439893 -379039 -295804 -201093 -106799 -70321 -77593
16000 -77593 -54693 19887 96928 99575 39252 -16506 -9324 42588 72460 63738 33182 -3536
15988 -3536 -40075 -87076 -135895 -155852 -170170 -183795 -191375 -176475 -157664 -190094 -227352 -240472
15976 -240472 -228764 -208965 -210064 -200384 -162591 -124159 -79295 -47826 -70504 -123209 -232293 -359526
15964 -359526 -417401 -384722 -304162 -240823 -208651 -184061 -128884 -54914 1572 25016 4921
15953 4921 -36034 -79291 -149236 -196781 -194131 -188635 -196633 -190276 -166086 -153864 -185973 -272709 -397711
15940 -397711 -454782 -430044 -376697 -324889 -314308 -325361 -302910 -266720 -262306 -300011 -345428 -358285
15928 -358285 -382349 -464081 -562802 -568670 -503483 -425714 -364196 -354585 -347606 -294801 -221710 -210473
15916 -210473 -217209 -173713 -153758 -190951 -211016 -207895 -208395 -171507 -92580 -34880 -22982 -12275
15904 -12275 -23865 -63660 -106446 -157912 -178857 -148478 -84844 49030 208707 294691 317113
15893 317113 276506 168490 40473 -29213 -21499 30081 100764 158155 166799 145514 157361
15882 157361 223164 262725 248743 210199 165804 130101 86845 54416 71163 103067 129429
15871 129429 175422 219228 225918 170141 99775 47970 5158 -55210 -105955 -98838 -32729 44894
15859 44894 85836 61364 -33384 -178741 -304049 -330445 -283846 -243796 -261181 -309602 -326387
15848 -326387 -261296 -140857 -53421 -18462 -59892 -135731 -179342 -201857 -194818 -161560 -171825
15837 -171825 -199688 -177503 -124063 -105269 -126058 -132459 -105939 -104372 -174127 -236433 -249488 -278649
15825 -278649 -321849 -288723 -171747 -42164 -1473 -41074 -65303 -69464 -86310 -100396 -104859
15814 -104859 -106799 -81545 -19885 7993 -49146 -101597 -71430 -25915 4141 54662 99707 88571
15802 88571 17736 -53052 -42786 19737 48624 68914 106969 157648 173791 142832 57782 -45506
15790 -45506 -126860 -217810 -299274 -340620 -303992 -203036 -99474 -12650 25962 -953 -66328
15779 -66328 -136070 -214742 -281778 -289904 -243502 -176374 -145801 -191401 -220710 -164319 -77966 -17412
15767 -17412 31513 71534 59318 19760 -19714 -76865 -142255 -189345 -194519 -158881 -133230 -147922
15755 -147922 -178379 -183493 -132096 -57984 -43974 -78207 -93140 -86705 -71435 -50839 -60519 -100631
15743 -100631 -168279 -266584 -334142 -335453 -319448 -313511 -290203 -246234 -198646 -205313 -244247 -252595
15731 -252595 -227053 -196037 -196865 -199609 -174438 -123228 -98351 -115988 -155374 -190887 -180944 -142791
15719 -142791 -123973 -100947 -82078 -101671 -111631 -93771 -70270 -43366 -14662 -18502 -72929 -138203
15707 -138203 -186032 -206665 -212300 -200606 -171309 -80893 36889 101364 126780 94813 -41514
15696 -41514 -233916 -409534 -489672 -453306 -375419 -307958 -234858 -158348 -121411 -141366 -151252
15685 -151252 -116463 -61185 -4023 29388 101034 239733 351774 362733 298861 224202 169993
15674 169993 126441 65106 -12709 -76626 -96303 -58591 3856 44825 18246 -59102 -131415
15663 -131415 -211060 -242987 -165121 -64833 -13206 -13081 -28761 -4766 64717 118562 66784 -56991
15651 -56991 -166385 -202544 -180388 -114992 -5413 93143 107647 26891 -76955 -156352 -212141
15640 -212141 -257189 -246468 -187339 -111655 -42577 -22278 -84136 -180905 -246140 -255520 -221807 -180692
15628 -180692 -117671 -34957 15290 42920 99488 150944 155585 91097 -14299 -87791 -123206
15617 -123206 -112572 -78139 -62927 -80771 -120830 -146718 -116307 -11548 82286 105989 82709
15606 82709 43567 15943 7982 10848 42930 95241 120629 113275 88107 65522 61295 71046 46987
15593 46987 3998 -8047 -24017 -49078 -56045 -94616 -177677 -219276 -202952 -161810 -119880 -47453
15581 -47453 72414 162671 197432 219225 250832 274164 252607 198902 150265 157344 202853 260409
15569 260409 301296 238404 105580 18862 -19483 -46088 -27683 53913 130051 143438 127494
15558 127494 127212 147380 190368 236772 247239 165656 16937 -98020 -147065 -157110 -168948
15547 -168948 -155598 -83542 5951 62078 57671 -1243 -61701 -75978 -10012 87028 133067 123595
15535 123595 95254 65640 46019 80549 149903 146245 47449 -47877 -54704 -11452 39524 107460
15523 107460 178260 201881 214769 263131 285076 254038 221274 202179 157080 71682 11091
15512 11091 15531 83049 163235 187551 148352 106487 93180 94486 80999 59338 49548 49528 96682
15499 96682 155375 172704 157272 105088 36056 -30835 -103460 -139646 -89047 -18357 -5793 -12911
15487 -12911 30353 67346 34851 -28139 -111772 -210405 -306361 -378583 -400651 -356327 -272579 -213030
15475 -213030 -170620 -125011 -88169 -67649 -29145 38528 69916 35942 -37473 -120451 -174264
15464 -174264 -186136 -184663 -210301 -251254 -277862 -250979 -160924 -53148 25115 96039 183714
15453 183714 238717 220059 168318 117139 104821 109122 68717 -1780 -56100 -58053 -28414 1425
15441 1425 -5797 -50577 -74584 -87557 -105368 -48471 80548 196945 229399 189240 177885 216036
15429 216036 251070 257264 231781 196483 200590 235872 228015 184534 151248 159219 164232 143432
15417 143432 131400 124574 110421 112621 90809 37489 474 -7502 49575 162155 250143 297291
15405 297291 297265 270029 211982 109909 -4254 -95877 -153925 -155454 -84160 7866 63260 93567
15393 93567 110710 125356 131050 106540 60864 22965 21981 55780 84192 56521 -43388 -175501
15381 -175501 -282394 -297452 -217951 -134473 -82913 -54870 -39435 -30526 -41316 -34911 4838 39149
15369 39149 57636 80942 99242 106734 136239 200128 284124 363376 400959 369982 310322 286627
15357 286627 255312 204231 190711 198260 210446 178111 93401 38617 57954 103412 112909 130265
15345 130265 187011 198835 137648 51812 -36408 -118623 -180047 -185984 -140006 -123081 -151628 -197087
15333 -197087 -203657 -138835 -81309 -84108 -91993 -96921 -107034 -75452 12705 96917 121196 108215
15321 108215 85843 69243 45274 -15623 -120197 -197405 -166979 -78046 16193 71496 28050
15310 28050 -84147 -185499 -246761 -273062 -259195 -230931 -228879 -252133 -283014 -305382 -325971
15299 -325971 -363407 -393947 -425997 -484683 -562691 -608120 -585183 -552319 -592653 -670865 -708057
15288 -708057 -691221 -667635 -644180 -596450 -562821 -581880 -625869 -602458 -496955 -375649 -283063
15277 -283063 -202284 -107834 2162 90235 107719 87712 85614 100871 126499 174667 220892
15266 220892 244467 255907 263546 237435 194770 161384 125410 105564 44671 -80514 -179039
15255 -179039 -219509 -238584 -235985 -251914 -311613 -383205 -434672 -482892 -533489 -532858 -471621 -408443
15243 -408443 -364892 -342769 -348685 -371313 -348229 -287298 -240854 -246359 -284268 -339729 -398507 -363288
15231 -363288 -193294 -9593 73089 110325 133434 129851 110056 82065 56967 54318 59216 16584
15219 16584 -66335 -145523 -205956 -236824 -233669 -180446 -104039 -74580 -98734 -90032 -8410 74161
15207 74161 92261 38643 -10044 27582 131047 217770 268319 305626 334894 327231 226966
15196 226966 94392 18076 4518 28859 62512 83622 67222 -12691 -96243 -107462 -39845
15185 -39845 53122 149898 217561 200113 131297 98943 104077 64555 -24567 -61629 -15916 48266
15173 48266 87604 105345 135838 150494 97858 -13127 -123161 -189699 -216966 -205301 -136232
15162 -136232 -95111 -148319 -260221 -418335 -590753 -688421 -652587 -545222 -458758 -396959 -313273
15151 -313273 -211512 -88910 27562 117860 212459 324182 402328 378750 278233 210378
15141 210378 207992 199923 195508 212693 245840 297983 341630 348197 324522 320814 335462 354400
15129 354400 365190 343641 343927 378629 413857 469082 578469 746535 958524 1142883 1214794
15118 1214794 1168660 1049548 929976 820256 698823 592524 511018 422724 306047 212137
15108 212137 227532 312988 344886 328156 320586 322605 309687 270473 233381 222520 232183 264442
15096 264442 309419 356671 372988 334880 262231 172874 79361 9648 36455 135499 194253
15085 194253 205026 264267 342945 356835 306825 211334 143565 145005 205110 312465 381565
15074 381565 356341 279059 229228 253003 307804 330261 307886 261729 247513 292676 367784
15063 367784 398892 369441 305203 265483 275857 292037 280086 238781 198822 209915 255167
15052 255167 259389 227447 185067 132983 61224 21217 64125 140551 190126 223544 286420 386033
15040 386033 479251 544819 610003 687518 738298 714342 619312 480933 303907 102242 -74829
15029 -74829 -210394 -332775 -479677 -653906 -781806 -849288 -878899 -882624 -899057 -934052 -905150
15018 -905150 -774806 -648327 -597791 -552802 -489420 -454742 -495192 -617938 -765654 -854157 -840699
15007 -840699 -751299 -639542 -523406 -422576 -338514 -269209 -235552 -220487 -227803 -258871 -311355
14996 -311355 -351482 -320532 -243049 -198130 -173394 -115702 -31690 47436 104438 135126 129631 91263
14984 91263 49804 24099 -1372 -21197 7795 71620 107904 70847 -37099 -180654 -280727
14973 -280727 -299698 -316230 -363530 -428823 -467924 -441119 -350101 -205588 -49217 63079 129664
14962 129664 137804 45652 -65666 -128082 -152504 -127955 -58794 15137 46458 72713 118664
14951 118664 125871 84074 79421 145711 230229 309404 363114 343881 287902 244650 199642 119431
14939 119431 -8073 -81583 -48834 27851 63708 44071 4748 -36807 -49112 -38442 -41721
14928 -41721 -56303 -69490 -86288 -122492 -184898 -197584 -169073 -151132 -137664 -112324 -78742 -70892
14916 -70892 -94315 -128983 -145011 -132078 -84204 -1093 62291 56513 -3156 -94183 -171640 -197282
14904 -197282 -214517 -256936 -278219 -249816 -210812 -177119 -105870 -25675 -1875 -48266 -103488
14893 -103488 -129768 -135075 -145561 -155139 -142829 -116871 -111529 -106855 -59502 4506 34022 41586
14881 41586 63866 110066 147345 162978 184595 164531 86658 28406 -11571 -89905 -116415 -45596
14869 -45596 43563 104684 135684 144340 117888 60175 -25257 -99960 -138666 -134904 -113177 -114758
14857 -114758 -139581 -166811 -216586 -275819 -276549 -245453 -250061 -289090 -307735 -297925 -269549 -216588
14845 -216588 -196903 -257184 -330268 -359158 -361656 -376802 -383759 -366627 -325199 -309056 -353197 -435304
14833 -435304 -493309 -485946 -402618 -310412 -275046 -281200 -327658 -380043 -364321 -243950 -126153
14822 -126153 -102127 -129227 -139126 -115107 -84133 -85546 -116396 -171366 -234954 -263933 -280293 -301052
14810 -301052 -293473 -253759 -204744 -189440 -205996 -216838 -203481 -179434 -175584 -192341 -218349 -233516
14798 -233516 -210670 -155638 -105598 -63649 -29009 1949 18083 -36765 -147491 -211584 -198610
14787 -198610 -152699 -114784 -82019 -79415 -135596 -236189 -327378 -367760 -375802 -357237 -290026 -197802
14775 -197802 -154189 -166672 -222821 -301218 -283674 -157707 -26930 48600 25262 -40113 -60251
14764 -60251 -46520 -63366 -145597 -235268 -257839 -240244 -225547 -238316 -247493 -219829 -197438 -208471
14752 -208471 -184256 -79715 61300 161520 169730 127608 97952 86208 63299 27184 4641
14741 4641 3453 47712 149495 269731 354132 380138 369316 346860 311815 223891 95556
14730 95556 13675 -7930 -25224 -29259 20285 64629 80614 85823 55829 -20628 -115440 -163289
14718 -163289 -146382 -110218 -89859 -62867 -52707 -84806 -111335 -107002 -68808 17368 62211 877
14706 877 -71769 -80022 -46550 -27309 -89713 -247566 -402716 -464794 -428557 -362263 -303598 -247218
14694 -247218 -190279 -146263 -122877 -107603 -62063 -26521 -14325 41372 123692 186267 219174
14683 219174 256100 296322 315245 281401 200213 145505 155519 238988 362786 454774 507122
14672 507122 494763 414559 316736 250918 196946 114626 21847 -48622 -85076 -102536 -92554 -1224
14660 -1224 124093 171659 153035 110651 32682 -56422 -86337 -42962 -7524 -34357 -88359 -154886
14648 -154886 -198554 -160831 -46328 55650 103221 114211 138090 190636 258319 310965 324074
14637 324074 289079 214933 182662 183955 201114 227862 248786 252060 250232 241660 194565 108935
14625 108935 70600 101455 99794 57021 80990 142494 171330 216387 313163 422665 523494
14614 523494 552906 515132 503412 544291 636275 743987 812723 836924 881773 916791 893894
14603 893894 804592 698530 610306 539841 500161 483251 474205 454071 406005 335391 291279
14592 291279 264995 195627 112247 64533 32311 -17024 -84417 -138810 -150014 -146885 -147555 -129266
14580 -129266 -120643 -117168 -97617 -129415 -201529 -243195 -257391 -242462 -197991 -133039 -68834 -27010
14568 -27010 -33638 -64949 -49424 -2748 -19708 -108709 -176671 -210659 -208247 -166113 -112804 -30395
14556 -30395 56597 76965 37982 -10020 -12893 17104 41028 42669 62623 119996 159673 223461
14544 223461 296476 321815 297357 198912 48465 -36537 -38280 -45600 -75591 -87411 -70006 -59458
14532 -59458 -52486 -35170 -38619 -27776 37806 114927 143085 157757 194974 212125 202852 160326
14520 160326 96100 51864 40588 38442 10898 -32144 -91068 -144309 -120706 -45406 -12696 -59822
14508 -59822 -129256 -166762 -191062 -215328 -212680 -213169 -224419 -223163 -217744 -216102 -235473 -258001 -222881
14495 -222881 -136706 -36248 45544 63698 19985 18136 68266 106970 110046 56655 -51133
14484 -51133 -183151 -282601 -329748 -381382 -422659 -405847 -375049 -365077 -363276 -368420 -373666 -332828
14472 -332828 -283087 -277053 -236160 -121566 -18763 24489 3053 -110130 -245874 -310876 -310319
14461 -310319 -284102 -218276 -141800 -84469 -10047 79715 151775 202625 218667 195072 193722 224564
14449 224564 224091 192721 163816 115012 21252 -82309 -172969 -253094 -299477 -312468 -335081 -385968
14437 -385968 -450933 -503820 -520938 -527697 -528624 -546910 -587447 -579689 -509349 -447028 -359512 -254848
14425 -254848 -247279 -331020 -404425 -428356 -417287 -388098 -337178 -262610 -170573 -90188 -64287 -65992
14413 -65992 -21404 32358 43627 62121 111745 172690 228843 255555 224093 180863 195444 225763
14401 225763 241217 281278 346637 364084 327306 277173 249188 246260 233300 216815 234871 265274
14389 265274 251276 178760 97058 14015 -115779 -253623 -306050 -284561 -256879 -236362 -254286
14378 -254286 -275277 -245492 -177937 -108738 -59324 -38139 -69778 -124628 -172095 -223339 -248016
14367 -248016 -239120 -229849 -254702 -311005 -327595 -294205 -272582 -258783 -233911 -179601 -83835 -2804
14355 -2804 28449 44358 53550 63593 59358 21824 -1132 41629 119648 172637 186387 137989
14343 137989 41507 -3564 32763 88666 116479 127357 128927 122349 116432 139843 176687 171767
14331 171767 125159 56856 2405 -8099 3319 -31162 -88148 -158223 -222532 -246770 -206897
14320 -206897 -113036 -16475 34567 8042 -48106 -92942 -134267 -139997 -114304 -126696 -159325 -192122
14308 -192122 -220053 -193703 -120131 -48955 -10595 -4918 -9044 -10040 10649 68519 150875 239778
14296 239778 323858 396177 459698 552002 658690 748744 823236 859789 885594 933744 967308
14285 967308 974687 941577 852380 775619 767044 782784 754192 666180 566153 486984 459134 462527
14273 462527 425332 393985 389328 374000 339652 301236 312204 346127 338113 270042 183162 165448
14261 165448 245888 348580 386474 365515 341123 373500 459628 557930 659613 757383 852751
14250 852751 961020 1078063 1188944 1316079 1474334 1614363 1729340 1806758 1816574 1794676
14240 1794676 1759557 1730813 1735218 1740354 1730415 1702313 1637053 1528226 1436346 1400382 1402588 1418077
14228 1418077 1422489 1364322 1203122 973367 771001 610279 514997 505296 510975 501196 503164
14217 503164 511640 511392 497965 480505 462034 456646 457217 413769 301289 180762 106270 93204
14205 93204 108438 103923 87792 102247 149714 194495 224793 209873 145641 84247 74820 98229
14193 98229 106607 98388 88594 57704 33040 23847 54547 118993 180705 209608 232758 311172
14181 311172 432044 496387 469295 415765 376328 343576 320833 309796 306323 313328 334864 394042
14169 394042 448429 444777 404962 369506 337932 304136 274602 250923 250185 275041 295707 305071
14157 305071 326558 344243 355108 371280 411079 479405 515198 479257 431333 433636 448077 430776
14145 430776 395960 332037 254984 231824 288379 375693 439355 483802 520045 519625 478927 450999
14133 450999 469909 483353 451142 400228 372168 353757 296357 208592 134485 97371 77209
14122 77209 91962 158829 272217 375359 415985 397338 351912 319655 334010 408658 516180
14111 516180 593843 596975 526769 413387 335100 377315 518648 619012 614384 594948 629296
14100 629296 715039 845747 965695 1003786 956736 864695 808458 833780 867011 840866 818121
14089 818121 849496 893261 886062 824902 727520 609040 495996 405910 377521 400411 423036
14078 423036 434641 429061 440914 489978 577278 716395 839302 877605 837235 784081 765069
14067 765069 759552 740920 700873 633711 557832 469392 355580 267882 222492 229585 267961 308099
14055 308099 379355 448766 491689 540433 599452 663851 736568 792072 797594 762953 699486 618176
14043 618176 558673 535558 547536 594825 673565 791282 915938 979397 964707 936266 934622
14032 934622 906866 802958 664745 569928 536462 533937 562890 631532 681043 687055 682668 672175
14020 672175 667266 724157 837816 952795 1015961 1012559 985638 994171 1076271 1155958 1151308 1091456
14008 1091456 1055221 1111612 1199174 1214082 1164657 1070459 934095 830017 802092 845131 868021
13997 868021 850715 868193 929047 973745 940890 890643 891405 949536 1058898 1189801 1308477
13986 1308477 1406483 1496833 1596100 1700181 1777603 1812482 1820774 1830322 1832918 1854547 1896210 1901950
13974 1901950 1881295 1898344 1963786 2028653 2054546 2058587 2054572 2020875 2000988 2056156 2148926 2257297
13962 2257297 2405301 2524787 2602972 2696792 2776020 2808426 2821283 2836109 2834064 2827748 2856161
13951 2856161 2915276 2959197 2929313 2852988 2781735 2691186 2602103 2563162 2559854 2559957 2536706 2482554
13939 2482554 2415843 2332402 2238834 2170361 2098997 1991219 1879265 1795273 1708640 1610754 1541145
13928 1541145 1512035 1508691 1511003 1489222 1474073 1465734 1434601 1371755 1306363 1288714 1293296 1293246 1278450
13915 1278450 1218676 1118001 968168 790354 671632 674856 782360 892508 959839 985650
13905 985650 962624 874664 767486 713886 698134 686110 681802 681398 720990 811279 885316 899843
13893 899843 886476 872509 894928 955348 1039647 1115724 1159037 1227862 1308446 1321166 1258336
13882 1258336 1204551 1225644 1296657 1374222 1391747 1368297 1405032 1489477 1540989 1519960 1474000
13871 1474000 1468986 1547409 1643847 1685095 1682712 1643065 1574875 1520077 1507703 1565022 1643275 1692421
13859 1692421 1706602 1656273 1562309 1489285 1418145 1306230 1187716 1087594 972911 870408
13849 870408 852354 897141 946671 1027023 1102636 1122065 1099987 1061075 1047004 1079427 1150600
13838 1150600 1161114 1056473 929747 875190 903496 1002857 1129116 1194585 1179958 1174905 1188873
13827 1188873 1211861 1269817 1339215 1399255 1431743 1424071 1382051 1321481 1274375 1263440 1277991
13816 1277991 1288355 1260224 1213314 1209823 1270372 1374648 1496706 1595921 1659065 1686492 1660749
13805 1660749 1594229 1542144 1526276 1512116 1498185 1494308 1489537 1480026 1488049 1540837 1599791 1658263
13793 1658263 1746383 1818357 1825658 1747524 1663661 1663278 1726506 1744985 1700551 1649151 1608414 1622673
13781 1622673 1680654 1727554 1797149 1928539 2097396 2232643 2290093 2321269 2370451 2465948 2595784
13770 2595784 2691228 2709494 2663997 2555174 2487852 2546524 2659261 2763907 2886103 3051033
13760 3051033 3181635 3263520 3346140 3422272 3481882 3473006 3414818 3390996 3386803 3347910 3306017
13749 3306017 3345668 3450939 3523563 3556540 3603908 3676950 3743245 3812472 3891221 3972292 4071622
13738 4071622 4196231 4364797 4618827 4915132 5160126 5346634 5523930 5732341 6007217
13729 6007217 6349206 6728813 7150464 7599680 8020361 8352663 8592454 8786401 8991026
13720 8991026 9246785 9584665 10022217 10524595 11085454 11720236 12475365 13398888 14511294
13711 14511294 15843314 17411935 19188247 21205385 23616245 26551161 30137627 34580202
13703 34580202 40142746 47105888 55783068 66459353 79196741 93403189 107350056
13696 107350056 118416027 124589979 126249464 126033946 127048831 131688953 141606616 158115843
13688 158115843 182264474 214315985 252264432 289837503 316398366 322012600 305127096
13681 305127096 273415076 236854108 202283193 172827765 149201913 130914575 116854358
13674 116854358 105434471 95036036 84725109 74539876 65039165 56658777 49483559
13667 49483559 43432998 38368996 34066980 30359141 27188723 24576413 22446288 20603379
13659 20603379 18935204 17423639 16064931 14852922 13767508 12788000 11914510 11150531
13651 11150531 10487328 9920973 9480342 9180371 8994021 8869489 8753310 8612831 8429505
13642 8429505 8153801 7793426 7425019 7083642 6760012 6472702 6251818 6111220 5999480
13633 5999480 5871658 5720876 5602587 5546634 5497327 5438268 5321470 5102564 4843898 4578264
13623 4578264 4282037 3993678 3799617 3768367 3835547 3883213 3928023 4015673 4109297 4233913
13613 4233913 4429177 4615335 4730434 4802720 4873166 4879176 4771427 4608775 4401387 4152115
13603 4152115 3917384 3706120 3521936 3403643 3312802 3195502 3010511 2814338 2689406 2599473
13593 2599473 2491431 2414906 2437854 2523848 2609349 2694546 2781233 2835355 2881071 3013277 3253055
13582 3253055 3542633 3840207 4138399 4406960 4561732 4568275 4463964 4248170 3946850 3600312
13572 3600312 3278848 3055419 2892399 2737339 2637933 2617926 2664581 2709490 2715621 2766574 2903388
13561 2903388 3076875 3221998 3345793 3454856 3521892 3503672 3381764 3201875 3001022 2812034
13551 2812034 2652152 2492961 2308778 2143139 2016032 1953105 1959551 1990164 2012140 1987882
13541 1987882 1919720 1861887 1844999 1853971 1887140 1920503 1942430 1946458 1954149 2021324 2114910 2153710
13529 2153710 2133285 2077477 2026881 1995774 1952179 1919249 1915127 1887420 1819261 1734614 1694453
13518 1694453 1780977 1948867 2030759 1999103 1933369 1906871 1973151 2100175 2221254 2331913
13508 2331913 2448341 2562975 2661675 2766558 2830840 2806785 2752740 2762952 2831487 2873472 2851004
13497 2851004 2779387 2677506 2585783 2528757 2473475 2436320 2411032 2368980 2328842 2299507 2309112
13486 2309112 2326876 2284521 2222614 2217299 2318881 2454743 2521177 2525466 2530661 2616449 2764124
13475 2764124 2881331 2936147 2956614 2960928 2933731 2869339 2843059 2883947 2985223 3140461 3266780
13464 3266780 3295688 3253850 3214809 3227436 3293378 3387678 3498177 3619327 3724843 3800199 3893882
13453 3893882 4065942 4348122 4702836 5092941 5527940 6007422 6562261 7233240 8094468
13444 8094468 9197585 10591221 12281166 14185749 16163678 17847669 18756659 18640960
13436 18640960 17623007 16059546 14264492 12458395 10799933 9376907 8199535 7217657
13428 7217657 6362104 5684385 5266413 5014146 4807187 4609419 4382772 4130951 3909763
13419 3909763 3763571 3662039 3562987 3507849 3517776 3556772 3610848 3703884 3815200 3946265 4111776
13408 4111776 4278254 4385674 4384211 4294962 4167731 4018696 3895148 3811492 3702459 3547241
13398 3547241 3368765 3189617 3051184 2910713 2743037 2586323 2460209 2380211 2362121 2363358
13388 2363358 2341421 2298194 2211325 2131268 2126452 2173091 2225206 2273167 2352450 2437138 2455613
13377 2455613 2380450 2252661 2172074 2175810 2208072 2252892 2291566 2312680 2341566 2398442 2462917
13366 2462917 2488765 2497918 2533893 2569024 2599513 2650325 2672131 2583368 2424859 2293887 2224112
13355 2224112 2180150 2101220 1993976 1922163 1948618 2072921 2201361 2294595 2358377 2360102 2291507
13344 2291507 2190003 2087330 2022587 1991527 2021524 2113055 2185023 2217342 2281460 2412972 2569132
13333 2569132 2709025 2755772 2686895 2543736 2354153 2122520 1890233 1701719 1549062 1390806
13323 1390806 1248071 1148822 1069832 1029614 1086028 1179774 1183639 1085305 956053 833033 761494
13312 761494 779786 798809 755693 712771 721522 745520 740443 689393 606527 499816 379218
13301 379218 310620 309238 318496 303895 292672 324037 386542 416990 439484 530187 617296 631494
13289 631494 574934 513670 531512 586258 589621 554730 531674 542925 549849 509748 479921 511717
13277 511717 614477 751514 823176 801833 729428 670019 669434 682382 665825 620394 571066
13266 571066 531228 517950 489408 438942 444577 551721 681767 716821 624449 476097 346134
13255 346134 291480 316150 355677 381001 384109 382435 429983 525910 595667 606550 586673 568121
13243 568121 542761 521409 556276 614345 629404 610972 580373 527747 476130 427690 373009
13232 373009 361294 400822 451807 513926 586297 605414 561824 515240 520636 561378 574121 525358
13220 525358 431801 350945 328389 340357 346098 352261 363181 351587 330157 314502 287725 224672
13208 224672 159869 156710 247424 374065 439848 431782 404295 457619 565748 627194 636393 604465
13196 604465 529864 416842 341835 333308 315876 297446 348216 444090 514217 555970 607436
13185 607436 671150 676894 591734 492118 469244 509105 573458 617818 629078 649597 642712 602214
13173 602214 594330 612797 608507 585955 584262 593695 609860 636124 693481 773038 815635 795703
13161 795703 708472 609238 519743 437698 387881 364527 333291 273780 252484 295869 379839
13150 379839 473638 535871 565971 597834 686308 841228 1037423 1231496 1378051 1464192 1494470
13139 1494470 1523657 1609667 1727251 1794894 1776837 1714434 1680827 1695843 1705826 1712684 1773136
13128 1773136 1849999 1841978 1796320 1764196 1706918 1625029 1522189 1417409 1356229 1297171 1202463
13117 1202463 1078164 924490 740074 534544 357793 260597 254158 299541 316830 274287
13107 274287 193967 113530 71939 89200 134469 206212 296022 362558 429068 471598 434434
13096 434434 338329 201680 59958 -28936 -43894 -11315 346 -14859 11772 63665 80703
13085 80703 89136 136309 221552 309936 411309 527488 594158 588800 547281 497442 454345 439222
13073 439222 460889 505720 540671 528283 481450 404630 326301 324191 422017 577264 724863
13062 724863 822276 862991 835976 796540 786271 774855 753225 749281 759418 768538 780929 771582
13050 771582 707492 641628 587424 502052 413846 402227 452210 469428 445044 447611 491255 521325
13038 521325 491210 441807 415213 387288 351643 350183 401060 441118 420945 404116 461054 556908
13026 556908 634933 683216 722186 759980 776331 744901 676996 669859 773176 897631 955084
13015 955084 984606 1047602 1131968 1195112 1230790 1278755 1349984 1418106 1464168 1476752 1476120 1506783
13003 1506783 1558310 1634547 1734269 1816622 1882521 1929410 1923138 1812849 1640088 1458388 1287299
12992 1287299 1163508 1093970 1053437 1004656 921565 813867 704770 617641 531245 422188
12982 422188 339157 328135 370990 391856 351076 344004 398546 438965 438601 417638 375430 362404
12970 362404 391210 396078 374796 332547 260186 182664 146912 140063 152640 217152 292697 336949
12958 336949 321153 273266 252827 268453 303366 302137 240219 138141 36201 -33769 -57538
12947 -57538 -81468 -123893 -166801 -173797 -122750 -42504 32109 88718 118687 131733 161639 224014
12935 224014 262392 232614 164353 136235 173383 245811 361601 459065 461368 414954 394826
12924 394826 395631 381149 338574 265342 194535 158598 184054 244412 279093 265696 215062 176818
12912 176818 156911 140219 133971 127155 104284 40595 -59995 -139779 -166769 -159841 -130338 -61695
12900 -61695 20303 56521 58543 77837 119053 141925 118137 77722 72084 94602 139488 216919
12888 216919 255525 212536 93996 -47999 -141112 -177770 -143241 -63847 10820 91785 157624
12877 157624 161768 136555 122337 116375 135618 199316 282131 329348 301968 256934 244298 273200
12865 273200 315183 331834 298990 201361 65884 -45288 -120035 -153656 -146696 -134422 -114745
12854 -114745 -74658 -39192 33653 125287 177776 203157 205725 237312 337617 443947 480947
12843 480947 436459 369611 321960 267771 183408 63541 -55611 -101429 -112552 -187705 -318202
12832 -318202 -414200 -447281 -434882 -416447 -401486 -394153 -394392 -397649 -417893 -444365 -440712 -393129
12820 -393129 -338986 -296678 -246383 -192392 -150426 -112072 -94440 -91779 -58433 5830 49704 51751
12808 51751 31547 22703 62718 154750 276106 392239 452411 477939 470269 392690 272174
12797 272174 198257 240602 375958 497854 519885 449255 294411 118784 -7733 -79628
12787 -79628 -104989 -54308 46981 117362 144779 169338 227806 317781 393854 428220 493799
12776 493799 643753 804731 889715 927272 935547 941998 994106 1035671 1039284 1030746 1005543 985452
12764 985452 995038 1000520 1010500 1048098 1109232 1124695 1080209 1055354 1057389 1003729 892872 797168
12752 797168 744073 724154 738775 824942 921555 925437 842310 705989 551359 457053 425420
12741 425420 423067 439015 470508 513183 570191 646680 726086 792209 822707 812089 788523 764020
12729 764020 710758 643359 608789 634973 714338 791246 839180 869067 925794 1030053 1147236
12718 1147236 1212236 1207670 1201923 1230455 1266368 1270275 1195012 1070526 966960 908996 881672
12707 881672 874300 870713 844695 779492 728199 747042 794165 863640 957327 999126 1014811 1035035
12695 1035035 1017828 955470 901249 911946 974589 1041276 1110887 1162884 1193212 1239113 1294687
12684 1294687 1394590 1565256 1782694 2023342 2238824 2415664 2574877 2707867 2740659 2640997
12674 2640997 2461994 2273798 2115904 2018975 1979587 1954174 1925366 1858251 1748864 1659573
12664 1659573 1573737 1501353 1458105 1401394 1358092 1372963 1432434 1523359 1620078 1669283 1640065
12653 1640065 1606155 1614273 1688849 1822587 1997723 2196544 2401069 2658796 2973503 3310860
12643 3310860 3676091 4066227 4419018 4677852 4840234 4904931 4875236 4828073 4834646 4840380 4758359
12632 4758359 4552255 4279186 4049024 3878991 3737148 3603418 3430970 3206399 2961604
12623 2961604 2703357 2463706 2265122 2066772 1844940 1651093 1505016 1431544 1389000 1310608
12613 1310608 1243193 1222137 1218667 1233507 1282604 1364961 1479068 1554898 1537869 1444298 1354862
12602 1354862 1368252 1483577 1589146 1608903 1564299 1517266 1486600 1485855 1524637 1580646 1617545
12591 1617545 1650889 1681835 1637480 1556643 1530277 1565546 1624739 1668157 1690785 1741117 1786043
12580 1786043 1793023 1819272 1895204 1973733 2026610 2056971 2040587 1961930 1887035 1878495 1855842 1716607
12568 1716607 1502399 1347274 1290498 1260743 1229196 1204876 1176523 1127062 1085034 1113193 1201486
12557 1201486 1298180 1392806 1478208 1509720 1467513 1394246 1342444 1333992 1349675 1356191 1356825 1374715
12545 1374715 1381364 1358724 1310899 1287168 1305611 1317388 1290112 1267344 1248133 1229093 1192930
12534 1192930 1120166 1026685 946753 916787 918885 911994 861990 803301 772380 722251 622422 548168
12522 548168 554693 603543 647668 647606 613304 563648 511746 516137 577198 656670 689049 616313
12510 616313 500132 383703 295666 276395 284725 275826 260322 291081 354000 409557 465736
12499 465736 529476 576892 566630 534475 492120 480980 548269 613382 627640 627858 595552 568880
12487 568880 577543 554455 489084 414165 315175 216903 198493 244501 298086 350572 407073 446846
12475 446846 446320 436242 416641 372926 360447 404326 476439 504214 468151 434218 466038 519152
12463 519152 520735 481174 431492 409642 451367 507675 530104 556165 575711 541693 541989 597196
12451 597196 581905 497994 452473 479245 552709 617899 641193 669949 712274 713162 635549 551816
12439 551816 518485 535159 577544 602596 605153 601603 605335 628028 653491 656551 636261 606186
12427 606186 586728 596904 625398 652826 703580 739797 722603 670473 600686 509996 414084
12416 414084 312057 273803 349678 466877 557135 621209 673305 713040 737310 716373 666162
12405 666162 706516 834226 949546 999587 993759 963334 942057 960593 1007725 1038657 1040639
12394 1040639 1002205 935708 911487 886249 828661 778141 731318 683239 678749 709959 758891
12383 758891 874758 1017851 1122216 1159294 1115889 1067156 1026722 1013754 1079638 1198935 1253552
12372 1253552 1204487 1097582 964331 861508 810837 780477 792758 872160 948754 993887 1040357
12361 1040357 1068035 1023648 941479 893434 868096 838821 871389 989710 1091760 1092271 1035731
12350 1035731 958120 886758 859056 890163 950195 998941 1033902 1052898 1064608 1110533 1194378
12339 1194378 1237076 1215914 1175974 1139314 1127970 1122837 1113595 1142142 1198200 1250800 1312313 1401168
12327 1401168 1477321 1484386 1419900 1348857 1273004 1198019 1162242 1144719 1139315 1186826 1234216 1228845
12315 1228845 1191097 1156168 1130753 1111259 1123708 1135022 1111437 1120994 1202116 1260748 1236054
12304 1236054 1184153 1132969 1082438 1029820 962775 889840 844957 861283 905046 936575 966383
12293 966383 993283 991848 961922 934059 968372 1052924 1101088 1100367 1114176 1182160 1271772 1301633
12281 1301633 1269950 1232534 1226646 1276447 1372781 1492803 1615070 1740581 1890175 2062757
12271 2062757 2218332 2353555 2473118 2563866 2607339 2603441 2613666 2659903 2693968 2712080 2740419
12260 2740419 2810118 2873494 2874588 2802866 2697970 2625698 2602668 2603565 2540730 2445288 2390428 2390061
12248 2390061 2426990 2440101 2415472 2386404 2348683 2298263 2231944 2117063 1979972 1894852 1888130
12237 1888130 1920403 1922185 1883556 1860408 1895124 1964072 2026582 2052276 2006625 1946978 1949399 1995552
12225 1995552 2025743 2009115 1970010 1932321 1909354 1898577 1885600 1885436 1957738 2053265 2059189 1948418
12213 1948418 1815699 1700887 1610593 1572876 1577932 1627389 1695826 1787391 1901947 1998084 2052882
12202 2052882 2081051 2104906 2144596 2221248 2264959 2250977 2234447 2210842 2194276 2223293 2275974
12191 2275974 2339975 2400569 2460686 2514657 2559062 2612626 2684171 2769435 2860950 2952275 3010923
12180 3010923 3056373 3147213 3254402 3354405 3475152 3619650 3712158 3705971 3659006 3642427 3667345
12169 3667345 3690953 3659735 3567884 3487268 3492980 3594268 3725013 3859860 3929750 3932110 3946389
12158 3946389 3997508 4094957 4224819 4355418 4477232 4591880 4710368 4818931 4904337 4985587
12148 4985587 5050342 5090852 5113969 5123438 5156530 5225276 5261581 5273807 5290003 5264762 5204027
12137 5204027 5185439 5252121 5398885 5582802 5762840 5933333 6091122 6264416 6471551 6709331
12127 6709331 6958853 7237714 7538575 7827960 8073849 8311737 8615272 8977551 9349652
12118 9349652 9740310 10210950 10776156 11417429 12078461 12735432 13419451 14162304 14943934
12109 14943934 15793697 16731640 17718424 18781368 20000619 21394297 22897645 24515167
12101 24515167 26339744 28460534 30910234 33688409 36840092 40458433 44634638 49480171
12093 49480171 55160951 61832862 69669788 78872402 89694343 102470824 117429247 134603629
12085 134603629 153826463 174565630 195633777 215059066 230334999 239026060 239693311
12078 239693311 232469351 218886398 201168619 181504388 161704699 142965288 125870099
12071 125870099 110673744 97422578 85955304 76030723 67433837 59985181 53584186
12064 53584186 48078132 43245233 38964599 35194563 31903314 29039979 26581979 24444453
12056 24444453 22515821 20780932 19242883 17855981 16596204 15452196 14422036 13527949
12048 13527949 12760361 12071376 11432413 10800832 10146227 9500101 8944030 8499810 8092542
12039 8092542 7723342 7411516 7105237 6774474 6437215 6119624 5861140 5675749 5524634
12030 5524634 5380330 5278008 5226943 5184932 5075693 4833145 4548980 4346496 4229341 4125877
12020 4125877 4008256 3884993 3743519 3575150 3409392 3281450 3214613 3199402 3210518 3225582
12010 3225582 3247090 3305399 3362819 3374556 3342102 3307037 3296340 3284846 3259036 3213187 3190949
11999 3190949 3200687 3171357 3058595 2879210 2684410 2561571 2501349 2410827 2296079 2209545
11989 2209545 2156954 2103870 2054556 2049839 2084718 2121397 2165255 2149897 2036724 1882166 1753868
11978 1753868 1711643 1746982 1792818 1801650 1802041 1814773 1821764 1806182 1755239 1699935 1654540 1636545
11966 1636545 1651344 1702938 1798495 1880426 1924513 1916605 1875193 1866534 1888957 1924908 1985448 2041339
11954 2041339 2040619 1964108 1870417 1759488 1606881 1461247 1330720 1195716 1096180 1064544 1084276
11943 1084276 1125396 1179921 1255664 1342815 1399068 1372035 1292109 1230642 1222350 1258867 1270133
11932 1270133 1236590 1178913 1112939 1083866 1085235 1111959 1177899 1233174 1214496 1133603 1053871
11921 1053871 1016102 1032806 1081710 1099120 1058898 1002425 1002250 1091920 1235370 1357271 1434426
11910 1434426 1517501 1589279 1608957 1604656 1608515 1628955 1694561 1833945 2029079 2229511 2352980
11899 2352980 2389821 2413238 2453623 2485853 2492268 2478952 2434704 2340347 2188703 2008916 1838091
11888 1838091 1652164 1468535 1388485 1415112 1424743 1401727 1377994 1329291 1223437 1087934 1008326
11877 1008326 1009204 1022365 1029344 1037588 1068553 1102612 1099423 1110416 1145372 1193011 1243016 1217400
11865 1217400 1090442 934657 836041 839644 870927 885541 912985 951579 994718 1026753 1035963
11854 1035963 1010507 938905 831208 758965 759947 789396 832054 831283 784910 747201 769512 808416
11842 808416 793014 754416 771514 824969 866372 911006 985986 1041043 1028985 984965 960558
11831 960558 930816 834850 706981 651156 669769 707597 784569 882781 953252 976888 965946
11820 965946 962822 973609 996820 1068849 1159445 1230833 1253735 1261641 1301909 1355070 1364188 1308654
11808 1308654 1275050 1267782 1194478 1056947 926743 846356 829127 852175 890588 897749 880793
11797 880793 914373 995489 1080028 1130785 1131049 1104582 1111998 1177821 1228664 1245107 1258977 1270163
11785 1270163 1254133 1210762 1166151 1131614 1109784 1080163 1053479 1032770 985741 913665 868866
11774 868866 864620 900450 950002 965906 913658 821693 759422 770359 816215 808639 773159 780925
11762 780925 785528 740689 658344 582780 538277 513188 510410 555308 648165 740395 810351 846543
11750 846543 813184 727816 661019 661738 677510 665251 644811 647561 682961 698409 659153 594067
11738 594067 580367 602837 601521 586651 560276 553955 561625 545999 536057 584342 668879 710820
11726 710820 707393 721359 769465 822021 817025 772640 757178 768434 775382 775619 783731 825080 887658
11713 887658 923239 898527 843633 835476 899126 983692 1046366 1066635 1024128 950187 926735 946796
11701 946796 942175 933181 925405 941862 1035208 1171406 1304736 1420599 1506647 1584805 1652069
11690 1652069 1719567 1871822 2127849 2413930 2684631 2972265 3311443 3720099 4158258 4519755
11680 4519755 4725608 4765717 4675266 4472685 4186099 3868216 3535128 3193036 2877985 2619370
11670 2619370 2430223 2306825 2253709 2236612 2189727 2101231 2024979 1931041 1771002 1621537
11660 1621537 1531699 1489297 1479335 1453167 1410606 1401132 1407808 1423820 1425580 1381399 1284557 1145588
11648 1145588 1017633 949980 940247 986136 1062199 1102667 1121971 1185622 1259316 1306854 1340037
11637 1340037 1348270 1324917 1304685 1311158 1315259 1309676 1287859 1248642 1193495 1148822 1152065 1125357
11625 1125357 1015818 872473 760889 737835 727548 676632 649069 632301 601960 617418 671395
11614 671395 746090 845576 942242 1011033 1037620 1002954 928368 842979 797244 814626 869832
11603 869832 919640 973924 1056033 1116002 1099054 1060626 1069566 1088099 1078642 1019213 903879 746381
11591 746381 586266 488865 448479 424644 401052 386639 398284 439047 460148 422268 358263
11580 358263 320222 299630 259624 216518 207733 266779 379556 487784 533764 530059 499874
11569 499874 460910 410816 307194 176716 103498 95062 91319 96100 149869 209742 262521 323799
11557 323799 353063 330743 309961 337962 357392 325899 282497 278824 312062 367881 454018 546467
11545 546467 591853 615620 673218 775492 893418 1026258 1207995 1408467 1613739 1839835
11535 1839835 2057538 2233676 2372334 2495730 2594578 2653607 2723111 2839417 2932768 3013258
11525 3013258 3108402 3151424 3102907 2998800 2864693 2688766 2507141 2316844 2115645 1945443
11515 1945443 1863201 1805282 1683371 1529835 1392112 1270869 1129457 1010664 953871 927477
11505 927477 886944 839672 819315 791892 750824 733154 770686 855309 922875 925931 852792 723206
11493 723206 594864 534496 543683 601520 687511 754600 746275 697665 655124 613372 554168 499749
11481 499749 490119 473529 395390 312701 306891 393387 534557 675205 814228 919487 938538
11470 938538 884331 787990 643949 482114 343868 254783 248795 297668 349431 358301 337938
11459 337938 336198 327135 281889 258606 318731 436318 554593 640262 682026 652684 566510
11448 566510 511956 549991 635317 695702 708913 694575 668935 617841 527829 448721 422736
11437 422736 417090 390346 374343 393194 385129 307973 170430 42599 -32378 -78926 -146617
11426 -146617 -231048 -261130 -212597 -128783 -20225 117893 258404 366034 397305 370649 343889
11415 343889 333262 348847 404884 499450 615760 711850 718329 635536 502979 397256 359879
11404 359879 355418 367034 395955 429008 425479 361456 275629 199520 146348 122127 92383 85301
11392 85301 108615 100058 80213 100175 141450 168200 156706 145281 194515 277503 320269 276198
11380 276198 197185 164602 171133 162731 120681 92622 95207 111995 136395 153669 137058 115913
11368 115913 107886 80158 48190 30868 19654 30078 46645 45146 6831 -65454 -99004 -51934
11356 -51934 38500 89676 87679 71271 29185 -33556 -111928 -167846 -149146 -94153 -60346 -76179
11344 -76179 -168695 -251624 -277525 -333881 -456559 -583646 -668189 -700458 -662762 -546795 -397835
11333 -397835 -303296 -305118 -358211 -376152 -359217 -349006 -317010 -320688 -438296 -585493 -621841
11322 -621841 -556902 -471703 -371711 -277483 -242968 -254560 -253614 -238022 -235459 -259305 -262274 -206253
11310 -206253 -160331 -188952 -242767 -259593 -250037 -239934 -244551 -260764 -261685 -237365 -221771 -203998
11298 -203998 -174536 -161388 -172586 -223159 -303549 -349257 -369322 -410615 -439328 -404903 -306382
11287 -306382 -186043 -92328 -71107 -103846 -148596 -184538 -193581 -208226 -256577 -296685 -287431 -248770
11275 -248770 -203211 -191549 -218032 -233156 -259028 -295106 -301376 -256162 -222163 -242495 -288221 -284717
11263 -284717 -184889 -66667 16712 109594 211064 269190 266706 196462 33504 -174658 -342556
11252 -342556 -413100 -395076 -344063 -308981 -292960 -255065 -218299 -173418 -131420 -133441 -169158 -202011
11240 -202011 -199179 -159445 -107159 -56537 -14884 23114 69185 116785 174632 245541 284238 262099
11228 262099 207301 152905 94716 49076 13722 -16561 121 83312 159665 186111 175424
11217 175424 135198 77271 22193 -20679 -34647 -49477 -102341 -132404 -152463 -208069 -282487
11206 -282487 -334628 -361850 -370508 -343861 -295459 -261339 -239858 -210568 -153909 -96231 -51196 -62919
11194 -62919 -123397 -175191 -233812 -262348 -205477 -95085 4692 45013 48773 41225 51047 83460
11182 83460 103307 129144 187413 219108 149841 55847 27875 67070 123453 167346 232832 316852
11170 316852 405866 527362 678498 848247 1057969 1300669 1549660 1730248 1798646 1782178
11160 1782178 1683847 1553238 1496129 1496551 1495718 1493075 1458072 1385552 1323061 1280324 1264562 1241854
11148 1241854 1167255 1052422 916024 798345 700371 614072 564310 544273 535749 487504 435870
11137 435870 455562 449084 367157 261863 189607 155316 147073 155120 187409 217526 216920 200830
11125 200830 207527 239732 289557 319722 314038 298377 294151 287307 249816 195800 161157 172932
11113 172932 217914 238091 208227 162174 125155 85297 51317 28578 -3157 -28279 -25783 505
11101 505 24907 22613 19342 35110 53642 25584 -39630 -72705 -64624 -37387 7739 57823 114318
11088 114318 156623 156715 95766 -18832 -102659 -104203 -52924 11869 83643 142167 148016 129105
11076 129105 143371 163097 178864 208152 245517 252937 197517 116983 56935 14223 1791 26209
11064 26209 45090 36797 32411 41400 66487 66152 34714 39165 113940 205722 275786 293544 259902
11051 259902 187171 76552 -57464 -154383 -183372 -174265 -142509 -88653 -55339 -50380 -114067
11040 -114067 -215100 -281234 -338333 -400759 -431910 -432574 -410605 -395838 -389517 -381451 -388933 -353670
11028 -353670 -253746 -158612 -134636 -133626 -94252 -70888 -63435 -26546 -12958 -66436 -178980 -289963
11016 -289963 -358307 -397273 -402984 -346605 -263171 -186617 -135503 -126633 -120918 -116502 -132738 -145460
11004 -145460 -170420 -207527 -215087 -184803 -147111 -127396 -126026 -124215 -116531 -103902 -90418 -93785
10992 -93785 -94822 -73259 -9477 76036 115984 107535 81520 76520 89000 96810 116142 141636
10980 141636 133892 96839 48646 -18436 -82650 -108275 -114487 -130099 -144108 -154561 -155637 -111009
10968 -111009 -28377 39107 17140 -68858 -149698 -195989 -214505 -195572 -131216 -57090 -39185
10957 -39185 -115281 -186985 -178525 -127082 -100535 -144840 -262528 -362311 -364035 -314420 -298488 -292164
10945 -292164 -231656 -122081 -43189 -49746 -60535 -27719 -16578 -32448 -42096 -61837 -95152 -111226
10933 -111226 -129565 -153222 -189971 -236754 -202489 -78958 9664 26405 9958 -43771 -105392
10922 -105392 -168166 -273597 -403145 -503899 -495065 -401578 -317682 -263963 -209445 -133306 -80491
10911 -80491 -47993 -42744 -72576 -73277 -29862 19167 29935 18768 51746 78860 60495 8082
10899 8082 -44709 -100691 -152507 -170267 -132473 -29024 63389 52804 -36039 -136283 -171738
10888 -171738 -112542 -5361 75141 110412 153351 216309 219205 157771 91141 10607 -72567
10877 -72567 -110037 -120413 -99025 -51582 -34105 -55538 -100333 -125508 -118969 -120340 -140800 -160092
10865 -160092 -164488 -146813 -74990 52174 195457 314064 384893 390017 323629 196070 62371
10854 62371 -13140 -7781 36706 38593 -7873 -78140 -161935 -242875 -300587 -329846 -343464 -349728
10842 -349728 -320902 -293599 -271927 -225820 -167357 -98833 -47304 -29179 -50731 -100021 -113953
10831 -113953 -71523 286 50907 20832 -59060 -80622 -23914 37860 37782 9429 -6104 -18788
10819 -18788 -23125 -43780 -108995 -162055 -146122 -99811 -69917 -19816 3282 -65776 -155830 -175764
10807 -175764 -126998 -66405 -58811 -77131 -47149 16151 82943 112003 93304 39891 -46736 -124797
10795 -124797 -161154 -149175 -70599 36197 145512 238871 274182 219327 107559 12837 -36112
10784 -36112 -30855 5093 21943 17236 6377 -31686 -78786 -114990 -150866 -169501 -218826 -313975
10772 -313975 -419929 -504146 -519747 -393082 -179632 -19071 75031 90805 48272 -33885 -116749
10761 -116749 -172579 -249471 -337859 -355935 -297943 -231841 -191115 -211341 -316833 -444034 -535552
10750 -535552 -576497 -565921 -504597 -408159 -340749 -347128 -351535 -300458 -218333 -119538 -66032 -96169
10738 -96169 -134511 -103621 -319 136300 318586 512698 576908 532433 518522 555583 579258
10727 579258 561547 493965 370119 230880 141600 109367 122304 159014 194168 205454 198325
10716 198325 207269 230312 239291 233570 279605 340889 355958 344467 343540 340763 301359 251567 238324
10703 238324 252550 228235 152256 59111 -32469 -106828 -145851 -164282 -179044 -178025 -168727 -141260
10691 -141260 -97307 -88881 -121740 -150163 -182128 -259378 -349908 -380313 -378489 -382333 -329596 -231465
10679 -231465 -158218 -136483 -128600 -105816 -70596 -44007 -56932 -118615 -175421 -179746 -126733 -46375
10667 -46375 38602 105436 111832 108863 132960 161818 191502 241491 299924 313320 265305 207932
10655 207932 196080 212530 229980 233292 204349 142300 87604 90957 120078 100931 33720 9154
10643 9154 46404 100649 171659 228036 260397 259770 222199 184668 155861 117056 71324 78091
10631 78091 167388 249350 248951 175863 84965 21608 -25914 -39293 -26694 -23414 -15158 -4676
10619 -4676 -50720 -135559 -208805 -227874 -224873 -286009 -411443 -506838 -507776 -428157 -333549 -309553
10607 -309553 -386918 -506967 -597043 -659439 -769671 -876348 -880272 -803926 -736100 -710366 -679810
10596 -679810 -623982 -558053 -506434 -444136 -352167 -271330 -245113 -276239 -330448 -335828 -282690 -207422
10584 -207422 -129551 -85010 -85558 -89922 -89736 -85256 -59550 205 46367 60591 28081 -46112 -114329
10571 -114329 -142750 -149361 -142852 -98634 -54507 -22634 21383 50680 34105 -14718 -36174 -22766
10559 -22766 -31849 -72545 -117637 -146908 -167175 -164294 -150770 -159220 -230486 -319903 -353671 -331478
10547 -331478 -317160 -347413 -372291 -368836 -371820 -348001 -298316 -273480 -281782 -249369 -176412 -137439
10535 -137439 -151720 -161434 -129843 -101939 -118638 -167903 -211308 -259668 -312194 -350374 -316163 -190165
10523 -190165 -75527 -47358 -62774 -60892 -78672 -150142 -207173 -212427 -191886 -169461 -154839 -192726
10511 -192726 -256138 -268225 -234487 -207047 -204153 -199485 -188645 -218676 -299817 -363042 -383636 -377582
10499 -377582 -340009 -266302 -182124 -127906 -113190 -80863 -18451 20391 -30814 -161599 -295500
10488 -295500 -406805 -470397 -471808 -495380 -597410 -704930 -777762 -814125 -808469 -775810 -708551
10477 -708551 -638124 -606817 -569197 -484570 -390422 -341472 -337907 -329530 -266586 -174296 -75167 30735
10465 30735 77974 81253 83555 33693 -77655 -176308 -227671 -246070 -221162 -175408 -136056 -127392
10453 -127392 -146906 -176155 -207974 -232694 -243621 -230221 -196355 -193767 -235746 -300562 -316101 -263877
10441 -263877 -178345 -84771 -18560 19984 67924 135678 183092 191813 221503 284024 337146 341469
10429 341469 324303 301232 249445 220291 239034 223863 183743 185841 244466 293433 267550 221106
10417 221106 215739 226120 227125 237201 254363 250871 248607 306021 407345 459197 418429 318041
10405 318041 208323 121516 63879 40362 8744 -64313 -122241 -150064 -153409 -103820 -27976
10394 -27976 60142 149557 207785 215431 172811 119229 82045 32678 -16750 -26357 -10762 -3957
10382 -3957 -22486 -96953 -167644 -148237 -91078 -55428 -35501 -19471 -6618 -23948 -55120 -53864
10370 -53864 -10853 29058 44892 28262 -16079 -67694 -87352 -90360 -110269 -165911 -237556 -280275
10358 -280275 -285121 -222832 -155768 -141208 -149991 -165401 -192470 -222906 -180155 -76632 -16700 -63608
10346 -63608 -184664 -290659 -321666 -265597 -170225 -76580 -15048 -5045 -20817 -22264 12438
10335 12438 69698 107029 119686 153863 210930 260800 287382 250449 152919 75200 78173 129860
10323 129860 166495 136676 82135 69406 52392 19061 30697 79343 111037 107858 92565 77076
10311 77076 95419 169609 258141 325748 332089 272812 222460 244366 303032 323895 316112 284224
10299 284224 191576 36361 -126789 -235576 -287251 -288755 -241740 -165396 -73395 2674 16815
10288 16815 -21392 -40681 -25843 -24692 -37846 -59045 -38112 84094 242487 310605 267409
10277 267409 196600 147322 138479 169860 166558 90536 27211 26984 14951 -47189 -112636 -116000
10265 -116000 -76979 -42049 -19491 -25746 2482 148722 306910 415652 482880 490791 464207
10254 464207 423371 381674 359445 369999 378737 342486 274367 225596 205013 184762 145897 95275
10242 95275 80836 92865 76013 50969 26302 -19008 -46298 -18293 69615 179579 269639
10231 269639 310797 293758 259931 221586 138637 45988 33650 52813 59996 73904 110914 150931
10219 150931 121607 42764 -37157 -104331 -163909 -210469 -192432 -118782 -67047 -42117 -23342
10208 -23342 -59388 -116111 -90295 4293 89111 174419 275694 367276 403687 380703 337111
10197 337111 275989 198697 115384 34441 -34436 -39684 29656 121172 162138 150626 140118 179559
10185 179559 205871 173727 152086 169100 202129 206367 137473 14768 -130621 -241315 -273196
10174 -273196 -227958 -134601 -36212 -672 -77735 -177687 -196598 -147134 -87393 -64096 -64088 -38454
10162 -38454 -22482 -921 48690 85992 90853 93464 118886 145909 167986 202824 232538 217446
10150 217446 194825 217328 255194 273296 270440 228021 139923 34756 -41544 -51104 -16199 35344
10138 35344 79349 121317 158258 199687 245390 273652 259458 190893 83467 -24832 -81786
10127 -81786 -59166 -10385 39248 89252 108728 111576 129342 154344 192073 212917 165050 69796
10115 69796 4370 -25119 -63455 -97825 -123829 -114782 -81424 -50319 -34169 -58787 -117586 -168202
10103 -168202 -150024 -62211 44199 143841 231956 289392 294399 267868 281808 331917 357276
10092 357276 309728 235322 230268 241862 213488 187565 169182 136301 97485 87210 83273 59820
10080 59820 28191 14979 61399 181929 289554 319338 288847 213447 160248 171471 207894
10069 207894 239787 271010 288051 249540 189748 166031 204762 322329 483578 621615 677492
10058 677492 641608 554371 447488 365353 335030 322601 325785 325552 293207 258799 224641 169025
10046 169025 125329 77993 7274 -56499 -61539 -9922 54159 92001 72337 -66 -97381 -191548
10034 -191548 -212208 -206778 -231581 -237661 -208558 -144241 -67562 4810 68663 106460 115272 143140
10022 143140 163156 138066 123641 174389 249075 254051 158103 57838 21453 -24249 -132016
10011 -132016 -208667 -203965 -197504 -188082 -172452 -174588 -221967 -314233 -382614 -342413 -210563 -84747
9999 -84747 -13218 14704 -4397 -68086 -97836 -86390 -92394 -150253 -259898 -321314 -288116 -187032
9987 -187032 -69990 14113 68583 115372 164354 213421 275236 339775 357430 309445 234110
9976 234110 196507 195590 210846 224965 216926 190916 131630 63695 13959 -17792 -37248 -58676
9964 -58676 -64249 -55544 -39299 -48990 -162107 -329164 -418251 -434413 -448528 -438717 -394315 -346927
9952 -346927 -303872 -223073 -113835 -37553 10464 29259 -18032 -114973 -186980 -213228 -246679
9941 -246679 -283550 -299550 -305483 -303337 -260042 -169324 -92338 -59489 -38283 -22307 -31770 -38343
9929 -38343 -27110 7539 95454 194640 223012 165631 85185 16912 -63177 -111144 -86742 -33102
9917 -33102 11070 11982 -2471 37559 119541 190656 218598 216642 233484 260599 290675 337223
9905 337223 342098 264462 181456 179830 269828 375604 428590 422548 397128 376779 358772 356141
9893 356141 372371 411825 445410 438205 401249 364976 338053 291731 226512 182414 192870 266498
9881 266498 382191 461682 459176 429446 435043 499414 628560 795892 960880 1073595 1108297
9870 1108297 1101189 1075196 1012495 902942 761592 617550 467812 350470 264082 146922
9860 146922 567 -140727 -231269 -236892 -162470 -79052 -51949 -91372 -155098 -221610 -287842
9849 -287842 -312841 -278106 -226894 -201110 -194200 -175509 -168779 -178263 -188190 -182161 -163072 -145577 -131814
9836 -131814 -143295 -168650 -191859 -230807 -304289 -411704 -515128 -533703 -438465 -295797 -174221
9825 -174221 -93378 -23167 34708 64934 18062 -84418 -134717 -113268 -55759 -32788 -84188
9814 -84188 -134533 -139227 -131868 -134842 -151017 -182818 -189386 -142256 -75520 2511 42840 52087 70111
9801 70111 86940 101056 109845 109766 119828 129486 96318 27808 -43354 -73375 -61702 -56742 -39360
9788 -39360 -4722 2190 -35646 -76738 -102239 -139050 -166526 -163405 -152138 -129267 -82824 -28901
9776 -28901 -19309 -41261 -69631 -102971 -123707 -141705 -129285 -110561 -102583 -57235 20272 97197
9764 97197 123250 87793 12944 -95454 -203080 -251159 -197478 -98025 -64758 -95232 -140678
9753 -140678 -146410 -93089 -48013 -82259 -163880 -235484 -248222 -209657 -174530 -150381 -108741 -77571
9741 -77571 -58761 -28811 27646 80189 75089 74002 92002 90329 84796 114504 167912 184219 145838
9728 145838 114962 106254 71106 9880 14797 67213 98936 125308 156890 193847 227412 214872
9716 214872 132523 16729 -79086 -154637 -192016 -195275 -217531 -250333 -248489 -222086 -169743 -136039
9704 -136039 -186075 -229773 -221130 -182111 -112364 -82835 -156751 -330149 -541599 -721509 -822993
9693 -822993 -817129 -723440 -597455 -478043 -404966 -364309 -345681 -310473 -266847 -255523 -240139
9682 -240139 -206633 -133455 -40407 9072 -8011 -68851 -149533 -216237 -219713 -157228 -92456 -32306
9670 -32306 22842 25038 1152 6064 18058 25775 58234 94378 103764 90713 40338 -21924 -49919
9657 -49919 -34465 43328 122119 153927 164283 147995 110145 70279 38763 46401 109144 188773
9645 188773 222364 209923 217187 271597 318028 318429 281962 221753 164012 132817 140156 156762
9633 156762 110940 -12956 -128452 -196006 -222802 -195217 -139035 -108671 -88962 -50625 -35364
9622 -35364 -16996 57238 130793 132874 75259 39987 36252 -7932 -86185 -125922 -110186 -87783
9610 -87783 -54965 1969 20041 -3883 -33808 -57638 -42406 20193 113175 198514 242660 189972
9598 189972 45917 -67051 -92090 -64113 7851 82984 123799 142180 139900 125818 49966
9587 49966 -105138 -235423 -291332 -281409 -226986 -172812 -142348 -121047 -92074 -61478 -67269 -108047
9575 -108047 -172294 -249556 -316094 -422856 -547949 -581852 -513486 -410085 -299449 -180727 -105820
9564 -105820 -59352 13372 60204 42339 28640 88937 184738 291730 388418 399431 329625
9553 329625 258046 228655 222938 214054 197364 183136 176930 168052 142753 93254 19509 -66842
9541 -66842 -107489 -118916 -141747 -135798 -128821 -175455 -207863 -204561 -169391 -123242 -87368 -40993
9529 -40993 -31375 -76169 -73574 -10631 37178 50047 35679 -5385 -33570 -32774 -50587 -84871 -94455
9516 -94455 -83826 -96045 -104052 -84970 -79016 -72031 -44695 2942 57411 89745 113102 132917
9504 132917 108681 69723 46195 49354 81065 91015 60010 31334 30586 23048 27294 39352 39172
9491 39172 66594 109204 83303 -1437 -40750 34392 133351 181579 200004 181317 136788 127925
9479 127925 153686 192009 261506 336403 383857 391598 376435 367920 353972 319095 294364 308931
9467 308931 337177 358001 355754 360841 369928 327617 275913 214250 136004 97878 61929 -12703
9455 -12703 -51309 -49023 -36718 -19280 -41206 -67604 -41025 -31805 -113770 -220544 -282968 -303183
9443 -303183 -323140 -346167 -329995 -287217 -241720 -177677 -72233 20707 47685 40625 57967 128658
9431 128658 208553 208266 109886 -17400 -113827 -178839 -206316 -165094 -71351 3174 58366 78772
9419 78772 46713 12369 37029 70144 28687 -55056 -119461 -146001 -121912 -44120 52096 114117
9407 114117 153016 204901 238360 240355 220018 153947 52809 -20017 -36960 -33015 -49580 -115053
9395 -115053 -208774 -282332 -324572 -303238 -200843 -66215 69108 166219 198439 196969 153197
9384 153197 68316 -5187 -37932 -57438 -49212 -16272 -1325 -12299 -20479 -49766 -134692 -195044
9372 -195044 -197860 -214617 -244533 -249068 -256398 -285966 -298300 -253029 -140974 -40310 -22540 -77394
9360 -77394 -145158 -177095 -212012 -269940 -296618 -266271 -196833 -117196 -88654 -124282 -154380 -163171
9348 -163171 -172798 -175234 -165494 -164844 -172849 -209862 -278286 -350229 -399623 -419505 -467872 -515616 -527377
9335 -527377 -543005 -523915 -475192 -487830 -524371 -482813 -347178 -175992 -68133 -52496 -59520
9324 -59520 -57554 -46308 -34369 -45229 -93328 -171526 -243453 -293431 -382137 -457807 -417027 -274778
9312 -274778 -129074 -63484 -111224 -182131 -182340 -185345 -227294 -241629 -199112 -141005 -126623 -175869
9300 -175869 -186645 -111817 -17429 29794 30735 -2895 -16411 -79 -25338 -77918 -107994 -110081
9288 -110081 -92182 -89623 -107656 -118023 -116938 -85535 -43952 -24526 -4427 6744 10187 43850
9276 43850 79922 88896 77009 57742 37758 21871 48946 59567 -5001 -94331 -178799 -261742
9264 -261742 -319744 -326030 -256748 -181334 -161245 -174599 -166683 -152859 -185198 -228979 -237179 -232397
9252 -232397 -238164 -236687 -212578 -198719 -223823 -261037 -273013 -258173 -243608 -225820 -212418 -224230
9240 -224230 -262552 -292016 -300933 -301672 -277852 -236519 -200604 -162223 -150265 -216571 -331385 -382373
9228 -382373 -323324 -185945 -50578 28114 68117 101875 100003 57830 -19688 -106455 -166173
9217 -166173 -158933 -73988 2293 27569 10448 -49811 -160195 -289722 -385453 -413079 -335776
9206 -335776 -191040 -76513 -45357 -88974 -121470 -107144 -81479 -63400 -82071 -138574 -216715
9195 -216715 -267667 -308507 -344369 -323996 -300917 -333781 -385909 -388245 -361991 -360182 -373529 -352246
9183 -352246 -321405 -330087 -354755 -360703 -367464 -405255 -473416 -512247 -462345 -357938 -301561 -348134
9171 -348134 -429106 -464468 -444617 -425448 -472868 -511660 -437612 -325776 -245056 -176027 -116870
9160 -116870 -145949 -250664 -350508 -398907 -405853 -437577 -503230 -558104 -573427 -564660 -564821 -553290
9148 -553290 -531276 -511148 -475906 -435226 -386413 -341253 -334242 -376374 -458419 -544100 -581840 -544204
9136 -544204 -465984 -385770 -333531 -296458 -218912 -82004 111623 326699 525188 677740 745387
9125 745387 729558 704662 715237 722304 714758 733100 746516 755989 758039 679257 545337 478056
9113 478056 460533 402769 285618 186168 195963 284815 367538 403823 396875 371432 376335 409133
9101 409133 422885 411018 388044 394141 394243 336455 227350 124995 61864 43514 95614 172535
9089 172535 239428 292011 326830 353951 358297 350183 377412 425738 424418 362730 295232 271422
9077 271422 289131 290739 276425 274514 300403 330338 315124 278448 245701 223687 200177 216938
9065 216938 274515 313149 337596 368360 390641 367705 325706 322486 348455 331889 260992 167094
9053 167094 62449 -25516 -86068 -118817 -113627 -74482 -28989 22051 105122 165843 163881 117325
9041 117325 94070 105057 86743 36309 6589 18093 75052 140651 169739 172394 187683 206677
9029 206677 188018 139520 96978 72619 52633 4555 -46024 -10723 70314 106967 101679 93965
9017 93965 111509 117087 105916 114310 118638 90802 60036 25902 -31845 -105301 -161763 -183217
9005 -183217 -136083 -35699 55250 123600 185721 222990 256672 288225 309206 299809 219705 97894
8993 97894 -16478 -105508 -142748 -126656 -100573 -75161 -65081 -76672 -66973 -13957 27517 13291
8981 13291 -56583 -133331 -162147 -155206 -154878 -165042 -155589 -133192 -95026 8248 119787 147631
8969 147631 95246 50375 38723 51183 97538 155490 210350 217691 201075 196516 153036 124054
8957 124054 196704 304490 358627 375701 347111 250777 154785 136166 175028 204129 198245 155276
8945 155276 78251 7842 -24576 -35615 -44185 -51665 -84452 -147017 -229211 -324552 -374337 -338127
8933 -338127 -244006 -169418 -140747 -116935 -88866 -82700 -126423 -191063 -240114 -247412 -224822 -193199
8921 -193199 -156011 -155970 -180324 -151070 -40482 78647 110395 56472 -8221 -53236 -59136 -30871
8909 -30871 17853 94802 185857 259844 271464 216109 154711 118755 77004 17060 -38160 -81869
8897 -81869 -131551 -176396 -160351 -104259 -74510 -77749 -98716 -115734 -106026 -27415 92181 175140
8885 175140 232493 273934 261923 229968 176154 68147 -26975 -48168 -87793 -137369 -130544 -99609
8873 -99609 -31604 89963 172469 155689 88695 14251 -48257 -115960 -224509 -318168 -340990
8862 -340990 -329360 -298317 -224293 -135643 -61169 -16470 7357 42535 97721 174107 245904 292959
8850 292959 303147 305986 326286 296851 186730 77952 15563 -30713 -39040 -34653 -36682 -20275
8838 -20275 -22614 -49667 -73775 -75381 -41383 -6772 19533 53170 73806 74391 42501 -4338 -63256
8825 -63256 -152477 -231705 -262615 -301947 -396755 -519386 -612132 -640523 -606714 -528516 -447687 -349837
8813 -349837 -231877 -158695 -167363 -209349 -234506 -222111 -186727 -151100 -114606 -102599 -94763 -60060
8801 -60060 2757 113097 213215 225323 156438 73710 24015 10687 -5673 -37310 -21862
8790 -21862 30787 46890 31966 47327 89055 102751 66302 -5886 -70095 -121028 -180896 -198636
8778 -198636 -164671 -120852 -81406 -47647 -12680 -26758 -86367 -118001 -133339 -190578 -280674 -348890
8766 -348890 -388447 -443163 -497205 -501987 -448441 -373375 -310293 -256482 -231346 -253557 -258251 -211914
8754 -211914 -135059 -36391 57075 91998 44236 -41592 -105376 -108015 -63812 -30423 -6348 30173
8742 30173 44921 38544 10264 -36629 -61872 -49369 -48743 -85452 -144798 -202170 -192485 -107154 -49614
8729 -49614 -40278 -27559 -26913 -66944 -102830 -126926 -87828 27692 110724 117055 102030 81880
8717 81880 23038 -25614 -18059 -17859 -47773 -83884 -111277 -117727 -116258 -96375 -28875 57897 113515
8704 113515 111152 99218 102357 81042 57133 50162 13420 -38144 -91078 -141580 -179905 -209550
8692 -209550 -234622 -253074 -273713 -288639 -305321 -319159 -265704 -156513 -59087 -25228 -65220
8681 -65220 -138770 -213950 -248336 -200365 -109730 -47650 -57772 -124717 -243368 -352171 -400388
8670 -400388 -434954 -469830 -491021 -517460 -563261 -580185 -472263 -300845 -199132 -161474 -158415
8659 -158415 -195781 -265801 -295182 -258589 -176362 -63717 55964 182370 249802 166310 -7905
8648 -7905 -150900 -202397 -154916 -97261 -111336 -161913 -203573 -230816 -240438 -230002 -190283 -175200
8636 -175200 -174396 -129765 -88118 -95191 -88684 -58912 -44190 -40813 -49043 -47342 -36205 -38462 -32560
8623 -32560 -35555 -109518 -194924 -246370 -227480 -109563 14523 77519 96012 119178 146496 168934
8611 168934 175364 158589 167655 210295 245493 240103 196996 125032 80258 82063 69265 20337
8599 20337 -13161 15242 39664 -10373 -102123 -155924 -153265 -139478 -150823 -207146 -274950 -296183
8587 -296183 -237880 -112770 14117 46562 -10543 -76652 -98656 -56343 -9157 7474 3260
8576 3260 13009 65974 90072 33331 -42039 -46846 -3018 9806 -2765 2363 44969 56765 -18311
8563 -18311 -96557 -128409 -147084 -175443 -229524 -296642 -345923 -336026 -268970 -201734 -205114 -265976
8551 -265976 -335282 -428835 -511455 -460963 -292304 -163300 -130625 -143479 -178075 -215297 -222889
8540 -222889 -192153 -139447 -95912 -76798 -118946 -218740 -301914 -347169 -352757 -341701 -328671 -318253
8528 -318253 -323277 -346507 -360374 -324687 -273862 -219123 -98947 46302 75982 -5136 -60158
8517 -60158 -57633 -67982 -118243 -186230 -243427 -254388 -224947 -198692 -226583 -272502 -261440 -182908
8505 -182908 -42098 98302 190813 239504 270322 294803 302513 262721 163997 87317 89914 117515
8493 117515 112275 76600 48014 56319 86349 90479 46941 461 -35414 -42199 -19849 -16772 -70677
8480 -70677 -148563 -173572 -151455 -132917 -134503 -168132 -259741 -358960 -369524 -302755 -217270 -160418
8468 -160418 -140951 -93119 31384 150211 181522 188432 221003 245200 212254 116653 26209
8457 26209 -7892 23474 102674 201443 242868 201443 162162 186980 227877 252421 258086 231244
8445 231244 176576 128386 131023 193028 230614 220670 237555 313302 392105 394324 325455 247951
8433 247951 186725 132235 75065 -21310 -163293 -315777 -413801 -432996 -406929 -380538 -347828
8422 -347828 -285775 -195787 -153231 -174531 -196670 -170334 -113089 -76004 -57836 -32659 709 43660
8410 43660 70211 35162 -32683 -93869 -153076 -176676 -167186 -166572 -192560 -228550 -212564 -121221
8398 -121221 8950 125082 183421 164249 95320 18890 -30222 -61977 -58083 4096 73711
8387 73711 129528 201128 283348 320982 325436 322329 290601 265601 292467 372266 439736 412307
8375 412307 306556 214384 166762 150865 115225 50949 19871 33657 49521 78993 126700
8364 126700 135620 84643 -8974 -115370 -199827 -225798 -213559 -206044 -207122 -183110 -113045 -43177
8352 -43177 -20143 14763 81398 123699 141713 129316 36581 -77176 -135035 -117870 -90911 -82304
8340 -82304 -72423 -51600 -19354 -21730 -56703 -78914 -95363 -113918 -98465 -69971 -6800 122173
8328 122173 245267 277973 219841 139009 77209 11294 -35164 -49761 -66514 -85394 -98261
8317 -98261 -119510 -152246 -172827 -139770 -57556 44718 114076 117381 69402 14052 -25299 -72920
8305 -72920 -114445 -125547 -99308 -45383 -4958 -23940 -92089 -158627 -182362 -159234 -123662 -89212
8293 -89212 -47890 -16364 -16262 -33832 -13483 41815 80298 84744 51567 -5598 -75099 -133373
8281 -133373 -144952 -84610 9064 59218 62761 69135 86677 70896 49958 70405 112912 121537
8269 121537 65191 -48812 -136325 -144340 -93297 -44283 -30311 -49659 -91437 -112507 -90242 -45636
8257 -45636 -35354 -85104 -113866 -80721 -44592 -23457 -33291 -90019 -168247 -199622 -155203 -97802
8245 -97802 -41555 14829 43628 39944 43463 65041 87334 121626 135546 97288 29435 -46647
8233 -46647 -78166 -60472 -26430 5214 30187 45393 28717 -44879 -157537 -241686 -282591 -300350
8221 -300350 -256122 -160778 -89365 -83506 -98942 -81643 -48891 -1377 70526 182434 291713
8210 291713 301997 238062 182675 164902 165288 156721 165842 212853 245659 216747 167014 91291
8198 91291 -20299 -117081 -204111 -283795 -340255 -376116 -371463 -300812 -210556 -158437 -138595 -127348
8186 -127348 -112652 -106814 -96743 -52429 -31470 -65898 -115535 -140827 -161425 -179531 -148509 -100658
8174 -100658 -97011 -177454 -288849 -357258 -370758 -364320 -373777 -362546 -300852 -212879 -164277 -205034
8162 -205034 -266102 -252936 -154987 566 168701 272018 274987 217846 146591 105090 104164 107320
8150 107320 114904 124683 151093 161362 148523 169807 221936 246975 200982 118841 64722 14823
$$ [...]
##END NTUPLES=NMR SPECTRUM
##END=
