##TITLE=31P ikalashn
LR-794-B3(H2O)
20.12.2024
##JCAMPDX= 6.0         $$ Bruker NMR JCAMP-DX V2.0
##DATA TYPE= NMR SPECTRUM
##DATA CLASS= NTUPLES
##ORIGIN= UXNMR, Bruker Analytische Messtechnik GmbH
##OWNER= root
$$ TOPSPIN		Version 1.3
$$ 2024-12-20 14:17:03.906 +0400  Irina@DPX200
$$ Compression mode = diff/dup
##.OBSERVE FREQUENCY= 81.01967998063
##.OBSERVE NUCLEUS= ^31P
##.ACQUISITION MODE= SIMULTANEOUS
##.ACQUISITION SCHEME= undefined
##.AVERAGES= 16
##.DIGITISER RES= 17
##SPECTROMETER/DATA SYSTEM= spect
##.PULSE SEQUENCE= zgpg
##.SOLVENT NAME= D2O
##.SHIFT REFERENCE= INTERNAL, D2O, 1, 298.5841
##AUDIT TRAIL= $$ (NUMBER, WHEN, WHO, WHERE, WHAT)
$$ ##TITLE= Audit trail, TOPSPIN		Version 1.3
$$ ##JCAMPDX= 5.01
$$ ##ORIGIN= Bruker BioSpin GmbH
$$ ##OWNER= Irina
$$ $$ F:/spectra/data/iren/nmr/P31dec/1/pdata/1/auditp.txt
$$ ##AUDIT TRAIL=  $$ (NUMBER, WHEN, WHO, WHERE, VERSION, WHAT)
(   1,<2024-12-20 14:16:13.531 +0400>,<Irina>,<DPX200>,<TOPSPIN 1.3>,
      <acquisition in progress>)
(   2,<2024-12-20 14:16:44.296 +0400>,<Irina>,<DPX200>,<TOPSPIN 1.3>,
      <Start of raw data processing
       efp BC_mod = 2 LB = 8 FT_mod = 6 PKNL = 1 PHC0 = 87.38737 PHC1 = 12.5932 SI = 32K 
       data hash MD5: 32K
       24 ED 78 4B D5 21 9A 34 B6 2D F8 89 26 DF C5 A5>)
(   3,<2024-12-20 14:16:46.390 +0400>,<Irina>,<DPX200>,<TOPSPIN 1.3>,
      <apk 
       data hash MD5: 32K
       5F 64 73 AB BD 9E 8B 2D B8 CA 9B 4F C7 19 C6 BF>)
(   4,<2024-12-20 14:16:52.468 +0400>,<Irina>,<DPX200>,<TOPSPIN 1.3>,
      <abs n ABSG = 5 
       data hash MD5: 32K
       57 C0 95 90 F9 B9 FC 7C 70 06 AC D9 39 87 B0 17>)
$$ ##END=
$$ 
$$ $$ hash MD5
$$ $$ 8C EB 4C B2 75 E4 AA 9C 72 77 0D 72 2E 2E 53 96
##$RELAX= 
##$RELAX= 
##$RELAX= 
##$RELAX= 
##$RELAX= 
##$RELAX= 
##$RELAX= 
##$RELAX= 
##$RELAX= 
##$RELAX= 
##$RELAX= 
$$ Bruker specific parameters
$$ --------------------------
##$DU= <F:/spectra>
##$EXPNO= 1
##$NAME= <P31dec>
##$PROCNO= 1
##$TYPE= <nmr>
##$USER= <iren>
##$AMP= (0..31)
100 100 100 100 100 100 100 100 100 100 100 100 100 100 100 100 100 100 
100 100 100 100 100 100 100 100 100 100 100 100 100 100 
##$ANAVPT= -1
##$AQSEQ= 0
##$AQ_mod= 1
##$AUNM= <au_zg>
##$AUTOPOS= <>
##$BF1= 81.014009
##$BF2= 200.13
##$BF3= 200.13
##$BF4= 200.13
##$BF5= 200.13
##$BF6= 200.13
##$BF7= 200.13
##$BF8= 200.13
##$BYTORDA= 1
##$CFDGTYP= 0
##$CFRGTYP= 5
##$CHEMSTR= <none>
##$CNST= (0..63)
1 1 145 1 1 1 1 1 1 1 1 1 1 1 1 1 1 1 1 1 1 1 1 1 1 1 1 1 1 1 1 1 1 1 
1 1 1 1 1 1 1 1 1 1 1 1 1 1 1 1 1 1 1 1 1 1 1 1 1 1 1 1 1 1 
##$CPDPRG= <waltz16>
##$CPDPRG1= <>
##$CPDPRG2= <waltz16>
##$CPDPRG3= <>
##$CPDPRG4= <mlev>
##$CPDPRG5= <mlev>
##$CPDPRG6= <mlev>
##$CPDPRG7= <mlev>
##$CPDPRG8= <mlev>
##$CPDPRGB= <>
##$CPDPRGT= <>
##$D= (0..63)
0 1 0 0 0 0 0 0 0 0.06 0 0.03 2e-005 3e-006 0 0 0.0002 0 0 0 0 0 0 0 0 
0 0 0 0 0 0 0 0 0 0 0 0 0 0 0 0 0 0 0 0 0 0 0 0 0 0 0 0 0 0 0 0 0 0 0 
0 0 0 0 
##$DATE= 1734689800
##$DBL= (0..7)
120 120 120 11 120 120 24 19 
##$DBP= (0..7)
$$ [...]
##$SW_h= 37037.037037037
##$TD= 32768
##$TD0= 1
##$TE= 300
##$TE2= 300
##$TE3= 300
##$TEG= 300
##$TL= (0..7)
0 120 53 12 22 120 120 120 
##$TP= (0..7)
150 150 150 150 150 150 150 150 
##$TP07= 0
##$TPNAME0= <>
##$TPNAME1= <>
##$TPNAME2= <>
##$TPNAME3= <>
##$TPNAME4= <>
##$TPNAME5= <>
##$TPNAME6= <>
##$TPNAME7= <>
##$TPOAL= (0..7)
0.5 0.5 0.5 0.5 0.5 0.5 0.5 0.5 
##$TPOFFS= (0..7)
0 0 0 0 0 0 0 0 
##$TUNHIN= 0
##$TUNHOUT= 0
##$TUNXOUT= 0
##$USERA1= <user>
##$USERA2= <user>
##$USERA3= <user>
##$USERA4= <user>
##$USERA5= <user>
##$V9= 5
##$VALIST= <valist>
##$VCLIST= <CCCCCCCCCCCCCCC>
##$VD= 0
##$VDLIST= <DDDDDDDDDDDDDDD>
##$VPLIST= <PPPPPPPPPPPPPPP>
##$VTLIST= <TTTTTTTTTTTTTTT>
##$WBST= 1024
##$WBSW= 4
##$XGAIN= (0..3)
0 0 0 0 
##$XL= 0
##$YL= 0
##$YMAX_a= 9280
##$YMIN_a= -7799
##$ZGOPTNS= <>
##$ZL1= 120
##$ZL2= 120
##$ZL3= 120
##$ZL4= 120
##$ABSF1= 298.5841
##$ABSF2= -158.5842
##$ABSG= 5
##$ABSL= 5
##$ALPHA= 0
##$AQORDER= 0
##$ASSFAC= 0
##$ASSFACI= 0
##$ASSFACX= 0
##$ASSWID= 0
##$AUNMP= <proc_1d>
##$AXLEFT= 0
##$AXRIGHT= 0
##$AXTYPE= 0
##$AXUNIT= <>
##$AZFE= 0.1
##$AZFW= 0.5
##$BCFW= 0
##$BC_mod= 2
##$BYTORDP= 0
##$COROFFS= 0
##$CY= 12.5935478210449
##$DATMOD= 1
##$DC= 0
##$DFILT= <>
##$DTYPP= 0
##$F1P= 47.1127640792319
##$F2P= -24.0371245302204
##$FCOR= 0.5
##$FTSIZE= 32768
##$FT_mod= 6
##$GAMMA= 0
##$GB= 0
##$INTBC= 1
##$INTSCL= 7.269226e-011
##$ISEN= 30
##$LB= 8
##$LEV0= 0
##$LPBIN= 0
##$MAXI= 12.09355
##$MC2= 0
##$MEAN= 0
##$ME_mod= 0
##$MI= 0.7550151
##$NCOEF= 0
##$NC_proc= -8
##$NLEV= 6
##$NOISF1= 298.5841
##$NOISF2= 270.0111
##$NSP= 0
##$NTH_PI= 0
##$NZP= 0
##$OFFSET= 298.5841
##$PC= 1.4
##$PHC0= 47.01492
##$PHC1= -0.1483669
##$PH_mod= 1
##$PKNL= yes
##$PPARMOD= 0
##$PPDIAG= 0
##$PPIPTYP= 0
##$PPMPNUM= 100
##$PPRESOL= 1
##$PSCAL= 0
##$PSIGN= 0
##$REVERSE= no
##$SF= 81.014009
##$SI= 32768
##$SIGF1= 270.0111
##$SIGF2= -158.5842
##$SINO= 77.54984
##$SIOLD= 32768
##$SREGLST= <31P.CDCl3>
##$SSB= 0
##$STSI= 32768
##$STSR= 0
##$SW_p= 37037.037037037
##$SYMM= 0
##$S_DEV= 0
##$TDeff= 32768
##$TDoff= 0
##$TI= <>
##$TILT= no
##$TM1= 0
##$TM2= 0
##$TOPLEV= 0
##$USERP1= <user>
##$USERP2= <user>
##$USERP3= <user>
##$USERP4= <user>
##$USERP5= <user>
##$WDW= 1
##$XDIM= 32768
##$YMAX_p= 402961168
##$YMIN_p= -3388498
$$ End of Bruker specific parameters
$$ ---------------------------------
##NTUPLES= NMR SPECTRUM
##VAR_NAME=  FREQUENCY,     SPECTRUM/REAL,   SPECTRUM/IMAG
##SYMBOL=    X,             R,               I
##VAR_TYPE=  INDEPENDENT,   DEPENDENT,       DEPENDENT
##VAR_FORM=  AFFN,          ASDF,            ASDF
##VAR_DIM=   32768,         32768,           32768
##UNITS=     HZ,            ARBITRARY UNITS, ARBITRARY UNITS
##FACTOR=    1.13031516577767, 1,            1
##FIRST=     37037.037037037, 23453,         -85270
##LAST=      0,             83583,           58444
##MIN=       0,             -3388498,        0
##MAX=       37037.037037037, 402961168,     0
$$ Real data points
##PAGE= N=1
##DATA TABLE= (X++(R..R)), XYDATA
$$ [...]
15304F79856j8037k8825k2678j4075j3731j5027r809j582K068k217r347j7126
15292E29470l0811m6380n4999n2515m2826l7194l7082l1832j7799m006M961J6278
15280A95265K8643L0479J7957n540l2104n0422n3070l8111j0865J6810L3362L2084
15268A64488J7228L16o941J632J7534K9309L1523K0293k305k8476m7760n2651
15256A44190m0603j3384J7560L4847L0483J3913J764k63L959R145R467J122j3875
15243A98325k0632j2265l984q290j7688j7528q714j262K178M109O528Q551J1452
15230A40780J4720J3541R762P095N70j2163k5978l9566m8343m8424m2976k9617
15218f0599m810K0231K7450J1659r377j3829j284J2408J7777K2882L6188N2159
$$ plain form
15304 679856 661819 632994 610316 596241 582510 567483 557674 556092 558160 555943 546596 529470
15292 529470 498659 452279 397280 344765 301939 264745 227663 195831 178032 174026 178987 195265
15280 195265 223908 254387 272344 266804 234700 184278 131208 93097 82232 99042 132404 164488
15268 164488 181716 182032 175091 176723 194257 223566 255089 275382 273077 244601 196841 144190
15256 144190 103587 90203 107763 142610 173093 187006 188770 188507 192466 201611 211078 212200 198325
15243 198325 177693 165428 161444 153154 135466 117938 109224 107962 110140 114249 120777 129328 140780
15230 140780 155500 169041 178803 185898 186468 174305 148327 108761 60418 11994 -30982 -60599
15218 -60599 -65409 -45178 -17728 -6069 -15446 -29275 -30559 -18151 -374 22508 58696 110855
15206A10855O0270N2983L7603K9018K8405K4351J1410l721j6079k6790l6738m5343
15194B26224n0717m7719l5416j8026K996K6116M2254M1050K7428J6161J6352K9390
15182B76093M5622N3519M8831K9323L54k3868k9554j1638K1427N0809N7052L6235
15170E54205L247j9803k3006j5558j2883j8095k1884j7587p127Q455L0147N2421
15158E12532O5631O0111L2541n229l3444m0395k9820j6574r751m538M915J1497
15146E47476R058Q306J9132L7571N1957N5114M3788J8814r834k4435j8007m949
15134G33991j749j4294l9367p1632j08727j48885j84584k02620j94543j65915
15124c98325j29891r3122n5894k5221r991n976o145o397m852p259j5747k1689
$$ plain form
15206 110855 171125 224108 261711 290729 319134 343485 354895 351174 335095 308305 271567 226224
15194 226224 175507 127788 92372 74346 77342 103458 145712 186762 214190 230351 246703 276093
15182 276093 321715 375234 424065 453388 453742 429874 400320 388682 410109 460918 517970 554205
15170 554205 557452 537649 514643 499085 486202 468107 446223 428636 421509 429964 460111 512532
15158 512532 578163 638274 670815 665586 632142 591747 561927 545353 535602 531064 535979 547476
15146 547476 556534 564840 583972 621543 673500 728614 772402 791216 781382 756947 738940 733991
15134 733991 732242 717948 678581 606949 498222 349337 164753 -37867 -232410 -398325
15124 -398325 -528216 -621338 -677232 -702453 -712444 -718420 -724565 -730962 -735814 -743073 -758820 -780509
15112g80509k0244j6976j5357q366R511L2883N1424N9243N7287N0488M7471N3153
15100d79992O3389O5952N3089L3469K0228J7890K2292K4901J7740J797j4377k4071
15088a97693k6660k8434l4944m2244m1393k4320J246J4495J0551J702l074J07
15076c70661J3101L1080M7343N7927O0842N4008M0523K8456J7730L659j6265m2287
15064g4544o1331n6198k7846R091L7288M5718L8684K8405K0538J1990J362o322
15052c3165p099m671j424k582j5132l0514l0490j4583L625K0099L2045L2237K4043
15039b7611K0576K4024K7401K5837J3296r165k5343k4233j0079Q227K4729L4032
15027H1691L0579J6287k681k1159l0716l0383k7722k0328n364J0679J7707J4510
$$ plain form
15112 -780509 -800753 -817729 -833086 -841452 -831941 -799058 -747634 -688391 -631104 -580616 -533145 -479992
15100 -479992 -416603 -350651 -297562 -264093 -243865 -225975 -203683 -178782 -161042 -159245 -173622 -197693
15088 -197693 -224353 -252787 -287731 -329975 -371368 -395688 -394442 -379947 -369396 -367694 -370768 -370661
15076 -370661 -357560 -326480 -279137 -221210 -160368 -106360 -65837 -37381 -19651 -15992 -32257 -74544
15064 -74544 -135875 -192073 -219919 -210828 -173540 -127822 -89138 -60733 -40195 -28205 -26843 -33165
15052 -33165 -40264 -44935 -46359 -48941 -64073 -94587 -125077 -139660 -136035 -115936 -83891 -51654 -27611
15039 -27611 -7035 16989 44390 70227 83523 74358 49015 24782 14703 22930 47659 81691
15027 81691 112270 128557 125876 104717 74001 43618 15896 -4432 -9796 883 18590 33100
15015C3100J3592K0351L0170M0048M3201K8189j1095o6760j05751j01235p2023
15004a48213m0115q017J6940K7798L0682K8930K0181J4408J7358J8882J3336M965
14992b865l469j3562k6036l5760l4883k0794k746P374J2075K4119M6442O6312
14980A6207O8639N7443M9024M8322M6618L7212K4082J2914N174k514j2934j8481
14968C31706j4893j3218j9168k7241l3267l5289l2077k4773j4375l431L723O459
14956A24156P994J0676J3634J0877j658j8717l3630m7030o3481q2780j02415j14385
14944b96759j04642p4392m3534k3750p312J1480K6517L1050K4294J2574N683P665
14932d31126J1534R436J791l241J546J2135K0468K7052L1916L2083K9107K3730
$$ plain form
15015 33100 46692 67043 97213 137261 180462 208651 197556 130796 25045 -76190 -148213
15004 -148213 -188328 -196345 -179405 -151607 -120925 -91995 -71814 -57406 -40048 -21166 -7830 -2865
14992 -2865 -6334 -19896 -45932 -81692 -116575 -137369 -140115 -132741 -120666 -96547 -50105 16207
14980 16207 84846 142289 191313 239635 286253 323465 347547 360461 365635 363121 350187 331706
14968 331706 316813 303595 284427 257186 223919 188630 156553 131780 117405 113974 117697 124156
14956 124156 132150 142826 156460 167337 165679 146962 113332 66302 2821 -79959 -182374 -296759
14944 -296759 -401401 -475793 -519327 -543077 -550389 -538909 -512392 -481342 -457048 -444474 -438791 -431126
14932 -431126 -419592 -410156 -408365 -411606 -410060 -397925 -377457 -350405 -318489 -286406 -257299 -233569
14920b33569K0603K4878K9387K2358N398n422N10J2837J3569O28j3815k6459l6507
14907a85604l7697l0756k3329j9145j4451j1750j8817l5445n0000n2817m9082
14896e28893m4589l7107k2629J179K8458L9671K6574P867j1L291J2081J7610J9951
14883d76547L0424M8678N9298N7309N0694M1894L1245K1372J1036J261l458k500
14871a29294J408M159N359M921m26j3352k7956k8572j0825J1364K4822K9338K7521
14858a01533K0831J0703m77p065m326O984K2805M1608N3435L8022o393m6097n3648
14845b5151m3736l9090l5096j9492L486K1105K7687K6720K3129J9657J8046J6056
14833f679O623j4973m2263n9694o1524n3625m0406j9486Q760L1089L4019J9154
$$ plain form
14920 -233569 -212966 -188088 -158701 -136343 -130945 -136367 -135857 -123020 -109451 -108823 -122638 -149097 -185604
14907 -185604 -223301 -254057 -277386 -296531 -310982 -322732 -341549 -376994 -426994 -479811 -528893
14896 -528893 -573482 -610589 -633218 -632039 -603581 -563910 -537336 -529469 -529480 -526189 -514108 -496498 -476547
14883 -476547 -446123 -397445 -338147 -280838 -230144 -188250 -157005 -135633 -124597 -123336 -126794 -129294
14871 -129294 -127886 -123727 -118368 -113447 -113873 -127225 -155181 -183753 -194578 -183214 -158392 -129054 -101533
14858 -101533 -80702 -69999 -70476 -77541 -81867 -74883 -52078 -10470 42965 80987 74594 28497 -25151
14845 -25151 -68887 -107977 -143073 -162565 -159079 -137974 -110287 -83567 -60438 -40781 -22735 -6679
14833 -6679 -56 -15029 -57292 -116986 -178510 -232135 -272541 -292027 -283267 -252178 -218159 -199005
14821a99005k866j8584j7147j294J2921J6669J5047J0666j642k2250l7740k9674
14809b74899l0K2543J9915M920q394k1302l1435k8575j4761j983j300j0950j4383
14796c60634m564J0507K3616L2342L3028K2878Q686j012o966j1126o789J0322
14784b49712K4931J9691L652m795l130K944Q217R488P532L382j862m797k350M151
14770a82658P245M463R22J984J949q158k5036m1743n3989n3420l5210o730J8455
14757c71926K8847K0914L435n818o91R671J7089J9449J8896K0582K4010K1383
14745a94159J2318M044J300J0447L5072O5212Q6353Q6754O6492L9800J4251j3361
14733B14523l7091m7265m4758l8177l5586l9703m6085m4698l1628j7330j0696
$$ plain form
14821 -199005 -201871 -220455 -237602 -238896 -225975 -209306 -194259 -183593 -185235 -207485 -245225 -274899
14809 -274899 -274929 -252386 -232471 -227551 -235945 -257247 -288682 -317257 -332018 -334001 -335301 -346251 -360634
14796 -360634 -365198 -354691 -331075 -298733 -265705 -242827 -234141 -235153 -242119 -253245 -260034 -249712
14784 -249712 -224781 -205090 -201438 -206233 -209363 -206419 -198202 -188714 -181182 -177800 -179662 -184459 -186809 -182658
14770 -182658 -175413 -170950 -170028 -168044 -166095 -174253 -199289 -241032 -295021 -348441 -383651 -390381 -371926
14757 -371926 -343079 -322165 -318730 -324548 -325239 -315568 -298479 -279030 -260134 -239552 -215542 -194159
14745 -194159 -181841 -177797 -176497 -166050 -130978 -65766 20587 107341 173833 213633 227884 214523
14733 214523 177432 130167 85409 47232 11646 -28057 -74142 -118840 -150468 -167798 -178494
14722a78494p221J254J2411J7838J0496j0056k7925k5745o816J0841J6394J1892
14710a75131M259L381P856N865o15l189m811j1212j8729k0605j8788j8391j2737
14697b62847J799J3244J6678J9625K3258J9014O409m905j0898j3024q102Q086
14685a91663K4822K8271K3286K3142K9848L0818K1043J6256K9017M9745N8017
14674A42602M4289J9019L267Q564K1059J9837L976j0940j2342l23J6578K7051
14662B82637K2438N635j0375j8250k5064m0019o3738q8036r8767q5814n0540j2789
14650a82682M808L01j7196l8666n1034m0700r150K2283L3876K1987k17j4567j4515
14637b85472m859N549R950O433l333j0075p022l266n097p394p010l513O390K1814
$$ plain form
14722 -178494 -185715 -184461 -172050 -154212 -143716 -153772 -181697 -207442 -214258 -203417 -187023 -175131
14710 -175131 -170872 -167491 -159635 -153770 -154385 -157574 -162385 -173597 -192326 -212931 -231719 -250110 -262847
14697 -262847 -261048 -247804 -231126 -211501 -188243 -169229 -162820 -167725 -178623 -191647 -199749 -191663
14685 -191663 -166841 -138570 -115284 -92142 -62294 -31476 -10433 5823 34840 84585 142602
14674 142602 186891 205910 209177 217741 238800 258637 262613 251673 239331 239008 255586 282637
14662 282637 305075 310710 300335 282085 257021 217002 153264 65228 -33539 -119353 -169893 -182682
14650 -182682 -177874 -177573 -194769 -233435 -284469 -325169 -334319 -312036 -278160 -256173 -256390 -270957 -285472
14637 -285472 -290331 -284782 -274832 -268399 -271732 -281807 -288829 -292095 -297192 -304586 -311596 -315109 -308719 -286905
14623b86905L2786L5543L6381L5002K6410Q302j3659k5482j7379L217J9476K6084
14611a20224L1319L6496L3659K0840N329p416j6268k1165k1734j9650k0868k5184
14599a24866k7867k8045k5191j4956L510J8819K2643J9090R146r944k9352l4690
14587b21703k5349j3577r999j6691l0812m9706o4725o3825n0014l5573k4775j6143
14575f22892j0040j1247k1149l1502l6495l6225k7936j0338J0207K6893M3553
14564g27171O4770Q2738Q4999O3225K2818j3729k8804k2155n786L964N626J1636
14552d57869K8882N1868O7187O6359N3801L4272J0606j0158k1751k2791j8066
14541b17660j5720j3597o729k75j181n874m359K475M132p13n985j1786j9305k6507
$$ plain form
14623 -286905 -254119 -218576 -182195 -147193 -120783 -112481 -126140 -151622 -169001 -165784 -146308 -120224
14611 -120224 -88905 -52409 -18750 2090 7419 3 -16265 -37430 -59164 -78814 -99682 -124866
14599 -124866 -152733 -180778 -205969 -220925 -217415 -198596 -175953 -156863 -147717 -157661 -187013 -221703
14587 -221703 -247052 -260629 -270628 -287319 -318131 -367837 -432562 -496387 -546401 -581974 -606749 -622892
14575 -622892 -632932 -644179 -665328 -696830 -733325 -769550 -797486 -807824 -797617 -770724 -727171
14564 -727171 -662401 -579663 -494664 -431439 -408621 -422350 -451154 -473309 -479095 -475131 -469505 -457869
14552 -457869 -428987 -377119 -309932 -243573 -189772 -155500 -144894 -155052 -176803 -199594 -217660
14541 -217660 -233380 -246977 -253706 -253981 -255162 -261036 -265395 -262920 -258788 -259501 -265486 -277272 -296577 -323084
14527c23084l2792l7356l6883k8187j1100J1578L0600L4770K3274N948k868O093
14515c60007K7454M4511M6860L9793L2439K1471J843j8667l0795l4815l5940l7152
14503c03005m1183m9795n7381n8218n4015m0935k0482p008l227j671J135Q869
14491f26916J8859J8542J731j9038k7098j9711l822J3661L0269M8603O7537P7380
14479d20003O9323M8974L1624K2272R288j5470m1522n5891o0225n7580m5562l3588
14467e48360l4384m3093m3835l3301k0937o335J4186L3172M2228M0003L0061J8571
14455e52024J4468K3760L5839L3435J3280j0728k3285k0109n580P650O138l966
14443d81122p301m688k929K826J5784K3079J5743J476j1144k0110k5460k5390
$$ plain form
14527 -323084 -355876 -393232 -430115 -458302 -469402 -457824 -427224 -392454 -369180 -363232 -366100 -360007
14515 -360007 -332553 -288042 -241182 -201389 -168950 -147479 -145636 -164303 -195098 -229913 -265853 -303005
14503 -303005 -344188 -393983 -451364 -509582 -563597 -604532 -625014 -632022 -635249 -636920 -635785 -626916
14491 -626916 -608057 -589515 -587784 -606822 -633920 -653631 -657453 -643792 -613523 -564920 -497383 -420003
14479 -420003 -350680 -301706 -270082 -247810 -238522 -253992 -295514 -351405 -411630 -469210 -514772 -548360
14467 -548360 -582744 -625837 -669672 -702973 -723910 -730245 -716059 -682887 -640659 -600656 -570595 -552024
14455 -552024 -537556 -513796 -477957 -444522 -431242 -441970 -465255 -485364 -490944 -483294 -477156 -481122
14443 -481122 -488423 -493111 -496040 -493214 -477430 -454351 -438608 -437132 -448276 -468386 -493846 -519236
14431e19236k2443k3339k7354l0264k8628j6326L708J4660J1416O319M516K200
14419f24771n55n220j4756j9656r251O747R764l448j9714k9075l3289l0028j0635
14406g83887J9127M6581O7043Q4563J03754J21753J34965J45942J65367K00944
14396C06152K48044K98056L41595L63978L54780L15180K54983J90750J33673Q5285
14386B892476L8911j4307o6197r8180j09235j11675j12256j06013r6515j01879
14376B115130j24767j41220j34394j16006j04487j01464r1816o8098m2003k9000
14366A161875l4536n0164o1002o0596n1314l8985k4852j0881o282r720j6637k8193
14354G68713m2195n1482n0691m0280k2509m825r46j2464k4032k4412j9559k2047
$$ plain form
14431 -519236 -541679 -565018 -592372 -622636 -651264 -667590 -663882 -649222 -637806 -631487 -626971 -624771
14419 -624771 -625326 -630546 -645302 -664958 -674209 -667462 -657698 -661146 -680860 -709935 -743224 -773252 -783887
14406 -783887 -764760 -718179 -651136 -566573 -462819 -341066 -206101 -60159 105208 306152
14396 306152 554196 852252 1193847 1557825 1912605 2227785 2482768 2673518 2807191 2892476
14386 2892476 2931387 2917080 2850883 2752703 2643468 2531793 2419537 2313524 2217009 2115130
14376 2115130 1990363 1849143 1714749 1598743 1494256 1392792 1300976 1232878 1190875 1161875
14366 1161875 1127339 1077175 1016173 955577 904263 865278 840426 829545 823263 813543 796906 768713
14354 768713 726518 675036 624345 584065 561556 556731 555785 543321 519289 494877 475318 453271
14342D53271l0784l6404l2597k4248k1785k6253k7559j3826J2496L6069M6241
14331C34621M5568M0561K9376R075j3972l3608m7760n5306n5686m9278l7827k5333
14319A40431j1393P526K5043L4680M0934M9880O0879O5843N6242L4155R837j0892
14307E03165k5028k9815k5672j3805L008J9103L2133M5271N6689N6568M2040K5470
14295F89127J8269J3574J588j0710j3225q849r512j9229k8769l1680l1736l0487
14283E38361k6873k5996k7648k8061l3269m8499o6047o9501n1773k6332p519L798
14271A30641Q418M907J218R055K0678J8781K157j3045j5330r442m289k136k770
14258A48843j0309k4570l8032m6640n2366n1806m1689k3095K743K9444M6823M8036
$$ plain form
14342 453271 422487 386083 353486 329238 307453 281200 253641 239815 252311 288380 334621
14331 334621 380189 420750 450126 459201 445229 411621 363861 308555 252869 203591 165764 140431
14319 140431 129038 136564 161607 196287 237221 287101 347980 413823 470065 504220 514057 503165
14307 503165 478137 448322 422650 408845 411853 430956 463089 508360 565049 621617 663657 689127
14295 689127 707396 720970 722558 711848 698623 689774 680262 661033 632264 600584 568848 538361
14283 538361 511488 485492 457844 429783 396514 348015 281968 212467 160694 134362 126843 130641
14271 130641 139059 143966 145184 154239 174917 193698 195855 182810 167480 158038 153749 151613 148843
14258 148843 138534 113964 75932 29292 -23074 -74880 -116569 -139664 -136921 -107477 -60654 -12618
14246a2618L6929L1592M6218P1743Q5238P5605M9593J8580o712k2793l2839l4260
14234C06276k1279K192K3524L2087K7824J4860j429q198J944J8053K3824J8272
14222D37950J0201N077N088J0858K2203M1788O8654R4950J13301J22749J24357
14211A057176J14446R4622P3843M9895J6482j9404m1864m2521l1512k4582k6684
14200A219897l5555m7645n9247o5357o0077m6046l2615k6932l0400l7507m3848
14189G34668n2846o5826p2564n9651k4650K0148N0466M9222K2265j0714l5446
14178E55072m7248m3912k9778j8285j6456j5399q014L210J5890K4928K0586r2
14166D40502k1375k6763j7816q461r999j7320j7559p181O525J8825K5117J7098
$$ plain form
14246 -12618 24311 55903 102121 173864 259102 334707 384300 402880 396168 373375 340536 306276
14234 306276 284997 287189 310713 342800 370624 385484 384055 375857 377801 395854 419678 437950
14222 437950 448151 453228 458316 469174 491377 533165 601819 696769 810070 932819 1057176
14211 1057176 1171622 1266244 1340087 1389982 1406464 1387060 1345196 1302675 1271163 1246581 1219897
14200 1219897 1184342 1136697 1077450 1012093 952016 905970 873355 846423 816023 778516 734668
14189 734668 681822 615996 543432 483781 459131 479279 529745 578967 601232 590518 555072
14178 555072 507824 463912 434134 415849 399393 383994 375980 379190 395080 420008 440594 440502
14166 440502 419127 392364 374548 366087 356088 338768 321209 314028 320553 339378 364495 381593
14154C81593L598K281J0361J2403J685j0498j1284m002J26l998r429o598O571
14141C72809K5282M2437N2165N1026L8939K4878J9206J9738J9346J3392m82j5805
14129F62931k0960j2908M75J1029J3940P747q837l0934m3603m2274l3877k4400
14117D78329j4872m830Q08l915j7568k9876l1961k3481j0634k287l035l893Q744
14104C41529L0519M2568M1310L5397K6882J0737r916k4125k9271k9256k8349k8000
14092C80025k5384j7011q129p734j7096l1326m0885l8329k8235k0270j6503j4754
14080A14369j1414k50J4036K0057J5987M781p782j3784p838R391K5861K8062J3042
14067B04518q846j4604L576K2824K4582R485j2149k0743p500J1346J5898L218
$$ plain form
14154 381593 385191 387472 397833 410236 411921 401423 390139 386137 386263 382265 372836 366238 372809
14141 372809 398091 440528 492693 543719 582658 607536 626742 646480 665826 679218 678736 662931
14129 662931 641971 629063 629538 640567 654507 662254 653417 622483 578880 536606 502729 478329
14117 478329 463457 458627 459435 455520 437952 408076 376115 352634 342000 339713 336678 332785 341529
14104 341529 372048 414616 455926 491323 518205 528942 519026 494901 465630 436374 408025 380025
14092 380025 354641 337630 329501 321767 304671 273345 232460 194131 165896 145626 129123 114369
14080 114369 102955 102705 116741 136798 152785 157566 149784 136000 128162 137553 163414 191476 204518
14067 204518 195672 181068 184644 207468 232050 241535 229386 208643 201143 212489 228387 231605
14055B31605j5112k5236k5366k8883m1253n3628n3001l5578j0366R366J9948K2895
14043d609J7593Q946L133O677K2070L7506M0091L0424J7242J1360J1383Q588P459
14030B17863J6513K5437J8242k614j7478j5090k728J0982K1428K8094L2930L1738
14018C65317J9033M506K325Q433J1521Q347J015q892j9746k5013k2797j9112j6843
14005C08094j4739j0051j250R162J5684J5378N956j1717l0138l8158k7685o140
13993B14396J2199J9360J9997K1158K1443J8754J6745J7534J6613R923m14q178
13981C79530j0874j1751j3586j6286j5261m002J1778J6205M864j1796k1382k5223
13969B82216l1591l8918m2544l8122k3486k272K0994M2027N4911N2238L3644O415
$$ plain form
14055 231605 216493 191257 165891 137008 95755 42127 -10874 -46452 -56818 -47452 -27504 -4609
14043 -4609 12984 21930 25063 31740 53810 91316 131407 161831 179073 190433 201816 210404 217863
14030 217863 234376 259813 278055 275441 257963 242873 240145 251127 272555 300649 333579 365317
14018 365317 384350 388856 391181 399614 411135 419482 420497 411605 391859 366846 344049 324937 308094
14005 308094 293355 283304 282054 291216 306900 322278 328234 316517 286379 248221 220536 214396
13993 214396 226595 245955 265952 287110 308553 327307 344052 361586 378199 388122 387708 379530
13981 379530 368656 356905 343319 327033 311772 307770 319548 335753 340617 328821 307439 282216
13969 282216 250625 211707 169163 131041 107555 105283 126277 168304 223215 275453 309097 315512
13957C15512k2739m5267n3619m6015l0115j9146j4958q467M83Q748J4970J6235
13945A15622J6734K0510K4040K6424K9827L3914L9588M4632M2852L2190J9576
13934D45909J5968K4720M1757O4207Q3224R0688R4611J00425R8954P9225M1904
13923A181592r96l4767n1443n3607m8364m3729m3391m3885m0665l7338m0909n4105
13911F88393p4000r0013r4909q9857q1942q1539q1134p0256n6803m4328k8819
13900a05207j2145J548J3712K4980L4925M4547N0613M8614L8474K7735K3980K2882
13888B14658J6785M919o546j1388j2139j2442p857L856J1940J1624R182L361r793
13875B16160k5942l7376m0772l6835k9692j8916k395J4601K7473L4499L4218L4944
$$ plain form
13957 315512 292773 247506 193887 147872 117757 98611 83653 75186 75669 84417 99387 115622
13945 115622 132356 152866 176906 203330 233157 267071 306659 351291 394143 426333 445909
13934 445909 461877 486597 528354 592561 675785 766473 861084 961509 1060463 1139688 1181592
13923 1181592 1180596 1145829 1094386 1040779 992415 948686 905295 861410 820745 783407 742498 688393
13911 688393 614393 524380 429471 339614 257672 176133 94999 24743 -32060 -76388 -105207
13900 -105207 -117352 -115804 -102092 -77112 -42187 2360 52973 101587 140061 167796 191776 214658
13888 214658 231443 236362 229816 218428 206289 193847 185990 189846 201786 213410 222592 225953 216160
13875 216160 190218 152842 112070 75235 45543 26627 24232 38833 66306 100805 135023 169967
13863A69967N0816P4492P8806N8332L3724K1456K0010K1936K6867L7051M9640
13852F43097N7890N8797N8864O5745P9617R3619J01964J02847R4270P4591M6754
13841A478055K0997K926j0032j9204k6963l6073m5006n2354n7084n7566n8640
13830A139056o4216o4048m9054k7035j3276j3514j5733k982K3995M7391N0126
13819A010710L2289O620j6843l3983m3743m8379m9045m3541l4670k8735k0409
13808G30271K76K4394L5847L6220L4166K6173O622j8126l6707m3377l6904k3943
13796G34912j6442j3708l703J6941M0193N4756N2192L7438K2315J5584K1353L5697
13784I97528M6712M4594K7885O084l060O688K6197M6467O1704O9582P0228O4609
$$ plain form
13863 169967 220783 295275 374081 432413 466137 487593 507603 529539 556406 593457 643097
13852 643097 700987 759784 818648 884393 964010 1057629 1159593 1262440 1356710 1431301 1478055
13841 1478055 1499052 1501978 1491946 1472742 1445779 1409706 1364700 1312346 1255262 1197696 1139056
13830 1139056 1074840 1010792 961738 934703 921427 907913 892180 889198 913193 960584 1010710
13819 1010710 1042999 1049619 1032776 998793 955050 906671 857626 814085 779415 750680 730271
13808 730271 730547 754941 790788 827008 861174 887347 893969 875843 839136 795759 758855 734912
13796 734912 718470 704762 701059 718000 758193 812949 865141 902579 924894 940478 961831 997528
13784 997528 1044240 1088834 1116719 1122803 1119743 1126431 1152628 1199095 1260799 1330381 1400609 1465218
13772A465218O2587O6880O5160N7582O0492Q5053J22362J53763J76643K00888
13762B516628K32187K71239L19153L79306M59890N65421O83622Q01350R28753
13753G157549J092436J308593J577757J893597K239987K590240K900909L093687
13745B3854755L057589K673843J875948P32471n27108j611808k335114k683859
13737B5036717k756564k665226k479330k239106j977459j715253j461580j227094
13729H515105j026523q63488p31272o27336n47168m77726m09749l43476k81263
13720C207104k34640k18298k27714k40623k38998k20182j89660j51249j16477
13711A369263r9554r2272p7900n5337l7782l1132k2731r804q446k3916m4182n4590
$$ plain form
13772 1465218 1527805 1594685 1659845 1717427 1777919 1862972 1985334 2139097 2315740 2516628
13762 2516628 2748815 3020054 3339207 3718513 4178403 4743824 5427446 6228796 7157549
13753 7157549 8249985 9558578 11136335 13029932 15269919 17860159 20761068 23854755
13745 23854755 26912344 29586187 31462135 32194606 31667498 30055690 27720576 25036717
13737 25036717 22280153 19614927 17135597 14896491 12919032 11203779 9742199 8515105
13729 8515105 7488582 6625094 5893822 5266486 4719318 4241592 3831843 3488367 3207104
13720 3207104 2972464 2754166 2526452 2285829 2046831 1826649 1636989 1485740 1369263
13711 1369263 1269709 1177437 1099537 1044200 1006418 975286 952555 942751 934305 910389 866207 811617
13699H11617n2031m7895n2789o2658o3241n0691l8067l7963m5816m5213l1719
13688B83534j4945m453l240m736J373J3857J7301J976k2394m0132m2578l2128
13676A53435k0351j6096k6529n0909p5425r0804r9750j07872j15213j19627j21570
13665f90711j27542j42317j60982j78301j90817j99216k10741k25665k31271k11313
13655b568876j62529r7777l0189L5264R5654J44191J73244J89725K07443K19412
13645a794438K15906K04054J92721J82895J67281J38059R5914N3224K7958K9411
13635d87015N0546P1969Q2008Q7437R1797Q3995O1776M2341L5099L4416L8271
13624A92640M9055O1528O4912N2338K4705n128k0060j7154p514Q62Q025J0129
$$ plain form
13699 811617 759586 711691 658902 596244 533003 482312 444245 406282 360466 315253 283534
13688 283534 268589 264136 260896 256160 257533 271390 288691 290667 268273 228141 185563 153435
13676 153435 133084 116988 90459 39550 -35875 -126679 -226429 -334301 -449514 -569141 -690711
13665 -690711 -818253 -960570 -1121552 -1299853 -1490670 -1689886 -1900627 -2126292 -2357563 -2568876
13655 -2568876 -2731405 -2829182 -2859371 -2824107 -2728453 -2584262 -2411018 -2221293 -2013850 -1794438
13645 -1794438 -1578532 -1374478 -1181757 -998862 -831581 -693522 -597608 -544384 -516426 -487015
13635 -487015 -436469 -364500 -282492 -195055 -103258 -19263 42513 84854 119953 154369 192640
13624 192640 241695 303223 368135 420473 445178 440050 419990 402836 395322 396184 404209 414338
13612D14338L511M97J2766L4046N2180O0924O1043N6135M4450K5206P906k852
13600G70150j4778k8354l3460k9969k9176l5595m4184m7427m0379k2825j693J3312
13588D55622J5546P882K251P595J9491K4028J3670j822q982p042k14N450P616
13575E41091J5387L3808N2741O3077O9106P7159Q7469R9193J07999J06442R2138
13564A345610P1572N5854N4596P5379J15214J56790J87565K12330K43009K83719
13554B801638L25449L49773L42013L03531K47240J85763J21663N4812j0670o7380
13544D653832j13318j54299j95131k38339k77138k98406k96604k71685k30671
13535B578241j86680j47994j11972o8853j7072L3743P5874J13663J52039J83172
$$ plain form
13612 414338 417849 418346 431112 465158 517338 578262 639305 695440 739890 765096 773002 770150
13600 770150 755372 727018 693558 663589 634413 598818 554634 507207 466828 444003 442310 455622
13588 455622 471168 479050 481301 488896 508387 532415 546085 544263 535281 528239 528025 533475 541091
13575 541091 556478 590286 643027 706104 775210 852369 939838 1039031 1147030 1253472 1345610
13564 1345610 1417182 1473036 1527632 1603011 1718225 1875015 2062580 2274910 2517919 2801638
13554 2801638 3127087 3476860 3818873 4122404 4369644 4555407 4677070 4731882 4721212 4653832
13544 4653832 4540514 4386215 4191084 3952745 3675607 3377201 3080597 2808912 2578241
13535 2578241 2391561 2243567 2131595 2062742 2045670 2079413 2155287 2268950 2420989 2604161
13525B604161J98863K07637K24860K56052K87476K91762K49051J66206O8546k9912
13515D524702j30535k26213k95737l24694l20284k97988k65558k27820j91859
13506B244014j61354j33277j03493p5943m9171j3860K7532O2927R0312J21113
13496B008800J59948J99335K37128K69575K77403K39066J56395N0012o5455j77043
13486C355164k67287l17065l14404k73751k28300j90053j49989j11937q5584o9227
13476A347567n0975k0285J5413L4429K8668Q290j5204l2017l8531l8381l2950
13465A206024k4731k2442k6993k9583l2580m9342p5939r3411r3069q0268o3055
13454F14611m7123l2517j2929J0428L1233M8141N9815O0765M8816L0449J7737
$$ plain form
13525 2604161 2803024 3010661 3235521 3491573 3779049 4070811 4319862 4486068 4554614 4524702
13515 4524702 4394167 4167954 3872217 3547523 3227239 2929251 2663693 2435873 2244014
13506 2244014 2082660 1949383 1845890 1769947 1720776 1706916 1734448 1797375 1887687 2008800
13496 2008800 2168748 2368083 2605211 2874786 3152189 3391255 3547650 3597662 3532207 3355164
13486 3355164 3087877 2770812 2456408 2182657 1954357 1764304 1614315 1502378 1416794 1347567
13476 1347567 1296592 1276307 1291720 1326149 1354817 1363107 1347903 1315886 1277355 1238974 1206024
13465 1206024 1181293 1158851 1131858 1102275 1069695 1020353 944414 851003 757934 677666 614611
13454 614611 567488 534971 522042 532470 563703 611844 671659 732424 781240 811689 829426
13443H29426J4706J4366J3428J4750K5357N1409Q2394J02920J12927J24496J41988
13432A528167J56095J59266J48183J17894P0028J6059l5290q0173j14944j33990
13422A831295j28228r8895o3777l8537k2775j6686k6710m7741o8553q1985q4156
13411A153252p4460o1776o0694p2157q4089q1893n8651k2589J0283K9678L7509
13400G14413M0575M3434M7161M8402M2344K9837J9408J8086K2138K1837J6225
13389A063860J4136J9210K2433J6109O649O984K2602M3268N4405N2500M3075L2664
13377A397895K5889K2293K3842L3053M2740M4428L8443K9734K3590J7474J0414
13366A709795J3821L4948O4786Q8602R7549R4832Q7593P5571N5147L1430J4983
$$ plain form
13443 829426 844132 858498 871926 886676 912033 963442 1045836 1148756 1261683 1386179 1528167
13432 1528167 1684262 1843528 1991711 2109605 2179633 2195692 2160402 2080229 1965285 1831295
13422 1831295 1703067 1604172 1540395 1501858 1479083 1462397 1435687 1387946 1319393 1237408 1153252
13411 1153252 1078792 1017016 956322 884165 800076 718183 659532 636943 647226 676904 714413
13400 714413 754988 798422 845583 893985 936329 966166 985574 1003660 1025798 1047635 1063860
13389 1063860 1077996 1097206 1119639 1135748 1142397 1149381 1171983 1215251 1269656 1322156 1365231 1397895
13377 1397895 1423784 1446077 1469919 1502972 1545712 1590140 1628583 1658317 1681907 1699381 1709795
13366 1709795 1723616 1758564 1823350 1911952 2009501 2104333 2191926 2267497 2322644 2354074 2369057
13355B369057K737j9579n4034q4420q9591o8120m2402k3989q666O710K4452N1474
13343B063629Q8154J21313J40996J51358J66426J98393K45563K95806L41541L92150
13333D205329M66357N71307O97946Q27409R34298R87816R57015Q20520N98659
13324A1066656L66049K03313J28336Q0384k2225k19822m88252p46625r07963r43946
13314H515905q90320q01884p14848o34942n59421m89990m22759l54316k89096
13305C358329k29328j78035j39781j13989j01121j02278j06277j03484j10389
13296B173647j38230j62776j61629j45948j36050j37503j40144j31504j10072
13287I09791q5524o5910n0949m1785m3639n2168n1853m0692l1541k9785k9772
$$ plain form
13355 2369057 2371794 2352215 2298181 2213761 2124170 2056050 2013648 1989659 1980993 1987703 2012155 2063629
13343 2063629 2151783 2273096 2414092 2565450 2731876 2930269 3175832 3471638 3813179 4205329
13333 4205329 4671686 5242993 5940939 6768348 7702646 8690462 9647477 10467997 11066656
13324 11066656 11432705 11636018 11764354 11844738 11822513 11602691 11114439 10367814 9459851 8515905
13314 8515905 7625585 6823701 6108853 5473911 4914490 4424500 4001741 3647425 3358329
13305 3358329 3129001 2950966 2811185 2697196 2596075 2493797 2387520 2284036 2173647
13296 2173647 2035417 1872641 1711012 1565064 1429014 1291511 1151367 1019863 909791
13287 909791 824267 758357 707408 665623 621984 569816 517963 477271 445730 415945 386173
13276C86173k3043n617K0448M4641N3238M5283L3495K7503K5474K0954Q004j0024
13264F26529k1980k1174j2166o12J1350J8986J5378k615l0938o0761q2708q7599
13252C51690p0543m0315j4112m149j0708k2677k7975k6742k5289k2503j2634M660
13240G8703K2638L4196L9155L8294K9100J2012p060k0214j6786N144K4304K2279
13228B61765P444m014r468j3158j6026k0409k6514k9626k7835k2753j4728m242
13216H0436M875J5029L3061N3782O8373P5650P5077N9541K7750o278k8988l6059
13204D22249k9503j2476J0412K9421L7530L6186K9423K1698J7765J9051K6273
13193F08029L9162N0361N2070M8241M7836M8538L7776J3785j0346k3616k2630
$$ plain form
13276 386173 363130 357513 377961 422602 475840 521123 554618 582121 607595 628549 636553 626529
13264 626529 604549 583375 571209 570597 581947 600933 616311 613696 582758 521997 439289 351690
13252 351690 281147 240832 226720 222571 211863 189186 161211 134469 109180 86677 74043 78703
13240 78703 101341 135537 174692 212986 242086 254098 247038 226824 210038 215182 239486 261765
13228 261765 269209 265195 255727 242569 226543 206134 179620 149994 122159 99406 84678 80436
13216 80436 85311 100340 133401 187183 255556 331206 406283 465824 493574 487296 458308 422249
13204 422249 392746 380270 390682 420103 457633 493819 523242 544940 562705 581756 608029
13193 608029 647191 697552 749622 797863 845699 894237 932013 945798 935452 911836 889206
13182H89206j1018j983k860r418k0906l9324n6097n8978m9104l9033l6755l5627
13170E28103k9062j9468q688M711J7750K0676P920j7081m2621n9745p1233p9365
13158B51897p6810n9630l3449n085J8341L2066L8792M1037L9709M2592N2563N6180
13146C98203M1251J4035j1525k3557j5770L605J4653R997L319O444J7146K5829
13134D83630L1678M5336O5278P5957O9074N1560L4971K2004J1818R561J7441K7677
13122I45985L6575M8725O5894Q3086R9981J23145J50116J76217J97644K07525
13112B134893K09509K13923K28135K54957K88637L17476L32074L27603L06987
13103D614194K79784K42585J79771Q8034j7346j16100j96653k59790l05277l24575
$$ plain form
13182 889206 878188 876205 873345 863927 843021 803697 747600 688622 639518 600485 563730 528103
13170 528103 499041 479573 470885 475596 493346 514022 521942 504861 462240 402495 331262 251897
13158 251897 175087 115457 82008 76923 95264 127330 166122 207159 246868 289460 342023 398203
13146 398203 439454 453489 441964 418407 402637 406242 420895 430892 434211 440655 457801 483630
13134 483630 515308 560644 625922 701879 770953 822513 857484 879488 891306 900867 918308 945985
13122 945985 982560 1031285 1097179 1180265 1280246 1403391 1553507 1729724 1927368 2134893
13112 2134893 2344402 2558325 2786460 3041417 3330054 3647530 3979604 4307207 4614194
13103 4614194 4893978 5136563 5316334 5404368 5387022 5270922 5074269 4814479 4509202 4184627
13093D184627l15838k92996k74980k69319k70215k67052k56905k41992k22086
13084A773244j96413j67748j41992j19594r1012n2459j9152l172K023O681O252
13073I96658q116l3811o2273p6906o3911l0459O121K5275J1389k3365n2840o5970
13061F21792o5811n9817n3087m7059m4525m6734m9864n3281n7280n4779m2631
13050D6924k5366j0389R2Q042J2230J8603L4415N0830N2903M1365K9523K5789
13038B84961K9587L3580L2636K9793L2448M2166N4893O5540O4650M8310K5491
13027G44055J0631J0821J6466J4549M145r073j7572j7447j2849q302n869n885
13015G23670q819j6195k4301k9640l7942n0583n6583n3179m6161l3875j6548m330
$$ plain form
13093 4184627 3868789 3575793 3300813 3031494 2761279 2494227 2237322 1995330 1773244
13084 1773244 1576831 1409083 1267091 1147497 1056485 1004026 984874 981702 983725 990406 996658
13073 996658 988542 954731 892458 815552 751641 721182 727303 752578 763967 740602 687762 621792
13061 621792 555981 496164 443077 396018 351493 304759 254895 201614 144334 89555 46924
13050 46924 21558 11169 11261 19303 31533 50136 84551 135381 188284 229649 259172 284961
13038 284961 314548 348128 380764 410557 443005 485171 540064 605604 670254 718564 744055
13027 744055 754686 765507 781973 796522 800667 791594 774022 756575 743726 735424 729555 723670
13015 723670 714851 698656 674355 644715 606773 556190 499607 446428 400267 366392 349844 345514
13003C45514m075p601l007M610jj1529r280P348K1665K6546L0384L7246L9153
12990D76973L2117J9169K968j2330k5267l0954k3307j3861j4842j8968j7919j3463
12978C60316o011L8m938k2348m0506m3784k8180m487J2324J5696J0970O789R734
12965B65613J9471K5879K0088O855n567j5319k5299l7492m1936k9791j4041j2580
12953A55881k0883k7319l5837m9735n8838m9749k3948L47Q586K40j6178k9456
12941a46889l1829j7037Q497K2224J5907K148o815j3665k5170m1230o1575p9157
12929c74591q2516o8564n1186n5350q6130j23451j43710j38238j15649r1018p0240
12918a400643m2548L605O2888J18268J56644J74636J81024J90247K00479J95567
$$ plain form
13003 345514 341439 333838 330831 335441 335440 323911 314631 321979 343644 370190 400574 437820 476973
12990 476973 509090 528259 531227 518897 493630 462676 439369 425508 410666 391698 373779 360316
12978 360316 354305 354343 349405 327057 286551 242767 214587 210100 222424 238120 249090 255879 265613
12965 265613 285084 310963 331051 337906 332339 317020 291721 254229 212293 182502 168461 155881
12953 155881 134998 107679 71842 22107 -36731 -86480 -110428 -110081 -101495 -101255 -117433 -146889
12941 -146889 -178718 -195755 -187258 -165034 -149127 -146979 -153794 -167459 -192629 -233859 -295434 -374591
12929 -374591 -457107 -525671 -576857 -632207 -718337 -841788 -985498 -1123736 -1239385 -1330403 -1400643
12918 -1400643 -1443191 -1439586 -1376698 -1258430 -1101786 -927150 -746126 -555879 -355400 -159833
12908a59833J74602J48789J23483R9052P5981N8376M4961L2388J9604P872K833
12897F28108L266M039M403K190k157k104P564K1990L5566M6987N0099M1459K6262
12884H67672J1897K754j166m11M860Q536N241K332L307Q10p432j6287k5332l6252
12870H20529m0845l3868k5595k1802j5059J240K6159N1695O9271P4224O8374N9336
12858A033659N5222N6740N5315M5915L3325K4281K0327K0527K0135P116j7713
12847A354849l7165m6450n2913n3303l7159m812K6353L7860L0953J7255L117q141
12835A230444j1302l202R394J5066R945P66m80Q397K1490L8132N6670P1434P7575
12822A524329P8287Q1129Q3988P6536N7904M0312K7494J4246j259k0130l8489
$$ plain form
12908 -159833 14769 163558 287041 386093 462074 520450 565411 597799 617403 625275 628108
12897 628108 631374 635413 639816 642006 639849 637745 645309 667299 702865 749852 799951 841410 867672
12884 867672 879569 882323 881157 880746 885606 894142 899383 901715 905022 905832 898400 882113 856781 820529
12870 820529 779684 745816 720221 698419 683360 684600 710759 762454 831725 905949 974323 1033659
12858 1033659 1088881 1145621 1200936 1246851 1280176 1304457 1324784 1345311 1365446 1372562 1354849
12847 1354849 1317684 1271234 1218321 1165018 1127859 1123047 1149400 1187260 1218213 1235468 1238585 1230444
12835 1230444 1219142 1215940 1225334 1240400 1250345 1251111 1250631 1259028 1280518 1318650 1375320 1446754 1524329
12822 1524329 1602616 1683745 1767733 1844269 1902173 1942485 1969979 1984225 1982966 1962836 1924347
12811A924347m9005n4233o2761p5778q4644q3544p8331p5205p0482o1847m9440
12800A179077l0782p042J4731L5122N9211Q0621R0093Q5281P5932P3635P2376
12789A728255N6825L0024R348M066R107J1202L097o547o666M617K0845L0949K6263
12776A921385O291k0490l9332l7024j4210J4641L8581N5018O0699N3729L5675
12765B074963J5786R872K0447L3005L3434K3669K0589L5732O6975J06349J45024
12754B585845J75175J96911K12746K28909K61035L13248L68602M14255M54368
12745E211094M98449N41815N73352O02702O45337P01349P59644P99516P95954
12736A1129212P35913O25264M81094L15569J33685n9644k51707m18163n35799
$$ plain form
12811 1924347 1875342 1821109 1758348 1682570 1597926 1514382 1436051 1360846 1290364 1228517 1179077
12800 1179077 1148295 1141253 1155984 1191106 1250317 1330938 1421031 1506312 1582244 1655879 1728255
12789 1728255 1785080 1815104 1824452 1828518 1837625 1848827 1851924 1845377 1838711 1843328 1864173 1895122 1921385
12776 1921385 1927676 1907186 1867854 1830830 1816620 1831261 1869842 1924860 1985559 2039288 2074963
12765 2074963 2090749 2100621 2121068 2154073 2187507 2211176 2231765 2267497 2334472 2440821 2585845
12754 2585845 2761020 2957931 3170677 3399586 3660621 3973869 4342471 4756726 5211094
12745 5211094 5709543 6251358 6824710 7427412 8072749 8774098 9533742 10333258 11129212
12736 11129212 11865125 12490389 12971483 13287052 13420737 13361093 13109386 12691223 12155424
12727A2155424o01883o31085o36393o21992n89845n43813m92947m49180m11650
12718G176636l67330l15853k70195k38190k14051j85945j54891j27362j06551
12709E196268r4137q2090o3325n1998n7973o6676o7759o8651p4088p9433q0349
12698D409789p8025p4162p1581o9608n9817m5265l9726m7963o3183p6414q0076
12687C703969o8720m7287l6153m9844p7221r5289q9614o2247k7038q94M462j0895
12675C143229l4453m8445m3677k9397k0160j6159j2057n038M624J4077K4213L5742
12663C012499L8930K6677N525j7161l4534l3179j0333J4878K4975K0026J502k8380
12651C021425n8722p9799q8903q4168p2109o8476p5446q1833q0372o8244n2432
$$ plain form
12727 12155424 11553541 10922456 10286063 9664071 9074226 8530413 8037466 7588286 7176636
12718 7176636 6809306 6493453 6223258 5985068 5771017 5585072 5430181 5302819 5196268
12709 5196268 5102131 5020041 4956716 4904718 4846745 4780069 4712310 4643659 4569571 4490138 4409789
12698 4409789 4331764 4257602 4186021 4116413 4056596 4011331 3971605 3923642 3860459 3784045 3703969
12687 3703969 3635249 3587962 3551809 3501965 3424744 3329455 3239841 3177594 3150556 3149662 3154124 3143229
12675 3143229 3108776 3060331 3016654 2987257 2967097 2950938 2938881 2933843 2938467 2952544 2976757 3012499
12663 3012499 3051429 3078106 3083631 3066470 3031936 2998757 2988424 3003302 3028277 3048303 3049805 3021425
12651 3021425 2962703 2882904 2794001 2709833 2637724 2569248 2493802 2411969 2331597 2263353 2210921
12640B210921m8490n7157o2563n3461l4004j9005j7401k0455j6412m974R633J8544
12628A905176J5704Q814N992L920m474j1425n543P093J7989K9132M4982O9075
12616B086435R7267J17167J24130J23882J27488J39869J55413J73430J97739K26794
12606C569614K63710L14264L82494M73690N80717O87442P80129Q43374Q59134
12597H754568Q15743O93479M70855J64564j70527m72438o96970q23174q51422
12588G884678q04703p13204o08512n19926m51572l89099l22175k56382k09595
12579C609510j87211j78410j71277j58506j39142j14551q7524o3560m2678j7131
12569B449520J7362N0534O8104O9244O5561O9267Q7606J14869J35364J48570J69332
$$ plain form
12640 2210921 2162431 2105274 2042711 1989250 1955246 1936241 1918840 1898385 1881973 1876999 1886632 1905176
12628 1905176 1920880 1929694 1935686 1939606 1935132 1923707 1918164 1925257 1943246 1972378 2017360 2086435
12616 2086435 2183702 2300869 2424999 2548881 2676369 2816238 2971651 3145081 3342820 3569614
12606 3569614 3833324 4147588 4530082 5003772 5584489 6271931 7052060 7895434 8754568
12597 8754568 9570311 10263790 10734645 10899209 10728682 10256244 9559274 8736100 7884678
12588 7884678 7079975 6366771 5758259 5238333 4786761 4397662 4075487 3819105 3609510
12579 3609510 3422299 3243889 3072612 2914106 2774964 2660413 2572889 2509329 2466651 2449520
12569 2449520 2466882 2517416 2585520 2654764 2720325 2789592 2877198 2992067 3127431 3276001 3445333
12558C445333K09187K69327L42057M17457M92586N67491O41373P13045P72838
12549G870694Q01166P69572O49073M30522J32421j95781m83531o78579p74330
12540H521227p91433p50088o69494n73252m78903l93518l21505k66920k32916
12531D043198k15581k01042j80469j58998j38911j14266q2552n2604l8136m3835
12521B816804o2411p6919p2468n2239l1865j7729m662N633K080j6229k9342k0928
12509B439725j132J7411L7433N6560O6853P0527O6780M9846K1427j2622m0731
12498B772077n2891n0455m4159m6962n8005o2940n8130n0525m0535k3748P47K7741
12486B312215M6114N1263N0371M4352K8554J0173o2M460K6789N5484P0078O1807
$$ plain form
12558 3445333 3654520 3923847 4265904 4683361 5175947 5743438 6384811 7097856 7870694
12549 7870694 8671860 9441432 10090505 10521027 10653448 10457667 9974136 9295557 8521227
12540 8521227 7729794 6979706 6310212 5736960 5258057 4864539 4543034 4276114 4043198
12531 4043198 3827617 3626575 3446106 3287108 3148197 3033931 2951379 2898775 2860639 2816804
12521 2816804 2754393 2677474 2605006 2552767 2520902 2503173 2498511 2504144 2506224 2489995 2460653 2439725
12509 2439725 2438593 2456004 2493437 2549997 2616850 2687377 2754157 2804003 2825430 2812808 2772077
12498 2772077 2719186 2668731 2624572 2577610 2519605 2456665 2398535 2348010 2307475 2283727 2284474 2312215
12486 2312215 2358329 2409592 2459963 2504315 2532869 2543042 2542980 2547440 2574229 2629713 2699791 2761598
12474B761598L6666K258l1661m8863m1267j9057K53J0686K0722L7109N8188Q0923
12462B867555R7798R9661Q9120P3626N7968M7093M2860L8759K9944K0731J1402
12451C476517O1j1174k3571l8835n7138q0603j05634j17454j06001q2427p1272
12440B782469q2188r4497q2143n3935m1587m9861n4983m2791j7700P937K4025
12429B294746L1015L0573K1207L212j4944j7543l402J2876J9629K0021K3029K6288
12417B446707K0503J879j9834k7094j5764M863L0099N7976Q3191J00511J09004
12406B792041J15743J26388J36724J44102J53156J64949J70845J63872J43816
12397D111636J10271O4252J6233j9044m0098n5344o7699p9535q5634p1957l7521
$$ plain form
12474 2761598 2798264 2800522 2768861 2719998 2678731 2659674 2659927 2670613 2691335 2728444 2786632 2867555
12462 2867555 2965353 3065014 3154134 3227760 3285728 3332821 3375681 3414440 3444384 3465115 3476517
12451 3476517 3476578 3465404 3441833 3402998 3345860 3265257 3159623 3042169 2936168 2853741 2782469
12440 2782469 2700281 2605784 2523641 2469706 2428119 2378258 2323275 2280484 2262784 2270721 2294746
12429 2294746 2325761 2356334 2377541 2380753 2365809 2348266 2344864 2357740 2377369 2397390 2420419 2446707
12417 2446707 2467210 2469089 2449255 2422161 2406397 2411260 2441359 2499335 2582526 2683037 2792041
12406 2792041 2907784 3034172 3170896 3314998 3468154 3633103 3803948 3967820 4111636
12397 4111636 4221907 4286159 4302392 4283348 4243250 4187906 4120207 4040672 3955038 3883081 3845560
12386C845560M612M4481Q2939J24675J65438J98610K27921K63225L08650L57442
12376E623553M02658M45869M90493N31508N64537N94135O21655O40572O43044
12367A0558024O26445N92645N40575M65748L63976K35500Q9913n5619j81637k78673
12357A2956897l56641m25191m78240n09785n30104n46182n48826n31349m99982
12348H530597m62784m26022l97094l74648l43437k92058k33157j91712j79599
12339E630086j82077j74856j51633j26441j06487q6755o6236m8805l3364j8180
12329D635252j1373j7192k6302k9511k9370k8581k0424n102J409j1654k9391k9435
12317D398326r907J0242J4873O039n000j0729p733K983J6780L3531N0482N9882
$$ plain form
12386 3845560 3850172 3894653 3977592 4102267 4267705 4466315 4694236 4957461 5266111 5623553
12376 5623553 6026211 6472080 6962573 7494081 8058618 8652753 9274408 9914980 10558024
12367 10558024 11184469 11777114 12317689 12783437 13147413 13382913 13472826 13417207 13235570 12956897
12357 12956897 12600256 12175065 11696825 11187040 10656936 10110754 9561928 9030579 8530597
12348 8530597 8067813 7641791 7244697 6870049 6526612 6234554 6001397 5809685 5630086
12339 5630086 5448009 5273153 5121520 4995079 4888592 4801837 4735601 4686796 4653432 4635252
12329 4635252 4623879 4606687 4580385 4550874 4521504 4492923 4472499 4467397 4468806 4457152 4427761 4398326
12317 4398326 4388419 4398661 4413534 4419573 4414573 4403844 4396111 4399094 4415874 4449405 4499887 4559769
12305D559769O0777N8159M8946L6932L7522M8458N9066O9551P6106P4982P4677
12294E204945Q4682J03352J19825J28095J31707J39419J54789J65692J62302J52747
12284F547555J50808J59635J71943J80901J80136J67272J47742J30241J17835
12275G954068J08317R4564O8002L6595J4974R995K0308L6782N0330N7557O0683
12264H512175O7592Q3223J04084J26298J43948J51555J53548J54405J50478J39845
12254I787151J31351J30842J33914J35075J30660J18823J02075Q6814Q3076J00511
12244A0940292J35493J74504K08854K41294K73276K98907L13278L17654L21329
12235A3224881L35889L70036M18141M58607M79651M92980N14889N46099N74917
$$ plain form
12305 4559769 4620546 4678705 4727651 4764583 4802105 4850563 4909629 4979180 5055286 5130268 5204945
12294 5204945 5289627 5392979 5512804 5640899 5772606 5912025 6066814 6232506 6394808 6547555
12284 6547555 6698363 6857998 7029941 7210842 7390978 7558250 7705992 7836233 7954068
12275 7954068 8062385 8156949 8224951 8261546 8276520 8286515 8306823 8343605 8393935 8451492 8512175
12264 8512175 8579767 8662990 8767074 8893372 9037320 9188875 9342423 9496828 9647306 9787151
12254 9787151 9918502 10049344 10183258 10318333 10448993 10567816 10669891 10756705 10839781 10940292
12244 10940292 11075785 11250289 11459143 11700437 11973713 12272620 12585898 12903552 13224881
12235 13224881 13560770 13930806 14348947 14807554 15287205 15780185 16295074 16841173 17416090
12226A7416090N95528O14913O41876O78401P20517P66927Q22486Q86557R54184
12217B4097479J028161J112645J205096J306912J421551J544923J675319J814673
12209C5206759J964497K137453K347926K592651K861359L157176L501386L911893
12201E7681100M381689M899971N478688O146039O921001P810646Q832599J0019290
12193A12171023J1396729J2977508J4771734J6778505J8971542K1287441K3601381
12186B31955863K5711356K7317420K8001664K7278683K4698936J9982501J3185272
12179C98131695M829473m132316j2556320j9452146k4262766k6925927k7732948
12172B87898745k7137838k5619405k3583996k1328213j9065227j6929800j4978897
$$ plain form
12226 17416090 18011618 18626531 19268407 19946808 20667325 21434252 22256738 23143295 24097479
12217 24097479 25125640 26238285 27443381 28750293 30171844 31716767 33392086 35206759
12209 35206759 37171256 39308709 41656635 44249286 47110645 50267821 53769207 57681100
12201 57681100 62062789 66962760 72441448 78587487 85508488 93319134 102151733 112171023
12193 112171023 123567752 136545260 151316994 168095499 187067041 208354482 231955863
12186 231955863 257667219 284984639 312986303 340264986 364963922 384946423 398131695
12179 398131695 402961168 398828852 386272532 366820386 342557620 315631693 287898745
12172 287898745 260760907 235141502 211557506 190229293 171164066 154234266 139255369
12165A39255369j3227709j1672928j0303816r105942q062617p163429o393525
12158G3325403n724283n133082m610038m146618l739884l386537l078168k807789
12150D0699004k569899k355870k151746j953789j768628j600292j454607j337810
12142B5506363j246908j169530j099718j037723r77775r14309q41361p64838p01976
12133A6752225o55767o21548n92638n60228n23192m82935m43833m14768l97941
12124A2059375l83748l60821l23894k80113k44583k22619k06641j88996j67639
12115I680321j47346j38730j46021j61073j74374j77190j69675j59390j44488
12106H262034j27219j18019j12893r7467p7147o7669p2930q6019r3689q5837o6730
$$ plain form
12165 139255369 126027660 114354732 104050916 94944974 86882357 79718928 73325403
12158 73325403 67601120 62468038 57858000 53711382 49971498 46584961 43506793 40699004
12150 40699004 38129105 35773235 33621489 31667700 29899072 28298780 26844173 25506363
12142 25506363 24259455 23089925 21990207 20952484 19974709 19060400 18219039 17454201 16752225
12133 16752225 16096458 15474910 14882272 14322044 13798852 13315917 12872084 12457316 12059375
12124 12059375 11675627 11314806 10990912 10710799 10466216 10243597 10036956 9847960 9680321
12115 9680321 9532975 9394245 9248224 9087151 8912777 8735587 8565912 8406522 8262034
12106 8262034 8134815 8016796 7903903 7806436 7729289 7661620 7588690 7502671 7408982 7323145 7256415
12095G256415n3278n8517p5245q3809p4253n4221l9738l6604l2202j4911O403
12084F740040J8364J6978N674o691j5845l0216n4650q1322j06915j33976j60384
12073F191057j81491j90382j86757j84386j88336j83916j67910j55358j49794
12064D602727j44008j34363j16135q6745n6774m4728n3906o5282n9189l4634j0517
12053C796446l700j4518l3803n1427n7858m7613k5463l065J2684K5101L7280M3699
12041C677763L4840J1053j0647j6326p826L300M783o597k3266l5722m0708l8341
12029C552306k7204j5913j4903j7535r995P390K6397M8611P9496J16993J50862
12018C896505J71669J81893J95626K21258K54213K90145L28705L67797M06489
$$ plain form
12095 7256415 7203137 7144620 7069375 6985566 6911313 6857092 6817354 6780750 6748548 6733637 6740040
12084 6740040 6758404 6775382 6781056 6774365 6758520 6728304 6673654 6592332 6485417 6351441 6191057
12073 6191057 6009566 5819184 5632427 5448041 5259705 5075789 4907879 4752521 4602727
12064 4602727 4458719 4324356 4208221 4121476 4064702 4019974 3966068 3900786 3841597 3806963 3796446
12053 3796446 3792746 3778228 3744425 3692998 3635140 3587527 3562064 3558999 3571683 3596784 3634064 3677763
12041 3677763 3712603 3723656 3713009 3696683 3688857 3692157 3696940 3690343 3667077 3631355 3590647 3552306
12029 3552306 3525102 3509189 3494286 3476751 3466756 3474146 3500543 3549154 3628650 3745643 3896505
12018 3896505 4068174 4250067 4445693 4666951 4921164 5211309 5540014 5907811 6314300
12009F314300M40998M70391M99842N29817N53198N65602N64626N43368N02374
12000A0984516M50368L87703L05962J98501O5683q5264k47901m13493n63301o70219
11990A0412555p12365o98573o61698o20544n76455n34996n01355m68479m32546
11981E205544l96058l56730l12596k76507k56501k41912k25506k06404j79172
11972B754158j43174j09379q7923p8560p2903o5463n9785o1596o7069o2909m7837
11961A897560l6976l7195l9395l4241k1403n281Q967J3851Q366l28r038j8850
11949A726037k4410k2021j6884j4337j2297n568R132K9751M5010M5284L2066J4349
11937A806112K440r60L14O602K1187L8308M5264M1302L5634L0075K6273L0501
$$ plain form
12009 6314300 6755298 7225689 7725531 8255348 8808546 9374148 9938774 10482142 10984516
12000 10984516 11434884 11822587 12128549 12327050 12392733 12307469 12059568 11646075 11082774 10412555
11990 10412555 9700190 9001617 8339919 7719375 7142920 6607924 6106569 5638090 5205544
11981 5205544 4809486 4452756 4140160 3863653 3607152 3365240 3139734 2933330 2754158
11972 2754158 2610984 2501605 2413682 2335122 2262219 2196756 2136971 2075375 2008306 1945397 1897560
11961 1897560 1860584 1823389 1783994 1749753 1728350 1723069 1732036 1745887 1754253 1753925 1744887 1726037
11949 1726037 1701627 1679606 1662722 1648385 1636088 1630520 1639652 1669403 1714413 1759697 1791763 1806112
11937 1806112 1808552 1807592 1807906 1814508 1835695 1874003 1919267 1960569 1996203 2026278 2052551 2083052
11925B083052L3715K6919J4388n572l0113m0544k7490j678K5582N5169Q6074J02798
11913B322300R1698O1482L2250J6435J5646J9412J2609p394k7943l5498l1044
11902B469953k1337j0845j0141j9642k2303j5027j1903j5491k0654k7407l3721
11891B261482k9435j0051J2007K3779K4936K0709J2497J409j0926k0600k0808
11880B264999j0248J642K708m308j1280k1784m1165o1676o7993n5341l1611o554
11868A957389J4922L3404N0622O6222P2686N8635K4292j5333l6765k6630L250
11857B202694L1316M2325L2429Q405j6411l1263l6055l7877m1645m5050m7023
11846B061845m7994m7227l8415j7323M056J0462O063P23j0018k5712l3833k8721
$$ plain form
11925 2083052 2116767 2143686 2158074 2152502 2122389 2081845 2054355 2052677 2078259 2133428 2219502 2322300
11913 2322300 2413998 2475480 2507730 2524165 2539811 2559223 2571832 2564438 2536495 2500997 2469953
11902 2469953 2448616 2437771 2427630 2407988 2385685 2370658 2358755 2343264 2322610 2295203 2261482
11891 2261482 2232047 2221996 2234003 2257782 2282718 2303427 2315924 2317333 2306407 2285807 2264999
11880 2264999 2254751 2256393 2259101 2254793 2243513 2221729 2180564 2118888 2050895 1995554 1963943 1957389
11868 1957389 1972311 2005715 2056337 2122559 2195245 2253880 2278172 2262839 2226074 2199444 2202694
11857 2202694 2234010 2276335 2308764 2317169 2300758 2269495 2233440 2195563 2153918 2108868 2061845
11846 2061845 2013851 1966624 1928209 1910886 1914942 1925404 1931467 1932190 1922172 1896460 1862627 1833906
11834A833906j6454j0392j4595j9489j8445j4157j3029j9922l1541l4723k3494
11823A617665p528N807J4848J8119K1491L2778M9659O4850P5043P9443Q1636Q5644
11811B139455Q7301P7447N6584L3012J4844J0437K0349L1546K9852J5653l14o930
11799B509236p37J3390K9105L7701L2378J9637J5607K4487L1828K0373p002k6798
11787B699205k5502j6733j5526j7680k0022k6677l7313m6888n5640o6364p4117
11776B296743p2988o1776m4402l3264l3683m0286n0315n9438n5589l5912j0070
11765A799020J5658L1891L0836K4176K5433K8136K4075K0062K4726L6426M1247
11754B101686L2205K1885K2966L6650N0975M6493K2753L898O183K4402M3332N1121
$$ plain form
11834 1833906 1817452 1807060 1792465 1772976 1754531 1740374 1727345 1707423 1675882 1641159 1617665
11823 1617665 1610137 1615944 1630792 1648911 1670402 1703180 1752839 1817689 1892732 1972175 2053811 2139455
11811 2139455 2226756 2304203 2360787 2393799 2408643 2419080 2439429 2470975 2500827 2516480 2516166 2509236
11799 2509236 2508499 2521889 2550994 2588695 2621073 2640710 2656317 2680804 2712632 2733005 2726003 2699205
11787 2699205 2673703 2656970 2641444 2623764 2603742 2577065 2539752 2492864 2437224 2370860 2296743
11776 2296743 2223755 2161979 2117577 2084313 2050630 2010344 1960029 1900591 1845002 1809090 1799020
11765 1799020 1814678 1846569 1877405 1901581 1927014 1955150 1979225 1999287 2024013 2060439 2101686
11754 2101686 2133891 2155776 2178742 2215392 2266367 2312860 2335613 2339511 2345694 2370096 2413428 2464549
11742B464549M5115L1389J9014J5241J9633K1411J4942R292J2848J8242J7464
11731B689140J2778M009p007r481J657J5389J4864l105k1102k3701j1820P381
11719B669002K5544L7149L8921K9188J4353R065K2379M8023P3380Q8330Q9001
11708C144335P5508N6387M7853N1799N0645L8351K4724J0912r143l2309m7353
11697C411709m7701l7546k6047j7884j4612j8934l1425m8019o1391p0451p9996
11686B957703q7436q6486p7135o2526m4646k8802k0529j7339j3601r978j1352
11675B497873k1238l3224l6420k9942k0287j1312n467p868j5468j2059J0574M2564
11663B357726O5851P1853O6262N3525M2280M9184P2936R3933J04787J16434J35062
$$ plain form
11742 2464549 2509664 2541053 2560067 2575308 2594941 2616352 2631294 2640586 2653434 2671676 2689140
11731 2689140 2701918 2705927 2698920 2689439 2691096 2706485 2721349 2718244 2697142 2673441 2661621 2669002
11719 2669002 2694546 2731695 2770616 2799804 2814157 2823222 2845601 2893624 2967004 3055334 3144335
11708 3144335 3219843 3276230 3324083 3375882 3426527 3464878 3489602 3500514 3491371 3459062 3411709
11697 3411709 3364008 3326462 3300415 3282531 3267919 3248985 3217560 3169541 3108150 3037699 2957703
11686 2957703 2870267 2783781 2706646 2644120 2599474 2570672 2550143 2532804 2519203 2509225 2497873
11675 2497873 2476635 2443411 2406991 2377049 2356762 2345450 2339983 2332115 2316647 2304588 2315162 2357726
11663 2357726 2423577 2495430 2561692 2615217 2657497 2706681 2779617 2873550 2978337 3094771 3229833
11652C229833J53991J67651J77880J89026K06464K34282K64096K86379L03690
11643E213292L26697L70170M40588N26254O06487O70873P25532P77568Q24398
11634A0481859Q63829R04273R52119R98407J026245J021648R78009Q96180P82085
11625A8904654O52875N39676M73353M69779N33655O66914Q67534J126859J424461
11616B5659760J724938J980025K144032K174200K014306J605938R28626M5317
11608C8277142q97124j733900k352375k711529k831598k769255k590007k357832
11600B0033522k120817j893936j671415j453896j254350j082846r42708q33886
11592H779668p48651o71051n90297n11401m40999l80012l31065k98160k82655
$$ plain form
11652 3229833 3383824 3551475 3729355 3918381 4124845 4359127 4623223 4909602 5213292
11643 5213292 5539989 5910159 6350747 6877001 7483488 8154361 8879893 9657461 10481859
11634 10481859 11345688 12249961 13202080 14200487 15226732 16248380 17226389 18122569 18904654
11625 18904654 19557529 20097205 20570558 21040337 21573992 22240906 23108440 24235299 25659760
11616 25659760 27384698 29364723 31508755 33682955 35697261 37303199 38231825 38277142
11608 38277142 37380018 35646118 33293743 30582214 27750616 24981361 22391354 20033522
11600 20033522 17912705 16018769 14347354 12893458 11639108 10556262 9613554 8779668
11592 8779668 8031017 7359966 6769669 6258268 5817269 5437257 5106192 4808032 4525377
11583D525377k74068k56232k24957j87537j51060j18874r5633q8218r7467j12660
11573B918671j17376j04554q1096n8089m6067n1155p1977r6786j04574r1027p8520
11562B017450p7423p4145o0802m3515k6969j2796n498l999k131k233j0011k1047
11550A676881k4420k0497j8764j7815r835M200J6239K3004L0387L6949L2013J4082
11538A742424r391l1212m7932n6472n7256n7610o0931o1948n3708l6269j7121
11527A252574p72N908l614k1376l4606l8955l7634l2384j9851k445Q301P378K854
11514A085378P30K109J0845K5099L1606J9082j3053m8927o8338o7408n7338n0531
11502H69254n2136n8211o0969n9442n8089n6391m9853m0003l0354j6503O312K8804
$$ plain form
11583 4525377 4251309 3995077 3770120 3582583 3431523 3312649 3217016 3128798 3031331 2918671
11573 2918671 2801295 2696741 2615645 2557556 2511489 2460334 2388357 2291571 2186997 2095970 2017450
11562 2017450 1940027 1865882 1805080 1761565 1734596 1721800 1716302 1712303 1710172 1707939 1697928 1676881
11550 1676881 1652461 1631964 1613200 1595385 1585550 1589750 1605989 1628993 1659380 1696329 1728342 1742424
11538 1742424 1733033 1701821 1653889 1597417 1540161 1482551 1421620 1359672 1305964 1269695 1252574
11527 1252574 1251802 1257710 1254096 1232720 1198114 1159159 1121525 1089141 1069290 1066845 1075146 1082524 1085378
11514 1085378 1086108 1088217 1099062 1124161 1155767 1174849 1161796 1112869 1044531 977123 919785 869254
11502 869254 817118 758907 697938 638496 580407 524016 474163 434160 403806 387303 393615 422419
11490D22419M0386M0907L3224K4152J9961J7903J1491m145k3509l4301l3350k6309
11478D88829j8969j2259k511Q952J5496J8777K4465L0534L1698K4757R225r350
11466F09644j8865j5097p189p955j8922k8956l1456k8596k7204l7012n7979p6660
11454B53753q2853p8106p4591q3929j00588j12155j16811j25416j46057j65978
11444h32731j64937j41552j10482p8463m3626k554N0754J06564J43841J59210
11434i13976J57068J42261J26666J17426J11363J06602J02213R0111O6164L9351
11424A45249K0980R367k601j5476k4773k8917k6282j1917P140J6089J4877J4577
11412A18313J4792M362j5057l0728l6122l4546l1536k1786L567L0355L9843L9690
$$ plain form
11490 422419 462805 503712 536936 561088 581049 598952 610443 606298 582789 548488 515138 488829
11478 488829 469860 457601 455090 464042 479538 498315 522780 553314 585012 609769 618994 609644
11466 609644 590779 575682 568493 560538 541616 512660 481204 452608 425404 388392 330413 253753
11454 253753 170900 92794 18203 -65726 -166314 -278469 -395280 -520696 -666753 -832731
11444 -832731 -997668 -1139220 -1249702 -1328165 -1371791 -1374345 -1323591 -1217027 -1073186 -913976
11434 -913976 -756908 -614647 -487981 -370555 -259192 -152590 -50377 39734 105898 145249
11424 145249 166229 175596 172995 157519 132746 103829 77547 65630 72770 88859 103736 118313
11412 118313 133105 137467 122410 91682 55560 21014 -10522 -32308 -28741 1614 41457 81147
11400H1147M0060L8202L8207L9959K9313O752p470p394o474j1377j5151r559N675
11387B21890K4383L7770M0275L7669L5915L0958K0735Q837j140m110k580o296
11375D44306j6761k2951j2101J8029N4345P7566P9532O3897L9459J6905N457J818
11363G49501p305k4959l5568k2420P319L0524L5313K9769K4252J7224N050j0165
11351G98535k0109j2860J4272M1054M5649L2844J9665J8146K9638M1975M1950
11340A050759K7620O287j4306k6574l0003k9081k6085k3604k1238j7313j1074
11329H85388k451L743o73j4076k4628l0831l9434m7403m6418l9380l3074k2362
11317E88401q80K2790L0765K0832Q735O847J2184J4613J8726L0864L8333K9238
$$ plain form
11400 81147 121207 159409 197616 237575 266888 273640 266170 258776 252302 240925 225774 216215 221890
11387 221890 246273 284043 324318 361987 397902 428860 449595 458432 457292 453182 450602 444306
11375 444306 427545 404594 392493 410522 464867 542433 621965 685862 725321 742226 747683 749501
11363 749501 742196 717237 681669 659249 666568 697092 732405 762174 786426 803650 808700 798535
11351 798535 778426 765566 779838 820892 866541 899385 919050 937196 966834 1008809 1050759
11340 1050759 1078379 1084666 1070360 1043786 1013783 984702 958617 935013 913775 896462 885388
11329 885388 882937 886680 886007 871931 847303 816472 777038 729635 683217 643837 610763 588401
11317 588401 587521 610311 641076 661908 670643 677490 689674 704287 723013 753877 792210 821448
11305H21448R603n142o407K794J1955J2161J0093J6730L2390N3175P2766P8653
11293A110219O1180K9479P595M051O434N924N330J1389K4860M2583O1390P9811
11281A450245R6271J04660J01644R6261J07421J40747J79249K08604K33518K65605
11271B984225L10006L63759M19791M70884N15895N57927O01082O54705P19156
11262G597430P72956P97778P90782P50953O66706N13306K75325l1105l58567o45449
11252A1130115q44821r41269r48177q97508q17542p26706o41262n67167n01687
11243D243976m42993l88341l35452k90308k57759k32533k12459j97046j76043
11234A711042j43482j06078p3871n0563l4247l0422l8812m7733n0472n2221n6542
$$ plain form
11305 821448 831051 825909 819502 822296 834251 846412 856505 873235 905625 958800 1031566 1110219
11293 1110219 1171399 1200878 1208473 1212524 1218958 1224882 1230212 1241601 1266461 1309044 1370434 1450245
11281 1450245 1546516 1651176 1752820 1849081 1956502 2097249 2276498 2485102 2718620 2984225
11271 2984225 3294231 3657990 4077781 4548665 5064560 5622487 6223569 6878274 7597430
11262 7597430 8370386 9168164 9958946 10709899 11376605 11889911 12165236 12134131 11775564 11130115
11252 11130115 10285294 9344025 8395848 7498340 6680798 5954092 5312830 4745663 4243976
11243 4243976 3800983 3412642 3077190 2786882 2529123 2296590 2084131 1887085 1711042
11234 1711042 1567560 1461482 1387611 1337048 1302801 1272379 1233567 1185834 1135362 1083141 1026599
11223A026599n7920n3888m7533m4397m7302n1405m7091l3080j9468j3535j3922
11212E97058k0415l1720m2143m9462n5271n9011n5510m2137k1305J981J7110J6221
11200B55396P636N683J1869J3971N146q555k1020k7618k5832j7740o76K2414L6471
11187B57145L6125K9439K1651J2924O248J728m992j1069q243O984K5204L4559
11175D07703L3701K5145J0433r056l1813m8963m7606k5937J591J5937J2521l028
11163C40628k1208k6259q827K0810M1036M0394K7497J6534L330j9369m0538m8222
11151C25806m6012m2740m2718m3309m0716l9291l8981l0731j1965P730J8810K0868
11139C6751J8148J5024J4337J4645J5337J7624J8948J3458r8j7535l2653m2761
$$ plain form
11223 1026599 968679 914791 867258 822861 775559 724154 677063 643983 624515 610980 597058
11212 597058 576643 544923 502780 453318 398047 339036 283526 241389 220084 222065 239175 255396
11200 255396 263032 268715 280584 294555 299701 291146 270126 242508 216676 198936 198260 220674 257145
11187 257145 293270 322709 344360 357284 363532 365260 360268 349199 340956 347940 373144 407703
11175 407703 441404 466549 476982 467926 436113 387150 339544 313607 315198 331135 343656 340628
11163 340628 319420 293161 284334 305144 346180 386574 414071 430605 433935 414566 374028 325806
11151 325806 279794 237054 194336 151027 110311 71020 32039 1308 -10657 -2927 15883 36751
11139 36751 54899 69923 84260 98905 114242 131866 150814 164272 164174 146639 113986 71225
11127G1225n0777n3916m6135k9959r719J0808K9019M1844M3072L2696J7253K490
11115E7901p237j0518o562K617J1121J3246Q768L039m2L039J4043K9603M4089
11102A63107M9176M0146K1884K515j4189k4111k2724j4742q700p702j3607k1122
11090A49931j9177j0797o779j2795k3780k7542j8405p495r448k1602k7909j7884
11078e3682J119J7710L0923M0717M2599L8745L7465L8777L7370K8213J2492j461
11066B70987j0466j4979r324J2367M6258P9152R9141J00501Q1183M9048J2965
11055G16833k4541n5502o7771o0358m2078k4323j7006k1007l0519l9813l9831
11044B94084k8466j8860j9903k8027l7314m6244n3957n3695m0233j3057K2598
$$ plain form
11127 71225 20448 -33468 -79603 -109562 -119281 -108473 -79454 -37610 5462 38158 55411 57901
11115 57901 50664 40146 33584 36201 47322 60568 69336 72375 72333 75372 89415 119018 163107
11102 163107 212283 252429 274313 276828 262639 238528 215804 201062 192362 184660 171053 149931
11090 149931 130754 119957 113178 100383 76603 49061 30656 23161 13713 -7889 -35798 -53682
11078 -53682 -52563 -34853 -3930 36787 79386 118131 155596 194373 231743 259956 272448 270987
11066 270987 260521 245542 236218 248585 294843 373995 473136 573637 654820 703868 716833
11055 716833 692292 636790 569019 508661 466583 442260 425254 404247 373728 333915 294084
11044 294084 265618 246758 226855 198828 161514 115270 61313 7618 -32615 -45672 -23074
11033b3074N2034O3530N3760K5340o508k5765l0357l0164l1232l0220k6106k1502
11021c0264j9902k3965k7568k1055n207J2951K7824L7540L7696K1470l490k1072
11009a5042k5669j5005P693L0531M3823M5630L7580K1148l23k2470l9885m7261
10997B0750m2987l0699j6987o965m117p245q657k600J0133K6169L9873M6575M8447
10984G1690M5557L8479L3673L1059K8473K7604K2409R472k227p040p713j2424
10972B79012k6250m4691n7083n3025l2167o074Q922M716n002l223R949K3018K6621
10959A24723K3385J7619N912q591j8375k3508k2137j2656J54J3512K6683L2450
10947A59171K0836o296l6548n5400n4610l9854k6362k2279k3239j8050P6K0273
$$ plain form
11033 -23074 28960 92490 146250 171590 165082 139317 108960 78796 47564 17344 -8762 -30264
11021 -30264 -50166 -74131 -101699 -122754 -127961 -115010 -87186 -49646 -11950 9520 6030 -15042
11009 -15042 -40711 -55716 -48023 -17492 26331 71961 109541 130689 130366 107896 68011 20750
10997 20750 -22237 -52936 -69923 -76888 -81005 -88250 -96907 -99507 -89374 -63205 -23332 23243 71690
10984 71690 117247 155726 189399 220458 248931 276535 298944 308416 306189 299149 291436 279012
10972 279012 252762 208071 150988 97963 65796 59722 68644 73360 68358 65135 75084 98102 124723
10959 124723 148108 165727 171639 163048 144673 121165 99028 86372 86526 100038 126721 159171
10947 159171 180007 173711 137163 81763 27153 -12701 -39063 -61342 -84581 -102631 -102555 -82282
10935h2282K7085J7892j165k1589k7569r456J6846L0189K3477O321n139n951j098
10922c2439K659K767P42n985j7351k2147j0869J2020L4245M4897M0959K9503J6605
10909I5606M35j6371k1374j1714l166n425j1802j3076k958J5880K7753K7511L0512
10896A11811M5691O2533O7483N9218M6122L3099J9504N565k537l595o708j8164
10884D20022l2526l7019l2668l6158n6581q4051j00274r2064o0723k6529q420
10873a46991n660j2054k1165j9158j849J9629L2863L1122K1875J4016O730r56
10861h1598o687p901l606M150Q456M400n422j5366j8323j1997k140K014j886n663
10847a41569p864j5557k5759l0622k5617j0104O571R865K055M37R333K2542L5025
$$ plain form
10935 -82282 -55197 -37305 -38470 -60059 -87628 -97084 -80238 -50049 -26572 -20251 -25390 -31341 -32439
10922 -32439 -29780 -27013 -26271 -32256 -49607 -71754 -82623 -70603 -36358 8539 49498 79001 95606
10909 95606 96041 79670 58296 46582 43416 37991 26189 13113 10155 26035 53788 81299 111811
10896 111811 157502 220035 287518 346736 392858 425957 445461 451026 448489 444894 438186 420022
10884 420022 387496 350477 317809 281651 225070 141019 40745 -51319 -112042 -138571 -146991
10873 -146991 -152651 -164705 -185870 -205028 -206877 -187248 -154385 -123263 -101388 -87372 -80642 -81598
10861 -81598 -88285 -96186 -99792 -95642 -87186 -82786 -88208 -103574 -121897 -133894 -136034 -134020 -135906 -141569
10847 -141569 -149433 -164990 -190749 -221371 -246988 -257092 -250521 -240656 -238601 -238164 -228831 -206289 -171264
10834a71264M2836M5487M3761L7505K2041j731j8406j9563j5471j8269k6272l0545
10822a09891k8830k8962l6425m1344l5525k4200j3170m200n78M35O357J7001L0493
10809b68839M4676N3721N2118L9037K1292P113k23l635n626n949o093p040j0827
10796i0275k1186l2971l5827k8069j6224l204K270r699k8971l4759k0165n87P984
10783c11683N290j591o504l178J3582L3963M2068L5915J9447O65k783J4738L9226
10770a20845N4073M6261J6279j2195j9450j1754q807j9713l5418m6654m9345m1730
10758b49298k4941l280J5876K7461K9626K5784K2005K2118K3061J6269J317j6775
10746a10777l5177m6784m4607l1599j8586j2242j2306j5659k0947k8927l5559
$$ plain form
10834 -171264 -128428 -82941 -39180 -1675 20366 18635 229 -19334 -34805 -53074 -79346 -109891
10822 -109891 -138721 -167683 -204108 -245452 -280977 -305177 -318347 -322547 -323125 -322690 -316333 -299332 -268839
10809 -268839 -224163 -170442 -118324 -79287 -57995 -50882 -51105 -54740 -60366 -66315 -72408 -79448 -90275
10796 -90275 -111461 -144432 -180259 -208328 -224552 -227756 -225486 -235185 -264156 -298915 -319080 -319667 -311683
10783 -311683 -306393 -307984 -314488 -317666 -304084 -270121 -228053 -192138 -172691 -172026 -174809 -160071 -120845
10770 -120845 -66772 -20511 -4232 -16427 -35877 -47631 -56438 -76151 -111569 -158223 -207568 -249298
10758 -249298 -274239 -277519 -261643 -234182 -204556 -178772 -156767 -134649 -111588 -95319 -94002 -110777
10746 -110777 -145954 -192738 -237345 -268944 -287530 -299772 -312078 -327737 -348684 -377611 -413170
10735d13170l6729l3327l0025k9521k3708o157J1815J3282n440l0683n0958o5695
10723g00316p6376q3289q8219r6414j07171j19460j35301j49657j60024j72710
10713a888937j90453k08170k17702k13590k00974j83163j49368r7705l8436K4654
10703c363844R2578J62403K18594K46749K53633K50517K42479K37773K34975K23095
10693a201048K06628J93838J81636J68228J51955J28120R7322O6347L9479J8043
10683E0548J221j0453j7393k4489l3360l4769k1849p59J7284K2303Q817j6472
10671e9371l5221l9027l3672k2009j150K5265M4837N0639M7130L9000K5632O721
10659D8774j2607k5813k9455k3840j2206J47J0629K1177K7643K1841K951k3374
$$ plain form
10735 -413170 -449899 -483226 -513251 -542772 -566480 -572637 -560822 -547540 -552980 -583663 -634621 -700316
10723 -700316 -776692 -859981 -948200 -1044614 -1151785 -1271245 -1406546 -1556203 -1716227 -1888937
10713 -1888937 -2079390 -2287560 -2505262 -2718852 -2919826 -3102989 -3252357 -3350062 -3388498 -3363844
10703 -3363844 -3271266 -3108863 -2890269 -2643520 -2389887 -2139370 -1896891 -1659118 -1424143 -1201048
10693 -1201048 -994420 -800582 -618946 -450718 -298763 -170643 -73321 -6974 32505 50548
10683 50548 51769 41316 23923 -566 -33926 -68695 -90544 -91303 -74019 -51716 -42899 -59371
10671 -59371 -94592 -133619 -167291 -189300 -190450 -165185 -120348 -69709 -22579 16421 42053 48774
10659 48774 36167 10354 -19101 -42941 -55147 -55000 -44371 -23194 4449 26290 29241 5867
10647E867n2316p2799p3438n3477k3122L013J8168K3982J7974P64j3285q746J2548
10634b14867L3440M2233L6661K7814K7923K8099J6974K029m214k836m916j5703
10622b7363k6348k9616k7252k4591k4017j7065l65J7829K9223K9586K2660J2005
10610f5314j681j2127j3819r148p74P101P721k5r680j4339j2627q886n014J980
10596a36632J0376J4961J6268J8781K3202K4251J7489R93k2471m0600m1907k5419
10584a40708K565L3074N4602O4701P2905P8685P0184M4265K638m6538q4393r5982
10572E5998q0883n0583j4700K5185O5429R3915J02395R2180O7102L3657L914j4704
10560C78905k5340l5137n0865o7498p2632o9843o6449n4707l1732o837J3718L0739
$$ plain form
10647 5867 -46449 -119248 -192686 -246163 -269285 -266272 -248104 -224122 -206148 -205384 -218669 -227415 -214867
10634 -214867 -181427 -139194 -102533 -74719 -46796 -18697 -1723 306 -3908 -6744 -11660 -27363
10622 -27363 -53711 -83327 -110579 -135170 -159187 -176252 -176617 -158788 -129565 -99979 -77319 -65314
10610 -65314 -66995 -79122 -92941 -102089 -102863 -95762 -88041 -88066 -97746 -112085 -124712 -133598 -138612 -136632
10596 -136632 -126256 -111295 -95027 -76246 -53044 -28793 -11304 -10311 -32782 -73382 -115289 -140708
10584 -140708 -138143 -105069 -50467 14234 87139 165824 236008 280273 282911 236373 151980 55998
10572 55998 -24885 -75468 -90168 -64983 446 94361 196756 288936 356038 389695 393609 378905
10560 378905 353565 318428 267563 200065 127433 57590 -8859 -63566 -95298 -102135 -88417 -57678
10548e7678M7389O1544O6861O2934N4393M0589J9444p4m839M559J5179K0723J9828
10535C50852J0221j396m145L60O619J3398K3541M4407P7306J08149J19416J09919
10523H58647R0438O7038M1409J9576N071o998k1576l9063n3626n8584o1989p3630
10511G66713q1825p6415o5504n6162n0821m9989n0812n2870o0328o8227o2964
10500I0796m6131l5184l6832m6423o0563o8371n5465k0783J7372L8066L9165K9252
10488a55101K0484K0348K3114K6872L6384M3761M1277L6253L1288J9818L884p678
10476A40704r724j564J1647J9833J1734j4317m2180n5324n3150n1215n7949o0130
10464a61635n0883l5571k0562p857L201Q178P777Q794J1985J6532K0448J6597
$$ plain form
10548 -57678 -10289 51255 118116 181050 235443 276032 295476 295402 290563 295122 310301 331024 350852
10535 350852 361073 359677 355532 355892 362511 375909 399450 443857 521163 629312 748728 858647
10523 858647 949085 1016123 1057532 1077108 1082179 1075181 1053605 1014542 960916 902332 840343 766713
10511 766713 684888 608473 542969 486807 435986 385997 335185 282315 221987 153760 90796
10500 90796 44665 9481 -27351 -73774 -134337 -202708 -258173 -278956 -261584 -223518 -184353 -155101
10488 -155101 -134617 -114269 -91155 -64283 -27899 15862 57139 93392 124680 144498 148382 140704
10476 140704 130980 129416 141063 160896 172630 158313 116133 60809 7659 -43556 -101505 -161635
10464 -161635 -212518 -248089 -268651 -276508 -273307 -265129 -257352 -248558 -236573 -220041 -199593 -182996
10452a82996O173j187l237j830N639J9821L4822M4960N0026M8355M1253L7227
10440I9026L8500M0287L7323K6773R935p654j5797j2466n885N09P619J6058K2566
10427B56794J6539l782k2796k7443k1270j2188j790O074P276L864j232p316j2648
10414A80082j4820j4982j3877p926P055L0312N2534N7328L8001K719l3400n2715
10402B30311n0723l4847j1403J1439K1728J3832k983j5138j7966j4116p688j578
10390A20868L341Q598J4093J7723J9319J9238J3121k724k4628m4782n1695l5270
10378E7202n271J6526K4310K6320K3469J4106Q906J7417K9543L1120K1453O317
10366B71418r274k1117k8010l0570k8768k6555k7199k5671k0234j5318j2418m657
$$ plain form
10452 -182996 -176823 -178010 -181247 -183077 -177438 -157617 -122795 -77835 -27809 20546 61799 99026
10440 99026 137526 177813 215136 241909 251844 244190 228393 215927 210042 210551 218170 234228 256794
10427 256794 273333 269551 246755 219312 198042 185854 184064 190138 197414 201278 200046 192730 180082
10414 180082 165262 150280 136403 128477 135532 165844 218378 275706 313707 316426 283026 230311
10402 230311 179588 144741 133338 144777 166505 180337 177354 162216 144250 130134 122446 120868
10390 120868 124209 132807 146900 164623 183942 203180 216301 213577 188949 144167 92472 57202
10378 57202 51931 68457 92767 119087 142556 156662 165568 182985 212528 243648 265101 271418
10366 271418 262144 241027 213017 182447 153679 127124 99925 74254 54020 38702 26284 21627
10354B1627R475J8991K0259J9617K1469K7570L5812M0330L5083K1385L300j7744
10342B57174l2524l5241l4964l9820m5048l7699j7186J159L935p129k0282k8251
10330c5876k9292k2120j0951k644j53p87J415Q885J9039K7392L1666L2997L1513
10317E1084K4892P747j9511l8806l7049k2874r145R52M132j548m403P082K4108
10304a3339K8710J7119L306m34R888K9217L6630J6905j4732l1782k8252j5820
10292C7416m691j716r290j4690l337J9540L2547K5620J5076J1885N836n317j1677
10279I7202p046N257J5388K0110K4841L4491M0194L2816J7103r59j4847k2041
10267B42509l1854m8810o0270n5089m2330l2784k0910K942L1516M8383N0220M5549
$$ plain form
10354 21627 31102 50093 70352 89969 111438 139008 174820 215150 250233 271618 274918 257174
10342 257174 224650 189409 154445 114625 69577 31878 14692 15851 19786 12657 -7625 -35876
10330 -35876 -65168 -87288 -98239 -100883 -101036 -101823 -100408 -91523 -72484 -45092 -13426 19571 51084
10317 51084 75976 83723 64212 25406 -11643 -34517 -43662 -42710 -38578 -40126 -44529 -37447 -13339
10304 -13339 15371 32490 35796 35362 45250 74467 111097 128002 113270 81488 53236 37416
10292 37416 32725 31009 21719 7029 3692 23232 55779 81399 96475 108360 114196 108879 97202
10279 97202 90156 95413 110801 130911 155752 190243 230437 263253 280356 279397 264550 242509
10267 242509 210655 161845 101575 46486 4156 -28628 -49538 -46596 -15080 33303 83523 129072
10255A29072L9585L0343J4754K74j511R459K5756L7808L4270J6296o08j0258j8441
10242C06799k5802k8249k1299k667K3675M8585O3414O6598O2029N1593L6049J8173
10230E98898L082l91Q353J8031K0179J6314J0013K620r34O129J8357J8753J341
10217G20745k2593m3101n6263o1117o1643o1114o1453o1379n3584m0460l2513
10206A65525l1377l0911k5106j5334r271j3376k2756k2389p558J2742K9665L8445
10194F8299M0942L8790L0510J7971O935Q179K4738M2283M5412L4739K1625J6918
10182C97341J9693K2927K9703L9100L9095K6623O366j4813k4591j6760K314J9482
10170E46480K6914K7676K7544L2117M4478O0354P2404P4644O4842M9510L5763
$$ plain form
10255 129072 168657 199000 213754 214028 212517 221976 247732 285540 319810 336106 335498 325240 306799
10242 306799 280997 252748 231449 228782 252457 301042 364456 431054 493083 544676 580725 598898
10230 598898 601980 601589 609942 627973 648152 664466 674479 677099 676165 682294 700651 719404 720745
10217 720745 698152 655051 598788 537671 476028 414914 353461 292082 238498 198038 165525
10206 165525 134148 103237 78131 62797 53526 40150 17394 -4995 -12553 189 29854 68299
10194 68299 109241 148031 178541 196512 203447 211626 236364 278647 324059 358798 380423 397341
10182 397341 417034 439961 469664 508764 547859 574482 580848 566035 541444 524684 526998 546480
10170 546480 573394 601070 628614 660731 705209 765563 837967 912611 977453 1026963 1062726
10159A062726K5020K0275K3783K8163K7043K0669Q963j0672m0393p2642r5297
10148I97638j00286q4833n9263m2177m3249n7997p4433q3882q5566q3161p5102
10137B07689n7920l5311j2012N990J7410K6661K9158J7236m623k5964m4875o4197
10125E9242q0281q1797o1168l1412j3565j0684j5703k6414l8827m2414k5285J3311
10113c54997N8542Q8676R5810Q9132P5775N8043L9425K5520J6670L262j8449l3567
10101A43842k9213j3280K873J6448K2612J3702o278k8911n2545p0064o7891m5040
10089a13745j1732K4951M9665M6102K2445N201R845K8458M4829N0001M4363L4633
10077B35016K8676K7544K7672L0835L5923L3913J8493r029l4481m3983m1307l3774
$$ plain form
10159 1062726 1087746 1108021 1131804 1159967 1187010 1207679 1216642 1205970 1165577 1092935 997638
10148 997638 897352 812519 753256 711079 667830 609833 535400 451518 365952 282791 207689
10137 207689 149769 114458 102446 108436 125846 152507 181665 198901 194278 168314 123439 59242
10125 59242 -21039 -102836 -164004 -195416 -208981 -219665 -235368 -261782 -300609 -343023 -368308 -354997
10113 -354997 -296455 -207779 -111969 -22837 52938 110981 150406 175926 192596 195858 177409 143842
10101 143842 114629 101349 104222 120670 143282 156984 150706 121795 69250 -814 -68705 -113745
10089 -113745 -125477 -100526 -50861 -4759 17686 22887 32732 61190 106019 156020 200383 235016
10077 235016 263692 291236 318908 349743 385666 419579 438072 429043 394562 350579 309272 275498
10065B75498k2478j0649k210L997Q332O598o97m168J273Q413J1817J8300K8418
10052C22444L4821L8661M1712M1484L7584K6004P186p991j2723j0621l689L467
10040E18339j49j9341m5378o3113o3005m8852k9564r761R213K4867L8596N2632
10028C64484O0517N5340M0374K6737J9641J4138K576j8002m0896n4540n4009m1076
10016C75284j7969J0056L3615M9879O5123Q0398Q1215N5724J4576j7620k4592
10005G05689j2580R43P823J7458L8143N8039O1833M7458K6151J0022J408j481
9993I60906M10J2665L9253O7127P6546O6039N0324M2643N0751P1866R2687J06565
9981A637782J15118J17990J16304J14168J16670J20748J20018J18601J14406R4803
$$ plain form
10065 275498 253020 242371 240161 244158 252490 259088 258391 254223 255496 263909 275726 294026 322444
10052 322444 357265 395926 437638 479122 516706 542710 549896 541905 529182 518561 514872 518339
10040 518339 518190 498849 453471 390358 327353 278501 248937 239176 248389 273256 311852 364484
10028 364484 425001 480341 520715 547452 567093 581231 583807 565805 524909 470369 416360 375284
10016 375284 357315 367371 400986 450865 515988 596386 677601 733325 747901 730281 705689
10005 705689 693109 694052 701875 719333 757476 815515 877348 924806 950957 960979 962387 960906
9993 960906 961316 973981 1013234 1080361 1156907 1222946 1273270 1315913 1366664 1438530 1531217 1637782
9981 1637782 1752900 1870890 1987194 2101362 2218032 2338780 2458798 2577399 2691805 2786608
9971B786608N1957q000p7228j58837k48283l22885l59212l54826l26404k86750
9961F96140k43628k07553j79953j51008j12404p2364m8853m6304n0930m8181l4177
9950d99215j3893O809K3200L1958L6994M3944M5704L0451j29l2567n4247o1707
9938d42698o2490o3436o1227n2725m0504k9316k6284l1523k8515m188K6464L8754
9926g77688K6184L48k2436l2171l0623k3846j1239N862J6528K0048K7601L6933
9914g64499L4859K3262J4085J3683J9002K2351K1824J9122J5100Q183l568j4326
9902e90922j4767j8K0980L3755L4875K7534J4847R224J7124K1694J2333K889K920
9889d07532Q99j4405l3380l7618k2911k990J0800K0526K7447K8054K6904L0185
$$ plain form
9971 2786608 2838565 2830565 2753337 2594500 2346217 2023332 1664120 1309294 982890 696140
9961 696140 452512 244959 65006 -86002 -198406 -270770 -319623 -365927 -416857 -465038 -499215
9950 -499215 -513108 -506299 -483099 -451141 -414147 -370203 -324499 -294048 -294177 -326744 -380991 -442698
9938 -442698 -505188 -568624 -629851 -682576 -723080 -752396 -778680 -810203 -838718 -842906 -816442 -777688
9926 -777688 -751504 -751156 -773592 -805763 -836386 -860232 -871471 -865609 -849081 -829033 -801432 -764499
9914 -764499 -729640 -706378 -692293 -678610 -659608 -637257 -615433 -596311 -581211 -573028 -576596 -590922
9902 -590922 -605689 -605707 -584727 -550972 -516097 -488563 -473716 -464492 -447368 -425674 -413341 -410452 -407532
9889 -407532 -406633 -421038 -454418 -492036 -514947 -517937 -507137 -486611 -459164 -431110 -404206 -374021
9877c74021K9719K0438R906K466p859k4776l9363m3123l8773l3772l0072k4186
9865e53416j2147R785M0285O6037P6899P3273N9657M3948L1750K4023J8848J3479
9853a07579O025l139r948r021q51Q139J6608K4524K4828J7445R116J559m925q568
9839c5787j4180k4554l3492l1767j7730o188r471j8825j8380m311J4769K7555
9827a72361K9386K2787J3300R478J1105Q181k603j7065l0288l8952m5128m8582
9815b60742m3825l0084j3664j951K742J043N97J0780K8122L6636K4023j012k2854
9802b70189l4926l6200l0143k4529k5711l4963m4957m5872l7261k8904l0973m3448
9790f88076n7356o1280m7691k3051n92J5956L0189M2766N1901N2230M0348K4852
$$ plain form
9877 -374021 -344302 -323864 -313958 -311492 -319351 -344127 -383490 -426613 -465386 -499158 -529230 -553416
9865 -553416 -565563 -555778 -515493 -449456 -372557 -299284 -239627 -195679 -163929 -139906 -121058 -107579
9853 -107579 -101554 -104693 -114641 -123662 -124513 -116374 -99766 -75242 -50414 -32969 -23853 -22294 -27219 -35787
9839 -35787 -49967 -74521 -108013 -139780 -157510 -163698 -173169 -191994 -210374 -214685 -199916 -172361
9827 -172361 -142975 -120188 -106888 -97410 -86305 -78124 -80727 -97792 -128080 -167032 -212160 -260742
9815 -260742 -304567 -334651 -348315 -350266 -347524 -346481 -345884 -335104 -306982 -270346 -246323 -247335 -270189
9802 -270189 -305115 -341315 -371458 -395987 -421698 -456661 -501618 -547490 -584751 -613655 -644628 -688076
9790 -688076 -745432 -806712 -854403 -877454 -878046 -862090 -831901 -789135 -737234 -685004 -644656 -619804
9778f19804J4697J0493J2441K3306L3359K8003Q217j0626j6736j3006m855R588
9766e24923K6480L3954K8348J9626J5429J4050J3258J2220J1244Q041J444o286
9754c47115j1533j0302l147J243k661q296k773J7093L7554L9696J7554j5810m0090
9741c28587m7889m6710l7222j6011O596J4123N762p696k1393l1329k9355j3329
9729e53040P753K0663J5144l551j7180j4536m542p395k8993n1800n8509m8249
9717g44235k7602m063K1075M9245O9150O4421M1751K1934J1827R792J2601J2746
9705d61358O946K938N673M748m175p936j61R522N057j3582k4318j3878J0970L8343
9691d41211O0891P5243Q0533P7800O6511M6012K3291R600N562P919J4479J4664
$$ plain form
9778 -619804 -605107 -594614 -582173 -558867 -525508 -497505 -489288 -499914 -516650 -529656 -534511 -524923
9766 -524923 -498443 -464489 -436141 -416515 -401086 -387036 -373778 -361558 -350314 -342273 -340829 -347115
9754 -347115 -358648 -368950 -372097 -370854 -373515 -381811 -384584 -367491 -329937 -290241 -272687 -288497 -328587
9741 -328587 -376476 -423186 -460408 -476419 -469823 -455700 -449938 -457634 -479027 -510356 -539711 -553040
9729 -553040 -545287 -524624 -509480 -513031 -530211 -544747 -549289 -556684 -585677 -637477 -695986 -744235
9717 -744235 -771837 -775900 -754825 -705580 -636430 -572009 -530258 -508324 -496497 -486705 -474104 -461358
9705 -461358 -454412 -451474 -445801 -441053 -445228 -453164 -453325 -443803 -438746 -452328 -476646 -490524 -479554 -441211
9691 -441211 -380320 -305077 -224544 -146744 -80233 -34221 -10930 -1330 4232 12151 26630 41294
9679D1294k475l0757m9550m3333j5736J6033L3865L0719J5681K436o810j8477
9667b7110l3594m4443m3314l3101k2960j6307j3022j2221q218j796N2o27J426
9654b55235P287J5933K7085L7142L7515K5803P191j5582l4855m3573m3762l8352
9642b73403l1133k3834j4892k837P954J0061P323N963O813R873J2286J1539J2437
9629b61850K2838L7291M5347M6120L9180K0876o424k8606k9912j1374J1581K3933
9617i1000K5085K4076K3864K3528K2367J4867j256k0165l4063l9138l3151j6798
9605a01784J185R482Q654J0183J7134K2957J8792N85j8173j8940n759J645l276
9592e7315q717n639k382n702j0928j4261j1661k613N399P207O120P302P514p5
$$ plain form
9679 41294 38819 8062 -41488 -84821 -100557 -84524 -50659 -19940 -4259 -1823 -8633 -27110
9667 -27110 -60704 -105147 -148461 -181562 -204522 -220829 -233851 -246072 -254290 -256086 -256034 -256661 -255235
9654 -255235 -247948 -232015 -204930 -167788 -130273 -104470 -97279 -112861 -147716 -191289 -235051 -273403
9642 -273403 -304536 -328370 -343262 -346099 -338145 -328084 -320761 -314798 -307985 -298112 -285826 -274287 -261850
9629 -261850 -239012 -201721 -156374 -110254 -71074 -50198 -56622 -85228 -115140 -126514 -114933 -91000
9617 -91000 -65915 -41839 -17975 5553 27920 42787 41531 21366 -12697 -51835 -84986 -101784
9605 -101784 -100599 -91117 -82463 -72280 -55146 -32189 -13397 -12812 -30985 -49925 -55684 -54039 -57315
9592 -57315 -66032 -71671 -74053 -79755 -90683 -104944 -116605 -119218 -113819 -106612 -100492 -93190 -85676 -85751
9578h5751j3371k3037j7942k130J0333J4084J0061J592o840j0515r325q665j0309
9565a51815j0524q110m67J3529K3480J6725J347m723k177n188j9386l7792n4100
9552b39201o7893p1401n1572j4024K0401L9776M1520K8635R564n859j0272k508
9540c22834J1851K4550L3385L8845L7890K8596J3588j870j1641j6529k0732j9996
9528b04897j4525j5233k1677j9729q218L66J911k328j4197k6565k8501k1259j3201
9515c88053r833j1642j0138K868K3671M1342M7444M2411L4739K8909K2060J3727
9503a62495O933M304J719p277k2627m0571n5517o0872n1260k9507k322K2743L3153
9490c63596K4986J0041R30k197q307j7269j8783r050R341K8664L8084L2474J3947
$$ plain form
9578 -85751 -99122 -122159 -140101 -142231 -131898 -117814 -107753 -106161 -113001 -123516 -132841 -141506 -151815
9565 -151815 -162339 -170449 -170916 -157387 -133907 -117182 -115835 -120558 -122735 -127923 -147309 -185101 -239201
9552 -239201 -307094 -378495 -430067 -444091 -423690 -383914 -342394 -313759 -304195 -310054 -320326 -322834
9540 -322834 -310983 -286433 -253048 -214203 -176313 -147717 -134129 -135999 -147640 -164169 -184901 -204897
9528 -204897 -219422 -234655 -256332 -276061 -284279 -283913 -282002 -284330 -298527 -325092 -353593 -374852 -388053
9515 -388053 -397886 -409528 -419666 -416798 -393127 -351785 -304341 -261930 -227191 -198282 -176222 -162495
9503 -162495 -155562 -151258 -149539 -156816 -179443 -220014 -275531 -336403 -387663 -417170 -419492 -396749 -363596
9490 -363596 -338610 -328569 -327639 -329836 -338143 -355412 -374195 -383245 -373904 -345240 -307156 -274682 -260735
9477b60735j0429k7411k8285k1222j6284j4353j1079K10J5278K3981K6750K9662
9465b93917L2929L2249K5895J7865J3733J5301J8765J2570o192k2706k2924r318
9453a85750L647P629M329m134j2965j4774j2076j1040q957l207K974P022R921
9440b17381J0526N130n282j3330j2742m102M756N577j459j1823j7948j5228j0812
9427b84118j2689j8388k2908k7525l0562k1914r28J7802K1818J4918J1554J9192
9415c33748L2189N0404P1591Q0400P0096N2169M0981M1582M4840L2710M470j9702
9403A67982j8819L61Q613j845j6590k5169k3198r759N625J1858J3186J2169N580
9390A29994p82m94M485P314N767L446K253m029k0287l7715m6699m7353m6579n0544
$$ plain form
9477 -260735 -271164 -298575 -326860 -348082 -364366 -378719 -389798 -389588 -374310 -350329 -323579 -293917
9465 -293917 -260988 -228739 -202844 -184979 -171246 -155945 -137180 -124610 -130802 -153508 -176432 -185750
9453 -185750 -182103 -174474 -170145 -174279 -187244 -202018 -214094 -225134 -234091 -237298 -234324 -227302 -217381
9440 -217381 -206855 -201725 -207007 -220337 -233079 -237181 -232425 -226848 -228307 -240130 -258078 -273306 -284118
9427 -284118 -296807 -315195 -338103 -365628 -396190 -418104 -419032 -401230 -379412 -364494 -352940 -333748
9415 -333748 -301559 -251155 -179564 -99164 -29068 23101 64082 105664 150504 183214 187684 167982
9403 167982 149163 149524 158137 156292 139702 114533 91335 81576 87201 99059 112245 124414 129994
9390 129994 129212 128718 133203 140517 146284 149730 151983 147954 127667 89952 43253 -4100 -50679 -101223
9376a01223m9991k7889J1041M0429M5221L1934J4021M208N619O922M848P147R925
9363B212L597r909k0053k3991k4692k1441j4232j339J6226K8512K8938J9835O017
9350a0320n053p051K17O889L442o474j5465j9915j8527j6424j6484j6080j1086
9337a32331k257K816L706O140P898L722j809q44R239K1813K5728K1412K1671K6854
9323A3758K4047J0081m042q282m312o15J619M093N086K529m322j1086j1814l070
9309A3670J0447J4829O136m446r699j4534k3397l6256n1555o0430m8675j8244
9297b22154N745M940j1942k7683l6789m0202l9135l5493l1163k5387j5476J487
9285d73252K4487M4186N0039M0366K3473J1113P497Q665R601R243P687J939j1651
$$ plain form
9376 -101223 -151214 -179103 -168062 -127633 -82412 -50478 -36457 -32249 -26630 -19708 -14860 -7713 2212
9363 2212 5809 -4100 -24153 -48144 -72836 -94277 -108509 -109848 -93622 -65110 -36172 -16337 -10320
9350 -10320 -15373 -22424 -22207 -15318 -11876 -18350 -33815 -53730 -72257 -88681 -105165 -121245 -132331
9337 -132331 -134588 -131772 -128066 -121926 -114028 -110306 -112115 -112959 -103720 -81907 -56179 -34767 -13096 13758
9323 13758 37805 47886 43844 35562 31250 30635 32254 36347 41433 43962 39640 28554 16740 13670
9309 13670 24117 38946 45082 40636 30937 16403 -6994 -43250 -94805 -155235 -203910 -222154
9297 -222154 -216409 -211469 -223411 -251094 -287883 -328085 -367220 -402713 -433876 -459263 -474739 -473252
9285 -473252 -448765 -404579 -354540 -314174 -290701 -279588 -272091 -263426 -253825 -244582 -236895 -234956 -246607
9272b46607l0395m2601m4130m3489m2656l7844l3742l5680l8852l7078l1170k3549
9260f87793j8681j9211j8907j0780M747K1927L1999K9851J5327p270k6354l4063
9248g19208l1929k4568j4391n012j748j0507k8114l8627l1104j0993Q060K0771
9236h87370L3717N4702Q4290J16649J41950J58418J70286J70659J51570J23975
9226C18846J06612J05163J05629R1972O2294K5581m732k3865l4827l7806l4426
9215F80441k8534k1527r442J1689L1748L2154J3554m268j4635k6246m1611n5119
9203E68204o0682n7137n0733m3776l5241k6967k0242j0713P168K9791M2022L1363
9191C73057O555o987M601K3376K6605J9034J5469J7473J9898K2037K3158K1520
$$ plain form
9272 -246607 -277002 -319603 -363733 -407222 -449878 -487722 -521464 -557144 -595996 -633074 -664244 -687793
9260 -687793 -706474 -725685 -744592 -755372 -750625 -728698 -696699 -666848 -651521 -658791 -685145 -719208
9248 -719208 -751137 -775705 -790096 -795108 -796856 -807363 -835477 -874104 -905208 -916201 -908141 -887370
9236 -887370 -853653 -798951 -714661 -598012 -456062 -297644 -127358 43301 194871 318846
9226 318846 425458 530621 636250 728222 790516 816097 811365 787500 752673 714867 680441
9215 680441 651907 630380 620938 632627 664375 696529 710083 705815 691180 664934 623323 568204
9203 568204 507522 450385 399652 355876 320635 293668 273426 262713 269881 299672 341694 373057
9191 373057 379612 372625 377226 400602 427207 446241 461710 479183 499081 521118 544276 565796
9179E65796J5506K824j1754j9522j7320r024n085j1001j9542k2239j7038q970
9167D42631l771l300m375L97Q944J3039J2958J2903J2979J0457M793O35R89R39
9153E10218r610l3650n5981n8079m2574k4476j2374o430m845o133m325M783J8232
9140B74756K8305K2147n514l5021m5290l7630k1512k023J5654K7302K9445K4868
9128B75487K2522K4036K5909K5632K3371K1691J2036j5245m3901n0681l5132j3199
9116B72526J261P310J2788K0482K5888K3498J2838J951k640m258j0173j9025k1398
9103C21048j3003m3M687n428k0262k5478j8961p934N30K268O28N09k805r679j3656
9088B12421j5783k0944k8257l3145l5647l4261k4473r472O234J9714L2886M8324
$$ plain form
9179 565796 581302 584126 572372 552850 535530 526506 521421 510420 490878 468639 451601 442631
9167 442631 438860 435560 431185 431582 440526 453565 466523 479426 492405 502862 507655 508290 509279 510218
9153 510218 500608 466958 410977 352898 310324 285848 273474 267044 262199 256066 251741 256524 274756
9140 274756 303061 325208 319694 284673 239383 201753 180241 178218 193872 221174 250619 275487
9128 275487 298009 322045 347954 373586 396957 418648 430684 415439 371538 320857 285725 272526
9116 272526 273787 281097 293885 314367 340255 363753 376591 378542 375902 371644 361471 342446 321048
9103 321048 308045 308002 312689 307261 286999 261521 242560 234626 235156 237424 238052 238561 235756 226077 212421
9088 212421 196638 175694 147437 114292 78645 44384 19911 10439 16673 36387 69273 117597
9076A17597N8629N7363M6995L7035L5954M0170L6402J7656l541j0294k324J0465
9064D42107K1352K7251K8086K8446L1348L0663J6717p163k9018m0984l8254k3547
9052D87004q526n548j4884k3780k5458k5313k9397l5914m1477m7019n0734n0676
9040A28278n0070n0024m8661m3233l3251k2914j6093j5622k2271l3795l9194k5956
9028b72806O253M2819O4303O2716M3895J2915k1810l9769l3569j4157P695K4296
9016a17219L1355K8639K0983J2644O302J860n890j7190k7076l3492l4689l0264
9004a64037k5831k3161j6963n230O905J7989L6315O3059Q2999P8721M9435J5769
8992A15970j828j569J577J341M855R220L962j6395m3413n5470m0810q225K1294
$$ plain form
9076 117597 176226 233589 280584 317619 353573 393743 430145 447801 444260 433966 431642 442107
9064 442107 463459 490710 518796 547242 578590 609253 625970 618807 589789 548805 510551 487004
9052 487004 478478 472930 458046 434266 408808 383495 354098 318184 276707 229688 178954 128278
9040 128278 78208 28184 -20477 -63710 -96961 -119875 -135968 -151590 -173861 -207656 -246850 -272806
9028 -272806 -266553 -223734 -159431 -96715 -52820 -39905 -61715 -101484 -135053 -149210 -141515 -117219
9016 -117219 -85864 -57225 -36242 -23598 -17296 -15436 -21326 -38516 -65592 -99084 -133773 -164037
9004 -164037 -189868 -213029 -229992 -235222 -228317 -210328 -174013 -110954 -27955 50766 100201 115970
8992 115970 114142 112573 114150 115491 120346 129566 133528 117133 73720 18250 -22560 -30785 -9491
8979i491L0287J6742j0585l6714m4881k9437m823P454N347K993N923J0585J5970
8966d0630K1113K1234J5169O892k164j1458j9382k3577k1272j6921j7681j6788
8954a05465o827K633M040M366J0975K2050K9152K4181J1821K86j0910k1038k7971
8941f2707k8505j6111M315J6190J1448k259j5232k3018k0104k110K1264L0787
8929h6042K0036L30j8516l4289m2100l6458j4765J9737N4364P2900O6310L8470
8917C9977M904k1774m0277m3789k5861K004K2902L3434L2165J8116N291Q634K5897
$$ plain form
8979 -9491 20796 37538 26953 -9761 -54642 -84079 -88902 -81448 -76101 -73108 -67185 -56600 -40630
8966 -40630 -19517 1717 16886 23778 21614 10156 -9226 -32803 -54075 -70996 -88677 -105465
8954 -105465 -112292 -109659 -105619 -101253 -90278 -68228 -39076 -14895 -3074 -2788 -13698 -34736 -62707
8941 -62707 -91212 -107323 -103008 -86818 -75370 -77629 -92861 -115879 -135983 -138093 -116829 -86042
8929 -86042 -66006 -65676 -84192 -118481 -160581 -197039 -211804 -192067 -137703 -64803 1507 39977
8917 39977 44881 23107 -17170 -60959 -86820 -84816 -61914 -28480 3685 21801 27092 35726 61623
$$ [...]
##END NTUPLES=NMR SPECTRUM
##END=
