##TITLE=31P ikalashn
LR-793-RM2(nlock)
10.12.2024
##JCAMPDX= 6.0         $$ Bruker NMR JCAMP-DX V2.0
##DATA TYPE= NMR SPECTRUM
##DATA CLASS= NTUPLES
##ORIGIN= UXNMR, Bruker Analytische Messtechnik GmbH
##OWNER= root
$$ TOPSPIN		Version 1.3
$$ 2024-12-10 15:54:53.328 +0400  Irina@DPX200
$$ Compression mode = diff/dup
##.OBSERVE FREQUENCY= 81.01967998063
##.OBSERVE NUCLEUS= ^31P
##.ACQUISITION MODE= SIMULTANEOUS
##.ACQUISITION SCHEME= undefined
##.AVERAGES= 128
##.DIGITISER RES= 17
##SPECTROMETER/DATA SYSTEM= spect
##.PULSE SEQUENCE= zgpg
##.SOLVENT NAME= DMSO
##.SHIFT REFERENCE= INTERNAL, DMSO, 1, 298.5841
##AUDIT TRAIL= $$ (NUMBER, WHEN, WHO, WHERE, WHAT)
$$ ##TITLE= Audit trail, TOPSPIN		Version 1.3
$$ ##JCAMPDX= 5.01
$$ ##ORIGIN= Bruker BioSpin GmbH
$$ ##OWNER= Irina
$$ $$ F:/spectra/data/iren/nmr/P31dec/1/pdata/1/auditp.txt
$$ ##AUDIT TRAIL=  $$ (NUMBER, WHEN, WHO, WHERE, VERSION, WHAT)
(   1,<2024-12-10 15:52:43.640 +0400>,<Irina>,<DPX200>,<TOPSPIN 1.3>,
      <created by zg
	started at 2024-12-10 15:49:25.437 +0400,
	POWCHK disabled, PULCHK disabled
       configuration hash MD5:
       BE 6D 3F 07 2A EA 11 49 91 17 2B D3 AF B3 58 0D
       data hash MD5: 32K
       7C 72 BD 98 67 5B 92 0F 28 51 8B AF 3B 3D F8 83>)
(   2,<2024-12-10 15:54:22.359 +0400>,<Irina>,<DPX200>,<TOPSPIN 1.3>,
      <Start of raw data processing
       efp BC_mod = 2 LB = 15 FT_mod = 6 PKNL = 1 PHC0 = 265.4702 PHC1 = -56.66505 SI = 32K 
       data hash MD5: 32K
       03 D3 A3 5C C8 BE 36 AA 54 C7 54 04 BE 14 D4 55>)
(   3,<2024-12-10 15:54:25.296 +0400>,<Irina>,<DPX200>,<TOPSPIN 1.3>,
      <apk 
       data hash MD5: 32K
       CD 6B 3B 0F 1A 03 E7 92 35 89 7C 95 49 4F 6B 40>)
(   4,<2024-12-10 15:54:39.625 +0400>,<Irina>,<DPX200>,<TOPSPIN 1.3>,
      <pk fgphup PHC0 = -91.14717 PHC1 = 168 
       data hash MD5: 32K
       47 11 D1 6B 00 A1 36 59 BE BE 64 A9 69 8A DD A1>)
$$ ##END=
$$ 
$$ $$ hash MD5
$$ $$ 20 C8 37 A2 1A 48 96 61 3A D8 C5 5A 7E 7C 68 A5
##$RELAX= 
##$RELAX= 
##$RELAX= 
##$RELAX= 
##$RELAX= 
##$RELAX= 
##$RELAX= 
##$RELAX= 
##$RELAX= 
##$RELAX= 
##$RELAX= 
$$ Bruker specific parameters
$$ --------------------------
##$DU= <F:/spectra>
##$EXPNO= 1
##$NAME= <P31dec>
##$PROCNO= 1
##$TYPE= <nmr>
##$USER= <iren>
##$AMP= (0..31)
100 100 100 100 100 100 100 100 100 100 100 100 100 100 100 100 100 100 
100 100 100 100 100 100 100 100 100 100 100 100 100 100 
##$ANAVPT= -1
##$AQSEQ= 0
##$AQ_mod= 1
##$AUNM= <au_zg>
##$AUTOPOS= <>
##$BF1= 81.014009
##$BF2= 200.13
##$BF3= 200.13
##$BF4= 200.13
##$BF5= 200.13
##$BF6= 200.13
##$BF7= 200.13
##$BF8= 200.13
##$BYTORDA= 1
##$CFDGTYP= 0
##$CFRGTYP= 5
##$CHEMSTR= <none>
##$CNST= (0..63)
1 1 145 1 1 1 1 1 1 1 1 1 1 1 1 1 1 1 1 1 1 1 1 1 1 1 1 1 1 1 1 1 1 1 
1 1 1 1 1 1 1 1 1 1 1 1 1 1 1 1 1 1 1 1 1 1 1 1 1 1 1 1 1 1 
##$CPDPRG= <waltz16>
##$CPDPRG1= <>
##$CPDPRG2= <waltz16>
##$CPDPRG3= <>
##$CPDPRG4= <mlev>
##$CPDPRG5= <mlev>
##$CPDPRG6= <mlev>
##$CPDPRG7= <mlev>
##$CPDPRG8= <mlev>
##$CPDPRGB= <>
##$CPDPRGT= <>
$$ [...]
##$SW_h= 37037.037037037
##$TD= 32768
##$TD0= 1
##$TE= 300
##$TE2= 300
##$TE3= 300
##$TEG= 300
##$TL= (0..7)
0 120 53 12 22 120 120 120 
##$TP= (0..7)
150 150 150 150 150 150 150 150 
##$TP07= 0
##$TPNAME0= <>
##$TPNAME1= <>
##$TPNAME2= <>
##$TPNAME3= <>
##$TPNAME4= <>
##$TPNAME5= <>
##$TPNAME6= <>
##$TPNAME7= <>
##$TPOAL= (0..7)
0.5 0.5 0.5 0.5 0.5 0.5 0.5 0.5 
##$TPOFFS= (0..7)
0 0 0 0 0 0 0 0 
##$TUNHIN= 0
##$TUNHOUT= 0
##$TUNXOUT= 0
##$USERA1= <user>
##$USERA2= <user>
##$USERA3= <user>
##$USERA4= <user>
##$USERA5= <user>
##$V9= 5
##$VALIST= <valist>
##$VCLIST= <CCCCCCCCCCCCCCC>
##$VD= 0
##$VDLIST= <DDDDDDDDDDDDDDD>
##$VPLIST= <PPPPPPPPPPPPPPP>
##$VTLIST= <TTTTTTTTTTTTTTT>
##$WBST= 1024
##$WBSW= 4
##$XGAIN= (0..3)
0 0 0 0 
##$XL= 0
##$YL= 0
##$YMAX_a= 9779
##$YMIN_a= -13567
##$ZGOPTNS= <>
##$ZL1= 120
##$ZL2= 120
##$ZL3= 120
##$ZL4= 120
##$ABSF1= 0
##$ABSF2= 0
##$ABSG= 0
##$ABSL= 0
##$ALPHA= 0
##$AQORDER= 0
##$ASSFAC= 0
##$ASSFACI= 0
##$ASSFACX= 0
##$ASSWID= 0
##$AUNMP= <proc_1d>
##$AXLEFT= 0
##$AXRIGHT= 0
##$AXTYPE= 0
##$AXUNIT= <>
##$AZFE= 0.1
##$AZFW= 0.5
##$BCFW= 0
##$BC_mod= 2
##$BYTORDP= 0
##$COROFFS= 0
##$CY= 12.5935478210449
##$DATMOD= 1
##$DC= 0
##$DFILT= <>
##$DTYPP= 0
##$F1P= 47.1127640792319
##$F2P= -24.0371245302204
##$FCOR= 0.5
##$FTSIZE= 32768
##$FT_mod= 6
##$GAMMA= 0
##$GB= 0
##$INTBC= 1
##$INTSCL= 7.269226e-011
##$ISEN= 30
##$LB= 15
##$LEV0= 0
##$LPBIN= 0
##$MAXI= 12.09355
##$MC2= 0
##$MEAN= 0
##$ME_mod= 0
##$MI= 0.7550151
##$NCOEF= 0
##$NC_proc= -12
##$NLEV= 6
##$NOISF1= 298.5841
##$NOISF2= 270.0111
##$NSP= 0
##$NTH_PI= 0
##$NZP= 0
##$OFFSET= 298.5841
##$PC= 1.4
##$PHC0= 166.6493
##$PHC1= 125.7226
##$PH_mod= 1
##$PKNL= yes
##$PPARMOD= 0
##$PPDIAG= 0
##$PPIPTYP= 0
##$PPMPNUM= 100
##$PPRESOL= 1
##$PSCAL= 0
##$PSIGN= 0
##$REVERSE= no
##$SF= 81.014009
##$SI= 32768
##$SIGF1= 270.0111
##$SIGF2= -158.5842
##$SINO= 77.54984
##$SIOLD= 32768
##$SREGLST= <31P.CDCl3>
##$SSB= 0
##$STSI= 32768
##$STSR= 0
##$SW_p= 37037.037037037
##$SYMM= 0
##$S_DEV= 0
##$TDeff= 32768
##$TDoff= 0
##$TI= <>
##$TILT= no
##$TM1= 0
##$TM2= 0
##$TOPLEV= 0
##$USERP1= <user>
##$USERP2= <user>
##$USERP3= <user>
##$USERP4= <user>
##$USERP5= <user>
##$WDW= 1
##$XDIM= 32768
##$YMAX_p= 299057572
##$YMIN_p= -58924836
$$ End of Bruker specific parameters
$$ ---------------------------------
##NTUPLES= NMR SPECTRUM
##VAR_NAME=  FREQUENCY,     SPECTRUM/REAL,   SPECTRUM/IMAG
##SYMBOL=    X,             R,               I
##VAR_TYPE=  INDEPENDENT,   DEPENDENT,       DEPENDENT
##VAR_FORM=  AFFN,          ASDF,            ASDF
##VAR_DIM=   32768,         32768,           32768
##UNITS=     HZ,            ARBITRARY UNITS, ARBITRARY UNITS
##FACTOR=    1.13031516577767, 1,            1
##FIRST=     37037.037037037, -44512260,     -13293843
##LAST=      0,             -46652698,       -5903033
##MIN=       0,             -58924836,       0
##MAX=       37037.037037037, 299057572,     0
$$ Real data points
##PAGE= N=1
##DATA TABLE= (X++(R..R)), XYDATA
$$ [...]
19331 -44362006 -43944962 -43418807 -42867933 -42377497 -41990356 -41696345 -41456071 -41229006 -40978776
19322 -40978776 -40660150 -40214697 -39592578 -38789119 -37866850 -36944812 -36163480 -35646782 -35474922
19313 -35474922 -35673867 -36224968 -37087628 -38217049 -39565730 -41072758 -42653501 -44203327
19305 -44203327 -45620652 -46836890 -47831442 -48623436 -49251136 -49753400 -50158490 -50476152 -50690065
19296 -50690065 -50758954 -50635816 -50295718 -49749707 -49036271 -48201461 -47282047 -46300540 -45274662
19287 -45274662 -44234728 -43232169 -42324799 -41548976 -40908874 -40394166 -40002122 -39737880 -39596915
19278 -39596915 -39552315 -39559361 -39572264 -39560111 -39511031 -39424011 -39299834 -39141723 -38962603 -38788096
19268 -38788096 -38649123 -38567373 -38543922 -38560001 -38588940 -38609092 -38610358 -38597315 -38593587 -38644839 -38813501
19257 -38813501 -39160784 -39720112 -40475762 -41357797 -42252393 -43022575 -43536857 -43703279 -43502697
19248 -43502697 -43005587 -42351926 -41694736 -41141066 -40728740 -40445162 -40260297 -40143491 -40059642
19239 -40059642 -39962766 -39802638 -39542412 -39173957 -38721679 -38234369 -37770043 -37381927 -37112083
19230 -37112083 -36991072 -37037427 -37254804 -37629868 -38133670 -38727202 -39370464 -40030992 -40686669
19221 -40686669 -41323296 -41931527 -42504357 -43031318 -43487636 -43826096 -43983149 -43901860 -43560039
19212 -43560039 -42983413 -42230274 -41357710 -40398718 -39368305 -38287839 -37202757 -36178956 -35282345
19203 -35282345 -34554716 -33998028 -33576301 -33235155 -32924950 -32611762 -32274658 -31899991 -31481409
19194 -31481409 -31025971 -30561410 -30137964 -29819944 -29669220 -29728254 -30005018 -30459266 -31000105
19185 -31000105 -31507876 -31876744 -32058208 -32082734 -32045900 -32065336 -32233142 -32587938 -33112523 -33749208
19175 -33749208 -34425366 -35081120 -35685015 -36229430 -36717941 -37164928 -37606276 -38096072 -38676625
19166 -38676625 -39344294 -40043653 -40695987 -41238061 -41642683 -41913424 -42069695 -42140297 -42163672 -42182230
19156 -42182230 -42231274 -42332218 -42490752 -42695902 -42923261 -43146743 -43352931 -43547617 -43752764
19147 -43752764 -43998334 -44312042 -44710527 -45196124 -45759633 -46384237 -47044963 -47704017 -48308505
19138 -48308505 -48796993 -49117102 -49245279 -49190442 -48977566 -48633033 -48190017 -47702910 -47248213
19129 -47248213 -46908461 -46754079 -46831351 -47153841 -47699370 -48418483 -49249840 -50128629 -50981169
19120 -50981169 -51717083 -52241039 -52490274 -52470959 -52258847 -51962916 -51681328 -51475688 -51369217
19111 -51369217 -51357963 -51419385 -51514542 -51595648 -51626177 -51600432 -51542880 -51485707 -51444315 -51412039 -51376708
19100 -51376708 -51339335 -51312822 -51301963 -51287747 -51231756 -51092875 -50840245 -50457595 -49943319 -49308482
19090 -49308482 -48572008 -47754703 -46876314 -45959764 -45041266 -44176551 -43434482 -42880759 -42560812
19081 -42560812 -42485946 -42625790 -42915273 -43276760 -43644187 -43978306 -44271035 -44536753 -44791203
19072 -44791203 -45031276 -45232116 -45361245 -45391731 -45303018 -45079780 -44721998 -44260044 -43755161 -43275813
19062 -43275813 -42863661 -42514236 -42184793 -41820799 -41384180 -40869433 -40301568 -39723005 -39183659
19053 -39183659 -38738002 -38439103 -38323230 -38394081 -38619741 -38944327 -39307911 -39666970 -40005588
19044 -40005588 -40329553 -40647366 -40953809 -41228773 -41447182 -41587284 -41634885 -41590767 -41483135 -41374954
19034 -41374954 -41352866 -41495807 -41837213 -42340844 -42905737 -43404871 -43742914 -43898254 -43919094 -43881330
19024 -43881330 -43847355 -43851534 -43903217 -43991409 -44094311 -44197767 -44307239 -44437786 -44589131 -44725619
19014 -44725619 -44774735 -44649558 -44291023 -43707540 -42981472 -42234901 -41577318 -41064510 -40687435
19005 -40687435 -40394704 -40132564 -39873284 -39615373 -39368761 -39148914 -38983989 -38917955 -38997264 -39249807
18995 -39249807 -39675178 -40250831 -40940085 -41691080 -42434127 -43090116 -43589541 -43890542 -43987044
18986 -43987044 -43904137 -43683106 -43366702 -42995400 -42612527 -42265240 -41995439 -41832712 -41800341 -41922676
18976 -41922676 -42217526 -42680279 -43277436 -43952238 -44634655 -45255043 -45763495 -46147083 -46430318
18967 -46430318 -46655260 -46856883 -47051903 -47241920 -47416987 -47553065 -47613800 -47564883 -47390713 -47098301
18957 -47098301 -46708452 -46245197 -45729134 -45172592 -44576958 -43936240 -43246349 -42514892 -41767076
18948 -41767076 -41045401 -40402526 -39887790 -39532805 -39346554 -39321413 -39438832 -39668789 -39970152
18939 -39970152 -40298178 -40615760 -40902672 -41160635 -41412824 -41695268 -42040500 -42461317 -42945343
18930 -42945343 -43462684 -43978187 -44459430 -44880588 -45228540 -45513365 -45773601 -46062866 -46419055
18921 -46419055 -46835918 -47259245 -47611186 -47823891 -47861113 -47719864 -47415716 -46964673 -46378198
18912 -46378198 -45675329 -44897269 -44105759 -43362856 -42709936 -42162541 -41719523 -41375607 -41129927
18903 -41129927 -40987977 -40956388 -41031930 -41191927 -41396658 -41608299 -41816937 -42052977 -42372220 -42821604
18893 -42821604 -43408888 -44097029 -44824988 -45532824 -46168469 -46682022 -47029009 -47184970 -47154810
18884 -47154810 -46966274 -46652926 -46238217 -45727231 -45110036 -44380552 -43563921 -42731675 -41988652
18875 -41988652 -41435147 -41124998 -41044334 -41121525 -41257234 -41356034 -41350130 -41213869 -40967831 -40669864
18865 -40669864 -40391039 -40182230 -40051246 -39968467 -39891651 -39783196 -39611069 -39349248 -38988918 -38550865
18855 -38550865 -38085424 -37658335 -37330351 -37142944 -37117930 -37263445 -37573276 -38020493 -38557954
18846 -38557954 -39132329 -39701031 -40236886 -40723677 -41154429 -41529458 -41845929 -42085271 -42211601
18837 -42211601 -42184946 -41983061 -41621779 -41163511 -40705028 -40341855 -40124273 -40034612 -40002419 -39944248
18827 -39944248 -39799134 -39540898 -39172935 -38723636 -38245952 -37805828 -37454461 -37206480 -37046755
18818 -37046755 -36958897 -36946402 -37025253 -37196615 -37431375 -37684787 -37924855 -38149538 -38388244 -38694937
18808 -38694937 -39131910 -39741091 -40514742 -41385520 -42243871 -42974224 -43491579 -43760819 -43794945
18799 -43794945 -43643106 -43377728 -43078645 -42812495 -42616657 -42496045 -42428687 -42373809 -42283869 -42122826
18789 -42122826 -41884765 -41600648 -41326007 -41118573 -41023097 -41068632 -41270067 -41627009 -42121046 -42714224
18779 -42714224 -43348297 -43946991 -44428947 -44731360 -44831037 -44751012 -44550722 -44303449 -44070876 -43887915
18769 -43887915 -43762865 -43686600 -43640975 -43601258 -43536689 -43418599 -43237435 -43016893 -42812463 -42693638
18759 -42693638 -42720903 -42929788 -43324182 -43872263 -44505158 -45129246 -45655187 -46028178 -46240566
18750 -46240566 -46322612 -46321660 -46281718 -46226745 -46147454 -46000734 -45731090 -45301890 -44713738 -44006613
18740 -44006613 -43255936 -42560322 -42012328 -41662296 -41499863 -41465524 -41482084 -41483238 -41422500 -41268049
18730 -41268049 -41004909 -40653684 -40285010 -40000340 -39883804 -39965120 -40220238 -40597086 -41039138
18721 -41039138 -41493019 -41905347 -42224631 -42415913 -42475952 -42433569 -42337435 -42243322 -42205493 -42270419
18711 -42270419 -42471595 -42822717 -43306534 -43866866 -44417425 -44869412 -45162336 -45277475 -45228451
18702 -45228451 -45042946 -44752695 -44395457 -44019913 -43681903 -43429325 -43286797 -43253583 -43314347 -43451844
18692 -43451844 -43653489 -43909274 -44202399 -44499505 -44749447 -44893561 -44884455 -44707175 -44392204 -44011810
18682 -44011810 -43661881 -43437410 -43408246 -43601089 -43995713 -44539611 -45171887 -45839727 -46500607
18673 -46500607 -47115349 -47641116 -48032439 -48251263 -48278449 -48120122 -47807134 -47387842 -46917378
18664 -46917378 -46448324 -46024304 -45677399 -45433287 -45320865 -45370038 -45590798 -45952424 -46384377
18655 -46384377 -46799796 -47125391 -47319215 -47369856 -47285851 -47087889 -46806416 -46477876 -46137639 -45816044
18645 -45816044 -45540960 -45340838 -45240226 -45249005 -45357780 -45547465 -45802833 -46113663 -46461637 -46806298
18635 -46806298 -47083660 -47221024 -47160803 -46882249 -46414224 -45833370 -45242523 -44735979 -44370569
18626 -44370569 -44156406 -44063446 -44031869 -43983241 -43839506 -43553307 -43136752 -42662819 -42229883 -41918602
18616 -41918602 -41779029 -41846477 -42152448 -42713259 -43512982 -44500536 -45598373 -46710810 -47731319
18607 -47731319 -48556870 -49111780 -49369493 -49354893 -49122574 -48724958 -48191203 -47530329 -46753173
18598 -46753173 -45892153 -45003785 -44156086 -43410716 -42809890 -42375345 -42115274 -42026631 -42088632 -42256840
18588 -42256840 -42467893 -42654286 -42762390 -42768844 -42689650 -42574241 -42486550 -42485452 -42610167 -42869190
18578 -42869190 -43237595 -43667663 -44104986 -44496978 -44791437 -44936218 -44893580 -44667790 -44322499
18569 -44322499 -43964699 -43702055 -43603386 -43682020 -43899820 -44184255 -44453993 -44644618 -44724306 -44695551
18559 -44695551 -44586303 -44440412 -44313734 -44267591 -44351817 -44588254 -44968396 -45460834 -46017173 -46577734
18549 -46577734 -47085001 -47501027 -47814465 -48032359 -48167945 -48234874 -48245079 -48204888 -48113345 -47968510
18539 -47968510 -47777523 -47560211 -47343552 -47153358 -47007815 -46911767 -46852330 -46800857 -46724181 -46602241
18529 -46602241 -46442469 -46278260 -46148745 -46073643 -46043073 -46030816 -46018170 -46004888 -46000132 -46010253 -46039288
18518 -46039288 -46096819 -46197489 -46349245 -46542272 -46748212 -46928837 -47048793 -47087802 -47049105 -46959578
18508 -46959578 -46857064 -46769195 -46697594 -46617241 -46489108 -46278133 -45968996 -45574500 -45133936 -44700360
18498 -44700360 -44320596 -44018374 -43788086 -43597856 -43397877 -43130939 -42747204 -42228031 -41607135
18489 -41607135 -40965193 -40396334 -39974089 -39737871 -39691503 -39799847 -39991303 -40178587 -40287443
18480 -40287443 -40272093 -40114872 -39826220 -39450383 -39060064 -38730034 -38504109 -38376139 -38295937 -38198005
18470 -38198005 -38037012 -37810750 -37560590 -37349494 -37228340 -37212288 -37282053 -37398533 -37511301 -37563140
18460 -37563140 -37505492 -37324422 -37057703 -36784685 -36591237 -36531493 -36608953 -36784696 -37002917 -37214737
18450 -37214737 -37385948 -37490793 -37506898 -37420805 -37234974 -36960775 -36601497 -36149552 -35608919 -35021627
18440 -35021627 -34466877 -34026298 -33743477 -33610732 -33584568 -33609240 -33639207 -33662319 -33715939 -33879624
18430 -33879624 -34238986 -34838173 -35651561 -36591237 -37539400 -38385941 -39060227 -39549645 -39897470
18421 -39897470 -40181132 -40480571 -40847935 -41290831 -41778763 -42266420 -42714130 -43094298 -43389117
18412 -43389117 -43589660 -43699456 -43734741 -43714039 -43644337 -43516630 -43311393 -43006988 -42589997 -42070942
18402 -42070942 -41501630 -40979555 -40626269 -40543716 -40770689 -41266065 -41931365 -42658479 -43371544
18393 -43371544 -44040162 -44664179 -45247266 -45775896 -46209951 -46485921 -46534863 -46314468 -45843183
18384 -45843183 -45215440 -44582627 -44103712 -43890212 -43975597 -44321167 -44843845 -45441100 -46002943
18375 -46002943 -46421468 -46609578 -46524212 -46179604 -45640658 -44993607 -44302008 -43575818 -42782566
18366 -42782566 -41892056 -40912538 -39893542 -38908338 -38033479 -37327007 -36808212 -36453677 -36219150
18357 -36219150 -36071801 -36004414 -36024592 -36140176 -36357876 -36688881 -37147909 -37741283 -38450765 -39227904
18347 -39227904 -40010140 -40751615 -41445388 -42119397 -42812034 -43546353 -44314982 -45079311 -45783361
18338 -45783361 -46376884 -46835768 -47167794 -47398869 -47548725 -47615607 -47581412 -47428951 -47154636 -46768761
18328 -46768761 -46287458 -45723553 -45081830 -44363278 -43578667 -42764339 -41988999 -41341790 -40900407
18319 -40900407 -40695279 -40697007 -40838545 -41054091 -41306112 -41586666 -41900222 -42246581 -42617738 -43006015
18309 -43006015 -43408930 -43822282 -44229369 -44598745 -44892099 -45075917 -45131369 -45056782 -44859844 -44547658
18299 -44547658 -44125111 -43598913 -42977646 -42266587 -41466088 -40581715 -39640634 -38696812 -37816426
18290 -37816426 -37055054 -36445143 -36000480 -35728944 -35639611 -35735534 -35996475 -36368247 -36772438 -37131662
18280 -37131662 -37391081 -37523727 -37527036 -37423332 -37259451 -37092461 -36966447 -36897096 -36869732 -36846302
18270 -36846302 -36779392 -36631628 -36391937 -36080478 -35742913 -35438927 -35228176 -35155035 -35233884 -35442297
18260 -35442297 -35733697 -36070048 -36455639 -36945615 -37617043 -38517758 -39626337 -40849644 -42059113
18251 -42059113 -43142835 -44043189 -44761105 -45331748 -45795888 -46185793 -46522992 -46817849 -47072286
18242 -47072286 -47289497 -47482308 -47670745 -47872819 -48097241 -48340684 -48589644 -48828063 -49046856
18233 -49046856 -49248010 -49442698 -49647522 -49878548 -50141148 -50421378 -50689436 -50915715 -51086210
18224 -51086210 -51204076 -51276729 -51299259 -51245639 -51072563 -50736610 -50221930 -49563894 -48847551 -48176189
18214 -48176189 -47628781 -47229524 -46941296 -46684762 -46376731 -45970543 -45476732 -44953487 -44475480
18205 -44475480 -44100064 -43846753 -43698657 -43625543 -43612362 -43671158 -43830519 -44114315 -44522637 -45022723
18195 -45022723 -45555230 -46055406 -46477479 -46804716 -47038898 -47181976 -47227934 -47170506 -47015752 -46783202
18185 -46783202 -46492470 -46149548 -45748473 -45288917 -44795365 -44320694 -43926548 -43652145 -43496898
18176 -43496898 -43431255 -43422964 -43455744 -43531752 -43662319 -43855765 -44113245 -44433679 -44814079 -45237462
18166 -45237462 -45661855 -46029608 -46295941 -46452214 -46523207 -46547002 -46563077 -46615722 -46756138 -47032124
18156 -47032124 -47471206 -48064473 -48756593 -49453379 -50054382 -50495994 -50774963 -50938212 -51053850
18147 -51053850 -51185313 -51375912 -51639107 -51954524 -52277469 -52560103 -52767464 -52876793 -52868508 -52726288
18137 -52726288 -52450740 -52070017 -51630028 -51171177 -50716608 -50281688 -49887930 -49564948 -49341911
18128 -49341911 -49235436 -49238978 -49321429 -49440295 -49564562 -49692199 -49847563 -50061551 -50354636 -50732960
18118 -50732960 -51186054 -51678539 -52148186 -52521709 -52740407 -52779431 -52650988 -52393378 -52057204
18109 -52057204 -51698624 -51378477 -51158526 -51087416 -51178477 -51395054 -51659474 -51882982 -51997561 -51971888
18099 -51971888 -51806293 -51514914 -51109733 -50597049 -49985178 -49292589 -48548863 -47792140 -47068313
18090 -47068313 -46428499 -45917708 -45556339 -45327187 -45179815 -45050549 -44883770 -44643770 -44320045
18081 -44320045 -43931666 -43524703 -43151017 -42833532 -42545622 -42228350 -41836415 -41374950 -40895897
18072 -40895897 -40460693 -40105649 -39836289 -39642485 -39511131 -39430986 -39401024 -39440409 -39582535 -39850824
18062 -39850824 -40237008 -40700358 -41186009 -41647093 -42059293 -42427503 -42785007 -43180325 -43653428
18053 -43653428 -44217217 -44858543 -45553696 -46283795 -47043196 -47838508 -48675191 -49536754 -50370906
18044 -50370906 -51094540 -51619878 -51892632 -51919654 -51764036 -51510700 -51230329 -50966978 -50751733
18035 -50751733 -50623863 -50635535 -50831336 -51219399 -51757275 -52358841 -52917919 -53342108 -53580627
18026 -53580627 -53629428 -53517030 -53288156 -52993708 -52684347 -52403849 -52181119 -52019279 -51883871
18017 -51883871 -51704228 -51400382 -50922488 -50272724 -49496086 -48652437 -47789142 -46927062 -46064935
18008 -46064935 -45195279 -44317739 -43444448 -42599894 -41814008 -41107408 -40477376 -39896758 -39331132
17999 -39331132 -38768306 -38240858 -37819612 -37576476 -37540544 -37676475 -37897270 -38100416 -38208055
17990 -38208055 -38196391 -38102169 -38000561 -37965641 -38037923 -38217791 -38481031 -38794800 -39117756 -39389452
17980 -39389452 -39527805 -39445969 -39081164 -38419193 -37504223 -36430079 -35315958 -34278889 -33414977
17971 -33414977 -32789834 -32432169 -32331534 -32447680 -32729227 -33126030 -33587398 -34060225 -34503748
17962 -34503748 -34913176 -35327762 -35813054 -36428226 -37195414 -38083384 -39008931 -39853516 -40495386
17953 -40495386 -40854414 -40928205 -40792928 -40569039 -40377741 -40309830 -40411706 -40687157 -41113592 -41666883
17943 -41666883 -42342038 -43155510 -44124627 -45235886 -46422831 -47568486 -48533935 -49201887 -49515603
17934 -49515603 -49493290 -49210483 -48761033 -48218447 -47615365 -46946843 -46194300 -45358504 -44480597
17925 -44480597 -43637559 -42921245 -42417254 -42187871 -42258024 -42607118 -43169585 -43843952 -44510816
17916 -44510816 -45060459 -45423681 -45590129 -45600762 -45518482 -45398620 -45276792 -45169601 -45077314 -44989508
17906 -44989508 -44896090 -44797868 -44711371 -44667229 -44700865 -44835174 -45062214 -45336007 -45585233 -45743964
17896 -45743964 -45784457 -45729559 -45636342 -45566049 -45560943 -45634614 -45773889 -45949821 -46130908 -46289458
17886 -46289458 -46401052 -46447090 -46424889 -46354028 -46265336 -46176221 -46072769 -45917704 -45680667 -45362558
17876 -45362558 -44991945 -44602436 -44215710 -43842604 -43494811 -43192183 -42958143 -42805969 -42725159
17867 -42725159 -42679405 -42620828 -42512161 -42342952 -42131473 -41914477 -41732730 -41617093 -41580119 -41623017
17857 -41623017 -41756358 -42010281 -42413895 -42956077 -43562021 -44108835 -44471972 -44573370 -44407544
17848 -44407544 -44038141 -43570866 -43117022 -42762601 -42554090 -42504778 -42609977 -42852359 -43194789
17839 -43194789 -43576931 -43929308 -44199631 -44374174 -44482123 -44582667 -44741136 -45003245 -45377167
17830 -45377167 -45829184 -46293795 -46698092 -46995824 -47193883 -47347480 -47519527 -47733356 -47955735
17821 -47955735 -48118770 -48160632 -48059438 -47844287 -47581809 -47347019 -47192815 -47133603 -47149482 -47201967
17811 -47201967 -47249681 -47261219 -47221431 -47124303 -46958721 -46706684 -46361950 -45951873 -45538581 -45194773
17801 -45194773 -44969537 -44864548 -44832975 -44799284 -44688261 -44451114 -44078922 -43597828 -43050559 -42480166
17791 -42480166 -41927301 -41432029 -41025055 -40712575 -40472453 -40268162 -40069643 -39865571 -39660823
17782 -39660823 -39465887 -39288709 -39135370 -39020249 -38975506 -39043541 -39251784 -39589631 -40004621 -40418708
17772 -40418708 -40754983 -40962944 -41034184 -41003413 -40928862 -40855393 -40785619 -40686105 -40524089 -40303024
17762 -40303024 -40070405 -39896101 -39838114 -39913275 -40083440 -40265930 -40369855 -40337576 -40160438 -39864223
17752 -39864223 -39490951 -39095764 -38746624 -38509981 -38429377 -38516957 -38764793 -39161258 -39691792 -40323199
17742 -40323199 -40994577 -41632244 -42175818 -42591272 -42868609 -43017810 -43067190 -43060012 -43047432 -43078221
17732 -43078221 -43189283 -43400787 -43712522 -44097829 -44500194 -44840399 -45036985 -45035534 -44832628 -44478090
17722 -44478090 -44053194 -43637948 -43284406 -43006984 -42790917 -42612748 -42462609 -42354756 -42317923
17713 -42317923 -42373458 -42519506 -42729453 -42958347 -43151755 -43258046 -43241699 -43091065 -42819270 -42461096
17703 -42461096 -42063362 -41664430 -41270484 -40850714 -40366375 -39814275 -39241733 -38716009 -38280554
17694 -38280554 -37940342 -37680271 -37488257 -37360838 -37293201 -37268566 -37257470 -37227695 -37158723 -37049914
17684 -37049914 -36915304 -36770108 -36621763 -36472491 -36328070 -36205557 -36139525 -36184824 -36406800 -36856288
17674 -36856288 -37544263 -38435702 -39466108 -40565774 -41674150 -42739926 -43715002 -44550208 -45196211
17665 -45196211 -45610945 -45772109 -45690391 -45415175 -45024021 -44598263 -44199418 -43859146 -43584175
17656 -43584175 -43368641 -43203153 -43074598 -42961420 -42833403 -42657065 -42403460 -42059766 -41643535
17647 -41643535 -41208253 -40830345 -40581802 -40502027 -40582923 -40774908 -41007840 -41212597 -41335625 -41349057
17637 -41349057 -41260644 -41117669 -40990665 -40937486 -40973012 -41067980 -41171561 -41235018 -41226207 -41139583 -41001274
17626 -41001274 -40862365 -40780382 -40795200 -40907239 -41071258 -41216044 -41279997 -41237558 -41099978 -40896037
17616 -40896037 -40653051 -40393304 -40143522 -39944806 -39851829 -39916816 -40166431 -40589456 -41145993 -41789699
17606 -41789699 -42482870 -43193861 -43886264 -44513626 -45022717 -45363270 -45503578 -45445848 -45227752
17597 -45227752 -44904113 -44519973 -44094626 -43629519 -43134046 -42645621 -42224740 -41930227 -41795162
17588 -41795162 -41817511 -41967461 -42206014 -42504531 -42853918 -43257481 -43712961 -44199079 -44679160
17579 -44679160 -45120780 -45515035 -45874011 -46203752 -46479093 -46647462 -46659115 -46497654 -46189095
17570 -46189095 -45788694 -45359495 -44956058 -44618580 -44373696 -44233276 -44187205 -44197533 -44204907 -44145995
17560 -44145995 -43969086 -43642260 -43160674 -42552984 -41875040 -41190680 -40557928 -40029103 -39652461
17551 -39652461 -39465273 -39483213 -39693939 -40056795 -40510931 -40996949 -41486874 -41999865 -42585381
17542 -42585381 -43283220 -44090166 -44955411 -45801392 -46550520 -47144571 -47554997 -47783948 -47855741
17533 -47855741 -47803524 -47657116 -47431799 -47117593 -46679135 -46076509 -45296004 -44365747 -43348206
17524 -43348206 -42322932 -41370975 -40564079 -39957914 -39583672 -39436840 -39474053 -39627383 -39832222
17515 -39832222 -40056638 -40317813 -40672620 -41182142 -41870445 -42705576 -43614131 -44516451 -45359963
17506 -45359963 -46134811 -46867321 -47596590 -48346209 -49104751 -49824925 -50441855 -50896454 -51145476
17497 -51145476 -51157174 -50911857 -50419721 -49740002 -48975975 -48244141 -47638812 -47208049 -46944105
17488 -46944105 -46790845 -46667879 -46500297 -46240739 -45879360 -45442527 -44981900 -44557310 -44217430
17479 -44217430 -43984990 -43856396 -43814136 -43835981 -43894723 -43960842 -44016357 -44069095 -44150447 -44292663
17469 -44292663 -44500274 -44737356 -44940593 -45045574 -45004824 -44790853 -44393647 -43820643 -43095623
17460 -43095623 -42247844 -41294821 -40238786 -39087773 -37881753 -36695021 -35611142 -34694540
17452 -34694540 -33981960 -33491049 -33226611 -33176887 -33310232 -33582024 -33948735 -34381198 -34872660
17443 -34872660 -35436472 -36089884 -36832796 -37637276 -38453531 -39224100 -39897103 -40439225 -40850571
17434 -40850571 -41173341 -41483549 -41866208 -42386700 -43070776 -43896839 -44801612 -45700587 -46517366
17425 -46517366 -47207461 -47763879 -48206223 -48566009 -48875063 -49155743 -49413837 -49638226 -49810802
17416 -49810802 -49923781 -49990870 -50041287 -50104069 -50196998 -50321431 -50457213 -50559408 -50563301 -50399114
17406 -50399114 -50012175 -49380338 -48518939 -47472258 -46301617 -45078064 -43877270 -42768751
17398 -42768751 -41796746 -40964748 -40241170 -39586705 -38983500 -38447239 -38018857 -37743018 -37644175
17389 -37644175 -37712402 -37906536 -38171656 -38460261 -38747287 -39033199 -39333133 -39657939 -40001183
17380 -40001183 -40341720 -40655043 -40918142 -41101557 -41159104 -41035040 -40694455 -40152992 -39474809
17371 -39474809 -38739642 -38010974 -37329146 -36725098 -36236464 -35911524 -35798055 -35925102 -36289503
17362 -36289503 -36854248 -37557372 -38324463 -39079537 -39753246 -40287618 -40636900 -40767911 -40663768
17353 -40663768 -40330844 -39806843 -39164691 -38502165 -37913986 -37461355 -37158746 -36980774 -36875677
17344 -36875677 -36776048 -36609871 -36316011 -35860515 -35245923 -34508813 -33709152 -32919086 -32211742
17335 -32211742 -31645155 -31243611 -30988177 -30827874 -30710693 -30616772 -30569918 -30619201 -30806798 -31147389
17325 -31147389 -31631296 -32242689 -32974671 -33829078 -34799736 -35849242 -36899903 -37855560 -38646162
17316 -38646162 -39262619 -39754727 -40196343 -40646174 -41128615 -41636615 -42141616 -42600959 -42968828
17307 -42968828 -43216974 -43355334 -43432750 -43510329 -43622728 -43755117 -43855504 -43874502 -43799943 -43660821
17297 -43660821 -43505630 -43377199 -43296126 -43250832 -43194823 -43057729 -42770028 -42292167 -41635444 -40861607
17287 -40861607 -40056261 -39289263 -38585185 -37918073 -37229693 -36462708 -35595634 -34662050 -33741716
17278 -33741716 -32929617 -32303288 -31903899 -31732636 -31758757 -31937126 -32228406 -32609592 -33068134
17269 -33068134 -33585457 -34124020 -34627751 -35034855 -35297086 -35398762 -35365548 -35255915 -35140679
17260 -35140679 -35083592 -35129710 -35300036 -35590846 -35977911 -36422998 -36880306 -37301903 -37639540 -37844371
17250 -37844371 -37873297 -37705213 -37356141 -36880345 -36357301 -35874185 -35512713 -35342979 -35420070 -35776699
17240 -35776699 -36408843 -37260514 -38222097 -39151769 -39912930 -40411319 -40619504 -40579134 -40375246
17231 -40375246 -40095547 -39801935 -39527999 -39291687 -39105762 -38979208 -38913108 -38898357 -38917763 -38948759
17221 -38948759 -38964674 -38936503 -38837341 -38649282 -38368938 -38007623 -37587167 -37135218 -36682446 -36260407
17211 -36260407 -35898860 -35625430 -35467781 -35449498 -35573882 -35807555 -36083297 -36326240 -36488363
17202 -36488363 -36571969 -36629994 -36742259 -36978213 -37364722 -37877277 -38460700 -39065341 -39672286 -40290486
17192 -40290486 -40933715 -41600150 -42268780 -42909552 -43495882 -44011265 -44448299 -44804452 -45079440
17183 -45079440 -45271014 -45364559 -45324279 -45100802 -44657107 -43997256 -43180187 -42308053 -41488189 -40784484
17173 -40784484 -40188645 -39632829 -39034889 -38346227 -37578119 -36802199 -36130916 -35681087 -35526904
17164 -35526904 -35662776 -35999773 -36400175 -36731352 -36911510 -36926146 -36811462 -36620929 -36397924
17155 -36397924 -36167775 -35947319 -35758097 -35629599 -35592709 -35672985 -35888574 -36248485 -36744512 -37336908
17145 -37336908 -37947089 -38473937 -38830577 -38976415 -38923396 -38718831 -38422798 -38093337 -37779258
17136 -37779258 -37516216 -37326782 -37226666 -37231502 -37353185 -37584748 -37891009 -38223272 -38551590 -38886001
17126 -38886001 -39266476 -39731484 -40291039 -40914177 -41524601 -42009038 -42253237 -42199366 -41888713
17117 -41888713 -41455976 -41075950 -40893513 -40970407 -41267240 -41663760 -42008848 -42180543 -42129508 -41885663
17107 -41885663 -41528013 -41138383 -40766246 -40421366 -40092352 -39774985 -39491241 -39286521 -39205594
17098 -39205594 -39262639 -39426261 -39631790 -39814365 -39939702 -40010317 -40046406 -40062033 -40057101 -40026369
17088 -40026369 -39970564 -39898077 -39819444 -39740174 -39653254 -39535946 -39358824 -39105637 -38791542 -38465877
17078 -38465877 -38192988 -38018783 -37944091 -37921579 -37875341 -37731374 -37444740 -37012082 -36467226 -35864204
17068 -35864204 -35253034 -34658440 -34076177 -33492037 -32913031 -32390892 -32017865 -31892024 -32073153
17059 -32073153 -32554475 -33263677 -34092798 -34940935 -35744431 -36479501 -37144035 -37735039 -38233732
17050 -38233732 -38606391 -38823914 -38889779 -38855013 -38802414 -38804078 -38882725 -39008186 -39130123 -39220497
17040 -39220497 -39296992 -39414409 -39631785 -39978272 -40440583 -40975388 -41529466 -42050533 -42486033
17031 -42486033 -42778429 -42868250 -42709732 -42291061 -41642525 -40824647 -39908073 -38963073 -38063308
17022 -38063308 -37292503 -36739125 -36477200 -36545880 -36936498 -37585377 -38375492 -39159518 -39804313
17013 -39804313 -40232721 -40437096 -40463722 -40388530 -40301256 -40293890 -40438818 -40758877 -41211567 -41703172
17003 -41703172 -42125501 -42396626 -42489860 -42438607 -42312718 -42181778 -42092673 -42070749 -42128694 -42268336
16993 -42268336 -42479696 -42749522 -43078566 -43490261 -44018068 -44681030 -45465749 -46322611 -47176033
16984 -47176033 -47945622 -48569009 -49012637 -49264353 -49318422 -49168951 -48812293 -48249503 -47490420
16975 -47490420 -46565052 -45535862 -44497220 -43556918 -42808583 -42308553 -42066347 -42051724 -42212729
16966 -42212729 -42492124 -42834688 -43188712 -43506108 -43744292 -43874625 -43892284 -43811626 -43646067 -43394773
16956 -43394773 -43052995 -42633396 -42171035 -41704998 -41257656 -40831714 -40422536 -40030126 -39659523
16947 -39659523 -39310419 -38966820 -38597182 -38165787 -37648388 -37045563 -36389164 -35735887 -35145408
16938 -35145408 -34654961 -34270950 -33982388 -33777452 -33646306 -33574419 -33539678 -33519028 -33499397 -33482352
16928 -33482352 -33478040 -33495401 -33537686 -33604259 -33691873 -33788563 -33862597 -33861110 -33730429 -33449556 -33053471
16917 -33053471 -32630108 -32292794 -32142096 -32233450 -32563547 -33079811 -33705061 -34361525 -34983569
16908 -34983569 -35521922 -35947257 -36254283 -36460943 -36598926 -36699899 -36786492 -36870592 -36953669 -37025194
16898 -37025194 -37062135 -37035762 -36925067 -36725267 -36442625 -36084865 -35662810 -35201586 -34745544 -34348398
16888 -34348398 -34054165 -33879514 -33805161 -33780116 -33737935 -33619014 -33389111 -33042023 -32583222 -32012050
16878 -32012050 -31326125 -30546809 -29738449 -29001154 -28444138 -28155606 -28176760 -28486802 -29009490
16869 -29009490 -29642082 -30292121 -30904770 -31472851 -32032227 -32648258 -33393671 -34317540 -35416940
16860 -35416940 -36628949 -37847844 -38955661 -39849833 -40459761 -40755773 -40757627 -40541781 -40236167
16851 -40236167 -39990698 -39925599 -40078337 -40376659 -40654714 -40711029 -40387269 -39631328 -38512992
16842 -38512992 -37187015 -35827222 -34566995 -33470915 -32539991 -31736997 -31016217 -30346602 -29722192
16833 -29722192 -29157008 -28667919 -28259681 -27926581 -27666422 -27487515 -27400992 -27412337 -27525640 -27752607
16823 -27752607 -28108023 -28590419 -29167445 -29784742 -30396082 -30989434 -31583501 -32198716 -32834199
16814 -32834199 -33472987 -34103732 -34732278 -35373620 -36035254 -36706602 -37358950 -37951491 -38441468
16805 -38441468 -38799219 -39020897 -39127856 -39151923 -39115770 -39019078 -38840388 -38556904 -38168836 -37709140
16795 -37709140 -37231851 -36790111 -36424290 -36167742 -36053178 -36103945 -36321817 -36690565 -37192685
16786 -37192685 -37819977 -38567140 -39419779 -40354652 -41349974 -42387182 -43437038 -44445731 -45341989
16777 -45341989 -46064744 -46584854 -46900008 -47013306 -46919079 -46603716 -46055123 -45274280 -44283927
16768 -44283927 -43130935 -41884911 -40635742 -39483039 -38513670 -37780503 -37295766 -37035582 -36946380
16759 -36946380 -36951765 -36962040 -36887039 -36653868 -36227930 -35626714 -34914896 -34181866 -33514910 -32980051
16749 -32980051 -32614597 -32428197 -32403989 -32495994 -32632248 -32736546 -32763214 -32719302 -32655615 -32632538
16739 -32632538 -32680873 -32779761 -32865071 -32862523 -32727142 -32471886 -32173815 -31952051 -31922323 -32147155
16729 -32147155 -32606107 -33199325 -33781158 -34211032 -34403116 -34353161 -34128389 -33827714 -33538915
16720 -33538915 -33314517 -33168399 -33086661 -33047324 -33039883 -33074931 -33183627 -33413200 -33818408 -34443671
16710 -34443671 -35298627 -36341334 -37480294 -38592786 -39552119 -40258467 -40663193 -40773652 -40637096
16701 -40637096 -40317150 -39876846 -39372195 -38851671 -38354023 -37903053 -37505797 -37157469 -36849117
16692 -36849117 -36574099 -36333583 -36140085 -36013471 -35969092 -36007988 -36114503 -36255747 -36379623 -36417888
16682 -36417888 -36302590 -35991599 -35485251 -34821694 -34057830 -33254061 -32474893 -31796256 -31296872
16673 -31296872 -31030152 -31002417 -31178722 -31506769 -31937537 -32435112 -32977597 -33550892 -34140427
16664 -34140427 -34726968 -35289496 -35814992 -36307221 -36781837 -37249053 -37701538 -38118971 -38482516
16655 -38482516 -38786104 -39038790 -39259926 -39468670 -39670683 -39850740 -39977212 -40013137 -39926118 -39696956
16645 -39696956 -39328313 -38849317 -38312111 -37779155 -37302268 -36902460 -36563430 -36240211 -35876231
16636 -35876231 -35426092 -34880360 -34280045 -33707224 -33250679 -32964853 -32849504 -32862727 -32954128 -33090984
16626 -33090984 -33257583 -33433991 -33582850 -33663027 -33657248 -33587217 -33504376 -33464480 -33504574 -33638647
16616 -33638647 -33871382 -34211326 -34668618 -35241724 -35904813 -36601922 -37250755 -37756205 -38029558
16607 -38029558 -38010675 -37689794 -37117566 -36392234 -35629992 -34938814 -34406142 -34089451 -33998867 -34083375
16597 -34083375 -34242846 -34369613 -34395106 -34310398 -34154337 -33988274 -33872238 -33843788 -33903595 -34016055
16587 -34016055 -34123991 -34168243 -34105818 -33922117 -33630522 -33259882 -32841910 -32405839 -31975322 -31564794
16577 -31564794 -31180555 -30827600 -30514751 -30253790 -30058189 -29946437 -29943375 -30070525 -30332848 -30719594
16567 -30719594 -31218664 -31824048 -32525022 -33287957 -34049551 -34731048 -35264203 -35605936 -35731718
16558 -35731718 -35624590 -35277601 -34703130 -33931578 -32996482 -31921245 -30719878 -29403054 -27975817
16549 -27975817 -26432436 -24762437 -22966917 -21070311 -19115213 -17141970 -15170191 -13201373
16541 -13201373 -11245177 -9353288 -7639730 -6273934 -5446007 -5314807 -5954963 -7322497
16533 -7322497 -9258382 -11534616 -13920798 -16236515 -18370014 -20269317 -21926770 -23370833
16525 -23370833 -24658112 -25851255 -26985246 -28045376 -28978098 -29726659 -30260838 -30585459 -30737878
16516 -30737878 -30783160 -30801805 -30865440 -31007961 -31207335 -31388829 -31448341 -31285321 -30832268 -30071191
16506 -30071191 -29034178 -27790030 -26422426 -25007133 -23591853 -22181423 -20738420 -19204498
16498 -19204498 -17528041 -15679131 -13651241 -11462062 -9157821 -6815569 -4542184 -2471249
16490 -2471249 -750343 487688 1159186 1250522 816566 -38007 -1184782 -2495155 -3855125
16481 -3855125 -5173252 -6385874 -7458811 -8386355 -9190199 -9913243 -10602477 -11288965 -11979784
16472 -11979784 -12665150 -13332119 -13977659 -14617388 -15285694 -16024830 -16866386 -17814564 -18839188
16463 -18839188 -19875291 -20826361 -21583407 -22068252 -22279326 -22302506 -22271940 -22306722 -22469555 -22769074
16453 -22769074 -23188345 -23711233 -24330532 -25039436 -25825202 -26680382 -27619307 -28673756 -29862953
16444 -29862953 -31162138 -32495975 -33758662 -34843254 -35664862 -36170530 -36334838 -36149576 -35619595
16435 -35619595 -34769347 -33654772 -32368123 -31024203 -29731291 -28564405 -27555407 -26701471
16427 -26701471 -25987500 -25413865 -25009645 -24812933 -24828530 -25002729 -25244101 -25473980 -25665758
16418 -25665758 -25851943 -26106589 -26515573 -27141859 -27995649 -29020724 -30100738 -31084185 -31826358
16409 -31826358 -32235521 -32296140 -32054076 -31580768 -30947327 -30223409 -29489359 -28837704 -28354827
16400 -28354827 -28098422 -28090004 -28324863 -28787175 -29456578 -30302354 -31272188 -32286384 -33247316
16391 -33247316 -34064304 -34677311 -35060530 -35207640 -35117309 -34792116 -34250905 -33540392 -32724843
16382 -32724843 -31855409 -30954667 -30040939 -29167347 -28431333 -27943244 -27780383 -27960062 -28447027
16373 -28447027 -29184527 -30120748 -31210642 -32402115 -33629799 -34823718 -35923166 -36886821
16365 -36886821 -37694592 -38339638 -38816028 -39110513 -39202489 -39072460 -38715758 -38153339 -37432504
16356 -37432504 -36618794 -35786448 -35011727 -34365974 -33903628 -33645050 -33560517 -33567224 -33548508 -33391870
16346 -33391870 -33029996 -32465993 -31771127 -31056775 -30432755 -29965952 -29652803 -29419762 -29154973
16337 -29154973 -28754002 -28156357 -27360305 -26414909 -25395499 -24372676 -23387333 -22445674 -21536727
16328 -21536727 -20656616 -19823928 -19081566 -18482818 -18063685 -17816652 -17684054 -17575849 -17403232
16319 -17403232 -17114966 -16721626 -16293234 -15929738 -15725077 -15747545 -16038103 -16612864 -17460405
16310 -17460405 -18534557 -19748310 -20978832 -22094387 -22997883 -23659044 -24112670 -24431286 -24696453
16301 -24696453 -24980710 -25334739 -25771416 -26253203 -26702805 -27041418 -27228378 -27274131 -27224973 -27135803
16291 -27135803 -27046830 -26974730 -26919491 -26879184 -26864549 -26906975 -27051761 -27337231 -27777964 -28365327
16281 -28365327 -29072171 -29848063 -30617777 -31298025 -31820194 -32140494 -32240245 -32126004 -31826990
16272 -31826990 -31385282 -30843646 -30239362 -29606809 -28983825 -28413985 -27940251 -27591225 -27367291
16263 -27367291 -27237054 -27149872 -27060641 -26952588 -26841713 -26760700 -26734930 -26762864 -26807579 -26806059 -26697543
16252 -26697543 -26456420 -26106580 -25708455 -25334556 -25055656 -24940159 -25050223 -25423271 -26046275
16243 -26046275 -26841857 -27681795 -28424057 -28950856 -29191102 -29129291 -28805982 -28305654 -27729189
16234 -27729189 -27162306 -26655521 -26220466 -25839956 -25487372 -25146594 -24822095 -24537545 -24328858
16225 -24328858 -24232233 -24266090 -24416441 -24636907 -24863292 -25032419 -25092569 -25001739 -24725362 -24245961
16215 -24245961 -23578971 -22776069 -21906145 -21025963 -20165533 -19339166 -18564981 -17868984 -17272038
16206 -17272038 -16777604 -16373007 -16039369 -15758262 -15512644 -15291090 -15099344 -14968371 -14946927
16197 -14946927 -15080592 -15388638 -15849983 -16404598 -16967609 -17448075 -17768555 -17882962 -17784561
16188 -17784561 -17496484 -17049475 -16464387 -15751230 -14914759 -13949966 -12831995 -11518305 -9962169
16179 -9962169 -8121100 -5958359 -3449170 -593931 2568903 5957312 9451933 12908605
16171 12908605 16162082 19018716 21261441 22687927 23166003 22666648 21257106 19072832
16163 19072832 16291836 13113901 9739595 6354379 3122523 182026 -2371108 -4505809
16155 -4505809 -6264005 -7734187 -9001548 -10111956 -11074373 -11887889 -12559605 -13099789 -13508823
16146 -13508823 -13771609 -13862834 -13759696 -13452581 -12942402 -12224927 -11277074 -10059635 -8536101
16137 -8536101 -6695652 -4568178 -2224775 235122 2697945 5035255 7086659 8650062
16129 8650062 9509246 9500543 8580995 6851972 4524029 1846684 -959140 -3738686 -6402797
16120 -6402797 -8900576 -11190008 -13226057 -14966601 -16383238 -17465175 -18214595 -18640311
16112 -18640311 -18756474 -18586923 -18168274 -17544178 -16753492 -15823203 -14771804 -13617133 -12379196
16103 -12379196 -11076640 -9721808 -8317793 -6859923 -5341887 -3760620 -2115551 -408697
16095 -408697 1346453 3114219 4837792 6449037 7869618 9001809 9729267 9938715 9550133
16086 9550133 8540717 6957075 4912051 2565440 95408 -2329684 -4573134 -6545275
16078 -6545275 -8212060 -9591368 -10735354 -11708218 -12569713 -13366387 -14128206 -14869038 -15587802
16069 -15587802 -16267071 -16874373 -17374559 -17747221 -17991786 -18113083 -18098553 -17905825 -17471839
16060 -17471839 -16739072 -15683301 -14328081 -12740336 -11011705 -9236914 -7497620 -5850358
16052 -5850358 -4317190 -2884723 -1513196 -150365 1251343 2713210 4210375 5665500
16044 5665500 6962185 7974264 8599940 8786954 8539948 7909974 6972268 5804140 4476052
16035 4476052 3055685 1610747 202541 -1120362 -2318404 -3353805 -4192639 -4817172
16027 -4817172 -5237665 -5492321 -5633310 -5709421 -5759262 -5816915 -5916934 -6087790 -6340105 -6662179
16017 -6662179 -7024175 -7383342 -7685784 -7867920 -7864981 -7629457 -7151523 -6468094 -5655254 -4809812
16007 -4809812 -4028740 -3392686 -2954301 -2727760 -2678912 -2722616 -2735102 -2582947 -2161832 -1429548
15997 -1429548 -414862 803224 2131277 3493000 4848384 6198727 7576464 9025312
15989 9025312 10580446 12253026 14021732 15836745 17635144 19357771 20961768 22430013
15981 22430013 23776187 25038937 26261387 27462267 28611638 29622551 30363346 30685765
15973 30685765 30458063 29594611 28076996 25961350 23367313 20448222 17351992 14194089
15965 14194089 11060617 8035088 5220027 2728986 651836 -981056 -2211088 -3134885
15957 -3134885 -3871755 -4531135 -5189242 -5878295 -6589364 -7287673 -7932896 -8490391 -8927365
15948 -8927365 -9207984 -9304148 -9218299 -9000687 -8746781 -8569147 -8552958 -8722495 -9042760 -9452612
15938 -9452612 -9901975 -10365443 -10827738 -11262883 -11632480 -11907933 -12098459 -12259363 -12469354
15929 -12469354 -12790661 -13237100 -13765491 -14290922 -14716918 -14967642 -15012163 -14876207 -14636446
15920 -14636446 -14394797 -14243676 -14240667 -14401232 -14705359 -15107587 -15541749 -15925103 -16173360 -16223801
15910 -16223801 -16051355 -15670088 -15122174 -14458719 -13721161 -12933294 -12104760 -11238379 -10336306
15901 -10336306 -9401745 -8431197 -7400484 -6259061 -4942698 -3401159 -1628169 324151
15893 324151 2357889 4360627 6236150 7924284 9410013 10719933 11902444 12998736
15885 12998736 14019717 14935542 15674056 16128837 16183218 15746871 14788511 13350957 11546155
15876 11546155 9534457 7495796 5601175 3988832 2745801 1895010 1392001 1142854
15868 1142854 1048013 1048741 1142151 1361438 1746633 2322095 3079434 3967779 4901224 5783407
15858 5783407 6530661 7077515 7372587 7381757 7097006 6537448 5742295 4768619 3697272 2632513
15848 2632513 1683000 933765 427846 161820 89757 136962 225472 300035 336137 325311
15838 325311 256286 115340 -94686 -340641 -567772 -724380 -784133 -752081 -651126 -498889
15828 -498889 -294830 -31517 279582 595188 857061 1025740 1101751 1118922 1121860 1148920
15818 1148920 1225149 1355075 1511674 1630885 1621846 1391179 870027 34122 -1088562 -2424506
15808 -2424506 -3868930 -5296261 -6567956 -7554700 -8179813 -8456849 -8481805 -8376503 -8227225
15799 -8227225 -8066268 -7898967 -7736023 -7597279 -7491284 -7395759 -7254613 -6992688 -6544480 -5886635
15789 -5886635 -5055632 -4137509 -3235915 -2438600 -1798961 -1336132 -1045709 -908721 -894174 -964424
15779 -964424 -1091581 -1272749 -1521923 -1837697 -2173459 -2438107 -2532559 -2399528 -2051905 -1562613
15769 -1562613 -1029069 -538489 -150534 103866 216986 197018 60118 -174550 -484546 -843154
15759 -843154 -1220997 -1584742 -1889816 -2078102 -2091605 -1893386 -1477172 -860019 -66470 884551
15749 884551 1979552 3191949 4459093 5682940 6764495 7649592 8353709 8950411 9533704
15740 9533704 10181662 10945519 11866508 12997803 14406439 16153327 18267053 20724078 23443006
15731 23443006 26296983 29134598 31791529 34091469 35853109 36914943 37171129 36601614
15723 36601614 35283181 33375925 31089644 28647061 26259308 24108236 22321287 20945356
15715 20945356 19943398 19221661 18666795 18168400 17624118 16943069 16063956 14986035 13785685
15706 13785685 12592289 11533576 10691084 10094602 9744204 9625406 9702284 9907385 10153336
15697 10153336 10364973 10506397 10582194 10617937 10641873 10680270 10757481 10887572 11061224 11241755
15687 11241755 11374620 11404962 11297405 11051763 10705894 10321860 9965424 9693791 9552738
15678 9552738 9572001 9755238 10075744 10488644 10954166 11455614 12001022 12609663 13293862 14051704
15668 14051704 14878508 15785909 16811605 18015995 19471033 21244060 23378901 25881184
15660 25881184 28716043 31819410 35115465 38530597 41998087 45454137 48829844 52043223
15652 52043223 54992939 57553624 59579482 60931344 61528772 61397323 60670270 59536656
15644 59536656 58174353 56716341 55259750 53887164 52672988 51679283 50956402 50544737
15636 50544737 50463950 50693516 51163348 51765608 52382551 52916532 53308703 53540755 53626973 53608450
15626 53608450 53548658 53520991 53591094 53809501 54219300 54862909 55771755 56943553 58326142
15617 58326142 59818385 61281734 62554561 63472929 63900491 63756996 63032026 61781307 60112050
15608 60112050 58162042 56072729 53961180 51904530 49946133 48113024 46423787 44879992
15600 44879992 43455850 42106769 40799312 39536853 38354331 37289739 36365245 35595074
15592 35595074 35003155 34623698 34481184 34567910 34833859 35191788 35535457 35766062 35820730 35696946
15582 35696946 35463845 35251870 35221426 35520686 36245677 37417769 38991277 40885704 43015461
15573 43015461 45296054 47636198 49940347 52128746 54157714 56019684 57719704 59243991
15565 59243991 60542852 61542401 62179619 62436087 62348621 61996026 61473989 60868119 60233543
15556 60233543 59591353 58946432 58317731 57761592 57370660 57245466 57453708 58001127 58829584
15547 58829584 59838606 60915426 61962316 62918617 63777188 64587806 65437907 66416556 67583444
15538 67583444 68957335 70517288 72204454 73926008 75568648 77018332 78176939 78974347
15530 78974347 79378667 79401809 79096104 78544789 77852735 77139228 76529323 76140385 76065248 76359074
15520 76359074 77035436 78071759 79426092 81061269 82953457 85067759 87318660 89549534
15512 89549534 91545868 93075014 93941669 94045006 93414088 92202792 90647377 89005850
15504 89005850 87498516 86263148 85334116 84653576 84116891 83637579 83200559 82875312 82782678
15495 82782678 83033129 83669030 84645056 85859320 87209292 88631301 90105191 91635160
15487 91635160 93227513 94875439 96550319 98202987 99780416 101246761 102587182 103790049
15479 103790049 104826267 105647529 106208130 106493225 106529769 106372879 106082374 105708926 105294121
15470 105294121 104875895 104492870 104184386 103983012 103904529 103948034 104107983 104384578 104782920
15461 104782920 105305437 105947343 106699609 107554751 108506286 109541387 110638214 111775510 112943707
15452 112943707 114140187 115348676 116519448 117564352 118372463 118845921 118940608 118686946 118179529
15443 118179529 117543941 116898796 116329345 115878473 115552123 115333663 115199039 115124585 115086111
15434 115086111 115052851 114980775 114810334 114472462 113903508 113064997 111961409 110651106 109244539
15425 109244539 107882848 106698688 105774883 105122628 104691678 104405708 104201311 104050582 103962739
15416 103962739 103973379 104130835 104482084 105056294 105849641 106822173 107911698 109056851 110217495
15407 110217495 111385789 112583910 113847473 115204437 116664898 118226319 119884410 121638449
15399 121638449 123490593 125447177 127524719 129752311 132163807 134785440 137629454 140695121
15391 140695121 143966845 147399388 150895019 154292715 157386464 159965997 161854807 162930921
15383 162930921 163136914 162486710 161066762 159028298 156570119 153911971 151264655 148808407
15375 148808407 146680168 144957328 143635988 142624591 141772500 140921200 139943476 138754949
15367 138754949 137314792 135634681 133790327 131916816 130183480 128760598 127788763 127353542
15359 127353542 127466045 128052192 128956203 129963551 130842262 131393966 131501619 131156641 130449309
15350 130449309 129520993 128499289 127447236 126347847 125128675 123714915 122083263 120284819
15342 120284819 118423650 116607051 114902637 113328299 111870974 110513841 109258818 108138205
15334 108138205 107208378 106525338 106118401 105980981 106077977 106353719 106732166 107117027 107402403
15325 107402403 107495791 107345927 106961599 106406572 105768301 105118136 104486226 103861713 103215859
15316 103215859 102536404 101850871 101219612 100704857 100343236 100140672 100084063 100153496 100327138
15307 100327138 100581766 100893696 101239887 101598822 101955516 102309530 102674733 103064994 103475251
15298 103475251 103871531 104195233 104377703 104358452 104103197 103617741 102950848 102182181 101401583
15289 101401583 100693381 100130217 99765116 99614123 99640096 99752167 99822719 99715197 99317865
15280 99317865 98578983 97530138 96278594 94965048 93710379 92582742 91597055 90738904
15272 90738904 89997590 89390186 88962362 88765233 88822746 89113468 89580220 90152881 90759445
15263 90759445 91323581 91767006 92024721 92064584 91900754 91593651 91232175 90903754 90668575
15254 90668575 90549883 90536124 90586430 90639526 90629152 90502756 90234539 89826234 89298731 88682885
15244 88682885 88012527 87315917 86601789 85843067 84970764 83892524 82534503 80882515 78993960
15235 78993960 76971709 74917286 72894217 70922524 68999556 67127173 65331086 63668301
15227 63668301 62222922 61092643 60367958 60103402 60285755 60818409 61539787 62269065 62853070
15218 62853070 63194029 63254717 63049375 62634847 62111394 61621751 61323574 61333136 61675363 62278422
15208 62278422 63014769 63758084 64425250 64988447 65459609 65868211 66253418 66667006 67168081
15199 67168081 67803836 68592859 69530184 70610413 71846817 73274469 74944093 76914592
15191 76914592 79244704 81981872 85147768 88721681 92624915 96709851 100759699 104508967
15183 104508967 107689996 110095850 111637045 112366752 112458726 112146093 111651179 111135216 110680368
15174 110680368 110305375 110007102 109806598 109773214 110015032 110647531 111763972 113422943 115652040
15165 115652040 118456744 121827685 125750884 130226293 135284741 140985648 147396284 154574272
15157 154574272 162571065 171452738 181318584 192296268 204499163 217944423 232449296
15150 232449296 247541140 262422889 276031338 287211810 294994880 298890134 299057572
15143 299057572 296258500 291615258 286311744 281364306 277513453 275208636 274626958 275681973
15135 275681973 278015165 280991451 283734737 285239657 284567406 281075759 274584286 265391888
15127 265391888 254148081 241660466 228729848 216049746 204153339 193384361 183893151
15120 183893151 175666613 168581286 162458256 157110502 152382076 148174214 144451139 141221786
15112 141221786 138500831 136264935 134427436 132845798 131357995 129826727 128166182 126346090
15104 126346090 124387824 122359786 120364646 118512326 116883165 115496186 114299475 113187218
15096 113187218 112032163 110719774 109177956 107397496 105434577 103393511 101401135 99585423
15088 99585423 98059672 96905823 96156111 95784666 95720971 95879709 96189028 96604329 97103172
15079 97103172 97662938 98233965 98729928 99048176 99109519 98892136 98439322 97838363 97184629
15070 97184629 96550117 95967090 95427119 94892816 94318335 93670953 92944643 92160741 91355346
15061 91355346 90557928 89772758 88975401 88128531 87210420 86238612 85271207 84384546 83641770
15052 83641770 83068660 82646959 82329139 82070532 81862465 81744208 81783329 82035593 82510913
15043 82510913 83168156 83938805 84758200 85582359 86384631 87143642 87836619 88440550 88935359
15034 88935359 89305780 89542632 89643011 89607809 89440372 89153638 88782923 88388113 88035902
15025 88035902 87774070 87617434 87552228 87550095 87579781 87611162 87612163 87543852 87361967 87027746 86522202
15014 86522202 85854874 85060390 84181585 83246736 82255052 81180146 79990402 78677778 77283430
15005 77283430 75905489 74678116 73728175 73132467 72896042 72957235 73210886 73533269 73801225
14996 73801225 73913399 73814429 73505350 73029595 72444520 71794286 71092813 70321865 69446819
14987 69446819 68440883 67299609 66038372 64683716 63269745 61837432 60433846 59116248
14979 59116248 57957632 57037344 56413030 56095765 56051863 56229053 56582862 57084227 57709317
14970 57709317 58426667 59196255 59982087 60765591 61545268 62320927 63075798 63771082 64353723
14961 64353723 64765499 64946541 64840335 64407619 63640973 62565108 61223381 59665403 57944888
14952 57944888 56125045 54286227 52530373 50973564 49722190 48841480 48333220 48136157
14944 48136157 48150213 48268924 48401113 48479125 48463032 48343826 48141641 47898651 47669051 47504115
14934 47504115 47430662 47432368 47448427 47391725 47174265 46728170 46020069 45062127 43918877 42700853
14924 42700853 41538230 40545239 39796392 39321848 39110262 39111787 39248587 39436277 39607039
14915 39607039 39723843 39781988 39801894 39821064 39889954 40068799 40417636 40977019 41749863 42697909
14905 42697909 43752492 44829543 45844293 46723694 47411582 47868956 48078231 48048956 47812348
14896 47812348 47405594 46861395 46207340 45465055 44646582 43757466 42811137 41845849 40929916
14887 40929916 40148821 39581175 39275731 39240696 39451329 39867006 40440066 41110798 41799796
14878 41799796 42413540 42869133 43124474 43190359 43115590 42957270 42754647 42520717 42257257 41981065
14868 41981065 41734488 41564202 41483361 41450992 41388684 41223975 40931560 40547755 40152604 39833402
14858 39833402 39651957 39630224 39754002 39988602 40300719 40675438 41116097 41630329 42220135
14849 42220135 42884512 43624750 44441259 45322103 46229743 47093754 47818561 48308700 48499436
14840 48499436 48374120 47961057 47319449 46526721 45668053 44822902 44050183 43379297 42811894
14831 42811894 42335962 41948690 41673300 41552612 41620038 41868209 42237494 42633783 42965892
14822 42965892 43178020 43257837 43223698 43106621 42935147 42727342 42496470 42265528 42071698 41950321
14812 41950321 41911710 41936137 41998010 42101328 42295552 42657338 43249552 44082248 45097398 46186344
14802 46186344 47230808 48144373 48894268 49500066 50019032 50526046 51089938 51751321 52511639
14793 52511639 53337451 54174547 54965768 55667740 56259111 56737040 57110372 57399454 57638327
14784 57638327 57863727 58090306 58299470 58462015 58573664 58667582 58798193 59018816 59370403
14775 59370403 59879253 60556249 61397386 62389444 63520341 64786372 66187566 67711056 69313124
14766 69313124 70915054 72421040 73748471 74846385 75686570 76240599 76471427 76350016 75879209
14757 75879209 75103244 74100535 72969781 71813548 70717729 69732519 68868938 68115080 67458408
14748 67458408 66898202 66442292 66091075 65821069 65584448 65328086 65017476 64649080 64247881
14739 64247881 63856643 63522970 63289643 63191874 63254434 63479832 63835137 64253132 64651837 64965009
14729 64965009 65171369 65306800 65451507 65702194 66145233 66833906 67765088 68862653 69985521
14720 69985521 70965604 71658774 71986150 71951156 71625398 71110027 70497738 69859467 69253944
14711 69253944 68737269 68357383 68140241 68082674 68159162 68339061 68603480 68948902 69373169 69855793
14701 69855793 70352059 70806013 71167269 71395749 71456217 71317563 70964442 70412070 69709660
14692 69709660 68927281 68132613 67368212 66636417 65897287 65084796 64140839 63054634 61884938
14683 61884938 60747509 59773461 59065101 58671659 58586154 58754301 59090947 59500205 59891106
14674 59891106 60185127 60320458 60259223 59998358 59575617 59058371 58514837 57982787 57453772
14665 57453772 56883415 56221410 55438914 54538682 53553336 52537601 51551469 50638991 49816699
14656 49816699 49075710 48391426 47738691 47109636 46522842 46016604 45633409 45404466 45335039
14647 45335039 45392424 45506534 45591445 45581985 45465772 45291891 45151665 45141095 45322127 45700573
14637 45700573 46228205 46822455 47391979 47860562 48186963 48379127 48497240 48637806 48899288
14628 48899288 49344139 49976183 50740216 51538819 52260900 52816979 53168776 53337726 53387876
14619 53387876 53392576 53402154 53429640 53459378 53468232 53446265 53408744 53394746 53453070 53623286 53920258
14608 53920258 54325302 54788435 55247594 55658520 56015268 56346979 56696839 57100681 57573565
14599 57573565 58101894 58646197 59165270 59649872 60133190 60663924 61266011 61922238 62595152
14590 62595152 63264113 63947791 64701509 65600006 66720221 68130531 69881915 71993099 74433857
14581 74433857 77126229 79975296 82909799 85897662 88925304 91966363 94973624 97902331
14573 97902331 100744075 103542319 106375621 109322292 112434157 115729789 119191046 122749418
14565 122749418 126274783 129586037 132484180 134794176 136401097 137266114 137412524 136889317
14557 136889317 135736759 133976343 131626485 128726893 125355004 121627511 117686408 113673637
14549 113673637 109703406 105844174 102116883 98505867 94976526 91496996 88059567 84694477
14541 84694477 81469539 78473155 75784576 73440687 71412105 69602332 67877729 66119926
14533 66119926 64274583 62368867 60489884 58740225 57196625 55891403 54816663 53932872
14525 53932872 53166950 52408496 51525219 50401246 48979131 47286372 45438358 43614252
14517 43614252 42008064 40770507 39968203 39580591 39530379 39721175 40058038 40448898 40800964
14508 40800964 41024280 41044862 40819930 40342960 39634476 38727974 37666073 36512334 35364203
14499 35364203 34346576 33583607 33164824 33121605 33423529 33997411 34758243 35631532 36555321
14490 36555321 37469073 38307080 39008381 39537013 39891797 40092711 40157550 40094231 39913691 39644505
14480 39644505 39331400 39016735 38717302 38413497 38061872 37623651 37087763 36472375 35806270
14471 35806270 35107828 34383015 33646753 32946101 32356554 31946583 31736962 31686602 31712477 31727194
14461 31727194 31671259 31525633 31305991 31051278 30813484 30642927 30567846 30584099 30668901 30808310
14451 30808310 31014783 31321689 31760506 32340719 33049632 33866602 34772649 35748749 36770306
14442 36770306 37805187 38815722 39760626 40594585 41267536 41728430 41936651 41877590 41574618
14433 41574618 41092014 40526289 39986141 39566221 39324491 39272496 39381284 39596899 39855499
14424 39855499 40093326 40254997 40302542 40219804 40008312 39680178 39254983 38761016 38235596 37719645
14414 37719645 37248453 36844163 36512928 36247705 36034470 35853919 35675022 35450814 35128868
14405 35128868 34671912 34072739 33354780 32560733 31736152 30915690 30121216 29377408 28732369
14396 28732369 28255387 28002049 27976044 28124218 28363871 28612344 28802934 28895867 28890024 28821096
14386 28821096 28733732 28644410 28527084 28333434 28030163 27626344 27174637 26746804 26398788 26150981
14376 26150981 26000968 25954044 26037223 26284399 26712976 27313277 28052498 28889199 29795168 30770457
14366 30770457 31832576 32982479 34174404 35314639 36290736 37009407 37418587 37510131 37317921
14357 37317921 36918616 36424294 35957637 35619696 35469907 35526885 35783600 36225038 36837637
14348 36837637 37605608 38499325 39467337 40440913 41349468 42135586 42761093 43207971 43482886
14339 43482886 43624251 43699779 43786328 43942427 44197070 44563670 45059110 45703096 46497621 47408679
14329 47408679 48371125 49317443 50210523 51056138 51889039 52749535 53669408 54669056 55754152
14320 55754152 56903860 58058159 59116135 59944562 60392798 60321850 59651608 58405442 56719679
14311 56719679 54805151 52879197 51099922 49528130 48132739 46840389 45601350 44428568
14303 44428568 43389110 42566485 42027384 41804714 41881924 42168783 42490361 42622032 42367884
14294 42367884 41635581 40458684 38957749 37274536 35524845 33789990 32132202 30607604
14286 30607604 29264036 28129326 27203895 26466519 25890480 25460741 25183589 25084503 25194847
14277 25194847 25531628 26078807 26781715 27559434 28326725 29013190 29573847 29991508 30274347
14268 30274347 30451855 30572801 30708621 30956663 31428391 32217556 33365383 34845570 36575803
14259 36575803 38444874 40340943 42174170 43891933 45483951 46975671 48411880 49835918
14251 49835918 51273347 52728791 54194609 55657803 57095486 58468033 59725556 60827502
14243 60827502 61760613 62545968 63234783 63889954 64553638 65219908 65835782 66329831 66649482
14234 66649482 66792590 66821243 66843334 66963924 67234632 67634241 68091559 68530052 68898154 69165633
14224 69165633 69298810 69243206 68928491 68291059 67305220 66013487 64539333 63065697 61781869
14215 61781869 60825747 60252524 60038736 60106378 60350605 60666693 60973387 61223834 61401933
14206 61401933 61513749 61581625 61637451 61707555 61793404 61864808 61871379 61757209 61466541 60948256
14196 60948256 60173487 59163824 58005500 56826341 55743466 54820079 54061880 53445734 52950820
14187 52950820 52572557 52319291 52198988 52202158 52289320 52392800 52436195 52362824 52156466 51842904
14177 51842904 51476855 51129981 50886471 50835276 51053323 51593684 52488558 53755923 55396702
14168 55396702 57384109 59654872 62111247 64638736 67136514 69547582 71870395 74144021
14160 74144021 76422594 78761341 81216003 83840522 86675061 89733387 93001311 96444644
14152 96444644 100013499 103632523 107182867 110495055 113365805 115593529 117017954 117549602
14144 117549602 117177626 115956320 113984697 111389642 108309704 104877313 101205261 97380518
14136 97380518 93465199 89507749 85561462 81694765 77981985 74483974 71236455 68250851
14128 68250851 65521047 63030501 60755425 58661543 56699552 54808326 52929453 51028451
14120 51028451 49111625 47226671 45443938 43827736 42414630 41212308 40214544 39412649
14112 39412649 38793432 38334097 38007786 37797669 37703957 37735889 37898085 38183482 38574374 39048457
14102 39048457 39588506 40189429 40852820 41569667 42304789 42995833 43567936 43956014 44125507
14093 44125507 44083728 43875538 43563683 43204529 42833395 42466647 42115256 41796424 41533670
14084 41533670 41348204 41253320 41261209 41397189 41703453 42223553 42979545 43957841 45108923 46360264
14074 46360264 47640499 48906443 50158556 51436340 52799227 54307355 56013455 57965693
14066 57965693 60213170 62806975 65795564 69219778 73113941 77510699 82435861 87877867
14058 87877867 93730991 99735296 105452447 110314372 113757467 115403281 115194623 113406551
14050 113406551 110536487 107153166 103778175 100819798 98546462 97083825 96421214 96420542 96833134
14041 96833134 97329997 97544993 97135659 95864407 93670392 90678349 87130252 83290445
14033 83290445 79380789 75556784 71905444 68451073 65169023 62007838 58913409 55847234
14025 55847234 52793335 49752741 46730775 43728919 40752105 37827427 35015740 32402425
14017 32402425 30070717 28074174 26426659 25115107 24122476 23442313 23074702 23008797 23209321
14008 23209321 23619954 24174603 24797128 25391877 25849798 26077283 26023568 25685887 25096494
13999 25096494 24304960 23364835 22330778 21264090 20235045 19314191 18554318 17971106 17536342
13990 17536342 17191547 16872082 16524906 16112519 15605684 14973640 14183499 13214516 12079099
13981 12079099 10833144 9563922 8362406 7298813 6411149 5702495 5144015 4688480 4293216
13972 4293216 3936382 3612035 3312145 3017410 2706683 2375405 2045592 1756557 1541749
13963 1541749 1409974 1343531 1309212 1271556 1202641 1086326 914305 675011 343160 -121370
13953 -121370 -760852 -1596444 -2609552 -3743091 -4919264 -6059184 -7098268 -7997335 -8743093
13944 -8743093 -9333324 -9759625 -10008731 -10083061 -10017985 -9878675 -9738287 -9648832 -9620615 -9624253
13934 -9624253 -9614194 -9558386 -9458336 -9350233 -9284961 -9297671 -9388969 -9530153 -9682496 -9812603
13924 -9812603 -9895923 -9912756 -9846150 -9689371 -9462430 -9224509 -9063892 -9061227 -9247101 -9585220
13914 -9585220 -9995512 -10402134 -10772703 -11121201 -11475703 -11840618 -12184591 -12457754 -12616296
13905 -12616296 -12635985 -12517307 -12290431 -12015477 -11769011 -11621256 -11619575 -11787513 -12134048 -12660896
13895 -12660896 -13361559 -14215376 -15184431 -16218797 -17268375 -18292262 -19255348 -20112981 -20800275
13886 -20800275 -21242111 -21380802 -21201833 -20741030 -20073421 -19294202 -18499147 -17768897 -17159684
13877 -17159684 -16698538 -16384151 -16198319 -16123852 -16156161 -16302130 -16570209 -16956655 -17432558 -17939807
13867 -17939807 -18402988 -18756952 -18980756 -19119932 -19277901 -19572528 -20080360 -20803274 -21673912
13858 -21673912 -22588002 -23439036 -24138559 -24622079 -24850777 -24815539 -24539449 -24072119 -23476677
13849 -23476677 -22817102 -22152958 -21541512 -21040054 -20701284 -20560312 -20617842 -20828403 -21104070
13840 -21104070 -21338369 -21439569 -21354242 -21072805 -20621553 -20048135 -19404750 -18731371 -18043030
13831 -18043030 -17328081 -16561770 -15731516 -14862837 -14032233 -13357626 -12968962 -12973273 -13426379 -14314348
13821 -14314348 -15547498 -16973479 -18409570 -19682313 -20658961 -21262698 -21473004 -21315847 -20848334
13812 -20848334 -20141888 -19267896 -18291447 -17274321 -16277280 -15353749 -14542242 -13866742 -13340820
13803 -13340820 -12969624 -12752954 -12689365 -12775157 -13001527 -13359636 -13850873 -14490085 -15297155 -16281905
13793 -16281905 -17428869 -18687826 -19976538 -21197251 -22255755 -23068039 -23555182 -23644511 -23290636
13784 -23290636 -22507556 -21385056 -20070678 -18727778 -17498389 -16487274 -15760405 -15345231
13776 -15345231 -15229450 -15361706 -15658058 -16016618 -16338500 -16546458 -16592904 -16459784 -16157416
13767 -16157416 -15719960 -15190163 -14597922 -13949771 -13237840 -12456132 -11608209 -10704820 -9759316
13758 -9759316 -8788415 -7822589 -6916980 -6141225 -5542170 -5106996 -4761707 -4407669 -3964883
13749 -3964883 -3392113 -2683573 -1860873 -967124 -53503 843120 1717221 2596670 3534209
13740 3534209 4593445 5831475 7284765 8963571 10850089 12894885 15017068 17115261
13732 17115261 19082600 20813604 22206660 23175859 23669275 23673044 23191192 22219612 20741093
13723 20741093 18748559 16278969 13429773 10344578 7183325 4098010 1215211 -1380708
13715 -1380708 -3657511 -5625555 -7307065 -8701299 -9772602 -10473263 -10782696 -10733511 -10409941
13706 -10409941 -9919425 -9349096 -8733054 -8053542 -7272209 -6367559 -5357618 -4298561 -3264390
13697 -3264390 -2325478 -1538784 -946815 -579618 -457709 -589312 -958571 -1516314 -2185973
13688 -2185973 -2881041 -3523085 -4054238 -4442253 -4678757 -4773114 -4745067 -4621711 -4441938 -4258642
13678 -4258642 -4121445 -4041218 -3968048 -3811088 -3488631 -2970777 -2288945 -1510298 -694106 141299
13668 141299 1018862 1971631 3005711 4090809 5191150 6314064 7538537 9004225 10872924
13659 10872924 13291808 16376355 20207527 24828992 30237983 36375230 43123324 50311239
13651 50311239 57708770 65003446 71779019 77528944 81726292 83940489 83956889 81842805
13643 81842805 77929012 72720070 66775209 60602101 54590763 48994126 43942423 39471171
13635 39471171 35548087 32094441 29004068 26163337 23470220 20851689 18280588 15782991
13627 15782991 13421982 11261217 9330046 7609678 6043580 4562185 3110156 1667178
13619 1667178 253361 -1083509 -2288122 -3311848 -4120611 -4702065 -5069995 -5258971 -5308264
13610 -5308264 -5244411 -5074030 -4791376 -4398557 -3928292 -3449109 -3039629 -2746567 -2559944 -2423528
13600 -2423528 -2267291 -2036579 -1705625 -1279311 -789742 -286347 184499 604896 1001575
13591 1001575 1440126 1994064 2703420 3552083 4479781 5414448 6301200 7116894 7869072
13582 7869072 8583630 9294929 10049444 10915391 11979633 13324592 14999493 17007124 19312237
13573 19312237 21862998 24616456 27558577 30706344 34087771 37710064 41533109 45461062
13565 45461062 49352266 53039607 56355598 59157604 61345767 62871261 63740816 64018736
13557 64018736 63817441 63271361 62504648 61610589 60649461 59652422 58616703 57496890 56210652
13548 56210652 54664533 52785496 50542554 47955464 45095474 42079796 39055833 36173523
13540 36173523 33552837 31258432 29292972 27613132 26157452 24867872 23696677 22603697
13532 22603697 21552395 20509387 19445682 18337998 17172427 15948382 14675700 13365362
13524 13365362 12022564 10647065 9241075 7823036 6438218 5154580 4042474 3149575
13516 3149575 2488491 2043323 1782293 1664581 1643499 1670446 1701235 1706457 1681368 1644342 1621470
13505 1621470 1629379 1667872 1721939 1768405 1787582 1777232 1756167 1749301 1764531 1779838 1750267 1631564
13493 1631564 1406950 1097752 748401 401581 89553 -153901 -280393 -229862 50583 582890
13483 582890 1343811 2271283 3286672 4314854 5290773 6156498 6859130 7356303 7626950
13474 7626950 7676910 7530578 7212874 6737969 6115730 5367871 4536215 3676288 2844465 2089184
13464 2089184 1449610 958680 644236 523712 594584 828229 1174759 1579958 2003213 2420463
13454 2420463 2811235 3146611 3390408 3509240 3481358 3300049 2975019 2535064 2027019 1504514
13444 1504514 1010051 560692 145760 -260832 -680055 -1113655 -1546267 -1958498 -2337802
13435 -2337802 -2680944 -2992949 -3289014 -3596943 -3951696 -4379409 -4880329 -5423787 -5957896
13426 -5957896 -6426141 -6783155 -7005600 -7096267 -7084006 -7023045 -6985871 -7041784 -7229330 -7541265
13416 -7541265 -7930164 -8327252 -8663758 -8889381 -8983582 -8955009 -8829806 -8635607 -8390779 -8105371
13406 -8105371 -7787853 -7445771 -7081241 -6692580 -6285610 -5885535 -5535719 -5279181 -5135767
13397 -5135767 -5092976 -5115924 -5166432 -5217248 -5255996 -5284653 -5320359 -5389641 -5505588 -5641484 -5730195
13386 -5730195 -5696895 -5501404 -5159912 -4733343 -4292532 -3882312 -3503643 -3123952 -2710888 -2264286
13376 -2264286 -1819352 -1422839 -1107888 -882206 -725781 -598072 -457482 -280525 -64157
13367 -64157 184731 457403 748742 1067979 1446943 1931573 2561820 3358584 4323703 5445076
13357 5445076 6703354 8082873 9586034 11244658 13120878 15294093 17838153 20798018
13349 20798018 24170864 27888016 31794658 35640407 39107577 41887063 43769466 44697378
13341 44697378 44754815 44117913 43003563 41629021 40176186 38761176 37421762 36128245
13333 36128245 34809394 33383821 31791327 30015888 28089582 26076882 24053527 22094555
13325 22094555 20270071 18636175 17219478 16010251 14975310 14082373 13317597 12685987
13317 12685987 12198101 11853401 11630359 11488508 11378739 11254785 11082784 10848668 10564511
13308 10564511 10271194 10027254 9880840 9842589 9885248 9975079 10108426 10320328 10660853 11163122
13298 11163122 11825868 12616806 13490171 14405755 15339174 16280985 17227227 18164414 19056170
13289 19056170 19844262 20469301 20898596 21140186 21232064 21216859 21125150 20977715 20792219 20576849
13279 20576849 20315530 19963649 19461065 18753900 17816880 16668210 15364079 13971752 12542463
13270 12542463 11104695 9675887 8275737 6931198 5677920 4561915 3633444 2928162
13262 2928162 2446971 2148565 1956844 1781591 1549303 1230207 845328 452546 123918
13253 123918 -74874 -101184 50534 339753 681335 962953 1077621 957595 590717 12838
13243 12838 -713372 -1520956 -2355508 -3181041 -3973154 -4703379 -5326149 -5783343 -6025649 -6029665
13233 -6029665 -5797618 -5350946 -4732567 -4014115 -3294200 -2683767 -2285109 -2172443 -2381979
13224 -2381979 -2915369 -3750845 -4852882 -6176817 -7669493 -9268396 -10903542 -12504821
13216 -12504821 -14013312 -15392314 -16631810 -17742494 -18740885 -19630402 -20387506 -20964866 -21314191
13207 -21314191 -21414462 -21285881 -20983427 -20580169 -20149105 -19743756 -19383612 -19058429 -18751032
13198 -18751032 -18458498 -18196920 -17992794 -17868183 -17823567 -17827722 -17828889 -17786952 -17702741 -17620333 -17602131
13187 -17602131 -17692980 -17889299 -18126897 -18296816 -18284482 -18012881 -17468173 -16695357 -15768272 -14755750
13177 -14755750 -13707564 -12663329 -11666225 -10763499 -9992962 -9368685 -8876651 -8481156 -8138730
13168 -8138730 -7816066 -7504451 -7221728 -7001605 -6880786 -6893146 -7068708 -7430891 -7991822 -8747036
13158 -8747036 -9668045 -10695972 -11745411 -12724097 -13561506 -14228655 -14735975 -15112315 -15380778
13149 -15380778 -15548319 -15614724 -15588458 -15489139 -15331149 -15107439 -14795926 -14383185 -13877068 -13295168
13139 -13295168 -12647075 -11932975 -11158406 -10348084 -9547069 -8811026 -8192392 -7726734 -7422315
13130 -7422315 -7258991 -7200448 -7212408 -7273972 -7376799 -7515773 -7680579 -7858708 -8048349 -8263998
13120 -8263998 -8524945 -8840275 -9208102 -9627517 -10105669 -10645631 -11220373 -11757066 -12154174
13111 -12154174 -12329409 -12267677 -12033407 -11739056 -11492717 -11357063 -11338662 -11403101 -11496688 -11562486
13101 -11562486 -11553429 -11446949 -11255985 -11026664 -10820547 -10692151 -10674800 -10776829 -10983106 -11260667
13091 -11260667 -11570601 -11882518 -12180754 -12456881 -12697178 -12877940 -12973006 -12967107 -12862429 -12671615
13081 -12671615 -12406375 -12075778 -11694912 -11292630 -10909605 -10589953 -10375719 -10302607 -10387976 -10615633
13071 -10615633 -10932247 -11259222 -11511897 -11620428 -11550893 -11320296 -10995000 -10669181 -10433069
13062 -10433069 -10347709 -10436118 -10686560 -11058729 -11490732 -11911430 -12259491 -12500758 -12632221 -12669254
13052 -12669254 -12624642 -12495295 -12270167 -11956813 -11604128 -11297536 -11124393 -11130961 -11300161 -11565025
13042 -11565025 -11844554 -12073697 -12214151 -12254925 -12209937 -12107024 -11969881 -11807039 -11612451 -11368999
13032 -11368999 -11051377 -10634462 -10109244 -9494908 -8833420 -8171164 -7546094 -6987095 -6517076
13023 -6517076 -6154776 -5916027 -5811326 -5835037 -5951164 -6088686 -6154868 -6063685 -5766824 -5273752
13013 -5273752 -4653981 -4019112 -3487715 -3145696 -3019461 -3074588 -3240708 -3447728 -3652856 -3848874
13003 -3848874 -4057185 -4313034 -4648354 -5077868 -5596149 -6189600 -6856067 -7614736 -8493841
12994 -8493841 -9504897 -10624585 -11793378 -12924517 -13917172 -14674952 -15129741 -15261653 -15102349
12985 -15102349 -14717268 -14174998 -13519255 -12756793 -11865271 -10814570 -9590313 -8210259 -6727123
12976 -6727123 -5215649 -3752364 -2404710 -1235656 -309374 316518 605382 547876 159692
12967 159692 -519638 -1424165 -2463729 -3539205 -4564903 -5482576 -6259116 -6874068 -7309352
12958 -7309352 -7549895 -7592793 -7454427 -7170147 -6789197 -6366189 -5951266 -5585860 -5306647 -5150519
12948 -5150519 -5154931 -5356647 -5787700 -6459204 -7337384 -8334579 -9327449 -10190066 -10822483 -11166356
12938 -11166356 -11209380 -10979277 -10528046 -9915614 -9201542 -8441743 -7683651 -6959679 -6283025
12929 -6283025 -5650844 -5056583 -4503820 -4011508 -3610061 -3331928 -3199357 -3216309 -3371076 -3648702
12919 -3648702 -4046074 -4578191 -5267840 -6125284 -7133816 -8252681 -9434997 -10642743 -11844372
12910 -11844372 -13003851 -14078179 -15023732 -15801065 -16377674 -16736972 -16890895 -16880091 -16756508
12901 -16756508 -16564759 -16336955 -16094742 -15846791 -15585588 -15293332 -14953312 -14553089 -14073694
12892 -14073694 -13477668 -12715042 -11748584 -10579108 -9250635 -7830646 -6381438 -4949568
12884 -4949568 -3582160 -2347289 -1331587 -612732 -224833 -139548 -278492 -551604 -893349
12875 -893349 -1272295 -1676923 -2094694 -2494304 -2816229 -2975871 -2877481 -2432788 -1580061 -300115
12865 -300115 1376150 3374033 5595208 7945431 10361778 12829897 15379769 18056624
12857 18056624 20879745 23807905 26723437 29441496 31747344 33451140 34434500 34667971
12849 34667971 34201259 33141688 31631650 29827120 27879261 25921857 24061859 22371813
12841 22371813 20889088 19619501 18535911 17575307 16649520 15671121 14578678 13349664
12833 13349664 12002569 10591591 9192610 7882360 6719951 5735869 4924409 4240911
12825 4240911 3614441 2976635 2290848 1564785 839833 162977 -439464 -968477 -1440505
12816 -1440505 -1871463 -2268985 -2634319 -2963704 -3240891 -3426686 -3461000 -3285864 -2878924 -2276941
12806 -2276941 -1576859 -914293 -425978 -206320 -273335 -561671 -950282 -1313327 -1568882 -1700156
12796 -1700156 -1739964 -1733127 -1706449 -1665552 -1611155 -1554801 -1523370 -1552815 -1672974 -1886163 -2151723
12785 -2151723 -2395606 -2547277 -2577070 -2503455 -2367928 -2201747 -2007755 -1763000 -1435793 -1006638
12775 -1006638 -481323 111647 734768 1352661 1933583 2449221 2883900 3250715 3597447
12766 3597447 3988808 4473255 5058439 5711146 6377415 7007326 7571618 8064924 8495724
12757 8495724 8868029 9168752 9372649 9457111 9409015 9219125 8873601 8351733 7633854 6719782
12747 6719782 5648429 4499417 3368400 2333738 1439507 700054 111090 -346093 -704714
12738 -704714 -1008488 -1302524 -1622359 -1983399 -2374505 -2760407 -3092018 -3318337 -3396271 -3299503
12728 -3299503 -3025768 -2596793 -2047063 -1406926 -692445 88844 920455 1762157 2549399
12719 2549399 3207767 3673119 3904020 3882433 3610637 3110531 2423794 1612044 760496 -17445
12709 -17445 -590839 -850535 -764531 -412519 32957 379072 500263 385607 118569 -185391
12699 -185391 -433876 -580116 -619303 -574163 -480919 -377902 -294011 -239996 -208170 -178543 -126241
12688 -126241 -29674 119272 305440 488630 615506 642029 557386 398291 244722 196946
12678 196946 341828 720327 1311278 2041167 2813105 3537928 4153890 4630209 4959391 5150272
12668 5150272 5229232 5242806 5246281 5274960 5320391 5337689 5277257 5108033 4815503 4390818 3836039
12657 3836039 3187068 2529670 1987676 1687898 1721233 2116564 2838832 3814922 4974448
12648 4974448 6279369 7725488 9321556 11062996 12913867 14802980 16632563 18295691
12640 18295691 19699340 20785576 21539173 21976685 22127436 22025005 21714609 21261611 20746269
12631 20746269 20245844 19814607 19469865 19189496 18925028 18624816 18252386 17792059 17248275
12622 17248275 16645086 16022634 15426996 14897776 14459777 14119860 13869974 13698708 13603916
12613 13603916 13591467 13659813 13788277 13940968 14078502 14165129 14174207 14101850 13981812 13882592
12603 13882592 13881745 14034272 14356214 14829633 15419221 16089078 16813828 17582179 18395114 19262162
12593 19262162 20195739 21202795 22278123 23406866 24574405 25771809 26993210 28233079
12585 28233079 29484145 30727057 31914926 32973559 33827319 34432343 34794901 34972904 35067515
12576 35067515 35202137 35484409 35966480 36632739 37426093 38291803 39206227 40173295 41197581
12567 41197581 42258685 43306954 44280792 45129117 45823778 46359649 46748328 47009356 47159219
12558 47159219 47205253 47156985 47049546 46951006 46937057 47052196 47290922 47609464 47949696 48255359
12548 48255359 48477336 48575531 48524254 48320454 47986717 47564710 47106846 46672913 46324167 46107944
12538 46107944 46040875 46102113 46242002 46409616 46590757 46828927 47209747 47822304 48726685 49938750
12528 49938750 51422448 53086326 54794146 56393536 57753987 58801797 59540131 60043618
12520 60043618 60427126 60804601 61257564 61820122 62475552 63162064 63792803 64289400 64612521
12511 64612521 64768611 64787883 64690909 64470893 64105301 63586748 62951081 62285019 61706375 61324868
12501 61324868 61204517 61344548 61680452 62100470 62473705 62682943 62650560 62349423 61800184
12492 61800184 61058642 60192703 59252434 58249750 57166125 55984111 54716301 53413882
12484 53413882 52158238 51043572 50153563 49537676 49197727 49090343 49139135 49246001 49298364
12475 49298364 49179483 48789798 48073588 47034594 45732481 44263873 42734702 41232522
12467 41232522 39809898 38485122 37256693 36122554 35093059 34188259 33423270 32798359
12459 32798359 32300258 31904558 31573605 31258397 30910949 30500329 30020525 29487073 28928363
12450 28928363 28375017 27845180 27331630 26805734 26240029 25629840 24996386 24373586 23791201
12441 23791201 23262982 22782935 22330484 21882611 21427336 20972780 20548723 20196763 19946472
12432 19946472 19787976 19663271 19489083 19202231 18801180 18354351 17966714 17728408 17676786
12423 17676786 17785153 17976344 18153782 18236823 18184184 17996305 17699000 17317705 16857749 16306685
12413 16306685 15656191 14920322 14132224 13324379 12512892 11699907 10886281 10077144 9278851
12404 9278851 8497990 7743003 7020640 6327733 5648172 4961186 4256426 3547434 2875990
12395 2875990 2299921 1864923 1576403 1393092 1250592 1097508 916083 718828 533161
12386 533161 381653 260751 131406 -65748 -378858 -818952 -1354428 -1926442 -2475256 -2961024
12376 -2961024 -3365173 -3675705 -3874150 -3938595 -3860908 -3660548 -3380660 -3072825 -2786836 -2570998
12366 -2570998 -2474359 -2538453 -2776959 -3156895 -3597318 -3990843 -4239493 -4288265 -4141254 -3852673
12356 -3852673 -3497878 -3141586 -2819696 -2538876 -2287125 -2045794 -1798226 -1536252 -1265855
12347 -1265855 -1006915 -781346 -595574 -430277 -241922 27643 434187 1006370 1723526
12338 1723526 2513829 3279997 3937086 4435788 4758364 4898908 4849768 4603830 4165869 3564061
12328 3564061 2858774 2144517 1538398 1154436 1070601 1299141 1773661 2364333 2918339 3306598
12318 3306598 3456192 3358392 3053775 2604419 2067767 1482479 865383 215153 -476083 -1204446
12308 -1204446 -1941670 -2640486 -3255029 -3758499 -4143242 -4408990 -4556634 -4591575 -4527390 -4384956
12298 -4384956 -4188769 -3962362 -3726331 -3504239 -3333898 -3270974 -3376507 -3695464 -4239166 -4976759
12288 -4976759 -5836021 -6714843 -7502993 -8109264 -8484942 -8632150 -8591145 -8414393 -8144844 -7811800
12278 -7811800 -7442238 -7072821 -6748536 -6505492 -6351159 -6261515 -6200689 -6147717 -6110380 -6120315
12268 -6120315 -6217257 -6432696 -6780935 -7260187 -7857389 -8549707 -9305521 -10090182 -10872162 -11621497
12258 -11621497 -12302712 -12872763 -13289775 -13527871 -13587302 -13493375 -13289168 -13028366 -12764429 -12533712
12248 -12533712 -12344700 -12185332 -12041079 -11907540 -11792530 -11713897 -11697205 -11769602 -11945746 -12212449
12238 -12212449 -12529687 -12858333 -13197775 -13600401 -14147375 -14902309 -15873548 -17004563 -18192772
12229 -18192772 -19324208 -20305639 -21078765 -21614617 -21900359 -21932099 -21717057 -21280993 -20675512
12220 -20675512 -19977516 -19275623 -18649614 -18154522 -17810748 -17595498 -17442861 -17264686 -16986334
12211 -16986334 -16575102 -16045213 -15443537 -14831201 -14268290 -13800391 -13448646 -13206287 -13041356
12202 -13041356 -12906999 -12758111 -12565755 -12324270 -12053323 -11791270 -11573627 -11408311 -11272731
12193 -11272731 -11140013 -11009285 -10908336 -10864805 -10874272 -10897464 -10888491 -10825469 -10718935 -10599635
12183 -10599635 -10502252 -10456538 -10484164 -10593600 -10773267 -10992606 -11214768 -11410866 -11565070 -11671108
12173 -11671108 -11727312 -11734467 -11698743 -11640541 -11600665 -11630986 -11771614 -12032783 -12396107 -12831977
12163 -12831977 -13315668 -13829687 -14359700 -14895119 -15428951 -15949742 -16433057 -16841951 -17138528
12154 -17138528 -17304630 -17362139 -17375934 -17433068 -17611566 -17955242 -18461302 -19083459 -19751086 -20396369
12144 -20396369 -20975226 -21473039 -21897139 -22264309 -22589367 -22875989 -23110415 -23261487 -23290614
12135 -23290614 -23168755 -22889681 -22472658 -21958361 -21403336 -20873728 -20438225 -20159822 -20084383
12126 -20084383 -20225226 -20551888 -20999176 -21499321 -22013705 -22538361 -23083562 -23646672 -24195784
12117 -24195784 -24672544 -25011027 -25161283 -25105765 -24862006 -24473664 -24000010 -23511919 -23090455
12108 -23090455 -22816896 -22751742 -22914275 -23277815 -23785457 -24376000 -25004312 -25648588 -26305299
12099 -26305299 -26974199 -27640855 -28269266 -28809424 -29212990 -29448591 -29510307 -29413943 -29181495 -28822959
12089 -28822959 -28327650 -27670501 -26828197 -25796228 -24602577 -23314964 -22032746 -20857715
12081 -20857715 -19858604 -19056472 -18439337 -17986255 -17679974 -17508066 -17461967 -17536043 -17725083 -18020971
12071 -18020971 -18409462 -18867121 -19357345 -19824154 -20191922 -20384830 -20362151 -20143481 -19802096
12062 -19802096 -19432082 -19115054 -18904285 -18823838 -18874723 -19045203 -19320846 -19685562 -20112627 -20560004
12052 -20560004 -20983107 -21356446 -21685122 -22000688 -22348084 -22769078 -23285377 -23886235 -24527409
12043 -24527409 -25144467 -25671727 -26052225 -26234796 -26169807 -25817236 -25169160 -24273117 -23234925
12034 -23234925 -22192687 -21277723 -20584101 -20155656 -19989867 -20055998 -20319235 -20754322 -21339084
12025 -21339084 -22038665 -22797274 -23542771 -24200798 -24712604 -25048860 -25212103 -25224670 -25109263
12016 -25109263 -24878503 -24542489 -24124050 -23663471 -23206929 -22789267 -22423111 -22096096 -21773487
12007 -21773487 -21408633 -20962520 -20423450 -19815856 -19194955 -18627315 -18161201 -17802786 -17518326
11998 -17518326 -17263385 -17017385 -16800004 -16661915 -16657922 -16818205 -17132371 -17551121 -18000108 -18398956
11988 -18398956 -18681868 -18815876 -18808639 -18700983 -18550935 -18417252 -18342071 -18335064 -18370273 -18402575
11978 -18402575 -18396677 -18352615 -18312929 -18348523 -18534529 -18929289 -19558892 -20405078 -21402823 -22456945
11968 -22456945 -23473843 -24393037 -25203761 -25936817 -26632693 -27303519 -27913391 -28389513 -28656582
11959 -28656582 -28672016 -28437857 -27985161 -27352896 -26584609 -25742344 -24917690 -24222570 -23760544
11950 -23760544 -23595792 -23737905 -24145351 -24738317 -25414398 -26066665 -26604117 -26969586 -27145233
11941 -27145233 -27143881 -26998708 -26757774 -26474311 -26189092 -25918156 -25656051 -25386233 -25088119 -24744656
11931 -24744656 -24354857 -23940697 -23536122 -23165061 -22828090 -22506314 -22173515 -21805785 -21386088
11922 -21386088 -20903754 -20349889 -19717197 -19011478 -18265536 -17539681 -16908329 -16444294 -16205943
11913 -16205943 -16224357 -16493986 -16979083 -17638404 -18448389 -19402213 -20485629 -21650193 -22803469
11904 -22803469 -23825969 -24610976 -25105400 -25324433 -25333710 -25218848 -25065071 -24952871 -24959592 -25151265
11894 -25151265 -25559442 -26159906 -26878553 -27627659 -28345958 -29013741 -29639016 -30233598 -30798828
11885 -30798828 -31325149 -31797490 -32196919 -32497232 -32665470 -32673071 -32510363 -32191186 -31742200 -31184419
11875 -31184419 -30521797 -29744829 -28844993 -27832114 -26747603 -25664511 -24667888 -23822955 -23152095
11866 -23152095 -22635895 -22231869 -21892833 -21576371 -21252235 -20915381 -20597573 -20362039 -20278329
11857 -20278329 -20393725 -20717821 -21221113 -21841586 -22498028 -23108373 -23608823 -23971313 -24213192
11848 -24213192 -24388804 -24563187 -24784290 -25070322 -25413901 -25793220 -26181420 -26551213 -26876827
11839 -26876827 -27136530 -27312454 -27382778 -27315102 -27075178 -26647525 -26051458 -25342479 -24598796 -23900046
11829 -23900046 -23309533 -22865705 -22580963 -22447271 -22447705 -22563873 -22770187 -23023530 -23264145 -23428097
11819 -23428097 -23461117 -23332526 -23049373 -22658596 -22226903 -21809383 -21431859 -21100377 -20825876
11810 -20825876 -20640054 -20589974 -20718041 -21043405 -21558114 -22239162 -23063877 -24016757 -25088437
11801 -25088437 -26271868 -27554975 -28908801 -30277014 -31575037 -32701227 -33557071 -34071268
11793 -34071268 -34219170 -34029042 -33575077 -32960906 -32293671 -31655579 -31091469 -30620372 -30254681
11784 -30254681 -30007832 -29890857 -29908067 -30052841 -30298856 -30593887 -30870409 -31070359 -31162575 -31140960
11774 -31140960 -31015784 -30812228 -30571943 -30348655 -30198643 -30170501 -30295946 -30582866 -31011263
11765 -31011263 -31532438 -32075257 -32563238 -32938262 -33180244 -33311327 -33378869 -33426694 -33476292 -33528526
11755 -33528526 -33574856 -33605755 -33616314 -33609992 -33597293 -33591645 -33608215 -33662146 -33758043 -33875526 -33967583
11744 -33967583 -33979543 -33878159 -33672842 -33416058 -33179746 -33016636 -32928229 -32862967 -32746777 -32521147
11734 -32521147 -32163960 -31691882 -31154020 -30618282 -30149830 -29789027 -29538986 -29367835 -29224873
11725 -29224873 -29063994 -28863710 -28634867 -28413597 -28243818 -28158424 -28167899 -28259032 -28400211 -28547565
11715 -28547565 -28651159 -28669640 -28594750 -28466196 -28358364 -28347772 -28484479 -28780465 -29216909 -29762412
11705 -29762412 -30383009 -31034702 -31656849 -32188474 -32600339 -32914840 -33196385 -33518247 -33928011
11696 -33928011 -34431479 -34996961 -35571930 -36106338 -36575932 -36996071 -37417529 -37901441 -38485133
11687 -38485133 -39160199 -39874512 -40552103 -41116316 -41505824 -41681774 -41627953 -41346742 -40854747
11678 -40854747 -40178451 -39347944 -38392307 -37342136 -36236651 -35126778 -34069498 -33116946 -32308294
11669 -32308294 -31670001 -31222127 -30982205 -30961051 -31152137 -31521609 -32008799 -32541415 -33054917
11660 -33054917 -33498948 -33828143 -33992744 -33941714 -33635696 -33060399 -32235157 -31216575 -30096693
11651 -30096693 -28992972 -28030552 -27322759 -26954917 -26969954 -27355938 -28043275 -28916463 -29836148
11642 -29836148 -30666737 -31306571 -31710747 -31891809 -31898962 -31795456 -31647264 -31516125 -31447045 -31455901
11632 -31455901 -31530372 -31643659 -31769721 -31895326 -32027711 -32192568 -32421469 -32738588 -33157252
11623 -33157252 -33684010 -34317269 -35034294 -35776988 -36454357 -36968249 -37248083 -37270908 -37057730
11614 -37057730 -36659036 -36142562 -35580173 -35029470 -34517926 -34039814 -33567603 -33072905 -32549861
11605 -32549861 -32029777 -31575773 -31258786 -31131499 -31214951 -31495717 -31925254 -32426866 -32922070
11596 -32922070 -33365822 -33759572 -34128456 -34485621 -34817950 -35104258 -35346222 -35582424 -35871871
11587 -35871871 -36258954 -36745498 -37288747 -37823377 -38287642 -38637689 -38853301 -38943610 -38948921 -38929620
11577 -38929620 -38944784 -39034108 -39211352 -39466329 -39771887 -40096763 -40419923 -40734569 -41038156 -41320759
11567 -41320759 -41564151 -41747245 -41845641 -41827019 -41655749 -41309426 -40793548 -40142965 -39414511 -38678188
11557 -38678188 -38005127 -37450178 -37036469 -36753859 -36575738 -36485461 -36493800 -36631310 -36919822 -37349775
11547 -37349775 -37885506 -38489355 -39136862 -39812574 -40500789 -41185418 -41858021 -42524680 -43202889
11538 -43202889 -43906102 -44625349 -45324311 -45953642 -46471327 -46852084 -47084681 -47166681 -47096791 -46861627
11528 -46861627 -46429843 -45770751 -44890976 -43858958 -42793482 -41824327 -41055061 -40547725 -40325245
11519 -40325245 -40378860 -40675712 -41167233 -41797548 -42511727 -43265270 -44029426 -44782558 -45491184
11510 -45491184 -46098711 -46533162 -46727960 -46644206 -46285287 -45694417 -44934678 -44069794 -43160246
11501 -43160246 -42263753 -41425377 -40666196 -39987383 -39385999 -38865841 -38439457 -38127893 -37957532
11492 -37957532 -37950753 -38115119 -38437408 -38884227 -39409175 -39964602 -40511947 -41022947 -41469682 -41813219
11482 -41813219 -42004350 -41997724 -41769524 -41330075 -40727391 -40039894 -39358710 -38764265 -38306897 -38001636
11472 -38001636 -37839914 -37809775 -37908650 -38136748 -38475696 -38873637 -39256380 -39560503 -39760348 -39865193
11462 -39865193 -39894147 -39857207 -39757671 -39606680 -39433522 -39281567 -39188529 -39160984 -39161339 -39121170 -38977332
11451 -38977332 -38709251 -38352300 -37977845 -37654197 -37414073 -37245688 -37109192 -36967819 -36813826
11442 -36813826 -36670382 -36570834 -36536849 -36571899 -36666980 -36808417 -36984435 -37189209 -37419870 -37668460
11432 -37668460 -37919971 -38161864 -38396547 -38643893 -38928228 -39255247 -39591691 -39860367 -39957410
11423 -39957410 -39790424 -39322172 -38590212 -37685761 -36713159 -35764761 -34920628 -34257870 -33851686
11414 -33851686 -33758419 -33985398 -34470880 -35098799 -35744445 -36320324 -36797860 -37203947 -37601160
11405 -37601160 -38058408 -38619069 -39275657 -39959774 -40553702 -40924501 -40971475 -40666269 -40063456
11396 -40063456 -39276556 -38434523 -37639572 -36943119 -36347477 -35827730 -35360278 -34947478 -34631005
11387 -34631005 -34483737 -34576115 -34933730 -35514447 -36217437 -36912701 -37474035 -37804476 -37847932 -37587828
11377 -37587828 -37041669 -36260071 -35329649 -34370792 -33521474 -32906625 -32604464 -32628047 -32931855
11368 -32931855 -33434883 -34043124 -34665003 -35227359 -35695354 -36083908 -36446118 -36840223 -37294791
11359 -37294791 -37795849 -38301777 -38767744 -39158227 -39444343 -39598249 -39595217 -39422031 -39083146 -38600000
11349 -38600000 -38007057 -37349463 -36682658 -36071805 -35586290 -35282384 -35175679 -35219836 -35310872 -35322711
11339 -35322711 -35159651 -34796121 -34277595 -33684033 -33087308 -32533948 -32054056 -31673320 -31410390
11330 -31410390 -31263373 -31202278 -31177610 -31138198 -31043591 -30866400 -30593483 -30232508 -29816892 -29398568
11320 -29398568 -29029284 -28741712 -28539215 -28395742 -28265785 -28102763 -27877697 -27587038 -27245860
11311 -27245860 -26876034 -26502892 -26160281 -25890395 -25730093 -25692335 -25759398 -25893688 -26056766 -26224848
11301 -26224848 -26396351 -26593813 -26862253 -27260858 -27842034 -28621389 -29560347 -30581913 -31609842
11292 -31609842 -32598313 -33532811 -34412447 -35234255 -35989139 -36665575 -37251615 -37732267 -38089863
11283 -38089863 -38314447 -38420118 -38452188 -38468900 -38501966 -38529814 -38494382 -38348190 -38087958 -37753174
11273 -37753174 -37404906 -37106124 -36911323 -36863108 -36988452 -37292147 -37756665 -38352769 -39047910
11264 -39047910 -39802639 -40565098 -41277182 -41891355 -42384979 -42762018 -43045128 -43265923 -43454679
11255 -43454679 -43628389 -43780395 -43876093 -43856512 -43650629 -43196222 -42461824 -41457557 -40233040
11246 -40233040 -38873247 -37495543 -36234040 -35204221 -34468296 -34028569 -33849273 -33882175 -34078295
11237 -34078295 -34390317 -34775563 -35199130 -35630907 -36034028 -36352311 -36512069 -36447765 -36139515
11228 -36139515 -35634607 -35034826 -34456639 -33987829 -33663168 -33466451 -33348766 -33250348 -33121940
11219 -33121940 -32942038 -32721879 -32496254 -32309771 -32206565 -32219211 -32353589 -32581870 -32855934
11210 -32855934 -33134074 -33400233 -33661892 -33932485 -34217791 -34519049 -34846306 -35223573 -35675425
11201 -35675425 -36206186 -36793019 -37398167 -37984341 -38518307 -38964859 -39283270 -39431816 -39375970
11192 -39375970 -39096718 -38598952 -37916643 -37109661 -36249063 -35393081 -34567204 -33763370 -32956405
11183 -32956405 -32124451 -31264218 -30396767 -29564639 -28827545 -28259906 -27942436 -27940166 -28273947 -28904168
11173 -28904168 -29739018 -30661241 -31557918 -32343957 -32975386 -33448727 -33789718 -34040799 -34248431
11164 -34248431 -34446818 -34646646 -34839326 -35009095 -35138200 -35206215 -35197600 -35121685 -35027245 -34991079
11154 -34991079 -35083315 -35333535 -35720230 -36187582 -36674017 -37132326 -37533974 -37863438 -38111485
11145 -38111485 -38275264 -38367934 -38427591 -38507783 -38645087 -38825150 -38978736 -39017025 -38881220 -38573229
11135 -38573229 -38154156 -37716956 -37348512 -37101468 -36989934 -37005609 -37138307 -37385327 -37745796
11126 -37745796 -38209560 -38750758 -39328633 -39895146 -40408401 -40846205 -41209508 -41510853 -41757623
11117 -41757623 -41946435 -42071614 -42134269 -42141604 -42100828 -42016166 -41889041 -41715060 -41476569 -41139777
11107 -41139777 -40666368 -40038614 -39285219 -38490048 -37772548 -37246819 -36980829 -36974776 -37165038 -37449460
11097 -37449460 -37723484 -37915074 -38008099 -38043840 -38095622 -38227428 -38459736 -38762701 -39079431 -39360123
11087 -39360123 -39582173 -39747846 -39868386 -39948709 -39984524 -39974315 -39935061 -39905250 -39930608 -40046474
11077 -40046474 -40272721 -40620424 -41095988 -41695868 -42400909 -43179973 -44001027 -44840658 -45684137
11068 -45684137 -46516302 -47312839 -48040655 -48664342 -49149843 -49464402 -49581382 -49495943 -49240722
11059 -49240722 -48880046 -48479265 -48072864 -47653914 -47186929 -46634603 -45985471 -45265723 -44524381
11050 -44524381 -43802626 -43113504 -42446552 -41787388 -41134044 -40502679 -39925480 -39442907 -39090135
11041 -39090135 -38881618 -38803569 -38821324 -38896900 -39002611 -39120630 -39232436 -39309572 -39312734 -39199548
11031 -39199548 -38939828 -38534337 -38024908 -37485572 -37001054 -36647714 -36483904 -36548408 -36861590
11022 -36861590 -37420928 -38190283 -39095558 -40038335 -40922684 -41675960 -42246319 -42582455 -42624699
11013 -42624699 -42327246 -41696140 -40811111 -39814599 -38871725 -38118729 -37625597 -37391447 -37368482
11004 -37368482 -37494326 -37715886 -38000404 -38336780 -38728364 -39176865 -39664752 -40151149 -40589443
10995 -40589443 -40954714 -41257843 -41537135 -41837058 -42182650 -42553547 -42871789 -43021980 -42902401
10986 -42902401 -42476976 -41791369 -40944285 -40040553 -39157377 -38332291 -37568770 -36856630 -36196206
10977 -36196206 -35607377 -35116920 -34738634 -34465877 -34280554 -34164075 -34095204 -34037231 -33931491 -33709881
10967 -33709881 -33321816 -32760268 -32072638 -31346324 -30670833 -30103397 -29669129 -29389071 -29299190
10958 -29299190 -29440761 -29835710 -30467049 -31273965 -32165142 -33045349 -33839591 -34504356 -35028337
$$ [...]
##END NTUPLES=NMR SPECTRUM
##END=
