##TITLE=31P ikalashn
LR-793-RB-O-C1
18.12.2024
##JCAMPDX= 6.0         $$ Bruker NMR JCAMP-DX V2.0
##DATA TYPE= NMR SPECTRUM
##DATA CLASS= NTUPLES
##ORIGIN= UXNMR, Bruker Analytische Messtechnik GmbH
##OWNER= root
$$ TOPSPIN		Version 1.3
$$ 2024-12-18 10:36:20.093 +0400  Irina@DPX200
$$ Compression mode = diff/dup
##.OBSERVE FREQUENCY= 81.01967998063
##.OBSERVE NUCLEUS= ^31P
##.ACQUISITION MODE= SIMULTANEOUS
##.ACQUISITION SCHEME= undefined
##.AVERAGES= 128
##.DIGITISER RES= 17
##SPECTROMETER/DATA SYSTEM= spect
##.PULSE SEQUENCE= zgpg
##.SOLVENT NAME= D2O
##.SHIFT REFERENCE= INTERNAL, D2O, 1, 298.5841
##AUDIT TRAIL= $$ (NUMBER, WHEN, WHO, WHERE, WHAT)
$$ ##TITLE= Audit trail, TOPSPIN		Version 1.3
$$ ##JCAMPDX= 5.01
$$ ##ORIGIN= Bruker BioSpin GmbH
$$ ##OWNER= Irina
$$ $$ F:/spectra/data/iren/nmr/P31dec/1/pdata/1/auditp.txt
$$ ##AUDIT TRAIL=  $$ (NUMBER, WHEN, WHO, WHERE, VERSION, WHAT)
(   1,<2024-12-18 10:35:39.437 +0400>,<Irina>,<DPX200>,<TOPSPIN 1.3>,
      <created by zg
	started at 2024-12-18 10:32:21.468 +0400,
	POWCHK disabled, PULCHK disabled
       configuration hash MD5:
       BE 6D 3F 07 2A EA 11 49 91 17 2B D3 AF B3 58 0D
       data hash MD5: 32K
       09 06 79 DA EF 10 11 4B 4B 4D B9 A5 9E 58 6B E7>)
(   2,<2024-12-18 10:35:59.609 +0400>,<Irina>,<DPX200>,<TOPSPIN 1.3>,
      <Start of raw data processing
       efp BC_mod = 2 LB = 12 FT_mod = 6 PKNL = 1 PHC0 = 73.70969 PHC1 = -82.89046 SI = 32K 
       data hash MD5: 32K
       90 59 A7 CA D5 9E 9C EB 43 64 0F 16 C8 7F EE A9>)
(   3,<2024-12-18 10:36:01.984 +0400>,<Irina>,<DPX200>,<TOPSPIN 1.3>,
      <apk 
       data hash MD5: 32K
       A5 4B E4 6E 2F AA 38 85 3B FF B9 1E BB 1F 2A 28>)
(   4,<2024-12-18 10:36:04.187 +0400>,<Irina>,<DPX200>,<TOPSPIN 1.3>,
      <abs n ABSG = 5 
       data hash MD5: 32K
       65 1F 54 19 E1 65 16 57 A4 B3 A1 D2 92 DC 46 38>)
(   5,<2024-12-18 10:36:10.203 +0400>,<Irina>,<DPX200>,<TOPSPIN 1.3>,
      <pk fgphup PHC0 = -3 PHC1 = 0 
       data hash MD5: 32K
       BB 4E 2E 59 41 07 53 48 6E 29 1B 1A EA E4 17 47>)
$$ ##END=
$$ 
$$ $$ hash MD5
$$ $$ 66 24 E4 A3 34 59 79 4A F8 28 A7 5E 20 EE AB 5E
##$RELAX= 
##$RELAX= 
##$RELAX= 
##$RELAX= 
##$RELAX= 
##$RELAX= 
##$RELAX= 
##$RELAX= 
##$RELAX= 
##$RELAX= 
##$RELAX= 
$$ Bruker specific parameters
$$ --------------------------
##$DU= <F:/spectra>
##$EXPNO= 1
##$NAME= <P31dec>
##$PROCNO= 1
##$TYPE= <nmr>
##$USER= <iren>
##$AMP= (0..31)
100 100 100 100 100 100 100 100 100 100 100 100 100 100 100 100 100 100 
100 100 100 100 100 100 100 100 100 100 100 100 100 100 
##$ANAVPT= -1
##$AQSEQ= 0
##$AQ_mod= 1
##$AUNM= <au_zg>
##$AUTOPOS= <>
##$BF1= 81.014009
##$BF2= 200.13
##$BF3= 200.13
##$BF4= 200.13
##$BF5= 200.13
##$BF6= 200.13
##$BF7= 200.13
##$BF8= 200.13
##$BYTORDA= 1
##$CFDGTYP= 0
##$CFRGTYP= 5
##$CHEMSTR= <none>
##$CNST= (0..63)
1 1 145 1 1 1 1 1 1 1 1 1 1 1 1 1 1 1 1 1 1 1 1 1 1 1 1 1 1 1 1 1 1 1 
1 1 1 1 1 1 1 1 1 1 1 1 1 1 1 1 1 1 1 1 1 1 1 1 1 1 1 1 1 1 
##$CPDPRG= <waltz16>
##$CPDPRG1= <>
$$ [...]
##$SW_h= 37037.037037037
##$TD= 32768
##$TD0= 1
##$TE= 300
##$TE2= 300
##$TE3= 300
##$TEG= 300
##$TL= (0..7)
0 120 53 12 22 120 120 120 
##$TP= (0..7)
150 150 150 150 150 150 150 150 
##$TP07= 0
##$TPNAME0= <>
##$TPNAME1= <>
##$TPNAME2= <>
##$TPNAME3= <>
##$TPNAME4= <>
##$TPNAME5= <>
##$TPNAME6= <>
##$TPNAME7= <>
##$TPOAL= (0..7)
0.5 0.5 0.5 0.5 0.5 0.5 0.5 0.5 
##$TPOFFS= (0..7)
0 0 0 0 0 0 0 0 
##$TUNHIN= 0
##$TUNHOUT= 0
##$TUNXOUT= 0
##$USERA1= <user>
##$USERA2= <user>
##$USERA3= <user>
##$USERA4= <user>
##$USERA5= <user>
##$V9= 5
##$VALIST= <valist>
##$VCLIST= <CCCCCCCCCCCCCCC>
##$VD= 0
##$VDLIST= <DDDDDDDDDDDDDDD>
##$VPLIST= <PPPPPPPPPPPPPPP>
##$VTLIST= <TTTTTTTTTTTTTTT>
##$WBST= 1024
##$WBSW= 4
##$XGAIN= (0..3)
0 0 0 0 
##$XL= 0
##$YL= 0
##$YMAX_a= 15797
##$YMIN_a= -9831
##$ZGOPTNS= <>
##$ZL1= 120
##$ZL2= 120
##$ZL3= 120
##$ZL4= 120
##$ABSF1= 298.5841
##$ABSF2= -158.5842
##$ABSG= 5
##$ABSL= 5
##$ALPHA= 0
##$AQORDER= 0
##$ASSFAC= 0
##$ASSFACI= 0
##$ASSFACX= 0
##$ASSWID= 0
##$AUNMP= <proc_1d>
##$AXLEFT= 0
##$AXRIGHT= 0
##$AXTYPE= 0
##$AXUNIT= <>
##$AZFE= 0.1
##$AZFW= 0.5
##$BCFW= 0
##$BC_mod= 2
##$BYTORDP= 0
##$COROFFS= 0
##$CY= 12.5935478210449
##$DATMOD= 1
##$DC= 0
##$DFILT= <>
##$DTYPP= 0
##$F1P= 47.1127640792319
##$F2P= -24.0371245302204
##$FCOR= 0.5
##$FTSIZE= 32768
##$FT_mod= 6
##$GAMMA= 0
##$GB= 0
##$INTBC= 1
##$INTSCL= 7.269226e-011
##$ISEN= 30
##$LB= 12
##$LEV0= 0
##$LPBIN= 0
##$MAXI= 12.09355
##$MC2= 0
##$MEAN= 0
##$ME_mod= 0
##$MI= 0.7550151
##$NCOEF= 0
##$NC_proc= -13
##$NLEV= 6
##$NOISF1= 298.5841
##$NOISF2= 270.0111
##$NSP= 0
##$NTH_PI= 0
##$NZP= 0
##$OFFSET= 298.5841
##$PC= 1.4
##$PHC0= 35.81481
##$PHC1= -6.78759
##$PH_mod= 1
##$PKNL= yes
##$PPARMOD= 0
##$PPDIAG= 0
##$PPIPTYP= 0
##$PPMPNUM= 100
##$PPRESOL= 1
##$PSCAL= 0
##$PSIGN= 0
##$REVERSE= no
##$SF= 81.014009
##$SI= 32768
##$SIGF1= 270.0111
##$SIGF2= -158.5842
##$SINO= 77.54984
##$SIOLD= 32768
##$SREGLST= <31P.CDCl3>
##$SSB= 0
##$STSI= 32768
##$STSR= 0
##$SW_p= 37037.037037037
##$SYMM= 0
##$S_DEV= 0
##$TDeff= 32768
##$TDoff= 0
##$TI= <>
##$TILT= no
##$TM1= 0
##$TM2= 0
##$TOPLEV= 0
##$USERP1= <user>
##$USERP2= <user>
##$USERP3= <user>
##$USERP4= <user>
##$USERP5= <user>
##$WDW= 1
##$XDIM= 32768
##$YMAX_p= 349999920
##$YMIN_p= -38652013
$$ End of Bruker specific parameters
$$ ---------------------------------
##NTUPLES= NMR SPECTRUM
##VAR_NAME=  FREQUENCY,     SPECTRUM/REAL,   SPECTRUM/IMAG
##SYMBOL=    X,             R,               I
##VAR_TYPE=  INDEPENDENT,   DEPENDENT,       DEPENDENT
##VAR_FORM=  AFFN,          ASDF,            ASDF
##VAR_DIM=   32768,         32768,           32768
##UNITS=     HZ,            ARBITRARY UNITS, ARBITRARY UNITS
##FACTOR=    1.13031516577767, 1,            1
##FIRST=     37037.037037037, -472919,       84170442
##LAST=      0,             -7682121,        -57230351
##MIN=       0,             -38652013,       0
##MAX=       37037.037037037, 349999920,     0
$$ Real data points
##PAGE= N=1
##DATA TABLE= (X++(R..R)), XYDATA
$$ [...]
$$ plain form
17885 -779012 -2473951 -3718575 -4236554 -3886750 -2723113 -999087 902325 2601997 3855646
17876 3855646 4624771 5039005 5236627 5216982 4869780 4140120 3118883 1976592 894248
17867 894248 89175 -196911 163580 1039340 2030435 2628671 2466443 1488078 -64309
17858 -64309 -1816752 -3468614 -4920680 -6259467 -7627805 -9110364 -10741293 -12557278
17850 -12557278 -14543333 -16505381 -18064298 -18869163 -18861441 -18328850 -17706840 -17319724 -17257633
17841 -17257633 -17420401 -17635116 -17741533 -17609763 -17126636 -16179050 -14670547 -12610651 -10198298
17832 -10198298 -7760015 -5567692 -3707375 -2090113 -552072 1034764 2691264 4318618
17824 4318618 5722594 6647112 6822766 6057159 4332232 1828776 -1136062 -4227071 -7197922
$$ packed form
17885g79012j694939j244624n17979L49804J163637J724026J901412J699672J253649
17876C855646P69125M14234J97622j9645l47202p29660j021237j142291j082344
17867H94248q05073k86086L60491Q75760R91095N98236j62228r78365j552387
17858f4309j752443j651862j452066j338787j368338j482559j630929j815985
17850a2557278j986055j962048j558917q04865P722N32591O22010L87116O2091
17841a7257633j62768k14715j06417J31770M83127R47586J508503K059896K412353
17832a0198298K438283K192323J860317J617262J538041J586836J656500J627354
17824D318618J403976R24518J75654p65607j724927k503456k964838l091009k970851
$$ plain form
17815 -7197922 -9888901 -12144841 -13780831 -14639646 -14662567 -13873021 -12307039 -10004578 -7074078
17806 -7074078 -3750276 -403396 2497305 4489663 5269969 4811228 3396608 1528972
17798 1528972 -255798 -1561060 -2198797 -2164679 -1559842 -466674 1135861 3265312 5714023
17789 5714023 8029163 9783594 10818734 11187005 10949322 10118857 8723208 6825873 4554912
17780 4554912 2164012 -3760 -1650601 -2638881 -3005541 -2858484 -2256784 -1202202 269382
17771 269382 2019484 3850360 5595730 7136356 8355211 9129002 9376792 9107837 8421203
17762 8421203 7479199 6503600 5760312 5452893 5578894 5903672 6107452 5994207 5588517
17753 5588517 5059167 4565993 4176232 3892524 3726830 3758249 4127405 4960765 6281830
$$ packed form
17815g197922k690979k255940j635990q58815k2921P89546J565982K302461K930500
17806g074078L323802L346880K900701J992358P80306m58741j414620j867636
17798A528972j784770j305262o37737L4118O04837J093168J602535K129451K448711
17789E714023K315140J754431J035140L68271k37683q30465j395649j897335k270961
17780D554912k390900k167772j646841r88280l66660J47057O01700J054582J471584
17771B69382J750102J830876J745370J540626J218855P73791K47790k68955o86634
17762H421203r42004r75599p43288l07419J26001L24778K03780j13245m05690
17753E588517n29350m93174l89761k83708j65694L1419L69156Q33360J321065
$$ plain form
17744 6281830 7948681 9631955 10882343 11303275 10715065 9202053 7067379 4740451
17736 4740451 2674222 1283542 878686 1544246 3065006 5003437 6877211 8314279
17728 8314279 9125126 9294246 8932131 8225913 7390336 6631682 6134824 6041473 6390819 7056670
17718 7056670 7759812 8192685 8177713 7712176 6896910 5863073 4726499 3572440 2456778
17709 2456778 1393670 378141 -564833 -1402107 -2127637 -2675111 -2810915 -2213197 -702671
17700 -702671 1606666 4370102 7200217 9800935 11957966 13481045 14217672 14123664 13362866
17691 13362866 12358515 11606365 11301351 11131655 10471567 8856621 6359230 3556369 1172507
17682 1172507 -307789 -855835 -833489 -696041 -735087 -1030192 -1513941 -2037268 -2428960 -2573628
$$ packed form
17744F281830J666851J683274J250388M20932n88210j513012k134674k326928
17736D740451k066229j390680m04856O65560J520760J938431J873774J437068
17728H314279Q10847J69120l62115p06218q35577p58654m96858r3351L49346O65851
17718G056670P03142M32873j4972m65537q15266j033837j136574j154059j115662
17709B456778j063108j015529r42974q37274p25530n47474j35804N97718J510526
17700g02671K309337K763436K830115K600718K157031J523079P36627r4008p60798
17691A3362866j004351p52150l05014j69696o60088j614946k497391k802861k383862
17682A172507j480296n48046K2346J37448l9046k95105m83749n23327l91692j44668
$$ plain form
17672 -2573628 -2468957 -2203198 -1886476 -1600653 -1363805 -1103972 -689484 -27485 840063
17663 840063 1735929 2463487 2930814 3171977 3295791 3433558 3699145 4153210 4779807 5508398
17653 5508398 6253942 6896077 7224389 6981080 6025447 4434951 2395949 24625 -2660748
17644 -2660748 -5623243 -8693164 -11542099 -13778941 -15144857 -15653060 -15537827 -15089214 -14514101
17635 -14514101 -13862006 -13022536 -11803252 -10079720 -7954258 -5767934 -3915055 -2635292
17627 -2635292 -1981966 -1934644 -2422551 -3216119 -3915108 -4099688 -3487338 -2022588 100937
17618 100937 2514497 4832741 6829521 8519574 10053469 11541768 13015025 14472870
17610 14472870 15869928 17071346 17863940 18037936 17515348 16451964 15201319 14123792
$$ packed form
17672b573628J04671K65759L16722K85823K36848K59833M14488O61999Q67548
17663H40063Q95866P27558M67327K41163J23814J37767K65587M54065O26597P28591
17653E508398P45544O42135L28312k43309r55633j590496k039002k371324k685373
17644b660748k962495l069921k848935k236842j365916n08203J15233M48613N75113
17635a4514101O52095Q39470J219284J723532K125462K186324J852879J279763
17627b635292O53326M7322m87907p93568o98989j84580O12350J464750K123525
17618A00937K413560K318244J996780J690053J533895J488299J473257J457845
17610A4472870J397058J201418P92594J73996n22588j063384j250645j077527
$$ plain form
17602 14123792 13404859 12994766 12629427 11949177 10705465 8884220 6640643 4151985 1564684
17593 1564684 -914290 -2938923 -4110816 -4182048 -3222642 -1591269 296954 2150890 3781386
17584 3781386 5050421 5892284 6300127 6268764 5780625 4844844 3524014 1909836 101776
17575 101776 -1795352 -3732893 -5805292 -8205189 -11009268 -13978317 -16610632 -18448524
17567 -18448524 -19343969 -19453458 -19031312 -18266870 -17310071 -16343587 -15533894 -14945431 -14547342
17558 -14547342 -14279271 -14085615 -13927219 -13819566 -13852007 -14121730 -14621102 -15184558 -15543913
17549 -15543913 -15448548 -14775770 -13579606 -12071107 -10540990 -9218834 -8116810 -7010489
17541 -7010489 -5621546 -3825983 -1697411 579517 2803208 4790673 6343880 7229844
$$ packed form
17602A4123792p18933m10093l65339o80250j243712j821245k243577k488658k587301
17593A564684k478974k024633j171893p1232R59406J631373J888223J853936J630496
17584C781386J269035Q41863M07843l1363m88139r35781j320830j614178j808060
17575A01776j897128j937541k072399k399897k804079k969049k632315j837892
17567a8448524q95445j09489M22146P64442R56799R66484Q09693N88463L98089
17558a4547342K68071J93656J58396J07653l2441k69723m99372n63456l59355
17549a5543913R5365O72778J196164J508499J530117J322156J102024J106321
17541g010489J388943J795563K128572K276928K223691J987465J553207Q85964
$$ plain form
17533 7229844 7258806 6409554 4875179 3000860 1178081 -286311 -1278543 -1846470 -2065050
17524 -2065050 -1968924 -1594226 -1034802 -433187 81964 466920 788134 1154146 1624537 2181660
17514 2181660 2729887 3125215 3295226 3336059 3425588 3621013 3732077 3419003 2495878 1169032
17504 1169032 -36352 -579391 -157903 1236143 3385963 5938608 8513854 10812337
17496 10812337 12649713 13918468 14516150 14301405 13200665 11430012 9558986 8248978
17488 8248978 7853658 8222564 8848357 9225734 9178023 8901464 8668892 8475517 7979202 6768886
17478 6768886 4692429 2001539 -735506 -2887805 -4037025 -4102397 -3284490 -1927438 -399384
17469 -399384 961397 1871052 2143617 1740189 783207 -500323 -1885209 -3228087 -4469931
$$ packed form
17533G229844K8962q49252j534375j874319j822779j464392r92232n67927k18580
17524b065050R6126L74698N59424O01615N15151L84956L21214L66012M70391N57123
17514B181660N48227L95328J70011M0833Q9529J95425J11064l13074r23125j326846
17504A169032j205384n43039M21488J394046K149820K552645K575246K298483
17496A0812337J837376J268755N97682k14745j100740j770653j871026j310008
17488H248978l95320L68906O25793L77377m7711k76559k32572j93375m96315j210316
17478F768886k076457k690890k737045k152299j149220o5372Q17907J357052J528054
17469c99384J360781R09655K72565m03428r56982j283530j384886j342878j241844
$$ plain form
17460 -4469931 -5579222 -6498511 -7140188 -7423890 -7336073 -6978690 -6529179 -6108193 -5713045
17451 -5713045 -5302930 -4903822 -4605431 -4482929 -4532039 -4665196 -4778757 -4872592 -5142018 -5910832
17441 -5910832 -7396188 -9510484 -11893569 -14106021 -15755605 -16482613 -15962022 -14028820
17433 -14028820 -10795954 -6634772 -2056538 2448772 6561726 10166827 13266500 15900964
17425 15900964 18135487 20037407 21592149 22667189 23116818 22922643 22223126 21257978 20322291
17416 20322291 19696398 19513210 19683253 19991717 20256881 20351435 20130371 19434809 18149424
17407 18149424 16259711 13921174 11464001 9277140 7635165 6599604 6077523 5956170
17399 5956170 6182869 6735256 7513467 8289257 8792253 8819228 8278340 7221368 5855798
$$ packed form
17460d469931j109291r19289o41677k83702Q7817L57383M49511M20986L95148
17451e713045M10115L99108K98391J22502m9110j33157j13561r3835k69426p68814
17441e910832j485356k114296k383085k212452j649584p27008N20591J933202
17433a4028820L232866M161182M578234M505310M112954L605101L099673K634464
17425A5900964K234523J901920J554742J075040M49629j94175o99517r65148r35687
17416B0322291o25893j83188J70043L08464K65164R4554k21064o95562j285385
17407A8149424j889713k338537k457173k186861j641975j035561n22081j21353
17399E956170K26699N52387P78211P75790N02996K6975n40888j056972j365570
$$ plain form
17390 5855798 4468958 3315102 2552615 2202244 2109558 2020845 1779952 1439205 1190081
17381 1190081 1235448 1693366 2558680 3740139 5099187 6438629 7548161 8295268 8607025
17372 8607025 8403462 7667260 6591250 5582552 5073621 5290160 6130182 7204313 8021670
17363 8021670 8235225 7808225 7017968 6294004 5984350 6224916 6956370 7977555 9011797
17354 9011797 9822301 10326054 10641334 11029375 11727216 12792491 14084210 15329204 16177457
17345 16177457 16290149 15500389 13917084 11849767 9616858 7399490 5244373 3183567
17337 3183567 1330104 -146179 -1145173 -1741300 -2107359 -2318305 -2278729 -1840399 -928714
17328 -928714 473918 2405935 4852704 7539095 9905469 11405618 11821599 11283399 10105210
$$ packed form
17390E855798j386840j153856p62487l50371r2686q8713k40893l40747k49124
17381A190081M5367M57918Q65314J181459J359048J339442J109532P47107L11757
17372H607025k03563p36202j076010j008698n08931K16539Q40022J074131Q17357
17363H021670K13555m27000p90257p23964l09654K40566P31454J021185J034242
17354I011797Q10504N03753L15280L88041O97841J065275J291719J244994Q48253
17345A6177457J12692p89760j583305k067317k232909k217368k155117k060806
17337C183567j853463j476283r98994n96127l66059k10946L9576M38330R11685
17328i28714J402632J932017K446769K686391K366374J500149M15981n38200j178189
$$ plain form
17319 10105210 8674274 7355460 6351244 5649607 5120783 4658947 4273861 4102972 4326173
17310 4326173 5010343 6000830 6963879 7585987 7786466 7735355 7701334 7922355 8556434 9650218
17300 9650218 11090113 12582464 13718267 14110585 13542216 12049867 9873680 7275758
17292 7275758 4393620 1302875 -1801637 -4588966 -6780321 -8267071 -9043815 -9110341 -8453126
17283 -8453126 -7097442 -5164667 -2864555 -412149 2062306 4557459 7181188 10048270
17275 10048270 13139213 16207475 18808506 20472458 20920574 20157076 18399478 15980241
17267 15980241 13299617 10759471 8660555 7144930 6210304 5750722 5592049 5522447 5340624
17258 5340624 4936722 4319145 3529619 2568411 1434785 232293 -794449 -1374157 -1369123
$$ packed form
17319A0105210j430936j318814j004216p01637n28824m61836l85086j70889K23201
17310D326173O84170R90487R63049O22108K00479n1111l4021K21021O34079J093784
17300I650218J439895J492351J135803L92318n68369j492349k176187k597922
17292G275758k882138l090745l104512k787329k191355j486750p76744o6526O57215
17283h453126J355684J932775K300112K452406K474455K495153K623729K867082
17275A0048270L090943L068262K601031J663952M48116p63498j757598k419237
17267A5980241k680624k540146k098916j515625r34626m59582j58673o9602j81823
17258E340624m03902o17577p89526r61208j133626j202492j026742n79708N034
$$ plain form
17249 -1369123 -819700 126746 1290566 2489787 3566934 4432255 5074179 5518272 5762680
17240 5762680 5750755 5454490 5010162 4719215 4851643 5412720 6063766 6273310 5601454 3890288
17230 3890288 1276687 -1881422 -5121653 -8000510 -10160601 -11364438 -11552398 -10903380
17222 -10903380 -9808946 -8714992 -7940528 -7616459 -7687843 -7892543 -7857506 -7368592 -6537182
17213 -6537182 -5670039 -5046756 -4844750 -5172687 -6064691 -7408194 -8901827 -10123472 -10692860
17204 -10692860 -10411841 -9284476 -7440603 -5044238 -2227190 926236 4330754 7838874
17196 7838874 11214328 14154381 16387743 17813809 18533530 18718555 18490301 17932508 17142898
17187 17142898 16225592 15248515 14236387 13217234 12278464 11586293 11334162 11649195 12551870
$$ packed form
17249a369123N49423R46446J163820J199221J077147Q65321O41924M44093K44408
17240E762680j1925k96265m44328k90947J32428N61077O51046K09544o71856j711166
17230C890288k613601l158109l240231k878857k160091j203837j87960O49018
17222a0903380J094434J093954P74464L24069p1384k04700L5037M88914Q31410
17213f537182Q67143O23283K02006l27937q92004j343503j493633j221645n69388
17204a0692860K81019J127365J843873K396365K817048L153426L404518L508120
17196G838874L375454K940053K233362J426066P19721J85025k28254n57793p89610
17187A7142898r17306r77077j012128j019153r38770o92171k52131L15033R02675
$$ plain form
17178 12551870 13972865 15751874 17635678 19364125 20805405 21947482 22718235 22882965
17170 22882965 22178518 20532618 18137512 15313906 12302971 9185875 5985697 2851277
17162 2851277 160635 -1583638 -2018085 -1125804 774607 3195244 5612170 7509376
17154 7509376 8419429 8040072 6393348 3867554 1052697 -1501447 -3433783 -4601193
17146 -4601193 -5046658 -4935761 -4466993 -3783688 -2950748 -2038114 -1218068 -726325 -702362 -1109969
17136 -1109969 -1854602 -2925406 -4379919 -6249024 -8472633 -10860467 -13083731 -14734664
17128 -14734664 -15468586 -15186664 -14137944 -12806803 -11630772 -10812494 -10348721 -10110849 -9881727
17119 -9881727 -9423300 -8583779 -7355843 -5831255 -4122090 -2331312 -525188 1300210
$$ packed form
17178A2551870J420995J779009J883804J728447J441280J142077P70753J64730
17170B2882965p04447j645900k395106k823606l010935l117096l200178l134420
17162B851277k690642j744273m34447Q92281J900411K420637K416926J897206
17154G509376R10053l79357j646724k525794k814857k554144j932336j167410
17146d601193m45465J10897M68768O83305Q32940R12634Q20046M91743K3963m07607
17136a109969p44633j070804j454513j869105k223609k387834k223264j650933
17128a4734664p33922K81922J048720J331141J176031Q18278M63773K37872K29122
17119i881727M58427Q39521J227936J524588J709165J790778J806124J825398
$$ plain form
17111 1300210 3146189 4858451 6103737 6562031 6155103 5083934 3668310 2164455
17103 2164455 686459 -722007 -1910424 -2562287 -2407899 -1507098 -297724 634802 851996
17094 851996 195519 -1244576 -3197455 -5290253 -7165002 -8573747 -9411152 -9710337 -9612570
17085 -9612570 -9310710 -8974875 -8717413 -8622427 -8744144 -9031233 -9287156 -9268041 -8870623 -8255347
17075 -8255347 -7772123 -7720535 -8175723 -9036512 -10150042 -11357799 -12517507 -13539402 -14396069
17066 -14396069 -15106147 -15725907 -16353902 -17103153 -17994017 -18857922 -19419302 -19492491 -19065233
17057 -19065233 -18222070 -17011642 -15365832 -13182884 -10524491 -7694242 -5111382 -3103209
17049 -3103209 -1739007 -818268 -57903 702975 1467809 2158692 2669863 2885104 2712942
$$ packed form
17111A300210J845979J712262J245286M58294m06928j071169j415624j503855
17103B164455j477996j408466j188417o51863J54388R00801J209374R32526K17194
17094H51996o56477j440095j952879k092798j874749j408745q37405k99185R7767
17085i612570L01860L35835K57462R4986j21717k87089k55923J9115L97418O15276
17075h255347M83224N1588m55188q60789j113530j207757j159708j021895q56667
17066a4396069p10078o19760o27995p49251q90864q63905n61380p3189M27258
17057a9065233Q43163J210428J645810K182948K658393K830249K582860K008173
17049c103209J364202R20739P60365P60878P64834O90883N11171K15241j72162
$$ plain form
17040 2712942 2128330 1177962 -32548 -1321065 -2397286 -2912301 -2618892 -1524596 90161
17031 90161 1806493 3262308 4251579 4676798 4476209 3612489 2104568 94407 -2087923
17022 -2087923 -3961894 -5079239 -5247337 -4609955 -3515937 -2296604 -1155247 -207174 484428
17013 484428 896450 971855 575744 -404618 -1884598 -3502687 -4757312 -5275204 -4979975
17004 -4979975 -4056216 -2788412 -1399761 -2148 1346086 2617711 3857492 5145459
16996 5145459 6465523 7660076 8549325 9030359 9029063 8451655 7262716 5603629 3789678
16987 3789678 2157471 917889 134943 -212195 -184098 114178 520607 847840 953990
16978 953990 772707 292523 -443507 -1305852 -2051290 -2345139 -1893950 -667611 983275
$$ packed form
17040B712942n84612r50368j210510j288517j076221n15015K93409J094296J614757
17031I0161J716332J455815R89271M25219k00589q63720j507921k010161k182330
17022b087923j873971j117345j68098O37382J094018J219333J141357R48073O91602
17013D84428M12022P5405l96111r80362j479980j618089j254625n17892K95229
17004d979975R23759J267804J388651J397613J348234J271625J239781J287967
16996E145459J320064J194553Q89249M81034j296n77408j188939j659087j813951
16987C789678j632207j239582p82946l47138K8097K98276M06429L27233J06150
16978I53990j81283m80184p36030q62345p45438k93849M51189J226339J650886
$$ plain form
16969 983275 2478520 3330332 3369081 2723529 1646145 371270 -922143 -2088381 -3003844
16960 -3003844 -3611303 -3954466 -4137275 -4251042 -4341308 -4455790 -4718643 -5297417 -6245070 -7396367
16950 -7396367 -8484136 -9373554 -10130486 -10851970 -11512027 -12005677 -12266270 -12291284 -12083293
16941 -12083293 -11620126 -10928607 -10174906 -9610738 -9379331 -9357959 -9204128 -8608630 -7546396
16932 -7546396 -6324521 -5439525 -5325483 -6082425 -7383342 -8667141 -9444837 -9511946 -8989652
16923 -8989652 -8209126 -7505491 -7003008 -6549881 -5885502 -4869685 -3574122 -2206674 -951130
16914 -951130 155849 1236102 2495462 4101528 6043352 8073057 9805038 10922636
16906 10922636 11344418 11244290 10950236 10759500 10759488 10830647 10841049 10821170 10951849 11407501
$$ packed form
16969I83275J495245Q51812L8749o45552j077384j274875j293413j166238r15463
16960c003844o07459l43163j82809j13767r0266j14482k62853n78774r47653j151297
16950g396367j087769q89418p56932p21484o60057m93650k60593k5014K07991
16941a2083293M63167O91519P53701N64168K31407K1372J53831N95498J062234
16932g546396J221875Q84996J14042p56942j300917j283799p77696o7109N22294
16923h989652P80526P03635N02483M53127O64379J015817J295563J367448J255544
16914i51130J106979J080253J259360J606066J941824K029705J731981J117598
16906A0922636M21782j00128k94054j90736j2P1159J0402j9879J30679M55652
$$ plain form
16896 11407501 12218398 13247487 14251710 14950312 15102971 14624351 13630058 12313270 10782269
16887 10782269 9071158 7272668 5577174 4184886 3221598 2735495 2750424 3259055 4099030
16878 4099030 4918245 5391924 5444186 5212981 4881488 4554934 4205027 3739317 3189130 2809222
16868 2809222 2933838 3687828 4851975 6063594 7106805 7950610 8594575 8979800 9003690
16859 9003690 8562029 7626875 6327615 4914167 3587215 2365666 1124734 -265018
16851 -265018 -1849213 -3594895 -5433987 -7301433 -9163631 -11032593 -12916300 -14703070
16843 -14703070 -16114027 -16819378 -16589878 -15339783 -13128112 -10213268 -7060106 -4167526
16835 -4167526 -1839872 -141266 974995 1553499 1614193 1189920 408872 -448482 -1039250
$$ packed form
16896A1407501Q10897J029089J004223O98602J52659m78620r94293j316788j531001
16887A0782269j711111j798490j695494j392288r63288m86103J4929N08631Q39975
16878D099030Q19215M73679N2262k31205l31493l26554l49907m65710n50187l79908
16868B809222J24616P53990J164147J211619J043211Q43805O43965L85225K3890
16859I003690m41661r35154j299260j413448j326952j221549j240932j389752
16851b65018j584195j745682j839092j867446j862198j868962j883707j786770
16843a4703070j410957p05351K29500J250095K211671K914844L153162K892580
16835d167526K327654J698606J116261N78504O0694m24273p81048q57354n90768
$$ plain form
16826 -1039250 -1157419 -851926 -357872 68350 261560 191468 -49228 -348897 -691074 -1121969
16816 -1121969 -1618061 -2043626 -2242450 -2146192 -1789084 -1252431 -642825 -122204 104130 -120888
16806 -120888 -852057 -2090592 -3831814 -6030304 -8520587 -11003428 -13143141 -14677822
16798 -14677822 -15477941 -15556826 -15011038 -13956985 -12573636 -11155161 -10016153 -9314174 -8974578
16789 -8974578 -8785469 -8537860 -8088929 -7364488 -6336115 -4998107 -3400346 -1728316 -315855
16780 -315855 469370 412389 -395258 -1533731 -2404721 -2488103 -1533619 420076 3120292
16771 3120292 6168904 9082325 11397374 12851277 13495993 13579176 13304361 12723213 11807030
16762 11807030 10559497 9052777 7375128 5573612 3655160 1643391 -320262 -1952809
$$ packed form
16826a039250j18169L05493M94054M26222J93210p0092k40696k99669l42177m30895
16816a121969m96092m25565j98824R6258L57108N36653O09606N20621K26334k25018
16806a20888p31169j238535j741222k198490k490283k482841k139713j534681
16798a4677822q00119p8885N45788J054053J383349J418475J139008P01979L39596
16789h974578J89109K47609M48931P24441J028373J338008J597761J672030J412461
16780c15855P85225n6981q07647j138473q70990q3382R54484J953695K700216
16771C120292L048612K913421K315049J453903O44716Q3183k74815n81148r16183
16762A1807030j247533j506720j677649j801516j918452k011769j963653j632547
$$ plain form
16754 -1952809 -2991006 -3385878 -3325756 -3096270 -2931538 -2965633 -3218810 -3573298 -3885975 -4197572
16744 -4197572 -4722585 -5561284 -6478110 -7029064 -6914850 -6213830 -5295977 -4506591 -3891730
16735 -3891730 -3206418 -2168109 -679853 1122798 2950351 4493148 5524293 5912113
16727 5912113 5609247 4691700 3388863 2015060 863508 165802 81608 672080 1905246
16718 1905246 3668182 5716883 7678370 9204951 10132578 10498950 10459614 10211959 9967591
16709 9967591 9936698 10280898 11023212 11994259 12901179 13471214 13553915 13161438 12487339 11862720
16699 11862720 11609629 11904577 12795654 14273161 16210699 18298429 20174437 21653188
16691 21653188 22799877 23799111 24812211 25954068 27283932 28714311 29936324 30499987
$$ packed form
16754a952809j038197l94872O0122K29486J64732l4095k53177l54488l12677l11597
16744d197572n25013q38699r16826n50954J14214P01020R17853P89386O14861
16735c891730O85312J038309J488256J802651J827553J542797J031145L87820
16727E912113l02866r17547j302837j373803j151552o97706q4194N90472J233166
16718A905246J762936K048701J961487J526581R27627L66372l9336k47655k44368
16709I967591l0893L44200P42314R71047R06920N70035Q2701l92477o74099o24619
16699A1862720k53091K94948Q91077J477507J937538K087730J876008J478751
16691B1653188J146689R99234J013100J141857J329864J430379J222013N63663
$$ plain form
16683 30499987 30039449 28477777 26065261 23270271 20591341 18343399 16556948 15066378
16675 15066378 13665097 12184580 10478795 8391047 5811966 2832437 -192959 -2793795
16667 -2793795 -4627724 -5638354 -6024875 -6034158 -5740260 -5002177 -3612291 -1515460 1068587
16658 1068587 3759578 6272023 8555424 10721438 12872068 14993150 16964449 18615139
16650 18615139 19764818 20251627 19977228 18983206 17497233 15868105 14412453 13285955
16642 13285955 12473881 11886864 11441817 11041742 10520378 9659292 8275280 6312685 3882027
16633 3882027 1238075 -1268381 -3263301 -4453471 -4718502 -4116672 -2831499 -1165491
16625 -1165491 439364 1505125 1759463 1286473 415295 -517020 -1301858 -1843054 -2075419
$$ packed form
16683C0499987m60538j561672k412516k794990k678930k247942j786451j490570
16675A5066378j401281j480517j705785k087748k579081k979529l025396k600836
16667b793795j833929j010630l86521r283K93898P38083J389886K096831K584047
16658A068587K690991K512445K283401K166014K150630K121082J971299J650690
16650A8615139J149679M86809k74399r94022j485973j629128j455652j126498
16642A3285955q12074n87017m45047m00075n21364q61086j384012j962595k430658
16633C882027k643952k506456j994920j190170k65031O01830J285173J666008
16625a165491J604855J065761K54338m72990q71178r32315p84838n41196k32365
$$ plain form
16616 -2075419 -1925523 -1381528 -612608 60177 367599 231097 -278130 -1027236 -1854726
16607 -1854726 -2590104 -3111369 -3405948 -3549564 -3617871 -3661837 -3752073 -3950258 -4205216 -4333778
16597 -4333778 -4153286 -3651323 -3035597 -2634914 -2749617 -3548619 -5036785 -7032569 -9155202
16588 -9155202 -10961830 -12210792 -12965972 -13426029 -13717364 -13868907 -13887843 -13769068 -13455781
16579 -13455781 -12885068 -12128139 -11442968 -11114995 -11261050 -11814148 -12642518 -13640828 -14735600
16570 -14735600 -15843639 -16846579 -17600014 -17936823 -17677970 -16724645 -15191998 -13426728 -11837490
16561 -11837490 -10659872 -9825217 -8995244 -7747251 -5809301 -3194856 -159123 2965744
16553 2965744 5880913 8301940 9940887 10546106 9936784 8081384 5244173 1992690
$$ packed form
16616b075419J49896N43995P68920O72785L07422j36502n09227p49106q27490
16607a854726p35378n21265k94579j43616o8307m3966r0236j98185k54958j28562
16597d333778J80492N01963O15726M00683j14703p99002j488166j995784k122633
16588i155202j806628j248962p55180m60057k91335j51543j8936J18775L13287
16579a3455781N70713P56929O85171L27973j46055n53098q28370r98310j094772
16570a4735600j108039j002940p53435l36809K58853R53325J532647J765270J589238
16561a1837490J177618Q34655Q29973J247993J937950K614445L035733L124867
16553B965744K915169K421027J638947O05219o09322j855400k837211l251483
$$ plain form
16545 1992690 -1050102 -3468428 -5088559 -5864514 -5824150 -5097686 -3904728 -2462278 -900145
16536 -900145 727637 2371253 3952963 5376653 6563017 7513576 8316328 9049622 9703598
16527 9703598 10236120 10685634 11141224 11598113 11936937 12076590 12104640 12213901 12511049 12916894
16517 12916894 13229262 13211220 12638044 11388763 9556130 7442678 5461186 4037915 3522694
16508 3522694 4071699 5548725 7544674 9559606 11250264 12564928 13667926 14697932
16500 14697932 15538699 15821140 15177858 13527849 11155239 8515831 5980498 3758376
16492 3758376 1956083 640528 -94373 -94280 747165 2315307 4270339 6228228 7923122
16483 7923122 9254485 10253282 10994459 11510890 11784257 11788771 11512201 10940752 10043811 8791440
$$ packed form
16545A992690l042792k418326j620131p75955M0364P26464J192958J442450J562133
16536i00145J627782J643616J581710J423690J186364R50559Q02752P33294O53976
16527I703598N32522M49514M55590M56889L38824J39653K8050J09261K97148M05845
16517A2916894L12368j8042n73176j249281j832633k113452j981492j423271n15221
16508C522694N49005J477026J995949K014932J690658J314664J102998J030006
16500A4697932Q40767K82441o43282j650009k372610k639408k535333k222122
16492C758376j802293j315555p34901R3Q41445J568142J955032J957889J694894
16483G923122J331363R98797P41177N16431K73367M514k76570n71449q96941j252371
$$ plain form
16473 8791440 7208751 5441258 3748466 2380670 1411548 622077 -445599 -2211174
16465 -2211174 -4754691 -7756990 -10681805 -12959804 -14085711 -13846011 -12624237 -11236313
16457 -11236313 -10302226 -9911576 -9817556 -9711186 -9343580 -8612764 -7615629 -6550759 -5518564
16448 -5518564 -4408734 -3012847 -1258755 717331 2735616 4728331 6692778 8562249
16440 8562249 10208501 11554582 12629815 13513673 14238447 14758543 15007538 14953339 14617498
16431 14617498 14076941 13441480 12810545 12214425 11539404 10513553 8831438 6342967 3183921
16422 3183921 -235934 -3407683 -5937997 -7635251 -8427472 -8251305 -7084636 -5065684
16414 -5065684 -2537811 79 2040496 3281859 3765099 3809838 3775959 3839699 3970816
$$ packed form
16473H791440j582689j767493j692792j367796r69122p89471j067676j765575
16465b211174k543517l002299k924815k277999j125907K39700J221774J387924
16457a1236313R34087L90650R4020J06370L67606P30816R97135J064870J032195
16448e518564J109830J395887J754092J976086K018285J992715J964447J869471
16440H562249J646252J346081J075233Q83858P24774N20096K48995n4199l35841
16431A4617498n40557o35461o30935n96120o75021j025851j682115k488471l159046
16422C183921l419855l171749k530314j697254p92221J76167J166669K018952
16414e065684K527873K537890K040417J241363M83240M4739l3879O3740J31117
$$ plain form
16405 3970816 4078125 4136512 4185288 4223995 4129853 3724975 2948423 1950193 1030969 512962
16395 512962 630637 1425166 2650631 3854928 4689647 5178926 5677075 6591239 8145781
16386 8145781 10340354 13038550 16021504 18999398 21719697 24050831 25862604 26934644
16378 26934644 27097121 26387734 25015448 23202990 21087484 18766315 16385924 14135831
16370 14135831 12184414 10624580 9424297 8460036 7675445 7165693 7035645 7203761 7390506
16361 7390506 7296003 6795480 5969818 4941139 3745033 2423762 1163629 240435 -164290
16352 -164290 -70834 347700 902284 1484435 2068413 2680809 3367882 4128656 4873942 5501933
16342 5501933 6013134 6510687 7105435 7866209 8818062 9894505 10891894 11531451 11621293
$$ packed form
16405C970816J07309N8387M8776L8707r4142m04878p76552r98230r19224n18007
16395E12962J17675P94529J225465J204297Q34719M89279M98149R14164J554542
16386H145781K194573K698196K982954K977894K720299K331134J811773J072040
16378B6934644J62477p09387j372286j812458k115506k321169k380391k250093
16370A4135831j951417j559834j200283r64261p84591n09752j30048J68116J86745
16361G390506r4503n00523q25662j028679j196106j321271j260133r23194m04725
16352a64290R3456M18534N54584N82151N83978O12396O87073P60774P45286O27991
16342E501933N11201M97553N94748P60774R51853J076443R97389O39557Q9842
$$ plain form
16333 11621293 11182921 10374390 9273770 7802326 5895264 3701786 1579318 -93032
16325 -93032 -1122157 -1607444 -1860190 -2175921 -2646905 -3154879 -3519257 -3649967 -3572078 -3368352
16315 -3368352 -3167176 -3191748 -3788706 -5353985 -8128716 -11954221 -16156707 -19703431 -21679124
16306 -21679124 -21815840 -20580454 -18778777 -17096757 -15868989 -15126744 -14787128 -14774586 -15063023
16297 -15063023 -15698735 -16753719 -18216983 -19934970 -21642100 -23006922 -23689782 -23467868
16289 -23467868 -22339456 -20470893 -18047107 -15210103 -12132176 -9084151 -6366685 -4180247
16281 -4180247 -2570198 -1441059 -614989 58313 629060 1091209 1453535 1754163 2053525
16272 2053525 2432634 2995474 3866631 5173686 7018915 9428125 12299788 15395372 18368974
$$ packed form
16333A1621293m38372q08531j100620j471444j907062k193478k122468j672350
16325i3032j029125m85287k52746l15731m70984n07974l64378j30710P7889K03726
16315c368352K01176k4572n96958j565279k774731l825505m202486l546724j975693
16306b1679124j36716J235386J801677J682020J227768P42245L39616J2542k88437
16297a5063023o35712j054984j463264j717987j707130j364822o82860K21914
16289b3467868J128412J868563K423786K837004L077927L048025K717466K186438
16281d180247J610049J129139Q26070O73302N70747M62149L62326L00628K99362
16272B053525L79109N62840Q71157J307055J845229K409210K871663L095584K973602
$$ plain form
16263 18368974 20843181 22524038 23286542 23182630 22397712 21193414 19806800 18313695
16255 18313695 16604311 14511335 11928839 8864419 5505930 2266014 -348270 -2036677
16247 -2036677 -2903751 -3339477 -3692724 -4012619 -4061430 -3563457 -2453674 -967408 443221
16238 443221 1332666 1497914 1057986 338933 -302507 -598215 -447818 33533 547283 750864
16228 750864 443968 -349821 -1503592 -2986534 -4888215 -7227688 -9819176 -12373051 -14689768
16219 -14689768 -16739939 -18614256 -20437129 -22272682 -24073631 -25702407 -26945311 -27542204
16211 -27542204 -27333123 -26420720 -25120737 -23710266 -22272631 -20797128 -19337905 -18028376
16203 -18028376 -16988540 -16255105 -15783894 -15462549 -15090818 -14408273 -13222142 -11546660 -9627620
$$ packed form
16263A8368974K474207J680857P62504j03912p84918j204298j386614j493105
16255A8313695j709384k092976k582496l064420l358489l239916k614284j688407
16247b036677q67074m35726l53247l19895m8811M97973J109783J486266J410629
16238D43221Q89445J65248m39928p19053o41440k95708J50397M81351N13750K03581
16228G50864l06896p93789j153771j482942j901681k339473k591488k553875k316717
16219a4689768k050171j874317j822873j835553j800949j628776j242904n96893
16211b7542204K09081R12403J299983J410471J437635J475503J459223J309529
16203a8028376J039836P33435M71211L21345L71731O82545J186131J675482J919040
$$ plain form
16194 -9627620 -7833398 -6516803 -5942122 -6254873 -7440729 -9308214 -11550948 -13848579
16186 -13848579 -15921513 -17558052 -18681140 -19413615 -20038942 -20838363 -21904650 -23084596
16178 -23084596 -24090453 -24670408 -24730814 -24336715 -23609989 -22686637 -21768874 -21121068 -20960641
16169 -20960641 -21368761 -22303051 -23632844 -25107732 -26308578 -26714062 -25928278 -23919870 -21043523
16160 -21043523 -17842670 -14835852 -12379690 -10634033 -9625420 -9259004 -9208168 -8926610 -7946648
16151 -7946648 -6166666 -3825487 -1301831 1002952 2712177 3579578 3610494 3074739 2418866
16142 2418866 2144674 2629484 3916763 5704654 7619485 9467213 11204117 12775920
16134 12775920 14075533 15030971 15664940 16047039 16207333 16113160 15717687 14986363 13884628
$$ packed form
16194i627620J794222J316595N74681l12751j185856j867485k242734k297631
16186a3848579k072934j636539j123088p32475o25327p99421j066287j179946
16178b3084596j005857n79955o0406L94099P26726R23352R17763O47806J60427
16169b0960641m08120r34290j329793j474888j200846m05484P85784K008408K876347
16160b1043523L200853L006818K456162J745657J008613L66416N0836K81558R79962
16151g946648J779982K341179K523656K304783J709225Q67401L0916n35755o55873
16142B418866k74192M84810J287279J787891J914831J847728J736904J571803
16134A2775920J299613R55438O33969L82099J60294r4173l95473p31324j101735
$$ plain form
16125 13884628 12429481 10771867 9144085 7696343 6402601 5105781 3637211 1921160
16117 1921160 -17186 -2116962 -4275775 -6281565 -7851069 -8779036 -9058481 -8918356 -8747495
16108 -8747495 -8878095 -9376641 -10052890 -10665261 -11086288 -11299135 -11320758 -11134356 -10641995 -9697441
16098 -9697441 -8237746 -6400734 -4509470 -2932044 -1937620 -1633267 -1953572 -2698122 -3658191
16089 -3658191 -4759362 -6072982 -7676419 -9529745 -11537095 -13683529 -16026328 -18597686
16081 -18597686 -21355684 -24131626 -26580421 -28271587 -28895987 -28378622 -26845730 -24592678
16073 -24592678 -22052061 -19689536 -17882893 -16834577 -16522502 -16695245 -16947121 -16903446 -16408139
16064 -16408139 -15536664 -14454167 -13326665 -12344015 -11681426 -11358310 -11180507 -10851128 -10142981
$$ packed form
16125A3884628j455147j657614j627782j447742j293742j296820j468570j716051
16117A921160j938346k099776k158813k005790j569504r27967k79445J40125J70861
16108h747495j30600m98546o76249o12371m21027k12847k1623J86402M92361R44554
16098i697441J459695J837012J891264J577426R94424L04353l20305p44550r60069
16089c658191j101171j313620j603437j853326k007350k146434k342799k571358
16081a8597686k757998k775942k448795j691166o24400N17365J532892K253052
16073b4592678K540617K362525J806643J048316L12075j72743k51876M3675M95307
16064a6408139Q71475J082497J127502R82650O62589L23116J77803L29379P08147
$$ plain form
16055 -10142981 -8990086 -7458662 -5679455 -3810637 -2031469 -515485 629265 1381129
16047 1381129 1773218 1875247 1799898 1655837 1438618 985111 71566 -1379180 -3130739
16038 -3130739 -4709543 -5707259 -6008754 -5747519 -5148398 -4448350 -3851960 -3449993 -3170930
16029 -3170930 -2830305 -2234326 -1303199 -155536 955792 1853019 2622692 3572343 4938992
16020 4938992 6622495 8218573 9338477 9901385 10127526 10305892 10578270 10885043 11052629
16011 11052629 10908013 10369201 9502331 8472251 7389281 6220473 4878267 3392793
16003 3392793 1996096 1031287 742070 1126370 1985321 3068657 4159067 5084326 5719601
15994 5719601 5986568 5839876 5269337 4297789 2945436 1221925 -830287 -3114738 -5513368
$$ packed form
16055a0142981J152895J531424J779207J868818J779168J515984J144750P51864
16047A381129L92089J02029p5349j44061k17219m53507r13545j450746j751559
16038c130739j578804r97716l01495K61235N99121P00048N96390M01967K79063
16029c170930L40625N95979R31127J147663J111328Q97227P69673R49651J366649
16020D938992J683503J596078J119904N62908K26141J78366K72378L06773J67586
16011A1052629j44616n38812q66870j030080j082970j168808j342206j485474
16003C392793j396697r64809k89217L84300Q58951J083336J090410R25259O35275
15994E719601K66967j46692n70539r71548j352353j723511k052212k284451k398630
$$ plain form
15985 -5513368 -7944803 -10408331 -12931366 -15409707 -17530778 -18918486 -19361791 -18941546
15977 -18941546 -18020255 -17083705 -16480748 -16275816 -16354833 -16659435 -17284324 -18342201 -19805670
15968 -19805670 -21488710 -23094276 -24283620 -24819563 -24701372 -24107229 -23183268 -21937029 -20348330
15959 -20348330 -18517056 -16659206 -15028295 -13891208 -13491372 -13932909 -15074632 -16551880
15951 -16551880 -17940192 -18942691 -19477860 -19646984 -19629563 -19558948 -19443235 -19195381 -18737498
15942 -18737498 -18061122 -17180289 -16047593 -14561779 -12680257 -10514660 -8302861 -6260873
15934 -6260873 -4450760 -2791037 -1160830 523856 2294919 4108525 5789191 7062300
15926 7062300 7730036 7808566 7480855 6997087 6630531 6574835 6793342 7054939 7185355 7244442
$$ packed form
15985e513368k431435k463528k523035k478341k121071j387708m43305M20245
15977a8941546R21291R36550O02957K04932p9017l04602o24889j057877j463469
15968a9805670j683040j605566j189344n35943J18191N94143R23961J246239J588699
15959b0348330J831274J857850J630911J137087L99836m41537j141723j477248
15951a6551880j388312j002499n35169j69124J7421P0615J15713K47854M57883
15942a8737498O76376Q80833J132696J485814J881522K165597K211799K041988
15934f260873J810113J659723J630207J684686J771063J813606J680666J273109
15926G062300O67736P8530l27711m83768l66556n5696K18507K61597J30416N9087
$$ plain form
15916 7244442 7427707 7838397 8410398 9016652 9559024 9945279 10070041 9855501 9270864
15907 9270864 8323096 7067794 5611649 4074588 2545806 1067449 -350615 -1715013
15899 -1715013 -3047492 -4371069 -5706965 -7108017 -8633932 -10218877 -11596553 -12415470
15891 -12415470 -12429508 -11595730 -10041257 -7966785 -5594519 -3180675 -1004235 697124
15883 697124 1786625 2249481 2202650 1905554 1687027 1765717 2148626 2719509 3359146 3965059
15873 3965059 4433677 4673505 4666675 4553018 4605328 5064150 6009745 7390086 9108093 11039632
15863 11039632 13015771 14835083 16311422 17351532 18015195 18476625 18882542 19260358 19617031
15854 19617031 20130906 21194223 23210438 26351724 30554904 35755636 42098700 49898883
$$ packed form
15916G244442J83265M10690N72001O06254N42372L86255J24762k14540n84637
15907I270864r47768j255302j456145j537061j528782j478357j418064j364398
15899a715013j332479j323577j335896j401052j525915j584945j377676q18917
15891a2415470j4038Q33778J554473K074472K372266K413844K176440J701359
15883F97124J089501M62856m6831k97096k18527P8690L82909N70883O39637O05913
15873C965059M68618K39828o830j13657N2310M58822R45595J380341J718007J931539
15863A1039632J976139J819312J476339J040110O63663M61430M05917L77816L56673
15854A9617031N13875J063317K016215L141286M203180N200732O343064P800183
$$ plain form
15846 49898883 59371176 70362973 82274991 94150808 104856658 113316241 118732597
15839 118732597 120693589 119149423 114356653 106850998 97418727 87017126 76613828 66962197
15831 66962197 58423532 50969249 44372341 38450042 33200303 28784745 25431887 23316856
15823 23316856 22421818 22441260 22816212 22905151 22215982 20581471 18180106 15384906 12563808
15814 12563808 9985189 7845198 6350866 5763095 6290227 7900676 10273567 12933888
15806 12933888 15397146 17241767 18186612 18160779 17292148 15825160 14051497 12304673 10936144
15797 10936144 10190843 10065914 10304700 10550405 10526115 10106669 9289397 8162400 6930613
15788 6930613 5930798 5530725 5955841 7170144 8888872 10731674 12426616 13909948 15255417
$$ packed form
15846D9898883R472293J0991797J1912018J1875817J0705850Q459583N416356
15839A18732597J960992j544166m792770p505655r432271j0401601j0403298r651631
15831F6962197q538665p454283o596908n922299n249739m415558l352858k115031
15823B3316856q95038J9442L74952Q8939o89169j634511k401365k795200k821098
15814A2563808k578619k139991j494332n87771N27132J610449K372891K660321
15806A2933888K463258J844621R44845k5833q68631j466988j773663j746824j368529
15797A0936144p45301j24929K38786K45705k4290m19446q17272j126997j231787
15788F930613r99815m00073M25116J214303J718728J842802J694942J483332J345469
$$ plain form
15779 15255417 16526419 17684725 18604227 19147604 19252356 18974321 18439432 17739412 16876358
15770 16876358 15816397 14598713 13387931 12395785 11711308 11223311 10754655 10249985 9790492
15761 9790492 9472291 9355873 9517811 10037206 10879147 11866335 12787899 13465798 13750176
15752 13750176 13553055 12908100 11965820 10893221 9762476 8557180 7280075 5998480
15744 5998480 4777818 3604377 2384043 1023249 -494792 -2082988 -3532858 -4539750
15736 -4539750 -4831214 -4331448 -3231058 -1889903 -664593 139917 229141 -587281 -2206945
15727 -2206945 -4237035 -6240230 -7972617 -9413812 -10629509 -11625935 -12298402 -12499410 -12158069
15718 -12158069 -11328174 -10125355 -8634024 -6882753 -4886841 -2696599 -423673 1751060
$$ packed form
15779A5255417J271002J158306R19502N43377J04752k78035n34889p00020q63054
15770A6876358j059961j217684j210782r92146o84477m87997m68656n04670m59493
15761I790492l18201j16418J61938N19395Q41941R87188R21564O77899K84378
15752A3750176j97121o44955r42280j072599j130745j205296j277105j281595
15744E998480j220662j173441j220334j360794j518041j588196j449870j006892
15736d539750k91464M99766J100390J341155J225310Q04510Q9224q16422j619664
15727b206945k030090k003195j732387j441195j215697r96426o72467k01008L41341
15718a2158069Q29895J202819J491331J751271J995912K190242K272926K174733
$$ plain form
15710 1751060 3601358 4922764 5606397 5696657 5407041 5050861 4923068 5182946 5758458
15701 5758458 6351269 6610236 6342739 5545676 4314937 2844018 1475367 631362 605160
15692 605160 1368525 2573164 3754053 4568380 4892354 4753101 4227637 3383424 2216322
15683 2216322 611944 -1555824 -4214197 -7003216 -9448599 -11202093 -12132749 -12305187
15675 -12305187 -11920876 -11225804 -10430200 -9659272 -8921599 -8134412 -7186160 -5953997 -4308620
15666 -4308620 -2181459 351243 3046704 5572857 7626644 8987644 9567514 9507593 9179226
15657 9179226 9009805 9261016 9941621 10889195 11861248 12554250 12671378 12061228 10760005
15648 10760005 8893129 6600669 4076765 1627158 -341792 -1389321 -1159111 462204
$$ packed form
15710A751060J850298J321406O83633R0260k89616l56180j27793K59878N75512
15701E758458N92811K58967k67497p97063j230739j470919j368651q44005k6202
15692F05160P63365J204639J180889Q14327L23974j39253n25464q44213j167102
15683B216322j604378k167768k658373k789019k445383j753494r30656j72438
15675a2305187L84311O95072P95604P70928P37673P87187R48252J232163J645377
15666d308620K127161K532702K695461K526153K053787J361000N79870n9921l28367
15657I179226j69421K51211O80605R47574R72053O93002J17128o10150j301223
15648A0760005j866876k292460k523904k449607j968950j047529K30210J621315
$$ plain form
15640 462204 3252278 6710470 10238660 13354859 15836967 17692525 18972795 19653262
15632 19653262 19720441 19283126 18517699 17541140 16374151 14987370 13344824 11441696 9353795
15623 9353795 7232521 5207811 3298998 1438003 -419206 -2176744 -3582865 -4390673
15615 -4390673 -4556334 -4241449 -3625068 -2754705 -1599812 -226246 1137794 2237500 2981840
15606 2981840 3509959 4087013 4929206 6088631 7455762 8858090 10144127 11200100 11956363
15597 11956363 12400518 12586123 12648649 12794716 13203820 13900644 14726068 15432602 15815155
15588 15815155 15768693 15276253 14418931 13386067 12401574 11625603 11144627 11033557 11382047
15579 11382047 12239215 13523874 14991821 16320942 17248153 17675899 17713515 17583769 17438768
$$ packed form
15640D62204K790074L458192L528190L116199K482108J855558J280270O80467
15632A9653262O7179m37315p65427r76559j166989j386781j642546j903128k087901
15623I353795k121274k024710j908813j860995j857209j757538j406121q07808
15615d390673j65661L14885O16381Q70363J154893J373566J364040J099706P44340
15606B981840N28119N77054Q42193J159425J367131J402328J286037J055973P56263
15597A1956363M44155J85605O2526J46067M09104O96824Q25424P06534L82553
15588A5815155m6462m92440q57322j032864r84493p75971m80976j11070L48490
15579A1382047Q57168J284659J467947J329121R27211M27746L7616j29746j45001
$$ plain form
15570 17438768 17288685 17098355 16870944 16606998 16232753 15607776 14609155 13237295 11675369
15561 11675369 10234601 9200931 8717216 8771194 9223792 9856426 10484080 11068393 11688378
15552 11688378 12396219 13119084 13686476 13924325 13713590 12988070 11746022 10125173 8450073
15543 8450073 7153006 6601730 6941440 8047186 9595490 11211767 12630124 13756998
15535 13756998 14601808 15171192 15431041 15336549 14873045 14099632 13199184 12453738 12121545
15526 12121545 12332146 13073746 14233198 15628465 17034129 18207074 18915372 19001646 18495016
15517 18495016 17708479 17170850 17350662 18385553 20043361 21898411 23554472 24760577
15509 24760577 25384754 25360759 24706156 23553847 22119158 20640770 19325836 18255463 17290226
$$ packed form
15570A7438768j50083j90330k27411k63946l74245o24977r98621j371860j561926
15561A1675369j440768j033670m83715N3978M52598O32634O27654N84313O19985
15552A1688378P07841P22865N67392K37849k10735p25520j242048j620849j675100
15543H450073j297067n51276L39710J105746J548304J616277J418357J126874
15535A3756998Q44810N69384K59849r4492m63504p73413r00448p45446l32193
15526A2121545K10601P41600J159452J395267J405664J172945P08298Q6274n06630
15517A8495016p86537n37629J79812J034891J657808J855050J656061J206105
15509B4760577O24177k3995o54603j152309j434689j478388j314934j070373r65237
$$ plain form
15500 17290226 16101375 14350511 11896938 8883734 5666763 2678290 304885 -1185785
15492 -1185785 -1669649 -1192920 -19818 1385901 2530575 3117421 3152684 2901963 2752640
15483 2752640 3026883 3859239 5232939 7101351 9437798 12165615 15060015 17741096
15475 17741096 19813513 21064004 21528990 21382471 20789096 19864381 18750899 17686140 16947476
15466 16947476 16725561 17036234 17698553 18408628 18906322 19084833 18962852 18610450 18078704
15457 18078704 17362940 16448387 15362145 14145505 12819128 11421106 10060268 8911854
15449 8911854 8188435 8111660 8851598 10418404 12564507 14866098 17009188 18994314 21009042
15440 21009042 23083145 24886675 25895204 25774078 24614587 22862920 21072506 19642021
$$ packed form
15500A7290226j188851j750864k453573l013204l216971k988473k373405j490670
15492a185785m83864M76729J173102J405719J144674N86846L5263k50721j49323
15483B752640K74243Q32356J373700J868412K336447K727817K894400K681081
15475A7741096K072417J250491M64986j46519n93375r24715j113482j064759p38664
15466A6947476k21915L10673O62319P10075M97694J78511j21981l52402n31746
15457A8078704p15764r14553j086242j216640j326377j398022j360838j148414
15449H911854p23419p6775P39938J566806K146103K301591K143090J985126K014728
15440B1009042K074103J803530J008529j21126j159491j751667j790414j430485
$$ plain form
15432 19642021 18662555 17952997 17238288 16345677 15312599 14336133 13592869 13095342 12705524
15423 12705524 12249255 11608639 10762317 9812779 8976302 8505318 8569913 9190721 10311938
15414 10311938 11907712 13934875 16192336 18283786 19715148 20064048 19168700 17226199
15406 17226199 14704274 12132414 9950826 8475661 7873991 8116428 8993514 10217941
15398 10217941 11542640 12824175 13998861 15017983 15845848 16526550 17195696 17979590 18888659
15389 18888659 19817349 20623446 21198312 21504721 21567077 21411993 21028839 20376318 19412666
15380 19412666 18175519 16851907 15688511 14794000 14072528 13361160 12592157 11822016 11173925
15371 11173925 10830022 11057857 12121980 14116607 16923973 20310923 24009298 27724303
$$ packed form
15432A9642021r79466p09558p14709q92611j033078r76466p43264m97527l89818
15423A2705524m56269o40616q46322r49538q36477m70984O4595O20808J121217
15414A0311938J595774K027163K257461K091450J431362L48900q95348j942501
15406A7226199k521925k571860k181588j475165o01670K42437Q77086J224427
15398A0217941J324699J281535J174686J019122Q27865O80702O69146P83894R09069
15389A8888659R28690Q06097N74866L06409O2356j55084l83154o52521r63652
15380A9412666j237147j323612j163396q94511p21472p11368p69003p70141o48091
15371A1173925l43903K27835J064123J994627K807366L386950L698375L715005
$$ plain form
15363 27724303 31135993 33987693 36238253 38099488 39888978 41852943 44099129 46633970
15355 46633970 49464077 52707739 56625150 61535519 67689501 75192565 84013840 94040050
15347 94040050 105119661 117118479 130032174 144074136 159613355 176991788 196366656
15340 196366656 217647532 240456775 264046017 287245549 308586538 326584722 339997338
15333 339997338 347952879 349999920 346124761 336778583 322907842 305900031 287342483
15326 287342483 268638905 250745018 234223845 219473284 206828004 196451349 188201517
15319 188201517 181700726 176573784 172616405 169775123 168041999 167428338 168002003 169838403
15311 169838403 172915342 177086376 182110696 187686339 193520763 199403132 205175902 210662296
$$ packed form
15363B7724303L411690K851700K250560J861235J789490J963965K246186K534841
15355D6633970K830107L243662L917411M910369O153982P503064Q821275J0026210
15347I4040050J1079611J1998818J2913695J4041962J5539219J7378433J9374868
15340A96366656K1280876K2809243K3589242K3199532K1340989J7998184J3412616
15333C39997338P955541K047041l875159r346178j3870741j7007811j8557548
15326B87342483j8703578j7893887j6521173j4750561j2645280j0376655q249832
15319A88201517o500791n126942l957379k841282j733124o13661N73665J836400
15311A69838403L076939M171034N024320N575643N834424N882369N772770N486394
$$ plain form
15303 210662296 215679768 220123786 224035489 227575616 230900819 234064431 237052706 239871921
15295 239871921 242552967 245139160 247723572 250467804 253611242 257483551 262382959 268360987
15287 268360987 275183909 282470350 289735979 296286607 301216434 303662282 303122336 299622753
15279 299622753 293694961 286200812 278098559 270268420 263396930 257868827 253695935 250502866
15271 250502866 247557617 243911726 238716161 231574456 222669563 212601715 202108569 191850825
15263 191850825 182327299 173865368 166632001 160667680 155940705 152348777 149643511 147401721
15255 147401721 145129587 142452600 139253440 135643423 131838133 128072489 124568165 121498394
15247 121498394 118961573 117018844 115734964 115123444 115056725 115251252 115322207 114871214 113622263
$$ packed form
15303B10662296N017472M444018L911703L540127L325203L163612K988275K819215
15295B39871921K681046K586193K584412K744232L143438L872309M899408N978028
15287B68360987O822922P286441P265629O550628M929827K445848n39946l499583
15279B99622753n927792p494149q102253p830139o871490n528103m172892l193069
15271B50502866k945249l645891n195565p141705q904893j0067848j0493146j0257744
15263A91850825r523526q461931p233367n964321m726975l591928k705266k241790
15255A47401721k272134k676987l199160l610017l805290l765644l504324l069771
15247A21498394k536821j942729j283880o11520o6719J94527P0955m50993j248951
$$ plain form
15238 113622263 111561238 108938483 106130673 103521193 101443332 100098950 99462865 99289380
15230 99289380 99242794 99016864 98354229 97061627 95082449 92521190 89580014 86501081 83553999
15221 83553999 81019914 79115003 77861160 77055183 76420802 75779686 75097316 74452844 74001931
15212 74001931 73897192 74164553 74643001 75058766 75173240 74837532 73890342 72113225 69391877
15203 69391877 65864192 61882132 57894291 54309056 51369717 49148880 47637711 46806339
15195 46806339 46591313 46886216 47606779 48725772 50186868 51824599 53416281 54790893
15187 54790893 55849889 56479631 56499647 55757767 54273063 52258549 50014624 47837374 46005081
15178 46005081 44748955 44151149 44063908 44177720 44245994 44294140 44590946 45400940 46790848
$$ packed form
15238A13622263k061025k622755k807810k609480k077861j344382o36085j73485
15230I9289380m6586k25930o62635j292602j979178k561259k941176l078933k947082
15221H3553999k534085j904911j253843q05977o34381o41116o82370o44472m50913
15212G4001931j04739K67361M78448M15765J14474l35708r47190j777117k721348
15203F9391877l527685l982060l987841l585235k939339k220837j511169q31372
15195D6806339k15026K94903P20563J118993J461096J637731J591682J374612
15187E4790893J058996O29742K0016p41880j484704k014514k243925k177250j832293
15178D6005081j256126n97806q7241J13812O8274M8146K96806Q09994J389908
$$ plain form
15169 46790848 48669741 50944711 53575426 56495984 59514453 62315645 64600850 66214691
15161 66214691 67122355 67334084 66935527 66187599 65565828 65643050 66818030 69105841 72188913
15152 72188913 75624489 78989322 81899777 84007577 85057453 84927636 83598554 81165326
15144 81165326 77918826 74342037 70943244 68044319 65724111 63957945 62756474 62161270
15136 62161270 62193348 62850277 64110705 65911805 68113412 70511757 72933528 75306178
15128 75306178 77611041 79765113 81528820 82525603 82434161 81206383 79046709 76210791
15120 76210791 72901573 69328465 65802745 62730464 60462529 59133101 58637798 58731437
15112 58731437 59148993 59732351 60480335 61391650 62274013 62805239 62758891 62120661 61068940
$$ packed form
15169D6790848J878893K274970K630715K920558L018469K801192K285205J613841
15161F6214691R07664K11729l98557p47928o21771P7222J174980K287811L083072
15152G2188913L435576L364833K910455K107800J049876j29817j329082k433228
15144H1165326l246500l576789l398793k898925k320208j766166j201471n95204
15136F2161270L2078O56929J260428J801100K201607K398345K421771K372650
15128G5306178K304863K154072J763707R96783r1442j227778k159674k835918
15120G6210791l309218l573108l525720l072281k267935j329428m95303R3639
15112E8731437M17556N83358P47984R11315Q82363N31226m6348o38230j051721
$$ plain form
15103 61068940 59917770 59007335 58539223 58465671 58550675 58555040 58367731 57991945 57463366 56807875
15093 56807875 56031171 55094894 53902006 52319004 50255103 47784108 45171643 42735773
15085 42735773 40688253 39112522 38043709 37518151 37571116 38253579 39646819 41785305 44523970
15076 44523970 47508785 50318654 52662235 54435075 55616193 56223682 56373794 56242931
15068 56242931 55933158 55446597 54809222 54161190 53658986 53285550 52812945 51975476 50639326
15059 50639326 48792083 46441710 43576349 40192778 36341711 32187674 28059532 24401401
15051 24401401 21615078 19908150 19237515 19330363 19763169 20128309 20209355 20012724 19671373
15042 19671373 19374642 19350226 19786413 20723769 22079453 23770467 25720994 27728070 29413472
$$ packed form
15103F1068940j151170r10435m68112p3552Q5004M365j87309l75786n28579o55491
15093E6807875p76704r36277j192888j583002k063901k470995k612465k435870
15085D2735773k047520j575731j068813n25558N2965O82463J393240K138486K738665
15076D4523970K984815K809869K343581J772840J181118O07489J50112j30863
15068E6242931l09773m86561o37375o48032n02204l73436m72605q37469j336150
15059E0639326j847243k350373k865361l383571l851067m154037m128142l658131
15051B4401401k786323j706928o70635R2848M32806L65140Q1046j96631l41351
15042A9671373k96731k4416M36187R37356J355684J691014J950527K007076J685402
$$ plain form
15033 29413472 30412200 30633399 30355872 30104285 30372216 31371454 32980586 34858722 36608022
15024 36608022 37921297 38671033 38921943 38867823 38731820 38678200 38742418 38841198 38904747 38994196
15014 38994196 39273440 39899643 40928116 42253483 43636685 44799275 45474241 45459975 44771270
15005 44771270 43717494 42743315 42184181 42120425 42363481 42552739 42295170 41314945 39621227
14996 39621227 37580315 35742517 34514757 33964758 33909708 34175602 34759664 35700204 36806094
14987 36806094 37594031 37490298 36098982 33411295 29841551 26020476 22518138 19701548
14979 19701548 17716004 16484830 15721530 15050492 14223213 13221823 12156058 11129747
14971 11129747 10235239 9614126 9438562 9832602 10871418 12616447 15014519 17756400 20358372
$$ packed form
15033B9413472R98728K21199k77527k51587K67931R99238J609132J878136J749300
15024C6608022J313275P49736K50910n4120j36003n3620O4218R8780O3549Q9449
15014C8994196K79244O26203J028473J325367J383202J162590O74966j4266o88705
15005D4771270j053776r74179n59134o3756K43056J89258k57569r80225j693718
14996C9621227k040912j837798j227760n49999n5050K65894N84062R40540J105890
14987C6806094P87937j03733j391316k687687l569744l821075l502338k816590
14979A9701548j985544j231174p63300o71038q27279j001390j065765j026311
14971A1129747q94508o21113j75564L94040J038816J745029K398072K741881K601972
$$ plain form
14962 20358372 22405984 23692765 24195816 24000351 23257952 22188955 21101466 20385863 20411276
14953 20411276 21317401 22879649 24638647 26193876 27351685 28080840 28486000 28807212 29315407
14944 29315407 30142958 31192504 32205139 32952366 33419564 33797848 34258851 34796161 35338757
14935 35338757 35933342 36766798 38070789 39959730 42265003 44547871 46317428 47258937
14927 47258937 47344738 46843838 46253697 46136931 46892000 48564590 50835802 53241878 55457243
14918 55457243 57401245 59151998 60826926 62538482 64419513 66641902 69343549 72470636
14910 72470636 75688542 78511991 80599229 81947771 82801767 83432902 84084884 85077569 86830367
14901 86830367 89670595 93564024 98049929 102472679 106291536 109217928 111162812 112150478
$$ packed form
14962B0358372K047612J286781N03051j95465p42399j068997j087489p15603K5413
14953B0411276R06125J562248J758998J555229J157809P29155M05160L21212N08195
14944B9315407Q27551J049546J012635P47227M67198L78284M61003N37310N42596
14935C5338757N94585Q33456J303991J888941K305273K282868J769557R41509
14927D7258937Q5801n00900n90141j16766P55069J672590K271212K406076K215365
14918E5457243J944002J750753J674928J711556J881031K222389K701647L127087
14910G2470636L217906K823449K087238J348542Q53996O31135O51982R92685J752798
14901H6830367K840228L893429M485905M422750L818857K926392J944884R87666
$$ plain form
14893 112150478 112284609 111716088 110572290 108904276 106717063 104062606 101152899 98407196
14885 98407196 96318393 95193192 94990110 95373874 95877173 96032938 95486308 94132194 92181274
14876 92181274 90028769 88022882 86335797 84995235 84003302 83402226 83207829 83310914 83468999
14867 83468999 83394916 82844741 81615412 79529791 76516198 72679993 68261606 63599008
14859 63599008 59146105 55380755 52566990 50582522 48999500 47397459 45657363 43967723
14851 43967723 42577364 41581809 40904583 40387294 39858132 39146184 38107718 36700389 35012521
14842 35012521 33177780 31244761 29134467 26746610 24118744 21458744 19032914 17058530
14834 17058530 15641680 14710073 14009641 13241283 12202380 10815656 9138988 7396562
$$ packed form
14893A12150478J34131n68521j143798j668014k187213k654457k909707k745703
14885I8407196k088803j125201k03082L83764N03299J55765n46630j354114j950920
14876I2181274k152505k005887j687085j340562r91933o01076j94397J03085J58085
14867H3468999p4083n50175j229329k085621l013593l836205m418387m662598
14859F3599008m452903l765350k813765j984468j583022j602041j740096j689640
14851D3967723j390359r95555o77226n17289n29162p11948j038466j407329j687868
14842C5012521j834741j933019k110294k387857k627866k660000k425830j974384
14834A7058530j416850r31607p00432p68358j038903j386724j676668j742426
$$ plain form
14826 7396562 5891793 4792072 4018201 3372207 2785333 2468621 2800476 4017507 6009210
14817 6009210 8391319 10723145 12666135 14010326 14640190 14572725 14024079 13317736 12676801
14808 12676801 12123044 11544835 10813634 9850167 8687272 7528567 6663278 6253728 6220503
14799 6220503 6342924 6461069 6591240 6871370 7420491 8281794 9485518 11075229 12995300
14790 12995300 14967367 16545664 17336682 17170348 16086424 14233244 11810447 9032461
14782 9032461 6057831 2944577 -304664 -3651672 -6961636 -10005655 -12503749 -14190986
14774 -14190986 -14918880 -14757887 -13993480 -12969801 -11911543 -10881100 -9870503 -8926872 -8199485
14765 -8199485 -7825546 -7735693 -7613147 -7107335 -6104965 -4783564 -3397191 -2049381 -727779
$$ packed form
14826G396562j504769j099721p73871o45994n86874l16712L31855J217031J991703
14817F009210K382109K331826J942990J344191O29864o7465n48646p06343o40935
14808A2676801n53757n78209p31201r63467j162895j158705q65289m09550l3225
14799F220503J22421J18145J30171K80130N49121Q61303J203724J589711J920071
14790A2995300J972067J578297P91018j66334j083924j853180k422797k777986
14782I032461k974630l113254l249241l347008l309964l044019k498094j687237
14774a4190986p27894J60993P64407J023679J058258J030443J010597R43631P27387
14765h199485L73939Q9853J22546N05812J002370J321401J386373J347810J321602
$$ plain form
14756 -727779 508267 1514959 2229494 2739091 3197363 3744323 4446820 5225630 5887273
14747 5887273 6282821 6400756 6317652 6129326 5931214 5825681 5920218 6286291 6929573 7846654
14737 7846654 9121932 10932241 13419903 16526149 19901149 22989390 25282360 26552444
14729 26552444 26876172 26481705 25612038 24488913 23288047 22089288 20913203 19816353
14721 19816353 18875408 18091795 17371260 16593771 15684520 14642727 13545420 12508326 11581678
14712 11581678 10679784 9675867 8566541 7473108 6464049 5434748 4212901 2796223
14704 2796223 1468131 664825 726994 1722324 3416052 5395740 7292263 8948551 10413111
14695 10413111 11805558 13195437 14551727 15750448 16633022 17069118 16988396 16418377 15544766
$$ packed form
14756g27779J236046J006692P14535N09597M58272N46960P02497P78810O61643
14747E887273L95548J17935q3104j88326j98112j05533R4537L66073O43282R17081
14737G846654J275278J810309K487662L106246L375000L088241K292970J270084
14729B6552444L23728l94467q69667j123125j200866j198759j176085j096850
14721A9816353r40945p83613p20535p77489r09251j041793j097307j037094r26648
14712A1581678r01894j003917j109326j093433j009059j029301j221847j416678
14704B796223j328092q03306O2169R95330J693728J979688J896523J656288J464560
14695A0413111J392447J389879J356290J198721Q82574M36096q0722n70019q73611
$$ plain form
14686 15544766 14712735 14287723 14477981 15299429 16655142 18365551 20174423 21834020 23185591
14677 23185591 24148169 24676213 24755134 24453780 23973291 23577731 23433714 23512599 23621586 23538811
14667 23538811 23163714 22565411 21929129 21471843 21355669 21591673 21974298 22132006 21677909
14658 21677909 20351882 18116931 15232759 12221797 9640692 7791552 6609900 5790849
14650 5790849 5018441 4109320 2991102 1639604 119846 -1341319 -2452554 -3105371 -3471154
14641 -3471154 -3801213 -4195395 -4584544 -4838987 -4860678 -4630499 -4203032 -3631901 -2884731 -1870093
14631 -1870093 -561593 944850 2481555 3829327 4688215 4764083 3949711 2393563 434743
14622 434743 -1522501 -3184746 -4500683 -5592946 -6540555 -7294501 -7834194 -8287886 -8788716
$$ packed form
14686A5544766q32031m25012J90258Q21448J355713J710409J808872J659597J351571
14677B3185591R62578N28044P8921l01354m80489l95560j44017P8885J08987q2775
14667B3538811l75097n98303o36282m57286j16174K36004L82625J57708m54097
14658B1677909j326027k234951k884172l010962k581105j849140j181652q19051
14650E790849p72408r09121j118218j351498j519758j461165j111235o52817l65783
14641c471154l30059l94182l89149k54443k1691K30179M27467N71131P47170J014638
14631a870093J308500J506443J536705J347772Q58888P5868q14372j556148j958820
14622D34743j957244j662245j315937j092263r47609p53946n39693m53692n00830
$$ plain form
14613 -8788716 -9282983 -9586760 -9583898 -9288159 -8723371 -7800829 -6387953 -4509399 -2396976
14604 -2396976 -320038 1561391 3184535 4526288 5591060 6383169 6827955 6741856 5964265
14595 5964265 4573539 2946566 1562898 730241 474014 643652 1076652 1668540 2335741
14586 2335741 2942814 3311499 3324293 2977411 2351716 1617460 1039726 861150 1119333 1572547
14576 1572547 1830342 1590295 785626 -417474 -1724711 -2834613 -3499961 -3543511 -2888478
14567 -2888478 -1624683 -41647 1461702 2561312 3161444 3413293 3582323 3870383 4335170
14558 4335170 4906869 5409592 5598929 5263023 4334741 2942743 1383560 18979 -884445
14549 -884445 -1287745 -1370085 -1381464 -1474413 -1622340 -1661945 -1430854 -910588 -291822 86350
$$ packed form
14613h788716m94267l03777K862K95739N64788R22542J412876J878554K112423
14604b396976K076938J881429J623144J341753J064772P92109M44786q6099p77591
14595E964265j390726j626973j383668q32657k56227J69638M33000N91888O67201
14586B335741O07073L68685J2794l46882o25695p34256n77734j78576K58183M53214
14576A572547K57795k40047q04669j203100j307237j109902o65348m3550O55033
14567b888478J263795J583036J503349J099610O00132K51849J69030K88060M64787
14558D335170N71699N02723J89337l35906r28282j391998j559183j364581r03424
14549h84445m03300q2340j1379r2949j47927l9605K31091N20266O18766L78172
$$ plain form
14539 86350 -64561 -778309 -1842488 -3005676 -4119879 -5084091 -5736508 -5877320 -5422194
14530 -5422194 -4520368 -3488167 -2617615 -2041975 -1733610 -1581717 -1493879 -1487556 -1686158 -2181836
14520 -2181836 -2905829 -3620253 -3978895 -3642149 -2451449 -513524 1906919 4544156 7183076
14511 7183076 9638264 11760486 13469297 14755664 15651913 16208926 16523936 16772977 17130612
14502 17130612 17635698 18177367 18602402 18809816 18733288 18252818 17223783 15664844 13838302
14493 13838302 12056913 10443657 8913846 7328911 5627926 3878630 2260316 957893
14485 957893 23786 -650822 -1210595 -1679433 -1929182 -1768695 -1045562 250499 1898057
14476 1898057 3505658 4748993 5548590 5999471 6181141 6105999 5840568 5576368 5508568
$$ packed form
14539H6350j50911p13748j064179j163188j114203r64212o52417j40812M55126
14530e422194R01826J032201Q70552N75640L08365J51893Q7838O323j98602m95678
14520b181836p23993p14424l58642L36746J190700J937925K420443K637237K638920
14511G183076K455188K122222J708811J286367Q96249N57013L15010K49041L57635
14502A7130612N05086N41669M25035K07414p6528m80470j029035j558939j826542
14493A3838302j781389j613256j529811j584935j700985j749296j618314j302423
14485I57893r34107o74608n59773m68838k49749J60487P23133J296061J647558
14476A898057J607601J243335P99597M50881J81670p5142k65431k64200o7800
$$ plain form
14467 5508568 5668506 5893189 5907507 5448700 4388091 2747439 608234 -1937840 -4719113
14458 -4719113 -7413199 -9627534 -11098617 -11818879 -11975268 -11782913 -11326109 -10447861 -8779259
14449 -8779259 -5982468 -2054196 2609039 7461901 12111601 16393515 20199959 23287594
14441 23287594 25332582 26190111 26026363 25186762 24001549 22691776 21351029 19996595
14433 19996595 18691481 17613336 16961928 16795197 16983326 17298220 17491328 17318881 16604472
14424 16604472 15349035 13760132 12126968 10648692 9334420 8018503 6518052 4836131
14416 4836131 3235106 2117089 1755180 2070716 2701301 3290683 3673404 3840381 3864531
14407 3864531 3862120 3918019 4005049 3979150 3667817 3029401 2287132 1883468 2215121 3345165
$$ packed form
14467E508568J59938K24683J4318m58807j060609j640652k139205k546074k781273
14458d719113k694086k214335j471083p20262j56389J92355M56804Q78248J668602
14449h779259K796791L928272M663235M852862M649700M281914L806444L087635
14441B3287594K044988Q57529j63748q39601j185213j309773j340747j354434
14433A9996595j305114j078145o51408j66731J88129L14894J93108j72447p14409
14424A6604472j255437j588903j633164j478276j314272j315917j500451j681921
14416D836131j601025j118017l61909L15536O30585N89382L82721J66977K4150
14407C864531k411N5899Q7030k5899l11333o38416p42269m03664L31653J130044
$$ plain form
14397 3345165 4935991 6429977 7330418 7408773 6755387 5711044 4730908 4223522 4431713
14388 4431713 5412443 7093810 9324300 11895003 14587115 17255263 19872684 22470685
14380 22470685 25054744 27633366 30330443 33436524 37313391 42200314 48092064 54829023
14372 54829023 62317350 70660167 80115401 90942359 103208095 116669226 130825968
14365 130825968 145046578 158599157 170625433 180188565 186421249 188729481 186978655
14358 186978655 181537060 173129794 162605430 150742723 138224066 125756694 114083804
14351 114083804 103768423 95006507 87713782 81728241 76841169 72712900 68912776 65099348
14343 65099348 61159924 57209303 53490814 50244997 47611906 45598685 44066933 42733255
$$ packed form
14397C345165J590826J493986R00441P8355o53386j044343r80136n07386K08191
14388D431713R80730J681367K230490K570703K692112K668148K617421K598001
14380B2470685K584059K578622K697077L106081L876867M886923N891750O736959
14372E4829023P488327Q342817R455234J0826958J2265736J3461131J4156742
14365A30825968J4220610J3552579J2026276R563132O232684K308232j750826
14358A86978655n441595q407266j0524364j1862707j2518657j2467372j1672890
14351A14083804j0315381q761916p292725n985541m887072m128269l800124l813428
14343F5099348l939424l950621l718489l245817k633091k013221j531752j333678
$$ plain form
14335 42733255 41242654 39321644 36925253 34278779 31786001 29834915 28599055 28005317
14327 28005317 27902264 28222399 29001178 30320517 32214844 34538050 36909990 38853095
14319 38853095 40042604 40457260 40286093 39707933 38804557 37658278 36434908 35347887 34602213
14310 34602213 34369351 34747835 35717985 37138727 38774059 40309721 41386400 41665324 40897534
14301 40897534 39017167 36262024 33174048 30352052 28113255 26343921 24686391 22922208
14293 22922208 21138862 19522675 18124023 16875342 15740687 14788279 14139272 13863932
14285 13863932 13911075 14114828 14280920 14320763 14324494 14469079 14827965 15270115 15546343 15466719
14275 15466719 14994645 14211795 13242055 12187734 11098755 10012782 9019116 8259045 7867643
$$ packed form
14335D2733255j490601j921010k396391k646474k492778j951086j235860n93738
14327B8005317j03053L20135P78779J319339J894327K323206K371940J943105
14319C8853095J189509M14656j71167n78160r03376j146279j223370j087021p45674
14310C4602213k32862L78484R70150J420742J635332J535662J076679K78924p67790
14301D0897534j880367k755143l087976k821996k238797j769334j657530j764183
14293B2922208j783346j616187j398652j248681j134655r52408o49007k75340
14285A3863932M7143K03753J66092L9843L731J44585L58886M42150K76228p9624
14275A5466719m72074p82850r69740j054321j088979j085973r93666p60071l91402
$$ plain form
14266 7867643 7915227 8351838 8969609 9478538 9658291 9436908 8893940 8256596 7854381 7973218
14256 7973218 8687857 9819729 11062849 12172763 13064644 13784832 14423804 15044570 15687497
14247 15687497 16419620 17322681 18394941 19474936 20310126 20715803 20666453 20267436 19652331
14238 19652331 18894218 18018891 17084047 16189380 15405971 14728082 14078120 13338448 12407377
14229 12407377 11279699 10072990 8910646 7799127 6688045 5610045 4704533 4090152
14221 4090152 3699436 3278987 2587464 1563678 341949 -818952 -1659089 -2063350 -2122274
14212 -2122274 -2048011 -2042175 -2203764 -2472411 -2653617 -2555063 -2146594 -1636302 -1393925 -1744984
14202 -1744984 -2776262 -4293102 -5919844 -7228727 -7865233 -7682526 -6789790 -5446113 -3907483
$$ packed form
14266G867643M7584M36611O17771N08929J79753k21383n42968o37344m02215J18837
14256G973218P14639J131872J243120J109914Q91881P20188O38972O20766O42927
14247A5687497P32123R03061J072260J079995Q35190M05677m9350l99017o15105
14238A9652331p58113q75327r34844q94667p83409o77889o49962p39672r31071
14229A2407377j127678j206709j162344j111519j111082j078000r05512o14381
14221D090152l90716m20449o91523j023786j221729j160901q40137m04261n8924
14212b122274P4263N836j61589k68647j81206R8554M08469N10292K42377l51059
14202a744984j031278j516840j626742j308883o36506J82707Q92736J343677J538630
$$ plain form
14193 -3907483 -2381492 -1092340 -309925 -269784 -1055298 -2512132 -4253758 -5803466 -6782465
14184 -6782465 -6990640 -6365262 -4941507 -2883458 -517713 1765857 3759586 5586856
14176 5586856 7559191 9892667 12543603 15237564 17614321 19394768 20502408 21088334
14168 21088334 21437370 21774905 22098119 22197281 21854270 21011647 19767062 18279664 16713375
14159 16713375 15211236 13866169 12706083 11723968 10926687 10350002 10063538 10156945 10648597
14150 10648597 11390515 12095118 12503036 12573774 12534440 12754500 13524410 14858759 16500109
14141 16500109 18129569 19542702 20655634 21433127 21822801 21709991 20944661 19464120 17401762
14132 17401762 15065105 12825754 11025488 9896159 9449751 9433547 9453715 9160601 8358782
$$ packed form
14193c907483J525991J289152P82415M0141p85514j456834j741626j549708r78999
14184f782465k08175O25378J423755K058049K365745K283570J993729J827270
14176E586856J972335K333476K650936K693961K376757J780447J107640N85926
14168B1088334L49036L37535L23214R9162l43011q42623j244585j487398j566289
14159A6713375j502139j345067j160086r82115p97281n76685k86464R3407M91652
14150A0648597P41918P04603M07918P0738l9334K20060P69910J334349J641350
14141A6500109J629460J413133J112932P77493L89674j12810p65330j480541k062358
14132A7401762k336657k239351j800266j129329m46408j6204K0168k93114q01819
$$ plain form
14123 8358782 7052250 5419313 3688391 2007302 432039 -971893 -2071064 -2718866
14115 -2718866 -2821841 -2366619 -1426289 -131025 1358094 2822385 3983528 4593947 4566217
14106 4566217 4070053 3525768 3441022 4171836 5769008 7993589 10495897 13052987 15677831
14097 15677831 18495927 21503549 24419413 26749743 28029648 28029341 26769461 24428544 21281982
14088 21281982 17701010 14137068 10991977 8425827 6315588 4420487 2581952 795617
14080 795617 -860466 -2338836 -3680343 -4996013 -6404958 -7957172 -9540568 -10835160
14072 -10835160 -11436584 -11097862 -9850150 -7892579 -5442959 -2747328 -133587 2055264
14064 2055264 3561080 4220615 3943979 2745131 806214 -1492216 -3662193 -5318201
$$ packed form
14123H358782j306532j632937j730922j681089j575263j403932j099171o47802
14115b718866j02975M55222R40330J295264J489119J464291J161143O10419k7730
14106D566217m96164n44285q4746P30814J597172K224581K502308K557090K624844
14097A5677831K818096L007622K915864K330330J279905l07j259880k340917l146562
14088B1281982l580972l563942l145091k566150k110239j895101j838535j786335
14080G95617j656083j478370j341507j315670j408945j552214j583396j294592
14072a0835160o01424L38722J247712J957571K449620K695631K613741K188851
14064B055264J505816O59535k76636j198848j938917k298430k169977j656008
$$ plain form
14056 -5318201 -6326145 -6766964 -6821656 -6676988 -6436365 -6083577 -5553869 -4850137 -4128572
14047 -4128572 -3703288 -3904033 -4832214 -6233624 -7624856 -8518192 -8546060 -7523710 -5525869
14038 -5525869 -2878269 1146 2773062 5236562 7305454 8938619 10082853 10708385
14030 10708385 10885997 10797239 10654389 10592315 10651864 10876350 11358756 12141394 13104657 14003930
14020 14003930 14621507 14902775 14975851 15036175 15179676 15305396 15199940 14772607 14183477 13712375
14010 13712375 13547972 13700661 14025032 14280458 14216857 13621294 12295803 10117291 7221837
14001 7221837 4039327 1018035 -1671893 -4115031 -6376704 -8291246 -9502464 -9738146
13993 -9738146 -9073835 -7890344 -6584323 -5359548 -4233434 -3144826 -2059604 -1051361
$$ packed form
14056e318201j007944m40819n4692J44668K40623L52788N29708P03732P21565
14047d128572M25284k00745r28181j401410j391232q93336k7868J022350J997841
14038e525869K647600K879415K771916K463500K068892J633165J144234O25532
14030A0708385J77612q8758j42850o2074N9549K24486M82406P82638R63263Q99273
14020A4003930O17577K81268P3076O0324J43501J25720j05456m27333n89130m71102
14010A3712375j64403J52689L24371K55426o3601n95563j325491k178512k895454
14001G221837l182510l021292k689928k443138k261673j914542j211218k35682
13993i738146O64311J183491J306021J224775J126114J088608J085222J008243
$$ plain form
13985 -1051361 -313093 -69336 -444560 -1382690 -2677640 -4076664 -5352698 -6301298 -6717842
13976 -6717842 -6396808 -5160826 -2947757 100016 3649929 7274517 10548762 13149157
13968 13149157 14954724 16074387 16740934 17162428 17456102 17644352 17651316 17307654 16422852
13959 16422852 14956947 13138076 11343040 9862268 8793657 8104601 7755136 7734460 7980071
13950 7980071 8345567 8700343 9058013 9641320 10814698 12847897 15671222 18884162 22035948
13941 22035948 24892789 27455788 29816252 32072832 34341319 36745112 39382736 42343358
13933 42343358 45721126 49559984 53812494 58359089 63013585 67542573 71773063 75709621
13925 75709621 79554408 83654142 88426674 94279057 101561416 110593067 121701600 135177784
$$ packed form
13985a051361P38268K43757l75224r38130j294950j399024j276034r48600m16544
13976f717842L21034J235982K213069L047773L549913L624588L274245K600395
13968A3149157J805567J119663O66547M21494K93674J88250O964l43662q84802
13959A6422852j465905j818871j795036j480772j068611o89056l49465k0676K45611
13950G980071L65496L54776L57670N83307J173378K033199K823325L212940L151786
13941B2035948K856841K562999K360464K256580K268487K403793K637624K960622
13933D2343358L377768L838858M252510M546595M654496M528988M230490L936558
13925G5709621L844787M099734M772532N852383P282359R031651J1108533J3476184
$$ plain form
13917 135177784 151161346 169574799 190160725 212521174 236052598 259849069 282702464
13910 282702464 303226081 320057769 332060604 338427745 338690096 332777168 321199795
13903 321199795 305122583 286112197 265697678 245018227 224685680 204883216 185640746
13896 185640746 167104474 149609839 133544264 119176015 106579884 95652909 86173787
13889 86173787 77872885 70508518 63917054 57980480 52547111 47423247 42469600 37722073
13881 37722073 33440190 30026809 27822081 26860597 26783976 27001311 26929756 26167240 24594806
13872 24594806 22382276 19887814 17500601 15501721 14001343 12953058 12219573 11648635
13864 11648635 11131963 10626838 10125870 9614352 9079261 8585911 8317669 8461676 9016480
$$ packed form
13917A35177784J5983562J8413453K0585926K2360449K3531424K3796471K2853395
13910B82702464K0523617J6831688J2002835O367141K62351n912928j1577373
13903C21199795j6077212j9010386k0414519k0679451k0332547j9802464j9242470
13896A85640746j8536272j7494635j6065575j4368249j2596131j0926975r479122
13889H6173787q300902p364367o591464n936574n433369n123864m953647m747527
13881C7722073m281883l413381k204728r61484p6621K17335p1555p62516j572434
13872B4594806k212530k494462k387213j998880j500378j048285p33485n70938
13864A1648635n16672n05125n00968n11518n35091m93350k68242J44007N54804
$$ plain form
13855 9016480 9696231 10044374 9729803 8795208 7631351 6713514 6338919 6535457 7122203
13846 7122203 7859351 8603962 9343243 10130322 11051790 12212948 13660597 15291768 16873829
13837 16873829 18193442 19197613 19999488 20763554 21557124 22270874 22668169 22514354 21699730
13828 21699730 20297168 18530147 16677404 14983777 13605478 12592015 11925693 11563171
13820 11563171 11401843 11275087 11079014 10891937 10950119 11520899 12742165 14494202 16448562
13811 16448562 18344422 20238685 22424601 25112153 28244983 31557694 34679963 37211924
13803 37211924 38829958 39393521 39012016 38080810 37172811 36723830 36759244 36945338 36909379
13794 36909379 36502809 35817493 35062421 34459249 34185994 34361102 35066073 36334633 38085720
$$ packed form
13855I016480O79751L48143l14571r34595j163857r17837l74595J96538N86746
13846G122203P37148P44611P39281P87079R21468J161158J447649J631171J582061
13837A6873829J319613J004171Q01875P64066P93570P13750L97295j53815q14624
13828B1699730j402562j767021j852743j693627j378299j013463o66322l62522
13820A1563171j61328j26756j96073j87077N8182N70780J221266J752037J954360
13811A6448562J895860J894263K185916K687552L132830L312711L122269K531961
13803C7211924J618034N63563l81505r31206r07999m48981L5414J86094l5959
13794C6909379m06570o85316p55072o03172k73255J75108P04971J268560J751087
$$ plain form
13785 38085720 40119454 42221964 44246483 46092357 47671314 48923179 49834333 50416984
13777 50416984 50636887 50339870 49285398 47308160 44509099 41337290 38458019 36456740
13769 36456740 35600083 35832619 36933824 38620200 40564897 42442979 43985123 44984185
13761 44984185 45311224 45012540 44393015 43884685 43733613 43811953 43745864 43208896 42120690
13752 42120690 40678109 39295827 38524165 38915269 40800282 44125079 48503404 53377991
13744 53377991 58145130 62291599 65552358 67959022 69732266 71117686 72274938 73226767
13736 73226767 73827805 73821645 73055652 71697410 70207432 69071693 68544498 68595799 69059246
13727 69059246 69795148 70690044 71617499 72512794 73417820 74399904 75479698 76600608 77568723
$$ packed form
13785C8085720K033734K102510K024519J845874J578957J251865R11154N82651
13777E0416984K19903k97017j054472j977238k799061l171809k879271k001279
13769C6456740q56657K32536J101205J686376J944697J878082J542144R99062
13761D4984185L27039k98684o19525n08330j51072P8340o6089n36968j088206
13752D2120690j442581j382282p71662L91104J885013L324797M378325M874587
13744E3377991M767139M146469L260759K406664J773244J385420J157252R51829
13736G3226767O01038o160p65993j358242j489978j135739n27195N1301M63447
13727F9059246P35902Q94896R27455Q95295R05026R82084J079794J120910R68115
$$ plain form
13718 77568723 78034247 77603701 76045287 73466557 70333355 67289037 64899619 63493187
13710 63493187 63114614 63546834 64391990 65189296 65541846 65237036 64291243 62898748 61365595
13701 61365595 60039276 59177675 58809086 58723137 58643431 58437340 58148930 57847826 57459849
13692 57459849 56713398 55283520 53068841 50360346 47717096 45633905 44301172 43623657
13684 43623657 43366274 43250037 43000650 42412516 41409677 40076642 38624435 37257409 36030759
13675 36030759 34842377 33571198 32225039 30951587 29920212 29225623 28903467 28987915 29516850
13666 29516850 30477254 31732798 33020380 34053484 34670953 34933157 35064813 35308619 35843462
13657 35843462 36747942 37961973 39309448 40568878 41510549 41921135 41673329 40811532 39568149
$$ packed form
13718G7568723M65524m30546j558414k578730l133202l044318k389418j406432
13710F3493187l78573M32220Q45156P97306L52550l04810r45793j392495j533153
13701F1365595j326319q61601l68589q5949p9706k06091k88410l01104l87977
13692E7459849p46451j429878k214679k708495k643250k083191j332733o77515
13684D3623657k57383j16237k49387n88134j002839j333035j452207j367026j226650
13675C6030759j188382j271179j346159j273452j031375o94589l22156Q4448N28935
13666B9516850R60404J255544J287582J033104O17469K62204J31656K43806N34843
13657C5843462R04480J214031J347475J259430R41671M10586k47806q61797j243383
$$ plain form
13648 39568149 38253579 37110727 36277775 35842461 35870308 36363023 37205488 38150061 38848182
13639 38848182 38981983 38476361 37576137 36656701 35942224 35381398 34733404 33770175 32458563
13630 32458563 30954373 29411659 27857474 26262903 24655414 23131677 21813256 20800444
13622 20800444 20104574 19594046 19038524 18251461 17237354 16178334 15240049 14450680 13806725
13613 13806725 13418864 13465136 13989281 14786212 15503859 15832198 15625551 14950344 14089376
13604 14089376 13454628 13382402 13920120 14778375 15515463 15808041 15629838 15275988 15217028 15848031
13594 15848031 17299892 19418710 21852422 24182190 26136006 27763175 29305146 30847689
13586 30847689 32180064 32985561 33073430 32445997 31234743 29594590 27627377 25390709 22958386
$$ packed form
13648C9568149j314570j142852q32952m35314K7847M92715Q42465R44573O98121
13639C8848182J33801n05622r00224r19436p14477n60826o47994r63229j311612
13630C2458563j504190j542714j554185j594571j607489j523737j318421j012812
13622B0800444o95870n10528n55522p87063j014107j059020r38285p89369o43955
13613A3806725l87861M6272N24145P96931P17647L28339k06647o75207q60968
13604A4089376o34748p2226N37718Q58255P37088K92578j78203l53850n8960O31003
13594A5848031J451861K118818K433712K329768J953816J627169J541971J542543
13586C0847689J332375Q05497Q7869o27433j211254j640153j967213k236668k432323
$$ plain form
13577 22958386 20440964 17970097 15694906 13777957 12373896 11600835 11488203 11896152
13569 11896152 12492272 12882092 12838418 12421735 11867935 11358230 10890097 10354068 9689407
13560 9689407 8941817 8232419 7729015 7589782 7824845 8205764 8375338 8088090 7373289
13551 7373289 6495487 5793859 5559848 5963635 6939418 8106758 8933824 9079147 8561969
13542 8561969 7620890 6481173 5267081 4063960 2975567 2092191 1426497 903047 440146
13533 440146 74822 20208 587433 1979526 4076867 6437130 8556177 10144688 11186072
13524 11186072 11816790 12212871 12508619 12709232 12702045 12380642 11701394 10645818 9229100
13515 9229100 7561366 5862958 4406497 3419875 2985371 2982667 3129976 3135723 2868657 2405373
$$ packed form
13577B2958386k517422k470867k275191j916949j404061p73061j12632M07949
13569A1896152N96120L89820m3674m16683n53800n09705m68133n36029o64661
13560I689407p47590p09398n03404j39233K35063L80919J69574k87248p14801
13551G373289q77802p01628k34011M03787R75783J167340Q27066J45323n17178
13542H561969r41079j139717j214092j203121j088393q83376o65694n23450m62901
13533D40146l65324n4614N67225J392093K097341K360263K119047J588511J041384
13524A1186072O30718L96081K95748K00613p187l21403o79248j055576j416718
13515I229100j667734j698408j456461r86622m34504k704J47309N747k67066m63284
$$ plain form
13505 2405373 1936861 1643133 1637932 1986748 2748988 4003374 5812657 8148010 10839101
13496 10839101 13573632 15945952 17562522 18210544 18021283 17445294 16956246 16741108 16694477
13487 16694477 16672633 16674051 16785416 17066449 17509444 18049181 18603569 19080069 19296056 18955086
13477 18955086 17821057 15947035 13675114 11386957 9298985 7492605 6041148 5042187
13469 5042187 4551660 4530912 4869128 5468638 6319296 7441433 8751308 10058756 11191765
13460 11191765 12050056 12542689 12546076 11977180 10913170 9616389 8421830 7556779 7023754
13451 7023754 6621395 6058943 5095824 3637272 1765222 -290296 -2268416 -4020121 -5526020
13442 -5526020 -6775591 -7676625 -8112195 -8048663 -7541193 -6653159 -5439475 -4030218 -2675946
$$ packed form
13505B405373m68512k93728n201L48816P62240J254386J809283K335353K691091
13496A0839101K734531K372320J616570O48022j89261n75989m89048k15138m6631
13487A6694477k1844J418J11365K81033M42995N39737N54388M76500K15987l40970
13477A8955086j134029j874022k271921k288157k087972j806380j451457r98961
13469E042187m90527k0748L38216N99510Q50658J122137J309875J307448J133009
13460A1191765Q58291M92633L387n68896j064010j296781j194559q65051n33025
13451G023754m02359n62452r63119j458552j872050k055518j978120j751705j505899
13442e526020j249571r01034m35570O3532N07470Q88034J213684J409257J354272
$$ plain form
13433 -2675946 -1653162 -1109103 -1008570 -1205103 -1500080 -1649380 -1421429 -717412 362618
13424 362618 1571597 2647583 3426293 3852243 3957721 3881690 3830523 3929183 4107610 4183677
13414 4183677 4071983 3919280 4076827 4902165 6508722 8706854 11199957 13802379 16498932
13405 16498932 19382320 22503246 25697384 28570841 30690341 31772642 31745222 30740310
13397 30740310 29031466 26898652 24536591 22074795 19598919 17118620 14566665 11886826
13389 11886826 9162729 6643560 4628454 3370172 3071777 3865491 5706339 8279072
13381 8279072 11067637 13590122 15615898 17193205 18498695 19678195 20804044 21909740
13373 21909740 23006807 24059511 24973319 25633271 25965324 25985873 25775479 25356012 24620996
$$ packed form
13433b675946J022784N44059J00533j96533k94977j49300K27951P04017J080030
13424C62618J208979J075986P78710M25950J05478p6031n1167R8660J78427P6067
13414D183677j11694j52703J57547Q25338J606557K198132K493103K602422K696553
13405A6498932K883388L120926L194138K873457K119500J082301k7420j004912
13397C0740310j708844k132814k362061k461796k475876k480299k551955k679839
13389A1886826k724097k519169k015106j258282k98395P93714J840848K572733
13381H279072K788565K522485K025776J577307J305490J179500J125849J105696
13373B1909740J097067J052704R13808O59952L32053K0549k10394m19467p35016
$$ plain form
13364 24620996 23422905 21706693 19531308 16986747 14170411 11261195 8532190 6232290
13356 6232290 4460764 3137685 2039216 885860 -480551 -1955938 -3249125 -4098371
13348 -4098371 -4391939 -4122948 -3318977 -2042281 -407942 1429622 3315845 5119819 6698528
13339 6698528 7864082 8436794 8351124 7741114 6929256 6276994 5980600 5954514 5910021 5599318
13329 5599318 5015080 4375516 3944355 3855883 4051523 4331789 4494949 4467601 4312233 4129468
13319 4129468 3981235 3923087 4080492 4613627 5573238 6810005 8039489 9031276 9775693
13310 9775693 10461911 11282777 12304375 13503939 14828548 16195689 17464959 18423041 18838360
13301 18838360 18547732 17508113 15816205 13675033 11302954 8848665 6363588 3842791
$$ packed form
13364B4620996j198091j716212k175385k544561k816336k909216k729005k299900
13356F232290j771526j323079j098469j153356j366411j475387j293187q49246
13348d098371k93568K68991Q03971J276696J634339J837564J886223J803974J578709
13339F698528J165554N72712q5670o10010q11858o52262k96394k6086m4493l10703
13329E599318n84238o39564m31161q8472J95640K80266J63160k7348j55368j82765
13319D129468j48233n8148J57405N33135R59611J236767J229484R91787P44417
13310I775693O86218Q20866J021598J199564J324609J367141J269270R58082M15319
13301A8838360k90628j039619j691908k141172k372079k454289k485077k520797
$$ plain form
13293 3842791 1305184 -1155121 -3381981 -5217701 -6582427 -7543006 -8285999 -8927242 -9348554
13284 -9348554 -9282872 -8524824 -7037113 -4939492 -2489259 -55553 1991529 3423774 4199079
13275 4199079 4437364 4433107 4625028 5406263 6896443 8858168 10801637 12209852 12738327
13266 12738327 12319040 11199722 9853167 8722639 8001095 7610839 7313485 6827479 5933582
13257 5933582 4586150 2957482 1347060 36272 -827969 -1287451 -1510909 -1662652 -1823880
13248 -1823880 -1989866 -2105568 -2136297 -2128132 -2159589 -2214584 -2149760 -1803550 -1104184 -79423
13238 -79423 1174876 2488059 3606195 4253962 4233257 3489413 2121021 328959 -1643542
13229 -1643542 -3511920 -4959656 -5743198 -5784578 -5125371 -3828596 -1952203 405810 3056647
$$ packed form
13293C842791k537607k460305k226860j835720j364726r60579p42993o41243m21312
13284i348554O5682P58048J487711K097621K450233K433706K047082J432245P75305
13275D199079K38285m257J91921P81235J490180J961725J943469J408215N28475
13266A2738327m19287j119318j346555j130528p21544l90256k97354m86006q93897
13257E933582j347432j628668j610422j310788q64241m59482k23458j51743j61228
13248a823880j65986j15702l0729Q165l1457n4995O4824L46210O99366J024761
13238g9423J254299J313183J118136O47767k0705p43844j368392j792062j972501
13229a643542j868378j447736p83542m1380O59207J296775J876393K358013K650837
$$ plain form
13220 3056647 5771243 8414709 10987692 13506371 15845306 17697455 18692171 18589725
13212 18589725 17460096 15747644 14113844 13137042 13098451 13943680 15376523 17025790 18576772
13203 18576772 19802296 20547540 20726082 20325568 19388327 18013090 16447584 15095332 14288484
13194 14288484 14076740 14293907 14785056 15505778 16432329 17479976 18558407 19629712 20606694
13185 20606694 21224083 21140452 20204277 18535111 16342050 13754116 10821289 7617443 4332696
13176 4332696 1269146 -1282717 -3208080 -4631565 -5826685 -7062143 -8481889 -10048302
13168 -10048302 -11578667 -12890347 -13941174 -14807531 -15535574 -16056662 -16246854 -16038275 -15472840
13159 -15472840 -14662533 -13711497 -12673201 -11568796 -10438601 -9347831 -8308729 -7222978
$$ packed form
13220C056647K714596K643466K572983K518679K338935J852149R94716j02446
13212A8589725j129629j712452j633800r76802l8591Q45229J432843J649267J550982
13203A8576772J225524P45244J78542m00514r37241j375237j565506j352252q06848
13194A4288484k11744K17167M91149P20722R26551J047647J078431J071305R76982
13185B0606694O17389q3631r36175j669166k193061k587934k932827l203846l284747
13176D332696l063550k551863j925363j423485j195120j235458j419746j566413
13168a0048302j530365j311680j050827q66357p28043n21088j90192K08579N65435
13159a5472840Q10307R51036J038296J104405J130195J090770J039102J085751
$$ plain form
13151 -7222978 -5985611 -4666298 -3492012 -2614380 -1963777 -1368567 -790675 -408281 -467163
13142 -467163 -1074498 -2140465 -3446878 -4691417 -5521487 -5663767 -5081107 -3957901 -2490520
13133 -2490520 -739755 1279475 3432465 5424102 6879063 7471928 7052757 5681326
13125 5681326 3551463 905047 -2013741 -4970755 -7734981 -10093792 -11892236 -13061138
13117 -13061138 -13593550 -13466535 -12626521 -11136970 -9354626 -7865296 -7143310 -7268926 -7966971
13108 -7966971 -8838559 -9572220 -10056573 -10358205 -10587276 -10757990 -10772256 -10521632 -9940242 -8931851
13098 -8931851 -7303508 -4860979 -1635277 1989011 5433822 8262061 10362625 11836169
13090 11836169 12785106 13254069 13298312 13032569 12613252 12208686 11991090 12098887 12552743
$$ packed form
13151g222978J237367J319313J174286Q77632O50603N95210N77892L82394n8882
13142d67163o07335j065967j306413j244539q30070j42280N82660J123206J467381
13133b490520J750765K019230K152990J991637J454961N92865m19171j371431
13125E681326k129863k646416k918788k957014k764226k358811j798444j168902
13117a3061138n32412J27015Q40014J489551J782344J489330P21986j25616o98045
13108g966971q71588p33661m84353l01632k29071j70714j4266K50624N81390J008391
13098h931851J628343K442529L225702L624288L444811K828239K100564J473544
13090A1836169R48937M68963M4243k65743m19317m04566k17596J07797M53856
$$ plain form
13081 12552743 13207499 13800684 14077842 13929159 13441344 12808618 12190191 11632753 11059886
13072 11059886 10318839 9288356 7962056 6414149 4692774 2775649 605232 -1872988
13064 -1872988 -4645625 -7501464 -9959057 -11439356 -11593345 -10440111 -8252894 -5451769
13056 -5451769 -2572250 -158523 1401767 1959581 1588219 508472 -1015140 -2751872
13048 -2751872 -4517541 -6142332 -7450493 -8300096 -8642472 -8510379 -7955646 -7028160 -5804138
13039 -5804138 -4412443 -3013015 -1727739 -580525 489592 1565157 2726751 4066639
13031 4066639 5660042 7462154 9205476 10447521 10788039 10088750 8559650 6682327
13023 6682327 4990898 3805561 3123919 2748558 2462455 2106024 1601214 980789 391104
$$ packed form
13081A2552743O54756N93185K77158j48683m87815o32726o18427n57438n72867
13072A1059886p41047j030483j326300j547907j721375j917125k170417k478220
13064a872988k772637k855839k457593j480299j53989J153234K187217K801125
13056e451769K879519K413727J560290N57814l71362j079747j523612j736732
13048b751872j765669j624791j308161q49603l42376J32093N54733R27486J224022
13039e804138J391695J399428J285276J147214J070117J075565J161594J339888
13031D066639J593403J802112J743322J242045L40518o99289j529100j877323
13023F682327j691429j185337o81642l75361k86103l56431n04810o20425n89685
$$ plain form
13014 391104 25313 18169 358069 877312 1358866 1685266 1923070 2279030 2921808 3810150
13004 3810150 4684786 5221428 5221056 4695836 3814297 2778843 1724491 707862 -216593
12995 -216593 -952465 -1424923 -1632610 -1599377 -1305839 -656131 491539 2203070 4344570
12986 4344570 6565119 8420689 9592868 10025257 9865508 9330136 8604721 7785360 6884349
12977 6884349 5900299 4865467 3819530 2769783 1697773 617226 -350472 -986468 -1101840
12968 -1101840 -631022 368255 1718628 3159136 4467396 5544695 6370554 6936278 7266205
12959 7266205 7464752 7662131 7890712 8075464 8159657 8172445 8156408 8076342 7824823 7311526
12949 7311526 6539530 5624535 4798447 4393185 4737730 6006953 8164662 11047138 14468038
$$ packed form
13014C91104l65791p144L39900N19243M81554L26400K37804L55960O42778Q88342
13004C810150Q74636N36642l72n25220q81539j035454j054352j016629r24455
12995b16593p35872m72458k07687L3233K93538O49708J147670J711531K141500
12986D344570K220549J855570J172179M32389j59749n35372p25415q19361r01011
12977F884349r84050j034832j045937j049747j072010j080547r67698o35996j15372
12968a101840M70818R99277J350373J440508J308260J077299Q25859N65724L29927
12959G266205J98547J97379K28581J84752Q4193J2788j6037q0066k51519n13297
12949G311526p71996r14995q26088m05262L44545J269223K157709K882476L420900
$$ plain form
12940 14468038 18248048 22208794 26152733 29805589 32782960 34686009 35313056 34832124
12932 34832124 33758874 32699908 32026634 31757348 31705506 31666615 31464816 30909791 29793404
12923 29793404 27971529 25465387 22455300 19124661 15525727 11661434 7685391 3967059
12915 3967059 989140 -787347 -1070456 100605 2345346 5138548 8009798 10593415
12907 10593415 12571985 13670940 13767059 12948798 11420975 9408554 7184459 5097459
12899 5097459 3489830 2615242 2613922 3459142 4933490 6721196 8514511 10034739 11046695
12890 11046695 11447535 11306916 10738511 9750959 8283113 6387668 4348763 2590078 1425059
12881 1425059 830818 433880 -257489 -1548714 -3401465 -5515674 -7555308 -9320583 -10778905
$$ packed form
12940A4468038L780010L960746L943939L652856K977371J903049O27047m80932
12932C4832124j073250j058966o73274k69286n1842l8891k01799n55025j116387
12923B9793404j821875k506142l010087l330639l598934l864293l976043l718332
12915C967059k977919j776487k83109J171061K244741K793202K871250K583617
12907A0593415J978570J098955R6119q18261j527823k012421k224095k087000
12899E097459j607629q74588j320Q45220J474348J787706J793315J520228J011956
12890A1046695M00840j40619n68405r87552j467846j895445k038905j758685j165019
12881A425059n94241l96938o91369j291225j852751k114209k039634j765275j458322
$$ plain form
12872 -10778905 -12023086 -13190906 -14333483 -15355816 -16137251 -16701190 -17251979 -18051750 -19232544
12863 -19232544 -20687088 -22125355 -23234137 -23789671 -23652000 -22712914 -20899685 -18249032
12855 -18249032 -14987925 -11544464 -8450422 -6183117 -5023518 -4960688 -5702226 -6807970
12847 -6807970 -7838386 -8463926 -8528293 -8038178 -7116406 -5956256 -4734914 -3500115 -2153589
12838 -2153589 -565191 1274473 3170482 4816665 5995965 6639924 6733910 6281981 5369990
12829 5369990 4198838 3014716 1965450 1003713 -16018 -1116802 -2147172 -2982885
12821 -2982885 -3691541 -4435213 -5300458 -6277298 -7285908 -8148039 -8615799 -8511424 -7826322
12812 -7826322 -6696872 -5351602 -4067658 -3090462 -2530129 -2343342 -2444123 -2802033 -3412514
$$ packed form
12872a0778905j244181j167820j142577j022333p81435n63939n50789p99771j180794
12863a9232544j454544j438267j108782n55534J37671R39086J813229K650653
12855a8249032L261107L443461L094042K267305J159599O2830p41538j105744
12847f807970j030416o25540o4367M90115R21772J160150J221342J234799J346526
12838b153589J588398J839664J896009J646183J179300O43959R3986m51929r11991
12829E369990j171152j184122j049266r61737j019731j100784j030370q35713
12821b982885p08656p43672q65245r76840j008610q62131m67760J04375O85102
12812g826322J129450J345270J283944R77196N60333J86787j00781l57910o10481
$$ plain form
12803 -3412514 -4213244 -5081627 -5916494 -6691728 -7434558 -8161501 -8817136 -9301075 -9601989
12794 -9601989 -9853594 -10217664 -10766697 -11477939 -12280236 -13092088 -13814634 -14310186 -14445765
$$ packed form
12803c412514q00730q68383q34867p75234p42830p26943o55635m83939l00914
12794i601989k51605l64070n49033p11242q02297q11852p22546m95552j35579
$$ [...]
##END NTUPLES=NMR SPECTRUM
##END=
