##TITLE=31P ikalashn
LR-793-O-C1
12.12.2024
##JCAMPDX= 6.0         $$ Bruker NMR JCAMP-DX V2.0
##DATA TYPE= NMR SPECTRUM
##DATA CLASS= NTUPLES
##ORIGIN= UXNMR, Bruker Analytische Messtechnik GmbH
##OWNER= root
$$ TOPSPIN		Version 1.3
$$ 2024-12-12 13:59:16.140 +0400  Irina@DPX200
$$ Compression mode = diff/dup
##.OBSERVE FREQUENCY= 81.01967998063
##.OBSERVE NUCLEUS= ^31P
##.ACQUISITION MODE= SIMULTANEOUS
##.ACQUISITION SCHEME= undefined
##.AVERAGES= 128
##.DIGITISER RES= 17
##SPECTROMETER/DATA SYSTEM= spect
##.PULSE SEQUENCE= zgpg
##.SOLVENT NAME= D2O
##.SHIFT REFERENCE= INTERNAL, D2O, 1, 298.5841
##AUDIT TRAIL= $$ (NUMBER, WHEN, WHO, WHERE, WHAT)
$$ ##TITLE= Audit trail, TOPSPIN		Version 1.3
$$ ##JCAMPDX= 5.01
$$ ##ORIGIN= Bruker BioSpin GmbH
$$ ##OWNER= Irina
$$ $$ F:/spectra/data/iren/nmr/P31dec/1/pdata/1/auditp.txt
$$ ##AUDIT TRAIL=  $$ (NUMBER, WHEN, WHO, WHERE, VERSION, WHAT)
(   1,<2024-12-12 13:58:12.453 +0400>,<Irina>,<DPX200>,<TOPSPIN 1.3>,
      <created by zg
	started at 2024-12-12 13:54:54.078 +0400,
	POWCHK disabled, PULCHK disabled
       configuration hash MD5:
       BE 6D 3F 07 2A EA 11 49 91 17 2B D3 AF B3 58 0D
       data hash MD5: 32K
       6A 61 8A 27 2A 99 FC 99 C7 5A C7 E0 D5 12 4E 71>)
(   2,<2024-12-12 13:58:12.671 +0400>,<Irina>,<DPX200>,<TOPSPIN 1.3>,
      <Start of raw data processing
       efp BC_mod = 2 LB = 15 FT_mod = 6 PKNL = 1 PHC0 = 94.614 PHC1 = 284.3068 SI = 32K 
       data hash MD5: 32K
       96 30 C1 E8 B6 C4 FE 82 33 DD 23 85 BA F0 AB CC>)
(   3,<2024-12-12 13:58:14.734 +0400>,<Irina>,<DPX200>,<TOPSPIN 1.3>,
      <apk 
       data hash MD5: 32K
       E0 39 DA 33 42 DF 18 0B 92 73 94 85 D6 5A DE 99>)
(   4,<2024-12-12 13:58:16.765 +0400>,<Irina>,<DPX200>,<TOPSPIN 1.3>,
      <abs n ABSG = 5 
       data hash MD5: 32K
       A3 99 6E F4 AE 50 10 EC CF 5C 37 F0 D6 20 77 E9>)
(   5,<2024-12-12 13:58:25.750 +0400>,<Irina>,<DPX200>,<TOPSPIN 1.3>,
      <pk fgphup PHC0 = 8.983691 PHC1 = -20 
       data hash MD5: 32K
       20 67 7C A7 F8 D9 6E A0 6B A1 9E E7 6F 0F AB 83>)
(   6,<2024-12-12 13:58:27.468 +0400>,<Irina>,<DPX200>,<TOPSPIN 1.3>,
      <abs n ABSG = 5 
       data hash MD5: 32K
       45 E5 4C 6F 97 9A E7 7D 0A 66 38 77 F7 9B 22 37>)
(   7,<2024-12-12 13:58:43.156 +0400>,<Irina>,<DPX200>,<TOPSPIN 1.3>,
      <pk fgphup PHC0 = 3.6 PHC1 = 0 
       data hash MD5: 32K
       8E C8 44 CE 6C 12 13 45 65 EE 06 0F 28 BB A0 71>)
(   8,<2024-12-12 13:58:45.250 +0400>,<Irina>,<DPX200>,<TOPSPIN 1.3>,
      <abs n ABSG = 5 
       data hash MD5: 32K
       C9 4E 39 6C 04 AA 34 B0 89 53 52 F9 58 CC 76 62>)
$$ ##END=
$$ 
$$ $$ hash MD5
$$ $$ 09 D4 B0 17 3F 46 07 2B 0F 60 0C 6A 6F 02 37 A2
##$RELAX= 
##$RELAX= 
##$RELAX= 
##$RELAX= 
##$RELAX= 
##$RELAX= 
##$RELAX= 
##$RELAX= 
##$RELAX= 
##$RELAX= 
##$RELAX= 
$$ Bruker specific parameters
$$ --------------------------
##$DU= <F:/spectra>
##$EXPNO= 1
##$NAME= <P31dec>
##$PROCNO= 1
##$TYPE= <nmr>
##$USER= <iren>
##$AMP= (0..31)
$$ [...]
##$SW_h= 37037.037037037
##$TD= 32768
##$TD0= 1
##$TE= 300
##$TE2= 300
##$TE3= 300
##$TEG= 300
##$TL= (0..7)
0 120 53 12 22 120 120 120 
##$TP= (0..7)
150 150 150 150 150 150 150 150 
##$TP07= 0
##$TPNAME0= <>
##$TPNAME1= <>
##$TPNAME2= <>
##$TPNAME3= <>
##$TPNAME4= <>
##$TPNAME5= <>
##$TPNAME6= <>
##$TPNAME7= <>
##$TPOAL= (0..7)
0.5 0.5 0.5 0.5 0.5 0.5 0.5 0.5 
##$TPOFFS= (0..7)
0 0 0 0 0 0 0 0 
##$TUNHIN= 0
##$TUNHOUT= 0
##$TUNXOUT= 0
##$USERA1= <user>
##$USERA2= <user>
##$USERA3= <user>
##$USERA4= <user>
##$USERA5= <user>
##$V9= 5
##$VALIST= <valist>
##$VCLIST= <CCCCCCCCCCCCCCC>
##$VD= 0
##$VDLIST= <DDDDDDDDDDDDDDD>
##$VPLIST= <PPPPPPPPPPPPPPP>
##$VTLIST= <TTTTTTTTTTTTTTT>
##$WBST= 1024
##$WBSW= 4
##$XGAIN= (0..3)
0 0 0 0 
##$XL= 0
##$YL= 0
##$YMAX_a= 5266
##$YMIN_a= -9449
##$ZGOPTNS= <>
##$ZL1= 120
##$ZL2= 120
##$ZL3= 120
##$ZL4= 120
##$ABSF1= 298.5841
##$ABSF2= -158.5842
##$ABSG= 5
##$ABSL= 5
##$ALPHA= 0
##$AQORDER= 0
##$ASSFAC= 0
##$ASSFACI= 0
##$ASSFACX= 0
##$ASSWID= 0
##$AUNMP= <proc_1d>
##$AXLEFT= 0
##$AXRIGHT= 0
##$AXTYPE= 0
##$AXUNIT= <>
##$AZFE= 0.1
##$AZFW= 0.5
##$BCFW= 0
##$BC_mod= 2
##$BYTORDP= 0
##$COROFFS= 0
##$CY= 12.5935478210449
##$DATMOD= 1
##$DC= 0
##$DFILT= <>
##$DTYPP= 0
##$F1P= 47.1127640792319
##$F2P= -24.0371245302204
##$FCOR= 0.5
##$FTSIZE= 32768
##$FT_mod= 6
##$GAMMA= 0
##$GB= 0
##$INTBC= 1
##$INTSCL= 7.269226e-011
##$ISEN= 30
##$LB= 15
##$LEV0= 0
##$LPBIN= 0
##$MAXI= 12.09355
##$MC2= 0
##$MEAN= 0
##$ME_mod= 0
##$MI= 0.7550151
##$NCOEF= 0
##$NC_proc= -11
##$NLEV= 6
##$NOISF1= 298.5841
##$NOISF2= 270.0111
##$NSP= 0
##$NTH_PI= 0
##$NZP= 0
##$OFFSET= 298.5841
##$PC= 1.4
##$PHC0= 131.5765
##$PHC1= 281.8385
##$PH_mod= 1
##$PKNL= yes
##$PPARMOD= 0
##$PPDIAG= 0
##$PPIPTYP= 0
##$PPMPNUM= 100
##$PPRESOL= 1
##$PSCAL= 0
##$PSIGN= 0
##$REVERSE= no
##$SF= 81.014009
##$SI= 32768
##$SIGF1= 270.0111
##$SIGF2= -158.5842
##$SINO= 77.54984
##$SIOLD= 32768
##$SREGLST= <31P.CDCl3>
##$SSB= 0
##$STSI= 32768
##$STSR= 0
##$SW_p= 37037.037037037
##$SYMM= 0
##$S_DEV= 0
##$TDeff= 32768
##$TDoff= 0
##$TI= <>
##$TILT= no
##$TM1= 0
##$TM2= 0
##$TOPLEV= 0
##$USERP1= <user>
##$USERP2= <user>
##$USERP3= <user>
##$USERP4= <user>
##$USERP5= <user>
##$WDW= 1
##$XDIM= 32768
##$YMAX_p= 393707369
##$YMIN_p= -9585119
$$ End of Bruker specific parameters
$$ ---------------------------------
##NTUPLES= NMR SPECTRUM
##VAR_NAME=  FREQUENCY,     SPECTRUM/REAL,   SPECTRUM/IMAG
##SYMBOL=    X,             R,               I
##VAR_TYPE=  INDEPENDENT,   DEPENDENT,       DEPENDENT
##VAR_FORM=  AFFN,          ASDF,            ASDF
##VAR_DIM=   32768,         32768,           32768
##UNITS=     HZ,            ARBITRARY UNITS, ARBITRARY UNITS
##FACTOR=    1.13031516577767, 1,            1
##FIRST=     37037.037037037, -4307967,      14983456
##LAST=      0,             -5010030,        -14333330
##MIN=       0,             -9585119,        0
##MAX=       37037.037037037, 393707369,     0
$$ Real data points
##PAGE= N=1
##DATA TABLE= (X++(R..R)), XYDATA
$$ [...]
17915D33409P5451O1905M4262K9280K1817K0695K0076J3535m540l9079r2376j61316
17903D23119k37318l08381l61244l84210l71465l27981k70565k19656j85146j58622
17893b401469j20815o0514J1496O8526Q9168P2939L7697N065j1312p569J4299
17882b302489N0036R5189J46463K00966K51689K84005K81022K36727J64796R3094
17872d98502M7303L7393N6451Q9021J19230J33809J22558P9297M220r3667j97250
17861a00137k86947l47316l69775l51203k91496j93235o4514P7343K05201K88343
17851a433736L05187K54107J52922K8470r4582k00218k83233l47301l98844m39701
17841b456929m63786m59884m18118l35604k17063p0867R3119K60130M06944N05280
$$ y = [433409, 508860, 570765, 615027, 644307, 666124, 686819, 706895, 720430, 715890, 676811, 584435, 423119, 185801, -122580, -483824, -868034, -1239499, -1567480, -1838045, -2057701, -2242847, -2401469, -2522284, -2582798, -2571302, -2502776, -2413608, -2340669, -2302972, -2297907, -2309219, -2316788, -2302489, -2252453, -2157264, -2010801, -1809835, -1558146, -1274141, -993119, -756392, -591596, -498502, -451199, -413806, -357355, -268334, -149104, -15295, 107263, 186560, 190780, 97113, -100137, -387084, -734400, -1104175, -1455378, -1746874, -1940109, -2004623, -1927280, -1722079, -1433736, -1128549, -874442, -721520, -693050, -787632, -987850, -1271083, -1618384, -2017228, -2456929, -2920715, -3380599, -3798717, -4134321, -4351384, -4422251, -4329132, -4069002, -3662058, -3156778]
17831c156778N32114M80668L65928K20383Q0077l0586j03735j39817j36332q6495
17821a974573J0644J40178K72652L75628M26202M18658L65853K92713K23826J73144
17811G24925J41633J21125J00768P4054M3979K1432J6945L2049N7022P6753P9703
17800A490388O2008K3987l3281j04682j77077k33659k64312k71309k64686k52422
17790b5045k35086k09337j76046j43042j18505j02847q9489p4260o2253o3356
17780a299266q3224j21547j76251k43242l11021l60942l77745l60268l20726k73622
17770c927854k23639j61659p2812M8787J90002L22009M15756M58311M58216M37326
17760b055557M16254M04087L97757L87669L62861L13768K35095J29026O085j17280
$$ y = [-3156778, -2624664, -2143996, -1778068, -1557685, -1477608, -1508194, -1611929, -1751746, -1888078, -1974573, -1963929, -1823751, -1551099, -1175471, -749269, -330611, 35242, 327955, 551781, 724925, 866558, 987683, 1088451, 1162505, 1206484, 1227916, 1244861, 1276910, 1333932, 1410685, 1490388, 1552396, 1576383, 1543102, 1438420, 1261343, 1027684, 763372, 492063, 227377, -25045, -260131, -469468, -645514, -788556, -907061, -1009908, -1099397, -1173657, -1235910, -1299266, -1382490, -1504037, -1680288, -1923530, -2234551, -2595493, -2973238, -3333506, -3654232, -3927854, -4151493, -4313152, -4385964, -4337177, -4147175, -3825166, -3409410, -2951099, -2492883, -2055557, -1639303, -1235216, -837459, -449790, -86929, 226839, 461934, 590960, 597045, 479765]
17750D79765k22622k93051l15692k84112k02488r0300J9671R4099J15222Q8860
17740f10648M0157J019l676L5274J09914J99562K79791L32524L50810L35267K87682
17729A357676K09970J09158Q14r5228j63516j98698k05850j96869j85637j84154
17719D47666j99290k28732k59222k71937k52971k00835j26005m5112K6385Q0599
17709a029454J18570J45194J64132J77582J87315J92850J89909J73025J40840
17700D59963R9776O2522M0441L5637M0216M2463L3447Q945l1829q5159j40014
17689E66408j80174j92120j71454j23012n7380J1538O9112J06059J22961J26023
17679B77961J17978R5523N5930M707m3250p0378o6421l4675Q551L9735L8082l720
$$ y = [479765, 257143, -35908, -351600, -635712, -838200, -928500, -908829, -814730, -699508, -610648, -570491, -569472, -573148, -537874, -427960, -228398, 51393, 383917, 734727, 1069994, 1357676, 1567646, 1676804, 1677618, 1582390, 1418874, 1220176, 1014326, 817457, 631820, 447666, 248376, 19644, -239578, -511515, -764486, -965321, -1091326, -1136438, -1110053, -1029454, -910884, -765690, -601558, -423976, -236661, -43811, 146098, 319123, 459963, 559739, 622261, 662702, 698339, 738555, 781018, 814465, 823410, 791581, 706422, 566408, 386234, 194114, 22660, -100352, -157732, -146194, -77082, 28977, 151938, 277961, 395939, 491462, 547392, 552099, 508849, 438471, 372050, 337375, 345926, 385661, 423743, 420023]
17667D20023p6013j60366k42191l15534l77296m19823m31725m06145l47177k68115
17657b624362j84095j06757m4729n740O444j035q652N550N0650J14645J70805
17646b627276J94516J78192J34421Q6468N3346M1181M6810O6518J00114J48259
17636a577451K06431K61458K95625K96303K62412K02179J25718M0736m5739j24594
17626e6922j85147k17586k15538j80004j23290o6059k5844q011q356k0616l6886
17615a144259m2778j9603M3192J36494K32861L00925L21274K91634K21278J24724
17605D65742K0766o7075j16326j17412q0546k9759J0270K3822O835l2983p8006
17594E328j08391j13322r5886o7501l9274j8683r985j2701k0816k6452k4166j1903
$$ y = [420023, 344010, 183644, -58547, -374081, -751377, -1171200, -1602925, -2009070, -2356247, -2624362, -2808457, -2915214, -2959943, -2965683, -2959239, -2960274, -2968926, -2963376, -2912726, -2798081, -2627276, -2432760, -2254568, -2120147, -2033679, -1980333, -1939152, -1892342, -1825824, -1725710, -1577451, -1371020, -1109562, -813937, -517634, -255222, -53043, 72675, 113411, 67672, -56922, -242069, -459655, -675193, -855197, -978487, -1044546, -1070390, -1078401, -1086757, -1107373, -1144259, -1187037, -1206640, -1163448, -1026954, -794093, -493168, -171894, 119740, 341018, 465742, 486508, 419433, 303107, 185695, 105149, 75390, 85660, 109482, 116317, 83334, 5328, -103063, -216385, -312271, -379772, -419046, -437729, -447714, -460415, -481231, -507683, -531849, -543752]
17582e43752Q187K7274L0710N203n1210j23072j82210k03930j83026j35118q3818
17571a434762m6566k7987k1815j7974r662L334J5094J6885K865k5228n9686r2956
17559a698458j19879j34103j26345q9240k3198O3036J55353K36665K90411L06598
17549a139160K87453K48623K13748K05151K36100L06199L99630M88278N40808
17540A786830N33671M59183L29240J72155K0034j06169k01197k67724l08337l26569
17530B091117l31034l32542l36142l37822l28612l00787k52762j92917j38305
17521d59806j05392r9347j11175j23993j23785j08210q6536o9963o1398n4968
17511a404573m5176l4963l2747m1218n0071m1152k975N7253J14545J40029J17345
$$ y = [-543752, -535565, -508291, -477581, -472378, -523588, -646660, -828870, -1032800, -1215826, -1350944, -1434762, -1481328, -1509315, -1531130, -1549104, -1558766, -1555432, -1540338, -1523453, -1520588, -1545816, -1605502, -1698458, -1818337, -1952440, -2078785, -2168025, -2191223, -2128187, -1972834, -1736169, -1445758, -1139160, -851707, -603084, -389336, -184185, 51915, 358114, 757744, 1246022, 1786830, 2320501, 2779684, 3108924, 3281079, 3301113, 3194944, 2993747, 2726023, 2417686, 2091117, 1760083, 1427541, 1091399, 753577, 424965, 124178, -128584, -321501, -459806, -565198, -664545, -775720, -899713, -1023498, -1131708, -1218244, -1288207, -1349605, -1404573, -1449749, -1484712, -1517459, -1558677, -1608748, -1649900, -1652875, -1595622, -1481077, -1341048, -1223703]
17500a223703N0530l9139j22723j74301j79348j38859o7329J5815R5688J65495
17490a617874K23833K69868L00566L11954L02600K75588K37449J95721J56220
17481F55925J20462Q5242M6379M053l4555n8213n9034l9262j3445l036k3828p5450
17469F05238j44130k14643k77331l25982l53236l49293l04621k15146q7560N8480
17459a608224J95061K97054L52647L67424L60624L54986L64332L86094M03502
17450A473500L96253L52445K73168J68392N0558o8968j80985k79683l63334m31926
17440A389420m82936n09279n01353m51577l58053k26312p0175Q9343K29847L36043
17430e55032M04079M37119M36064L95151L06908J71892M580j69459l21875m27026
$$ y = [-1223703, -1173173, -1212312, -1335035, -1509336, -1688684, -1827543, -1894872, -1879057, -1783369, -1617874, -1394041, -1124173, -823607, -511653, -209053, 66535, 303984, 499705, 655925, 776387, 861629, 908008, 912061, 877506, 819293, 760259, 720997, 707552, 704516, 680688, 605238, 461108, 246465, -30866, -356848, -710084, -1059377, -1363998, -1579144, -1666704, -1608224, -1413163, -1116109, -763462, -396038, -35414, 319572, 683904, 1069998, 1473500, 1869753, 2222198, 2495366, 2663758, 2714316, 2645348, 2464363, 2184680, 1821346, 1389420, 906484, 397205, -104148, -555725, -913778, -1140090, -1210265, -1120922, -891075, -555032, -150953, 286166, 722230, 1117381, 1424289, 1596181, 1600761, 1431302, 1109427, 682401]
17420F82401m64021m23058l15705j75790m3780N3109J07730J25265J14180Q4076
17410b55593M5706Q440k2060m2606n0734m5759l0320r969P773J5077P502j2421
17398c84964l5320m9944m9882l6598j6788K929K0254L8063O0562Q7432J12958
17387b51298J31948J45076J57581J73230J88771J93315J73860J22803M1867n9269
17377A017884j66298k62298l29940l56048l35952k75311j89894j00763k4155L6526
17367i86249Q9766J47046K11355K69597K94933K61003J61255J7813j29852k46508
17357I0159l14541l33101l11775k66354k14608j71031j43781j34142j36683j41064
17347b076921j35727j12219o9445j6207L1507N9608O5496N9355N4971N8474O4580
$$ y = [682401, 218380, -204678, -520383, -696173, -739953, -686844, -579114, -453849, -339669, -255593, -209887, -201447, -223507, -266113, -316847, -362606, -392926, -402895, -395122, -380045, -372543, -384964, -420284, -470228, -520110, -556708, -573496, -570567, -550313, -512250, -451688, -364256, -251298, -119350, 25726, 183307, 356537, 545308, 738623, 912483, 1035286, 1077153, 1017884, 851586, 589288, 259348, -96700, -432652, -707963, -897857, -998620, -1022775, -986249, -896483, -749437, -538082, -268485, 26448, 287451, 448706, 466519, 336667, 90159, -224382, -557483, -869258, -1135612, -1350220, -1521251, -1665032, -1799174, -1935857, -2076921, -2212648, -2324867, -2394312, -2410519, -2379012, -2319404, -2253908, -2194553, -2139582, -2081108, -2016528]
17336b016528O1374L8842m734o2719j24137j75797k02223j89336j33496m6238
17326b854992N2348J44026K15751K58392K69130K55909K34504K17746K07956J98964
17316h00266J82693J53791J11068N7550L05n0511q5671j02998j09438j16389j32551
17305h92417j59268j89699k10951k08384j71984j02631j2604Q2071J71746K55886
17295a438235L35527M03587M42682M32626L62458K40639R6157l3792j22904j67414
17285E51331j82443j87861j94968k01232j93850j60103r7949j8649N8247J11847
17275e15630J27948J07157O5302K3031n853j8742k3213l3672o3375j14138j74291
17264f25476k28109k66004k84921k82303k54854k06100j51082j06121p1754k9768
$$ y = [-2016528, -1955154, -1916312, -1921046, -1983765, -2107902, -2283699, -2485922, -2675258, -2808754, -2854992, -2802644, -2658618, -2442867, -2184475, -1915345, -1659436, -1424932, -1207186, -999230, -800266, -617573, -463782, -352714, -295164, -294859, -345370, -431041, -534039, -643477, -759866, -892417, -1051685, -1241384, -1452335, -1660719, -1832703, -1935334, -1947938, -1865867, -1694121, -1438235, -1102708, -699121, -256439, 176187, 538645, 779284, 875441, 841649, 718745, 551331, 368888, 181027, -13941, -215173, -409023, -569126, -667075, -685724, -627477, -515630, -387682, -280525, -215223, -192192, -198045, -216787, -240000, -273672, -337047, -451185, -625476, -853585, -1119589, -1404510, -1686813, -1941667, -2147767, -2298849, -2404970, -2476724, -2506492]
17254b506492M0502J43528K62733L70065M40131M59210M26256L49309K41438J18093
17244C44773m833j12268j90550k29056k23448j77885j03398j3912P5753J50227
17234d84597J96981K12234K02201J76836J42124R9201M9420l360n4887j01104
17224D35049j37862j63977j84630k09073k43629k86324l26446l47952l36302k86454
17214b087600k06648j15342l3493K4216N4521O3543O0110N0875M0237L3207L7242
17203b079132O0376J05243J63209K15372K41269K28610J77669R9113Q612p7472
17193h57131j44500j81285j83176j55592j13492p4906n3067n1221o0820o5279
17183a940469n0820j7821J7420L3367J9043j8173n9410q7797r5909q5343o4089
$$ y = [-2506492, -2465990, -2322462, -2059729, -1689664, -1249533, -790323, -364067, -14758, 226680, 344773, 339940, 227672, 37122, -191934, -415382, -593267, -696665, -710577, -634824, -484597, -287616, -75382, 126819, 303655, 445779, 544980, 594400, 591040, 536153, 435049, 297187, 133210, -51420, -260493, -504122, -790446, -1116892, -1464844, -1801146, -2087600, -2294248, -2409590, -2443083, -2418867, -2364346, -2300803, -2240693, -2189818, -2149581, -2116374, -2079132, -2018756, -1913513, -1750304, -1534932, -1293663, -1065053, -887384, -788271, -779659, -857131, -1001631, -1182916, -1366092, -1521684, -1635176, -1710082, -1763149, -1814370, -1875190, -1940469, -1991289, -2009110, -1991690, -1958323, -1939280, -1957453, -2016863, -2104660, -2200569, -2285912, -2350001]
17172b350001m4262l8558n4331q7661j23623j44248j37862j02550m3273L2496
17162c093873J16905K02281K81561L48302L96209M18680M08608L59960K73306
17153b88061J61458M7672m3298r3471r6722o3010j6899J5691K4279J6963P040
17142c28358j230j3859l8262p5084j16191j48392j59167j41437r7900m2819M258
17131a158441L0923M0185M7837P0676J12631J59140J86150J77202J34165P4250
17121a25282J8027k2741m8661o4423o8298n3541k0517J5452K9980L991o4495j57951
17109e58459k45634k94422k81197k03218p8780O4797K04473L23184M04234M31617
17099b33405L98419L13471J98761Q0337j9983q8560j20617j18919r1354m9713
$$ y = [-2350001, -2394263, -2432821, -2487152, -2574813, -2698436, -2842684, -2980546, -3083096, -3126369, -3093873, -2976968, -2774687, -2493126, -2144824, -1748615, -1329935, -921327, -561367, -288061, -126603, -78931, -122229, -215700, -312422, -375432, -392331, -376640, -352361, -335398, -328358, -329588, -343447, -381709, -456793, -572984, -721376, -880543, -1021980, -1119880, -1162699, -1158441, -1127518, -1087333, -1039496, -968820, -856189, -697049, -510899, -333697, -199532, -125282, -107255, -129996, -178657, -243080, -311378, -364919, -385436, -369984, -340004, -336013, -400508, -558459, -804093, -1098515, -1379712, -1582930, -1661710, -1596913, -1392440, -1069256, -665022, -233405, 165014, 478485, 677246, 757583, 737600, 649040, 528423, 409504, 318150, 268437]
17089B68437r735J2197P057k2447o7531j22583j88049k65576l51540m34555m98531
17078a672856n29324n20695m74763l97275k94056j72060m1510Q4769J94131K76265
17068c547374L24812L40229L31763L14262L01442L00071L06966L09932K93449
17059g24448K46490J68593P1502k4300r6535j27900j10343m6069N3690J71545
17049d17775K87941L85361M51996M83851M83815M57208M07268L36295K50557J60402
17039C286919P4534l137o9576j18156j41714j39851j21603j01562r4148j08629
17029B463077j43951j86109k14158k12969j82018j34021q7335n8510n6651p9179
17019A108176j11444j33145j28560r3500l5920K8165Q1847J15444J30143J34310
$$ y = [268437, 258702, 270899, 277956, 255509, 187978, 65395, -122654, -388230, -739770, -1174325, -1672856, -2202180, -2722875, -3197638, -3594913, -3888969, -4061029, -4102539, -4017770, -3823639, -3547374, -3222562, -2882333, -2550570, -2236308, -1934866, -1634795, -1327829, -1017897, -724448, -477958, -309365, -237863, -262163, -358698, -486598, -596941, -643010, -589320, -417775, -129834, 255527, 707523, 1191374, 1675189, 2132397, 2539665, 2875960, 3126517, 3286919, 3361453, 3358316, 3288740, 3170584, 3028870, 2889019, 2767416, 2665854, 2571706, 2463077, 2319126, 2133017, 1918859, 1705890, 1523872, 1389851, 1302516, 1244006, 1187355, 1108176, 996732, 863587, 735027, 641527, 605607, 633772, 715619, 831063, 961206, 1095516]
17009A095516J36060J37329J30678J00604L3156o9988j86049k80298l22552l01017
16999D73439k26773j25787k2933O9453J49935K18989K73674L08862L21410L12736
16989A753005K87904K53593K17162J85307J61433J44325J29585J12531R0206O0917
16979C395968K2357k8833r6862j87117l03176m38850n72286o69012o95358o37052
16969b10221n09138l47241j88006n5608L8551R0630J02831Q4904N2478K1329K340
16958i17151n38Q874K0200K1865P481k2383o2374j03448j33755j43723j32688
16947a457640j09461q5234o5709m9101k9875l538L1141P2832J18327J60422J86494
16936a231342J83828J48601Q8828J8602n0405j13650j72907k32051k93548l57827
$$ y = [1095516, 1231576, 1368905, 1499583, 1600187, 1633343, 1563355, 1377306, 1097008, 774456, 473439, 246666, 120879, 97946, 167399, 317334, 536323, 809997, 1118859, 1440269, 1753005, 2040909, 2294502, 2511664, 2696971, 2858404, 3002729, 3132314, 3244845, 3335051, 3395968, 3418325, 3389492, 3292630, 3105513, 2802337, 2363487, 1791201, 1122189, 426831, -210221, -719359, -1066600, -1254606, -1310214, -1271663, -1181033, -1078202, -993298, -940820, -919491, -917151, -917689, -908815, -888615, -866750, -859269, -881652, -944026, -1047474, -1181229, -1324952, -1457640, -1567101, -1652335, -1718044, -1767145, -1797020, -1800558, -1769417, -1696585, -1578258, -1417836, -1231342, -1047514, -898913, -810085, -791483, -841888, -955538, -1128445, -1360496, -1654044, -2011871]
16926b011871m23202m82538n19439n12134m46093l24116j65143L490J53361K61089
16916d466596L13390L08514K53551J61041M7858o5076j55429k05206k07854j72949
16906d188756j23471q5093p3788q9674j20259j48925j61171j46003r6382j1612
16896e245134R9104K15305L09435L56130L42722K75489J77479P9000N364l2739
16886c417845m1022l3684k1356m803K0691N6366R7585J39301J79345K14715K37233
16875b573474K35917K05432J52429R3164M5420K2219K9084O3131J14004J66910
16865a445764K06333K20570K07048J74075J35829J05261R0609R4992J16221J48040
16855E3214J84084K20234K51276K65923K48432J87701Q6145l7937j55822k40347
$$ y = [-2011871, -2435073, -2917611, -3437050, -3949184, -4395277, -4719393, -4884536, -4881046, -4727685, -4466596, -4153206, -3844692, -3591141, -3430100, -3382242, -3447318, -3602747, -3807953, -4015807, -4188756, -4312227, -4397320, -4471108, -4560782, -4681041, -4829966, -4991137, -5137140, -5233522, -5245134, -5146030, -4930725, -4621290, -4265160, -3922438, -3646949, -3469470, -3390470, -3385106, -3417845, -3458867, -3492551, -3513907, -3518710, -3498019, -3441653, -3344068, -3204767, -3025422, -2810707, -2573474, -2337557, -2132125, -1979696, -1886532, -1841112, -1818893, -1789809, -1726678, -1612674, -1445764, -1239431, -1018861, -811813, -637738, -501909, -396648, -306039, -211047, -94826, 53214, 237298, 457532, 708808, 974731, 1223163, 1410864, 1497009, 1459072, 1303250, 1062903]
16845A062903k78030k72704k38216j88737j35236q6939n1258l1135k4458k7430
16835b71240l7312n0953o2738o6951o2273n3308m8082n3386p0776r7006j28159
16824a002184j61249j91577k11444k13300j93047j49328q2017O291J07112K04644
16814a886099K78752L13173L04685K65128K13011J61383J12541O2594Q862m7436
16804b13406j04150j61274k19237k74117l14822l25319k92228k13436j01200K2210
16794b196979J33561K17069K66801K82426K64892K17632J49698P2180j0790j04201
16784g07711k12037l25232m22401m83994n04753m93085m62784m27766l99978l84875
16774d824616l75413l52758k96433j97276o5656O9948J75964K31449K37356K11430
$$ y = [1062903, 784873, 512169, 273953, 85216, -50020, -136959, -188217, -219352, -243810, -271240, -308552, -359505, -422243, -489194, -551467, -604775, -652857, -706243, -777019, -874025, -1002184, -1163433, -1355010, -1566454, -1779754, -1972801, -2122129, -2204146, -2197855, -2090743, -1886099, -1607347, -1294174, -989489, -724361, -511350, -349967, -237426, -174832, -165970, -213406, -317556, -478830, -698067, -972184, -1287006, -1612325, -1904553, -2117989, -2219189, -2196979, -2063418, -1846349, -1579548, -1297122, -1032230, -814598, -664900, -592720, -603510, -707711, -919748, -1244980, -1667381, -2151375, -2656128, -3149213, -3611997, -4039763, -4439741, -4824616, -5200029, -5552787, -5849220, -6046496, -6112152, -6042204, -5866240, -5634791, -5397435, -5186005]
16764e186005J75677J47528J38465J55647K01208K68322L38785L88391L99322
16755b972660L70135L14044K47803J82490J24242Q1126O4400Q0306J23393J79791
16745a204930K34898K76367K92468K72795K14861J29994M0216l2599p6680r3745
16735E3645r5714r6262j01161j05229r9475q0979n5594l2615j7037n104J2908
16724f22617M4611Q9798J40639J84798K08706K01221J57341Q0712j6516j17588
16714C51105k06921k73245l09228l10427k76108k12050j32243n5409K868L6294
16704a385364M8230M8211M8601O1717R4567J43791J97547K42623K66735K56196
16694B2854J99940J00016k5495j53544k68878l66107m43608m97426n19232n00123
$$ y = [-5186005, -5010328, -4862800, -4724335, -4568688, -4367480, -4099158, -3760373, -3371982, -2972660, -2602525, -2288481, -2040678, -1858188, -1733946, -1652820, -1588420, -1508114, -1384721, -1204930, -970032, -693665, -401197, -128402, 86459, 216453, 256669, 224070, 147390, 53645, -42069, -138331, -239492, -344721, -444196, -525175, -580769, -613384, -630421, -635525, -622617, -578006, -488208, -347569, -162771, 45935, 247156, 404497, 485209, 468693, 351105, 144184, -129061, -438289, -748716, -1024824, -1236874, -1369117, -1424526, -1421658, -1385364, -1337134, -1288923, -1240322, -1178605, -1084038, -940247, -742700, -500077, -233342, 22854, 222794, 322810, 297315, 143771, -125107, -491214, -934822, -1432248, -1951480, -2451603]
16684b451603m38674l45412k37798j30848l3459M7994J07027J39142J44013J24026
16674c075592Q2808K8346k1946m2770j3112O9626J87315L11408M13844M72557
16664a587516M75932M26430L38409K30730J21044K4831m5610q4826r6380r0037
16654b86993p7039o8574p7364j15732j87270k79773l68298m26148m35122l91342
16644b713655l06847k05665j13136m5034o317L116j2794m2622o8486p4186n2739
16633c638365o859N6361J30510K10177K87222L48278L79376L75075L41289K88646
16623a228290K26372J62412J04257N6874K1462l659k1976l6719m7589n0587m2995
16612h60438k6672m590K4253O4023J15021J67244K02616K08060J88134J62681
$$ y = [-2451603, -2890277, -3235689, -3473487, -3604335, -3637794, -3589800, -3482773, -3343631, -3199618, -3075592, -2992784, -2964438, -2986384, -3029154, -3042266, -2972640, -2785325, -2473917, -2060073, -1587516, -1111584, -685154, -346745, -116015, 5029, 29860, -15750, -100576, -196956, -286993, -364032, -432606, -509970, -625702, -812972, -1092745, -1461043, -1887191, -2322313, -2713655, -3020502, -3226167, -3339303, -3384337, -3390654, -3387538, -3400332, -3442954, -3511440, -3585626, -3638365, -3645224, -3588863, -3458353, -3248176, -2960954, -2612676, -2233300, -1858225, -1516936, -1228290, -1001918, -839506, -735249, -678375, -656913, -660572, -682548, -719267, -766856, -817443, -860438, -887110, -891700, -867447, -803424, -688403, -521159, -318543, -110483, 77651, 240332]
16602B40332J50471J55348J66430J68318J51234J16078P4310M2553L3611M9744
16592A348429Q3488J24595J65694K02071K29554K46001K54248K60588K70014K83563
16582C468245K99296L13992L23074L19929K97724K52901J86765J04602J3836p7599
16572E502765j61893k30800k76322k94300k87932k67240k44445k27553k15775
16563C296505k01180j76620j42408j05071p0218l7082J467N4329J24770K04264
16553B948756K73836L13609L13164K75676K14269J42446O4144k8209j44266k82746
16543D090679m26748n51129o34400o66070o47770n90590n10575m24017l44499
16534g05119k81488k38255k09884j86104j59781j33749j18626j23425j46441j72416
$$ y = [240332, 390803, 546151, 712581, 880899, 1032133, 1148211, 1222521, 1265074, 1298685, 1348429, 1431917, 1556512, 1722206, 1924277, 2153831, 2399832, 2654080, 2914668, 3184682, 3468245, 3767541, 4081533, 4404607, 4724536, 5022260, 5275161, 5461926, 5566528, 5580364, 5502765, 5340872, 5110072, 4833750, 4539450, 4251518, 3984278, 3739833, 3512280, 3296505, 3095325, 2918705, 2776297, 2671226, 2601008, 2563926, 2565393, 2619722, 2744492, 2948756, 3222592, 3536201, 3849365, 4125041, 4339310, 4481756, 4545900, 4517691, 4373425, 4090679, 3663931, 3112802, 2478402, 1812332, 1164562, 573972, 63397, -360620, -705119, -986607, -1224862, -1434746, -1620850, -1780631, -1914380, -2033006, -2156431, -2302872, -2475288]
16524b475288j78676j46822p1457L8546J64322K83604L76532M29573M38784M10656
16514g30226L56770K85540J99093R7577j4390j24793k17687k81555l15353l26046
16504a071070l20543l01337k69491k29362j88259j51457j18232q3686m4884n343
16494b783664K4963L4144J6457j9974n3454n9609k5295M4649J32311K18966K93782
16483b176724L52746L93797M15483M17093L97147L54484K93021K23891J59887
16474H30825J06133N6429j172p7096j77839l05712m58641o32121q21730j020529
16464b501453j210226j352712j391570j272100r79900n72323j60740J55179L39976
16455h945869M18219M35861M28913M14319L93932L60925L05132K19320J07721
$$ y = [-2475288, -2653964, -2800786, -2872243, -2833697, -2669375, -2385771, -2009239, -1579666, -1140882, -730226, -373456, -87916, 111177, 208754, 194364, 69571, -148116, -429671, -745024, -1071070, -1391613, -1692950, -1962441, -2191803, -2380062, -2531519, -2649751, -2733437, -2778321, -2783664, -2758701, -2724557, -2708100, -2728074, -2781528, -2841137, -2866432, -2821783, -2689472, -2470506, -2176724, -1823978, -1430181, -1014698, -597605, -200458, 154026, 447047, 670938, 830825, 936958, 993387, 992215, 915119, 737280, 431568, -27073, -659194, -1480924, -2501453, -3711679, -5064391, -6455961, -7728061, -8707961, -9280284, -9441024, -9285845, -8945869, -8527650, -8091789, -7662876, -7248557, -6854625, -6493700, -6188568, -5969248, -5861527]
16446e861527r799j05131j56523j58941j23804p0301j5318L1958O9199R6690J13437
16435f190060J17351J11572J10465J34448J94687K82156L70623M29660M39687
16426c999411M02180L38344K75092K28468J98010J75907J59398J54056J67608
16417a900348K02388K52291L05115L47491L69086L64642L33517K77773K00363
16408G52318J03508j1744j42960k82290m15999n28152o04366o35618o25668n95611
16398b986582n73606n75139n94527o14450o18823n96216n37403m34795k85341
16389g816882r3875J26962L60000N86517P86015R35031J011427J005347R27222
16380b172236Q04518O70788N54824M73052M26019M01018L81241L56236L25979
$$ y = [-5861527, -5871326, -5976457, -6132980, -6291921, -6415725, -6486026, -6501344, -6469386, -6400187, -6303497, -6190060, -6072709, -5961137, -5850672, -5716224, -5521537, -5239381, -4868758, -4439098, -3999411, -3597231, -3258887, -2983795, -2755327, -2557317, -2381410, -2222012, -2067956, -1900348, -1697960, -1445669, -1140554, -793063, -423977, -59335, 274182, 551955, 752318, 855826, 844082, 701122, 418832, 2833, -525319, -1129685, -1765303, -2390971, -2986582, -3560188, -4135327, -4729854, -5344304, -5963127, -6559343, -7096746, -7531541, -7816882, -7910757, -7783795, -7423795, -6837278, -6051263, -5116232, -4104805, -3099458, -2172236, -1367718, -696930, -142106, 330946, 756965, 1157983, 1539224, 1895460, 2221439]
16371B221439K97184K76865K66768K60239K46165K19308J86571J61705J54715
16362D290959J66189J88557K10117K19710K11956J90169J63178J37999J15015
16353E893849Q9229N5144J0516m4015j07052j76032k45866l11191l69773m20380
16343D374429m55929m60569m17492l22936j94026o2579L9714R3649R8573P1782
16333B764616L8538J5585J85k7123q7758j87072l06181m11695m75147m85962m51404
16322C86582l88950l18384k58203k27089k43725l18207m41954n89323p30241q40617
16312c970111r03775r06778q35842o74685m15279q1347K62242N36194O86500P01168
16302e601713O02391M32429K41914P9134k1439m9016j7307M7788J25027K05339
$$ y = [2221439, 2518623, 2795488, 3062256, 3322495, 3568660, 3787968, 3974539, 4136244, 4290959, 4457148, 4645705, 4855822, 5075532, 5287488, 5477657, 5640835, 5778834, 5893849, 5983078, 6038222, 6048738, 6004723, 5897671, 5721639, 5475773, 5164582, 4794809, 4374429, 3918500, 3457931, 3040439, 2717503, 2523477, 2460898, 2500612, 2594261, 2692834, 2764616, 2803154, 2818739, 2818924, 2791801, 2704043, 2516971, 2210790, 1799095, 1323948, 837986, 386582, -2368, -320752, -578955, -806044, -1049769, -1367976, -1809930, -2399253, -3129494, -3970111, -4873886, -5780664, -6616506, -7291191, -7706470, -7787817, -7525575, -6989381, -6302881, -5601713, -4999322, -4566893, -4324979, -4245845, -4267284, -4316300, -4333607, -4285819, -4160792, -3955453]
16292c955453K85441L56340L99661L96854L42769K51058J47514N6704q971n0750
16282a778833p6268r0745r3070p9572n1849k0428O4Lj9472m8929p9245j08650
16270b446994j41307j79739k20445k57464k86602l03123k98248k62359j91698
16261d587979r1654K4572J40076K38812L08601L43555L46476L28668L05442K89239
16251b354192K83273K81089K74620K61805K44277K21191J90838J58745J38687
16242b99667J41130J60951J79517J80030J60890J33944J11417R6824Q6560P5495
16232A027091O0495M2350K6120J6842J2919P042m061j3603j0202J2132M8919Q7237
16220A313281J11882J10878P8251J5381o8817j60503k45747l15424l68292m09337
$$ y = [-3955453, -3670012, -3313672, -2914011, -2517157, -2174388, -1923330, -1775816, -1719112, -1728083, -1778833, -1855101, -1945846, -2038916, -2118488, -2170337, -2190765, -2190701, -2190698, -2210170, -2259099, -2338344, -2446994, -2588301, -2768040, -2988485, -3245949, -3532551, -3835674, -4133922, -4396281, -4587979, -4679633, -4655061, -4514985, -4276173, -3967572, -3624017, -3277541, -2948873, -2643431, -2354192, -2070919, -1789830, -1515210, -1253405, -1009128, -787937, -597099, -438354, -299667, -158537, 2414, 181931, 361961, 522851, 656795, 768212, 865036, 951596, 1027091, 1087586, 1129936, 1156056, 1172898, 1185817, 1192859, 1188798, 1175195, 1164993, 1177125, 1226044, 1313281, 1425163, 1536041, 1614292, 1629673, 1560856, 1400353, 1154606, 839182, 470890, 61553]
16210F1553m43194m68948m81584m77011m54114m13392l56050k83672j97460r9611
16200c613483L576J02028J86918K54747L06025L39830L50277L29595K76627K01983
16190a261877J22822N1339j1020o8248j19984j57378j67677j43633r1450k9997
16180a877103K0843N2876P1423Q7781J11717J46921J88912K26695K48577K47221
16170d74137K20324J70668J09080N4503K5377K7964N2245P8171Q6540O7107K0284
16159D38126m5860j20275j92629k53997k95538l09783k95168k58293k10058j58930
16149a702405j07650n5467j787N2414J05752J58021K11311K68985L30615L86256
16139c53955M17312M05349L43373K40292J13767k0875j53190k71432l59717m05071
$$ y = [61553, -381641, -850589, -1332173, -1809184, -2263298, -2676690, -3032740, -3316412, -3513872, -3613483, -3609907, -3507879, -3320961, -3066214, -2760189, -2420359, -2070082, -1740487, -1463860, -1261877, -1139055, -1087716, -1098736, -1166984, -1286968, -1444346, -1612023, -1755656, -1847106, -1877103, -1856260, -1803384, -1731961, -1644180, -1532463, -1385542, -1196630, -969935, -721358, -474137, -253813, -83145, 25935, 80438, 105815, 133779, 186024, 264195, 350735, 417842, 438126, 392266, 271991, 79362, -174635, -470173, -779956, -1075124, -1333417, -1543475, -1702405, -1810055, -1865522, -1867309, -1814895, -1709143, -1551122, -1339811, -1070826, -740211, -353955, 63357, 468706, 812079, 1052371, 1166138, 1145263, 992073, 720641, 360924, -44147]
16129d4147m06533l75863l29835k81385k34705j85379j25297n0544L2445J08075
16119a893168J60179J80880J72969J45681J08330O6054J9585l1793q6425j37104
16109a294812j71009j75880j51087j14098r2684j05837j49547k00059k31115k30033
16099b916161k00477j53091r4608k4718N9140J56338K61981L69073M70124N55515
16089a516884O10570O17809N65839M57213L07765J40387j9864j49642k32822k64474
16079E15897k49625j98657j24032l9607M0419J04766J47678J67266J61894J31573
16069F57572Q3891L4612q68j7404k2829l1499n2841q2587j04653j03452p6204
16058B83738l3901Q051M0933O8247J02432J54368K24152K99969L64082M00928
$$ y = [-44147, -450680, -826543, -1156378, -1437763, -1672468, -1857847, -1983144, -2033688, -2001243, -1893168, -1732989, -1552109, -1379140, -1233459, -1125129, -1059075, -1039490, -1071283, -1157708, -1294812, -1465821, -1641701, -1792788, -1906886, -1999570, -2105407, -2254954, -2455013, -2686128, -2916161, -3116638, -3269729, -3364337, -3389055, -3329915, -3173577, -2911596, -2542523, -2072399, -1516884, -906314, -288505, 277334, 734547, 1042312, 1182699, 1162835, 1013193, 780371, 515897, 266272, 67615, -56417, -96024, -55605, 49161, 196839, 364105, 525999, 657572, 741463, 776075, 775207, 757803, 734974, 703475, 650634, 568047, 463394, 359942, 283738, 249837, 257888, 298821, 367068, 469500, 623868, 848020, 1147989, 1512071, 1912999]
16048A912999M02580L68667L01702K03145P5180p3241k22435l45222m16972m26821
16038A779582l83131l09438k33275j75128j43433j35302j40660j48103j49376
16029c8264j40394j21602r9652q5253q3206q3316o5369j5877O1025J49307K33851
16018b88750L05288L55234L72091L44666K70118J57782K4582j12610k39664l42673
16008H46064m07125m21155l80114k90999j74801o2815J3681L6420Q567m7276r9902
15997i79455j21729r7210k5991P8315J92384K89524L47292L54774L16560K50718
15987F05182J80526J23242Q2120M6754J144o6063j54890k53495l43641m09213
15977a88334m42857m45888m22072l72397k96456j97052q2252L5299J39652K13809
$$ y = [1912999, 2315579, 2684246, 2985948, 3189093, 3264273, 3191032, 2968597, 2623375, 2206403, 1779582, 1396451, 1087013, 853738, 678610, 535177, 399875, 259215, 111112, -38264, -178658, -300260, -399912, -485165, -568371, -651687, -717056, -732933, -671908, -522601, -288750, 16538, 371772, 743863, 1088529, 1358647, 1516429, 1541011, 1428401, 1188737, 846064, 438939, 17784, -362330, -653329, -828130, -890945, -877264, -840844, -832277, -879553, -979455, -1101184, -1198394, -1224385, -1146070, -953686, -664162, -316870, 37904, 354464, 605182, 785708, 908950, 991070, 1037824, 1038968, 972905, 818015, 564520, 220879, -188334, -631191, -1077079, -1499151, -1871548, -2168004, -2365056, -2447308, -2412009, -2272357, -2058548]
15967b058548K45349K33844J93051J45034J11252J05617J30384J76117K26407
15958d91493K64492K78854K66953K35422J95743J57756J25214R5021O1250K3362
15948A212574q049j5403J4203P9779J66194K50734L10896L31348L09258K54887
15938B906421J85387J15829N4726N338l3222o7438j07513j59413k17650k67107
15928B415358k92558k87724k58331k18694j84585j66491j66414j78614j91886
15919D70061j91818j65222j06990k3046P3115J64488K33579K68255K67470K40156
15909A230048J99336J58630J30175J18544J14363R7162M7810l9572j54465k74761
15899A627270l74097m29127m26646l68859k73091j64106o3716J4309O3571Q5005
$$ y = [-2058548, -1813199, -1579355, -1386304, -1241270, -1130018, -1024401, -894017, -717900, -491493, -227001, 51853, 318806, 554228, 749971, 907727, 1032941, 1127962, 1189212, 1212574, 1204525, 1189122, 1203325, 1283104, 1449298, 1700032, 2010928, 2342276, 2651534, 2906421, 3091808, 3207637, 3262363, 3267701, 3234479, 3167041, 3059528, 2900115, 2682465, 2415358, 2122800, 1835076, 1576745, 1358051, 1173466, 1006975, 840561, 661947, 470061, 278243, 113021, 6031, -17015, 56100, 220588, 454167, 722422, 989892, 1230048, 1429384, 1588014, 1718189, 1836733, 1951096, 2048258, 2096068, 2056496, 1902031, 1627270, 1253173, 824046, 397400, 28541, -244550, -408656, -472372, -458063, -394492, -309487]
15889c09487Q8233Q7767R3109J01881J03112Q6999N2889J0925k2953l6436k9340
15878B26699j4603j0636k9951o9461j08620j21236r4894m0564J7274O0280Q7573
15867i8139J10371J38511J72930K08152K38158K58717K66103K55778K23565J69926
15857A944072J04389M4752R673J0144M4585R8884J52885J91302K09629K09496
15847C019811J91615J55536J03859M3826j6051p0516j17947j56035j78463j76360
15837B799275j43890q3869p702P1031J42667K01080K41050K60544K63586K55169
15827C998941K33651J94008J40168Q9316O0548O0102P6392Q6343O8065J2363p3903
15816D945994j72566k62184l26841l62853l79327l90500m03440m10648l94995
$$ y = [-309487, -221254, -133487, -40378, 61503, 164615, 251614, 304503, 315428, 292475, 256039, 226699, 212096, 201460, 171509, 102048, -6572, -127808, -222702, -263266, -245992, -185712, -98139, 12232, 150743, 323673, 531825, 769983, 1028700, 1294803, 1550581, 1774146, 1944072, 2048461, 2093213, 2102886, 2113030, 2157615, 2256499, 2409384, 2600686, 2810315, 3019811, 3211426, 3366962, 3470821, 3514647, 3498596, 3428080, 3310133, 3154098, 2975635, 2799275, 2655385, 2571516, 2563814, 2634845, 2777512, 2978592, 3219642, 3480186, 3743772, 3998941, 4232592, 4426600, 4566768, 4656084, 4716632, 4776734, 4853126, 4939469, 5007534, 5019897, 4945994, 4773428, 4511244, 4184403, 3821550, 3442223, 3051723, 2648283, 2237635, 1842640]
15807A842640l43394k58185j59016p4165k4796j1320j1971L790N5441J40194K38129
15796A397347L25770L85031M05259L85141L34926K71827K09233J51016R5549M1211
15786D002310j4186p5522j46546k21979k84051l08288k76108j85712n3790R2305
15776B528433K26350L31497M00080M28271M13249L55557K63678J56080N6394j7757
15766E141832o2383q3616q9815q8890q8821r6409j16214j51060k01299k62845
15756C900480l25323l71656l82953l49693k80027j95081j16236n6609j9146K117
15746A805873J6886L0386L9136L5333J5157j6725m9286p1036p4778n7972k0425
15735A652549L6243J06407J78862K38558K70915K67305K30329J74714J21032Q6017
$$ y = [1842640, 1499246, 1241061, 1082045, 1007880, 983084, 971764, 959793, 963583, 1019024, 1159218, 1397347, 1723117, 2108148, 2513407, 2898548, 3233474, 3505301, 3714534, 3865550, 3961099, 4002310, 3988124, 3912602, 3766056, 3544077, 3260026, 2951738, 2675630, 2489918, 2436128, 2528433, 2754783, 3086280, 3486360, 3914631, 4327880, 4683437, 4947115, 5103195, 5159589, 5141832, 5079449, 4995833, 4906018, 4817128, 4728307, 4631898, 4515684, 4364624, 4163325, 3900480, 3575157, 3203501, 2820548, 2470855, 2190828, 1995747, 1879511, 1822902, 1803756, 1805873, 1822759, 1853145, 1892281, 1927614, 1942771, 1926046, 1876760, 1805724, 1730946, 1672974, 1652549, 1688792, 1795199, 1974061, 2212619, 2483534, 2750839, 2981168, 3155882, 3276914, 3362931]
15725C362931P6620Q9855J15521J39934J51081J43590J19422Q3934M1592n833
15715D318647n8183j14952j74974k37612l03105l70328m32039m72769m75162m31635
15705A247888l51086k55933j72578j20289j03827j13521j32241j44697j43159
15696b89443j26005r2306m0176K7779R7399J43615J42052Q5721o238r8318j60502
15685c16422j82759j72600j43322j05450o5889k9665j4K1384L2631L1114J6249
15674i14743p328l1157m9084o1590p2400q0973q0237o2254k4960K6195Q0952J28615
15662a148964J62622J81966J87427J78675J58247J36628J28939J44993J82316
15653C12849K26917K59481K63844K35251J82312J18214M9350k3737r3358j37575
$$ y = [3362931, 3439551, 3529406, 3644927, 3784861, 3935942, 4079532, 4198954, 4282888, 4324480, 4318647, 4260464, 4145512, 3970538, 3732926, 3429821, 3059493, 2627454, 2154685, 1679523, 1247888, 896802, 640869, 468291, 348002, 244175, 130654, -1587, -146284, -289443, -415448, -507754, -547930, -520151, -422752, -279137, -137085, -51364, -57602, -155920, -316422, -499181, -671781, -815103, -920553, -986442, -1016107, -1016121, -994737, -962106, -930992, -914743, -922071, -953228, -1002312, -1063902, -1136302, -1217275, -1297512, -1359766, -1384726, -1358531, -1277579, -1148964, -986342, -804376, -616949, -438274, -280027, -143399, -14460, 130533, 312849, 539766, 799247, 1063091, 1298342, 1480654, 1598868, 1648218, 1624481, 1531123, 1393548]
15643A393548j30181n9296O1602J98771L13973L79632L87113L47427K84630K23943
15633C401162J80277J53648J33451J09071Q0856O3397P6619J30214K13410K98115
15623D840220L53403L60354L17036K32899J19514j4431j60431l03840m23016m97743
15613D823965n19912m97299m48731l94784l49065l14563k86121k56329k21558
15604A535603j84644j51934j27677j09825q8181m7397K2288J12980J99328K54295
15594A414836K65447K37932J86694J28304P7045M4221L7409N7667R8337J49581
15584B697473K04175K57137L01486L27762L28424L02657K58360K09626J69958
15575E057058J44922J30153J16664R8764P6269M8808J0374m6857j21620j97624
$$ y = [1393548, 1263367, 1204071, 1265673, 1464444, 1778417, 2158049, 2545162, 2892589, 3177219, 3401162, 3581439, 3735087, 3868538, 3977609, 4058465, 4121862, 4198481, 4328695, 4542105, 4840220, 5193623, 5553977, 5871013, 6103912, 6223426, 6208995, 6048564, 5744724, 5321708, 4823965, 4304053, 3806754, 3358023, 2963239, 2614174, 2299611, 2013490, 1757161, 1535603, 1350959, 1199025, 1071348, 961523, 873342, 825945, 848233, 961213, 1160541, 1414836, 1680283, 1918215, 2104909, 2233213, 2310258, 2354479, 2391888, 2449555, 2547892, 2697473, 2901648, 3158785, 3460271, 3788033, 4116457, 4419114, 4677474, 4887100, 5057058, 5201980, 5332133, 5448797, 5547561, 5623830, 5672638, 5683012, 5636155, 5514535, 5316911]
15565E316911k51381k67478k47275k06041j63627j34036j17547r9535n8665J8233
15555C789559J23504K28534K97633L05215K44281J26234k0880j55644k34720k31474
15545D472242j48317j2022J42457K85310L95373M58833M71410M42632L93121L43348
15535G244387L03856K74701K51312K29608K07592J85386J65801J53781J52157
15526I168581J57254J61218J60286J59805J69566J94073K26830K52878K58819
15517A0909310K43981K21664K08199K12164K34249K72963L26135L87641M46841
15508A3463147M94734N31638N67228O12331O70430P34017P86800Q12928Q08629
15499A9481882P85580P63206P59077P84979Q49010R59957J128257J361720J660877
$$ y = [5316911, 5065530, 4798052, 4550777, 4344736, 4181109, 4047073, 3929526, 3829991, 3771326, 3789559, 3913063, 4141597, 4439230, 4744445, 4988726, 5114960, 5094080, 4938436, 4703716, 4472242, 4323925, 4311903, 4454360, 4739670, 5135043, 5593876, 6065286, 6507918, 6901039, 7244387, 7548243, 7822944, 8074256, 8303864, 8511456, 8696842, 8862643, 9016424, 9168581, 9325835, 9487053, 9647339, 9807144, 9976710, 10170783, 10397613, 10650491, 10909310, 11153291, 11374955, 11583154, 11795318, 12029567, 12302530, 12628665, 13016306, 13463147, 13957881, 14489519, 15056747, 15669078, 16339508, 17073525, 17860325, 18673253, 19481882, 20267462, 21030668, 21789745, 22574724, 23423734, 24383691, 25511948, 26873668, 28534545]
15490B8534545K018114K419250K845099L271788L667480L986904M170787M158136
15482E5072103L910789L433604K769406J970374J074846J12939q69318j797610
15474F5677133k584949l163434l507599l635625l593469l434342l203868k935852
15466C9617995k655057k378758k114973j861931j611838j357691j099924q48208
15458B5689615o15980m11569k33940p8126N4761J54447K09960K20759J98982J60912
15448B5349821J17271P2480L1438K993n387O459L4188P6991J40313K30442L46523
15437B6403532M75705N95151O81795P24909P32096P23591P21260P41138P89401
15428C2588578Q61212R47075J045395J169932J342695J575600J854855K140210
$$ y = [28534545, 30552659, 32971909, 35817008, 39088796, 42756276, 46743180, 50913967, 55072103, 58982892, 62416496, 65185902, 67156276, 68231122, 68344061, 67474743, 65677133, 63092184, 59928750, 56421151, 52785526, 49192057, 45757715, 42553847, 39617995, 36962938, 34584180, 32469207, 30607276, 28995438, 27637747, 26537823, 25689615, 25073635, 24662066, 24428126, 24350000, 24404761, 24559208, 24769168, 24989927, 25188909, 25349821, 25467092, 25539572, 25571010, 25574003, 25568616, 25575075, 25609263, 25686254, 25826567, 26057009, 26403532, 26879237, 27474388, 28156183, 28881092, 29613188, 30336779, 31058039, 31799177, 32588578, 33449790, 34396865, 35442260, 36612192, 37954887, 39530487, 41385342, 43525552]
15420D3525552K377684K513893K505150K325557J978513J505258R76910M65492
15412E8174009Q959m03658q12829j248733j702556k128731k471898k696466k798896
15403D3919201k797733k714908k566255k364348k123042j858677j590100j336668
15395B6567470j112639r22702p65019o40194n55429n16660n17176n37112n55958
15386B0444581n64560n64938n61604n55057n40791n11807m63640m00176l35387
15377A5946621k87338k66361k66252k66115k41344j75912p0227N8054J81039K72559
15367A4884724L17628L13851K67037J87778R0470q472r4673j60350k06383k40249
15357A5351361k71994l11218l62183m16079m49546m37092l69031k59957j41489
$$ y = [43525552, 45903236, 48417129, 50922279, 53247836, 55226349, 56731607, 57708517, 58174009, 58182968, 57779310, 56966481, 55717748, 54015192, 51886461, 49414563, 46718097, 43919201, 41121468, 38406560, 35840305, 33475957, 31352915, 29494238, 27904138, 26567470, 25454831, 24532129, 23767110, 23126916, 22571487, 22054827, 21537651, 21000539, 20444581, 19880021, 19315083, 18753479, 18198422, 17657631, 17145824, 16682184, 16282008, 15946621, 15659283, 15392922, 15126670, 14860555, 14619211, 14443299, 14373072, 14431126, 14612165, 14884724, 15202352, 15516203, 15783240, 15971018, 16061488, 16053016, 15958343, 15797993, 15591610, 15351361, 15079367, 14768149, 14405966, 13989887, 13540341, 13103249, 12734218, 12474261, 12332772]
15348A2332772m4361J8542N5855Q5325J17082J47332J65270J63962J45543J18849
15338A3306171R2976P1787N2010K5755j1540n2858q0660p7935m0207J9853P7304
15327A3382656J06557R3575M2064k9758j00196j54793j89740k10776k32271k73253
15317A2434065l46587m46327n44998o05678n99463n15799l64011j69614L3247
15308H874835K11144L38736M03098M06188L64348L02674K45472K07396J89698
15299A1543589J82297J69872J40722R3810L8025j5196n8348q8491j04143j04315
15289A1797822r0191o4018k4805L1930J08378J98334K84084L38441L35176K64280
15279A3179431J40404l427j32424k24308k72550k81158k58784k16422j66861j22370
$$ y = [12332772, 12288411, 12306953, 12362808, 12448133, 12565215, 12712547, 12877817, 13041779, 13187322, 13306171, 13399147, 13470934, 13522944, 13548699, 13537159, 13484301, 13403641, 13325706, 13285499, 13305352, 13382656, 13489213, 13582788, 13624852, 13595094, 13494898, 13340105, 13150365, 12939589, 12707318, 12434065, 12087478, 11641151, 11096153, 10490475, 9891012, 9375213, 9011202, 8841588, 8874835, 9085979, 9424715, 9827813, 10234001, 10598349, 10901023, 11146495, 11353891, 11543589, 11725886, 11895758, 12036480, 12130290, 12168315, 12153119, 12094771, 12006280, 11902137, 11797822, 11707631, 11643613, 11618808, 11650738, 11759116, 11957450, 12241534, 12579975, 12915151, 13179431, 13319835, 13316408, 13183984, 12959676, 12687126, 12405968, 12147184, 11930762, 11763901, 11641531]
15269A1641531r1000p5104p3473q4469j07251j40857j82627k26888k65487k91393
15259A0102982l01298k93000k62947k10103j40061o1121K2880J13850K15463L29317
15249I515962M52244N75107O84975P69209Q18084Q25506P90068P17098O19007
15240A5767260N11881M09341L16617K29088J39101M6275m0563j11053j59676j84451
15230A6923820j82895j51314q7367P317J25538K54430L79511M92001N92401O85722
15220A9039164P73719Q51586R10557R43127R47771R31405R07526Q89214Q80917
15211B7074986Q74559Q52833P98841P06781N85996M56484L41399K61502K31511
15202C2184892K57473L35911M53849N89433P17093Q17115Q81486R11708R13420
$$ y = [11641531, 11550531, 11475427, 11401954, 11317485, 11210234, 11069377, 10886750, 10659862, 10394375, 10102982, 9801684, 9508684, 9245737, 9035634, 8895573, 8834452, 8857332, 8971182, 9186645, 9515962, 9968206, 10543313, 11228288, 11997497, 12815581, 13641087, 14431155, 15148253, 15767260, 16279141, 16688482, 17005099, 17234187, 17373288, 17419563, 17379000, 17267947, 17108271, 16923820, 16740925, 16589611, 16502244, 16509561, 16635099, 16889529, 17269040, 17761041, 18353442, 19039164, 19812883, 20664469, 21575026, 22518153, 23465924, 24397329, 25304855, 26194069, 27074986, 27949545, 28802378, 29601219, 30308000, 30893996, 31350480, 31691879, 31953381, 32184892, 32442365, 32778276, 33232125, 33821558, 34538651, 35355766, 36237252, 37148960, 38062380]
15193C8062380Q94423Q65894Q40899Q29385Q35998Q63628R18470J010649J149022
15184D6270748J335990J567729J835912K126031K416696K686181K921578L120591
15176F4281456L283856L404265L460418L417854L236765K884058K348680J655152
15168H7972504Q64921O0868o76117j284175j725364j983634k062630j985047j790356
15159G7390970j526850j238165r52473o82516m33231k07066l887J80494L54391
15150G2881667N28310P09829Q97480J078975J235534J347918J400189J382495
15142H1462397J295696J155782R91195Q30148O87832N68153M79283M44127M92733
15133H8407346O44963R00235J240473J640785K079249K540513L013822L489282
$$ y = [38062380, 38956803, 39822697, 40663596, 41492981, 42328979, 43192607, 44111077, 45121726, 46270748, 47606738, 49174467, 51010379, 53136410, 55553106, 58239287, 61160865, 64281456, 67565312, 70969577, 74429995, 77847849, 81084614, 83968672, 86317352, 87972504, 88837425, 88898293, 88222176, 86938001, 85212637, 83229003, 81166373, 79181326, 77390970, 75864120, 74625955, 73673482, 72990966, 72557735, 72350669, 72346782, 72527276, 72881667, 73409977, 74119806, 75017286, 76096261, 77331795, 78679713, 80079902, 81462397, 82758093, 83913875, 84905070, 85735218, 86423050, 86991203, 87470486, 87914613, 88407346, 89052309, 89952544, 91193017, 92833802, 94913051, 97453564, 100467386, 103956668]
15125A03956668L955469M399808M810558N178807N500063N774983O009142O214199
15117A45799697O414154O654463P003807P540874Q333242R423818J0828720J2536675
15109B14535450J4502401J6634897J8783762K0724172K2141528K2628367K1722887
15102C51673464J9020512J4357503P993978O61912o614345j2858478j7444219
15095C56790327k0199113k1312120k1158803k0146794j8621552j6831602j4937598
15088B23582745j3041252j1209123r482133p881302o419126n110807l978104l047480
15080A63413418k346336j897255j709789j773927k059456k518766l088091l687806
15072A44331992m228348m627786m836869m856280m730197m518125m266705l999058
$$ y = [103956668, 107912137, 112311945, 117122503, 122301310, 127801373, 133576356, 139585498, 145799697, 152213851, 158868314, 165872121, 173412995, 181746237, 191170055, 201998775, 214535450, 229037851, 245672748, 264456510, 285180682, 307322210, 329950577, 351673464, 370693976, 385051479, 393045457, 393707369, 387093024, 374234546, 356790327, 336591214, 315279094, 294120291, 273973497, 255351945, 238520343, 223582745, 210541493, 199332370, 189850237, 181968935, 175549809, 170439002, 166460898, 163413418, 161067082, 159169827, 157460038, 155686111, 153626655, 151107889, 148019798, 144331992, 140103644, 135475858, 130638989, 125782709, 121052512, 116534387, 112267682, 108268624]
15064A08268624l721016l434509l147042k869414k606269k353599k106544j866608
15056H6163623j640929j437855j264360j124461j015408r23648q26136o99125
15048G7231701n29014l17535p8186J72044M19950O58011Q80516J077516J230543
15039H0745546J313285J298446J167316R15780N54055J03566m03021r19515j391155
15030H3384303j770794k034582k183118k230775k196725k102887j972590j826820
15022F7066012j681841j549891j439895j354621j285637j212136j109002r61773
15014E6471216p78206n84761m09555k67194j57069p1056m43O1125J16118J61672
15004E4541847J91266K00584J91956J72933J51289J31651J17078J12475J22611
$$ y = [108268624, 104547608, 101113099, 97966057, 95096643, 92490374, 90136775, 88030231, 86163623, 84522694, 83084839, 81820479, 80696018, 79680610, 78756962, 77930826, 77231701, 76702687, 76385152, 76306966, 76479010, 76898960, 77556971, 78437487, 79515003, 80745546, 82058831, 83357277, 84524593, 85440373, 85994428, 86097994, 85694973, 84775458, 83384303, 81613509, 79578927, 77395809, 75165034, 72968309, 70865422, 68892832, 67066012, 65384171, 63834280, 62394385, 61039764, 59754127, 58541991, 57432989, 56471216, 55693010, 55108249, 54698694, 54431500, 54274431, 54203375, 54202932, 54264057, 54380175, 54541847, 54733113, 54933697, 55125653, 55298586, 55449875, 55581526, 55698604, 55811079, 55933690]
14995E5933690J44256J62537J58821J24509O8970J6841r52M3429J67502L74452
14985E7194055O53962R86636J348893J718729K082608K437395K782668L109752
14977G2314698L397584L616561L733217L710461L506326L078786K402208J493028
14969I7252869M29966o52407j604209k313333k736689k895382k848079k663522
14961H1969214k401916k106102j800787j497844j203443r21240o50108l82141
14953G1005633j07301J77742M64809P38309R84622J198240J377566J513346J582135
14944G8935101J551725J393048J090936O53797J22092m33261r30398j304301j523576
14935G9555163j589520j526395j370490j160109r30206p14687n50023m70954m98779
$$ y = [55933690, 56077946, 56240483, 56399304, 56523813, 56592783, 56609624, 56608672, 56652101, 56819603, 57194055, 57848017, 58834653, 60183546, 61902275, 63984883, 66422278, 69204946, 72314698, 75712282, 79328843, 83062060, 86772521, 90278847, 93357633, 95759841, 97252869, 97682835, 97030428, 95426219, 93112886, 90376197, 87480815, 84632736, 81969214, 79567298, 77461196, 75660409, 74162565, 72959122, 72037882, 71387774, 71005633, 70898332, 71076074, 71540883, 72279192, 73263814, 74462054, 75839620, 77352966, 78935101, 80486826, 81879874, 82970810, 83624607, 83746699, 83313438, 82383040, 81078739, 79555163, 77965643, 76439248, 75068758, 73908649, 72978443, 72263756, 71713733, 71242779, 70744000]
14926G0744000o30275q33699j056139j241805j352072j375899j325806j223986
14918F1704319j090805r44140q03214o85384n96822n28137m60261l76845k76103
14909E5942608j74792j00077p2562r2336j38888j84290k08735k07721j88337j59310
14899E4415560j22780p4468j2782N1962R8430J05453O3409k2344j35799k57871
14889E4108770l72474m68506n38685n79074n90905n81006n57015n21892m74219
14880D9424994m11273l30222k30987j21521j8426N9225R7412R2851N4746K22n4651
14869D8562370j01431j38356j64502j76054j67073j32080o8603K0875J27083K33393
14859D7995622L19774L69979L75467L34643K53620J50066N2716r497k2218R147
$$ y = [70744000, 70113725, 69280026, 68223887, 66982082, 65630010, 64254111, 62928305, 61704319, 60613514, 59669374, 58866160, 58180776, 57583954, 57055817, 56595556, 56218711, 55942608, 55767816, 55667739, 55595177, 55502841, 55363953, 55179663, 54970928, 54763207, 54574870, 54415560, 54292780, 54218312, 54205530, 54257492, 54355922, 54461375, 54524784, 54502440, 54366641, 54108770, 53736296, 53267790, 52729105, 52150031, 51559126, 50978120, 50421105, 49899213, 49424994, 49013721, 48683499, 48452512, 48330991, 48312565, 48371790, 48469202, 48562053, 48616799, 48617021, 48562370, 48460939, 48322583, 48158081, 47982027, 47814954, 47682874, 47614271, 47635146, 47762229, 47995622, 48315396, 48685375, 49060842, 49395485, 49649105, 49799171, 49851887, 49842390, 49820172, 49829319]
14849D9829319O8779J42957K22522K98098L59544M01235M26259M45055M69545
14840E2663313N06251N52885O01736O45487O78418O95796O97635O93279O98231
14831E8433031P24101P71525Q31959Q94439R50349R94702J027762J057613J097674
14822F6783155J157380J234552J317548J392845J449495J480157J481730J454440
14814G7751302J399659J320552J226289J134379J065469J034178J043892J085986
14806H7061706J140460J180252J180704J128944J026456Q84319P16447N36243
14798I4855531L58003J98892P6477K229k5631k6209l1128p0886j60571k93781
14788I4882926m48337n98882p26791q24208q93655r42947r78055j000303j010146
$$ y = [49829319, 49898098, 50041055, 50263577, 50561675, 50921219, 51322454, 51748713, 52193768, 52663313, 53169564, 53722449, 54324185, 54969672, 55648090, 56343886, 57041521, 57734800, 58433031, 59157132, 59928657, 60760616, 61655055, 62605404, 63600106, 64627868, 65685481, 66783155, 67940535, 69175087, 70492635, 71885480, 73334975, 74815132, 76296862, 77751302, 79150961, 80471513, 81697802, 82832181, 83897650, 84931828, 85975720, 87061706, 88202166, 89382418, 90563122, 91692066, 92718522, 93602841, 94319288, 94855531, 95213534, 95412426, 95488903, 95491132, 95465501, 95439292, 95408164, 95337278, 95176707, 94882926, 94434589, 93835707, 93108916, 92284708, 91391053, 90448106, 89470051, 88469748, 87459602]
14779H7459602j013347j022614j051825j107217j183485j268472j350846j422077
14771G8039719j473654j497912j493366j467076j431111j397769j377580j378265
14763F6522986j401169j437809j473102j494351j498143j489902j477263j463158
14755E4788089j444577j416918j378414j330770j276820j218718j159400j105041
14747D4457431j063009j035811j018345j001964r80505r52461r19053q81214q37519
14738C5767550p83763p15157o31207n40568m61088m12706m06584m38691m92376
14729C0885410n45623n76723n68004n11487m14897k99945j91644j08968o2145
14720B7605974n1797o7878r2299j07097j04998r6758j07135j57121k44508l41348
$$ y = [87459602, 86446255, 85423641, 84371816, 83264599, 82081114, 80812642, 79461796, 78039719, 76566065, 75068153, 73574787, 72107711, 70676600, 69278831, 67901251, 66522986, 65121817, 63684008, 62210906, 60716555, 59218412, 57728510, 56251247, 54788089, 53343512, 51926594, 50548180, 49217410, 47940590, 46721872, 45562472, 44457431, 43394422, 42358611, 41340266, 40338302, 39357797, 38405336, 37486283, 36605069, 35767550, 34983787, 34268630, 33637423, 33096855, 32635767, 32223061, 31816477, 31377786, 30885410, 30339787, 29763064, 29195060, 28683573, 28268676, 27968731, 27777087, 27668119, 27605974, 27554177, 27486299, 27394000, 27286903, 27181905, 27085147, 26978012, 26820891, 26576383, 26235035]
14710B6235035m12783m42006m40489m35987m49676m80445n05611m96097m37524
14701B2134417l44342k54884k08111k20482k80993l64063m45597n10186n50010
14692A8955749n63092n53169n28119m95778m59351m17082l66932l10824k53898
14683A5007504k01329j56745j22455j00133r1130r5454j09499j24701j30710j22698
14673A3752650j06880r6663j01651j20574j43698j60348j65371j60219j48555
14664A2548691j31494j07327p5278l9271q170P692K581j8527l8532l4986P944
14653A2113323R0981K00119L12003L99476M38066M14095L29463J98931M2733j19877
14643A4419313k72862m02144m93808n35049n18350m47142l39879k27652j42288
$$ y = [26235035, 25822252, 25380246, 24939757, 24503770, 24054094, 23573649, 23068038, 22571941, 22134417, 21790075, 21535191, 21327080, 21106598, 20825605, 20461542, 20015945, 19505759, 18955749, 18392657, 17839488, 17311369, 16815591, 16356240, 15939158, 15572226, 15261402, 15007504, 14806175, 14649430, 14526975, 14426842, 14335712, 14240258, 14130759, 14006058, 13875348, 13752650, 13645770, 13549107, 13447456, 13326882, 13183184, 13022836, 12857465, 12697246, 12548691, 12417197, 12309870, 12234592, 12195321, 12187151, 12194843, 12197424, 12178897, 12140365, 12105379, 12113323, 12204304, 12404423, 12716426, 13115902, 13553968, 13968063, 14297526, 14496457, 14539190, 14419313, 14146451, 13744307, 13250499, 12715450, 12197100, 11749958, 11410079, 11182427, 11040139]
14634A1040139j01215j00991j23893j49661j62568j53117j18902o4845l22O4753
14624A0129378J21600J62344J78672J61226J03902J2239r2456j79534k21827k06028
14614A0169516j36147l0620Q4656J84096K47388K61208K20628J32465J8542q7294
14604A1064438j52359j61225j20921n1836K5071R4586J47301J77415J80382J52456
14594A1355308R3793J2848p3564j47799k00952k34767k55415k67021k69785k61852
14584I750794k42596k14664j83609j55447j33125j14361r3315o5275l1042L176
14574H520536L1004N0313O1060N9607L7699j0305p8777j50549k05594k29326k15153
14563G870515j64678q9161r315N0560P1714M6982j7997j06482j95953k66254l05987
$$ y = [11040139, 10938924, 10837933, 10714040, 10564379, 10401811, 10248694, 10129792, 10064947, 10064625, 10129378, 10250978, 10413322, 10591994, 10753220, 10857122, 10869361, 10776905, 10597371, 10375544, 10169516, 10033369, 10002749, 10087405, 10271501, 10518889, 10780097, 11000725, 11133190, 11151732, 11064438, 10912079, 10750854, 10629933, 10578097, 10603168, 10697754, 10845055, 11022470, 11202852, 11355308, 11449101, 11461949, 11388385, 11240586, 11039634, 10804867, 10549452, 10282431, 10012646, 9750794, 9508198, 9293534, 9109925, 8954478, 8821353, 8706992, 8613677, 8548402, 8517360, 8520536, 8551540, 8601853, 8662913, 8722520, 8760219, 8749914, 8671137, 8520588, 8314994, 8085668, 7870515, 7705837, 7616676, 7607361, 7657921, 7729635, 7776617, 7758620, 7652138, 7456185, 7189931, 6883944]
14552F883944l14936l03279k87220k80639k87467l02257l18049l32410l46054
14543D111633l58161l64437l58728l35197k88658k14606j11815J4393J51925K84061
14533B530410L91620M56693M70298M39858L87183L34900K92796K58020K27225
14524E789003K05586K02740K22365K59522L08176L67716M39633N18249N86796
14515H899786O24589O18866N70876M93597M06857L33604K94780L01072L47774
14506A2891801M19335M99388N76169O41624O90507P20874P31841P18766O71414
14497A8561719N79137M40240K67232Q2250r2472k40609l51800m18557m33259l88773
14487A8005108k84982j38076J6965J37229J91253J71986R3732j9981j45446k61924
$$ y = [6883944, 6569008, 6265729, 5978509, 5697870, 5410403, 5108146, 4790097, 4457687, 4111633, 3753472, 3389035, 3030307, 2695110, 2406452, 2191846, 2080031, 2094424, 2246349, 2530410, 2922030, 3378723, 3849021, 4288879, 4676062, 5010962, 5303758, 5561778, 5789003, 5994589, 6197329, 6419694, 6679216, 6987392, 7355108, 7794741, 8312990, 8899786, 9524375, 10143241, 10714117, 11207714, 11614571, 11948175, 12242955, 12544027, 12891801, 13311136, 13810524, 14386693, 15028317, 15718824, 16439698, 17171539, 17890305, 18561719, 19140856, 19581096, 19848328, 19930578, 19838106, 19597497, 19245697, 18827140, 18393881, 18005108, 17720126, 17582050, 17599015, 17736244, 17927497, 18099483, 18193215, 18173234, 18027788, 17765864]
14477A7765864l52031m02235m06373l70277l10852k47618j95422j64783j62678
14468A5153595j85707k14031k19813j86561j21730n1931l886J4822J8923L0234
14458A4233915N9727J01903J41892J66338J70363J57562J35016J09235Q7410Q1245
14448A5444606J05653J70231K71140L90858N05181N92230O39179O42789O04840
14439A9366707N30382M31996L33170K63100K43512K76814L46034M24779M86706
14430B2703200N10215M81574L98671K73066J26582j5985j33097k11147k49330
14421B3883749k62173k73865l03867l54248m11205m58544m88799n05302n18429
14412B0307317n38802n69183o00769o18838o13456n85594n44310m99422m56782
$$ y = [17765864, 17413833, 17011598, 16605225, 16234948, 15924096, 15676478, 15481056, 15316273, 15153595, 14967888, 14753857, 14534044, 14347483, 14225753, 14173822, 14169936, 14184758, 14203681, 14233915, 14293642, 14395545, 14537437, 14703775, 14874138, 15031700, 15166716, 15275951, 15363361, 15444606, 15550259, 15720490, 15991630, 16382488, 16887669, 17479899, 18119078, 18761867, 19366707, 19897089, 20329085, 20662255, 20925355, 21168867, 21445681, 21791715, 22216494, 22703200, 23213415, 23694989, 24093660, 24366726, 24493308, 24477323, 24344226, 24133079, 23883749, 23621576, 23347711, 23043844, 22689596, 22278391, 21819847, 21331048, 20825746, 20307317, 19768515, 19199332, 18598563, 17979725, 17366269, 16780675, 16236365, 15736943, 15280161]
14403A5280161m18558l85676l59282l40952l32312l33801l42845l52127l49967
14394A2064641l24928k71833j93741r9795l196Q0555J38271J64374J61489J36074
14384A1851911R3860L7289l5488j28062k38348l51362m39989m76159m45126l51775
14374I516751k15999o3621Q1696K04500L00301L72742M26052M58208M60580M24766
14364A1965976L51637K54525J52408N9604j7735p8019j21118j47968j59361j53780
14354A2106169j28445q4186k9124K3717O3477Q6913R9354J11913J35849J76065
14344A2561702K28385K83161L32217L74543M17162M69591N36395O14946O98759
14335A6516861P80488Q52606R07750R39415R42346R12781Q48606P49263O15626
$$ y = [15280161, 14861603, 14475927, 14116645, 13775693, 13443381, 13109580, 12766735, 12414608, 12064641, 11739713, 11467880, 11274139, 11174344, 11171148, 11251703, 11389974, 11554348, 11715837, 11851911, 11945771, 11983060, 11947572, 11819510, 11581162, 11229800, 10789811, 10313652, 9868526, 9516751, 9300752, 9237131, 9318827, 9523327, 9823628, 10196370, 10622422, 11080630, 11541210, 11965976, 12317613, 12572138, 12724546, 12784150, 12766415, 12688396, 12567278, 12419310, 12259949, 12106169, 11977724, 11893538, 11864414, 11888131, 11951608, 12038521, 12137875, 12249788, 12385637, 12561702, 12790087, 13073248, 13405465, 13780008, 14197170, 14666761, 15203156, 15818102, 16516861, 17297349, 18149955, 19057705, 19997120, 20939466, 21852247, 22700853, 23450116, 24065742]
14326B4065742M50689K60598N4367j56933l59213n34380o63887p36747p54467
14317B1625769p27429o68712n93099n19168m67516m52887m75334n18147n55500
14308A6647977n65053n38269m82015m10492l35221k61182j88438j15818m5788
14299A3705701J2992M9567N7619L7944m695o4285j33590k05466k76154l45383
14289A2834250m12168m72684n24973n72939o18446o46882o26870n31594l62637
14280H065057j54136M4581J93097K74367K93912K71016K30988J98743J90466K06973
14270I815064K36389K65745K91341L18688L53363L92567M26407M47395M56962
14261A3003921M61895M67731M77849M94923N18162N42117N63889N90471O34534
$$ y = [24065742, 24516431, 24777029, 24831396, 24674463, 24315250, 23780870, 23116983, 22380236, 21625769, 20898340, 20229628, 19636529, 19117361, 18649845, 18196958, 17721624, 17203477, 16647977, 16082924, 15544655, 15062640, 14652148, 14316927, 14055745, 13867307, 13751489, 13705701, 13718693, 13768260, 13825879, 13863823, 13859128, 13794843, 13661253, 13455787, 13179633, 12834250, 12422082, 11949398, 11424425, 10851486, 10233040, 9586158, 8959288, 8427694, 8065057, 7910921, 7955502, 8148599, 8422966, 8716878, 8987894, 9218882, 9417625, 9608091, 9815064, 10051453, 10317198, 10608539, 10927227, 11280590, 11673157, 12099564, 12546959, 13003921, 13465816, 13933547, 14411396, 14906319, 15424481, 15966598, 16530487, 17120958, 17755492]
14252A7755492P01913P83400Q56169Q90878Q60900P52214N69971L37353Q9400
14243B3597690j33818k96139l77037l78420l19628k24972j13609K452J15255K19814
14233B2091588L16020M07217M93152N65160O10121O18206N87112N21596M29168
14224B6639340L13197J69865o748k16879m50837o88334r01627j064600j162972
14215B2630405j197180j177458j117256j030301r31247q34877p50474o77513o10123
14206A4303976n46083m89625m46293m17465l99125l82535l56695l14601k58603
14197A0692951j98241j43787j03020q1185q0345r9155j34116j79750k26635k60457
14187I186260k66172k36533j77352j03584l0789L1238Q0751J22491J62189J99834
$$ y = [17755492, 18457405, 19240805, 20096974, 20987852, 21848752, 22600966, 23170937, 23508290, 23597690, 23463872, 23167733, 22790696, 22412276, 22092648, 21867676, 21754067, 21756519, 21871774, 22091588, 22407608, 22814825, 23307977, 23873137, 24483258, 25101464, 25688576, 26210172, 26639340, 26952537, 27122402, 27115654, 26898775, 26447938, 25759604, 24857977, 23793377, 22630405, 21433225, 20255767, 19138511, 18108210, 17176963, 16342086, 15591612, 14914099, 14303976, 13757893, 13268268, 12821975, 12404510, 12005385, 11622850, 11266155, 10951554, 10692951, 10494710, 10350923, 10247903, 10166718, 10086373, 9987218, 9853102, 9673352, 9446717, 9186260, 8920088, 8683555, 8506203, 8402619, 8371830, 8403068, 8483819, 8606310, 8768499, 8968333]
14177H968333K27454K32825K05485J41745M7509o2550j70542k63742l40827m10944
14167H574746m85295n66980o47188p10646p44268p40990o99224o22860n22220
14158B835075m11975l04713k04237j04448L895J22977K42253L43044M09268M34053
14148C365192M18438L68789K97667K22408J56490J01990N3024O262l3276n6657
14138D900327o0095n0220m1024m4726o5228r8646j35892j64233j72400j58609
14128C909254j31646j02427p5710m9737k1332R468L8536N9446O5507N2054K0141
14117C773554k0516n3308o1508l5757K2682J03956J94554K82542L61046M27571
14107D994816M79156N07323M97334M34751L18391J70740L4678m4393m0172M2650
$$ y = [8968333, 9195787, 9428612, 9634097, 9775842, 9823351, 9760801, 9590259, 9326517, 8985690, 8574746, 8089451, 7522471, 6875283, 6164637, 5420369, 4679379, 3980155, 3357295, 2835075, 2423100, 2118387, 1914150, 1809702, 1813597, 1936574, 2178827, 2521871, 2931139, 3365192, 3783630, 4152419, 4450086, 4672494, 4828984, 4930974, 4983998, 4990260, 4956984, 4900327, 4840232, 4790012, 4748988, 4704262, 4639034, 4540388, 4404496, 4240263, 4067863, 3909254, 3777608, 3675181, 3599471, 3549734, 3528402, 3537870, 3576406, 3635852, 3701359, 3753413, 3773554, 3753038, 3699730, 3638222, 3602465, 3625147, 3729103, 3923657, 4206199, 4567245, 4994816, 5473972, 5981295, 6478629, 6913380, 7231771, 7402511, 7437189, 7392796, 7352624, 7395274]
14097G395274J72992L10274M22703M98211N45034N83236O32774P05110Q01358
14088A2066966R14491J030412J126946J175505J148466J029247Q20546N46705
14080A9859284K48193k9890k49885l89102m40851m10366l08651j47058O5755L23930
14070A8521359O21970R51012J295335J630617J925046K141799K239773K175533
14062C1502444J915160J456234Q44450J68047m71302r94698j367661j597877j717386
14053B9737411j764620j773296j765951j751861j730874j697809j641895j546687
14045A6064418j397563j192998r49556o96494m63880k72870j33088m3602Q090
14036A0922457M5473R2665J58456K30661K86616L07196K82347K10179R6030m7070
$$ y = [7395274, 7568266, 7878540, 8301243, 8799454, 9344488, 9927724, 10560498, 11265608, 12066966, 12981457, 14011869, 15138815, 16314320, 17462786, 18492033, 19312579, 19859284, 20107477, 20077587, 19827702, 19438600, 18997749, 18587383, 18278732, 18131674, 18197429, 18521359, 19143329, 20094341, 21389676, 23020293, 24945339, 27087138, 29326911, 31502444, 33417604, 34873838, 35718288, 35886335, 35415033, 34420335, 33052674, 31454797, 29737411, 27972791, 26199495, 24433544, 22681683, 20950809, 19253000, 17611105, 16064418, 14666855, 13473857, 12524301, 11827807, 11363927, 11091057, 10957969, 10914367, 10922457, 10967930, 11060595, 11219051, 11449712, 11736328, 12043524, 12325871, 12536050, 12632080, 12585010]
14026A2585010j98578l33199m26769m63790m42795l76422k86337j95986j23317
14017I737817p4770m3933j7460J5469N7919J06896J57283K04492K46732K87270
14007A0677715L33670L91297M54369N02429N07714M51161L37630J98584P9774
13998A3934343K2451M8277J53141L10526M80837O20700O88770O51489M94983K37969
13988A7643486p0768l74355o30528q18427r34110r85396r87976r61164r24287
13979A0956475q93237q75803q68150q57330q29591p77533p02175o12046n19534
13970D021076m33103l51219k65291j68543o2508M0474J18472J47852J16240L1647
13960C195097q0168j89136k75059l31864l61655l67037l47108k97468k14993j06738
$$ y = [12585010, 12386432, 12053233, 11626464, 11162674, 10719879, 10343457, 10057120, 9861134, 9737817, 9663047, 9619114, 9601654, 9617123, 9675042, 9781938, 9939221, 10143713, 10390445, 10677715, 11011385, 11402682, 11857051, 12359480, 12867194, 13318355, 13655985, 13854569, 13934343, 13956794, 14005071, 14158212, 14468738, 14949575, 15570275, 16259045, 16910534, 17405517, 17643486, 17572718, 17198363, 16567835, 15749408, 14815298, 13829902, 12841926, 11880762, 10956475, 10063238, 9187435, 8319285, 7461955, 6632364, 5854831, 5152656, 4540610, 4021076, 3587973, 3236754, 2971463, 2802920, 2740412, 2780886, 2899358, 3047210, 3163450, 3195097, 3114929, 2925793, 2650734, 2318870, 1957215, 1590178, 1243070, 945602, 730609, 623871]
13950F23871M389Q5862J13477Q7256L0873k4564n7028n8991l4747K174L2498M1045
13938H46115K8682J3236J5730M4664R2170J41390J75574J82742J57058J00074
13928A797435K2183n8136j18035j36451j02668k3606P6802J69339K34678K68551
13918B130092K74452K54604K07469J31515L2106p4280j64934k22578k43201k33726
13908B091519k04748j66637j29445j00943q3603p6583q1167j00546j32428j64047
13898H51372j77412j61592j21539p4643l7564j6085n456L176J6257L3313M8286
13887C58113N8701P3905J11473J83989K87654M00848M92181N33345N10449M28419
13877C439077L06047J65669K5243j02474k07078k80532l20102l28959l13114k78585
$$ y = [623871, 628260, 714122, 827599, 914855, 945728, 921164, 864136, 805145, 770398, 772572, 805070, 846115, 874797, 888033, 903763, 948427, 1040597, 1181987, 1357561, 1540303, 1697361, 1797435, 1819618, 1761482, 1643447, 1506996, 1404328, 1380722, 1457524, 1626863, 1861541, 2130092, 2404544, 2659148, 2866617, 2998132, 3030238, 2955958, 2791024, 2568446, 2325245, 2091519, 1886771, 1720134, 1590689, 1489746, 1406143, 1329560, 1248393, 1147847, 1015419, 851372, 673960, 512368, 390829, 316186, 278622, 262537, 257081, 260257, 276514, 309827, 358113, 416814, 490719, 602192, 786181, 1073835, 1474683, 1966864, 2500209, 3010658, 3439077, 3745124, 3910793, 3936036, 3833562, 3626484, 3345952, 3025850, 2696891, 2383777, 2105192]
13867B105192k30743j74480j14656n7747j2918J0384Q273j2521l4240l3621P548
13856A460471R1112J98265K97773L62974L85356L74846L49489L24912L09794L05951
13846D460943L09641L14806L18294L21125L23076L18349K99553K64581K17561
13837G147929J64043J07025M7511j2712o9888j19315j56277j77246j83068j80959
13827F567043j80261j84607j89159j85472j67384j32494q2361k4862K5760N6534
13817E502737O7404P4911J02015J62882K55602L66479M79952N86772O86283P82819
13807I067856Q80344R79968J079838J174891J257669J321965J366982J398920
13799A8528433J429703J475057J552872J680173J868178K118868K426445K783637
$$ y = [2105192, 1874449, 1699969, 1585313, 1527566, 1514648, 1525032, 1533305, 1520784, 1486544, 1452923, 1460471, 1551583, 1749848, 2047621, 2410595, 2795951, 3170797, 3520286, 3845198, 4154992, 4460943, 4770584, 5085390, 5403684, 5724809, 6047885, 6366234, 6665787, 6930368, 7147929, 7311972, 7418997, 7466508, 7453796, 7383908, 7264593, 7108316, 6931070, 6748002, 6567043, 6386782, 6202175, 6013016, 5827544, 5660160, 5527666, 5445305, 5420443, 5446203, 5502737, 5570141, 5645052, 5747067, 5909949, 6165551, 6532030, 7011982, 7598754, 8285037, 9067856, 9948200, 10928168, 12008006, 13182897, 14440566, 15762531, 17129513, 18528433, 19958136, 21433193, 22986065, 24666238, 26534416, 28653284, 31079729, 33863366]
13791C3863366L189851L657292M211210M881084N684243O610853P620539Q649350
13783G8367788R612687J0395691J0844305J0779827J0045777Q574146O440679
13776A45060900L874057J204302j228068l159267m448724n073971n093845m610068
13768A26525316l742057k611749j332896n965J276065K409263L259836L669295
13760A29447108L499495K705229J394525j73950j676591k847604l559817l826042
13752A24962353l747588l458938l094350k771536k579153k563931k723080l010756
13744A01013021l360094l708077m006538m218737m315855m280706m110933l815711
13736F9196370l411004k917836k361649j772389j186245o45906j98193J09116
$$ y = [33863366, 37053217, 40710509, 44921719, 49802803, 55487046, 62097899, 69718438, 78367788, 87980475, 98376166, 109220471, 120000298, 130046075, 138620221, 145060900, 148934957, 150139259, 148911191, 145751924, 141303200, 136229229, 131135384, 126525316, 122783259, 120171510, 118838614, 118832649, 120108714, 122517977, 125777813, 129447108, 132946603, 135651832, 137046357, 136872407, 135195816, 132348212, 128788395, 124962353, 121214765, 117755827, 114661477, 111889941, 109310788, 106746857, 104023777, 101013021, 97652927, 93944850, 89938312, 85719575, 81403720, 77123014, 73012081, 69196370, 65785366, 62867530, 60505881, 58733492, 57547247, 56901341, 56703148, 56812264]
13728E6812264K35221J64508p3304m01634p24328r66512j100768j142766j126248
13719E1676433j080275j021315r55365q81818p97268o99558n90923m77991l67871
13710D4804049k64778j72019r4694l6308O314L9953O5540P5166O0230K1460k9015
13699D4475898p4028r9520r7812o6861j1110N7103J21400J69100J95191K00863
13689D4870224J91562J77073J72323J95600K62027L75985N28123O97738Q57355
13680D8328010R77692J034641J018213R36894Q11914O67096N24470M05487L29697
13671E5034114L08641L40291M08703M88773N53369N79716N52429M63804L15275
13662E9045115J20261r6619l06449m84536o14766o90071p13263o99233o73541
$$ y = [56812264, 57047485, 57211993, 57138689, 56737055, 56012727, 55046215, 53945447, 52802681, 51676433, 50596158, 49574843, 48619478, 47737660, 46940392, 46240834, 45649911, 45171920, 44804049, 44539271, 44367252, 44272558, 44236250, 44242564, 44282517, 44348057, 44423223, 44483453, 44504913, 44475898, 44401870, 44302350, 44204538, 44137677, 44126567, 44183670, 44305070, 44474170, 44669361, 44870224, 45061786, 45238859, 45411182, 45606782, 45868809, 46244794, 46772917, 47470655, 48328010, 49305702, 50340343, 51358556, 52295450, 53107364, 53774460, 54298930, 54704417, 55034114, 55342755, 55683046, 56091749, 56580522, 57133891, 57713607, 58266036, 58729840, 59045115, 59165376, 59068757, 58762308, 58277772, 57663006, 56972935, 56259672, 55560439, 54886898]
13653E4886898o64068o89273p50742q35264r25142j007698j076507j126772j152934
13644D6658498j152116j128521j092568j055751j026969j011967j012662j024555
13636C8153389j036545j036557j018676r84022r35814q77335q16155p66681p43358
13627B9938246p49468p74468q02769q23502q32758q31046q21027q06146p89686
13618B2707376p74121p60223p46102p28229p04586o75774o41200n95979n34407
13609A6546755m56846l73265k99848k49898k26227k21685k24654k21841j98731
13600A4073760j44545o1450L1981J09550J50704J46325R5475J966j23092k57409
13590A4023265l70781m36272m41030l88677k94397j78995o4232L2627J04238J54299
$$ y = [54886898, 54222830, 53533557, 52782815, 51947551, 51022409, 50014711, 48938204, 47811432, 46658498, 45506382, 44377861, 43285293, 42229542, 41202573, 40190606, 39177944, 38153389, 37116844, 36080287, 35061611, 34077589, 33141775, 32264440, 31448285, 30681604, 29938246, 29188778, 28414310, 27611541, 26788039, 25955281, 25124235, 24303208, 23497062, 22707376, 21933255, 21173032, 20426930, 19698701, 18994115, 18318341, 17677141, 17081162, 16546755, 16089909, 15716644, 15416796, 15166898, 14940671, 14718986, 14494332, 14272491, 14073760, 13929215, 13867765, 13899746, 14009296, 14160000, 14306325, 14401800, 14403766, 14280674, 14023265, 13652484, 13216212, 12775182, 12386505, 12092108, 11913113, 11848881, 11881508, 11985746, 12140045]
13580A2140045J92960K29885K68799L05234L29516L34301L19326K88602K45398
13571A4654066J90909J26823N8582m805n5244q9236j07068j10704j05363j01341
13561A4456619j09700j33785j65578j90373j95890j80631j56429j41783j49644
13552A3032806j79146k16822k45380k54071k43858k23486k01209j80385j61111
13543A1127338j44277j33166j30202j32448j33688j32873j36584j49005j60972
13534I874123j53889j16057n3339J6608P8217J24543J54065J66980J65427J53973
13524A0410651J38105J22396J09582J00518R3502Q2757N8835J3593n3419j33670
13514A0942850k15497k91062l57463m12303m50597m68222m68663m63796m65623
$$ y = [12140045, 12333005, 12562890, 12831689, 13136923, 13466439, 13800740, 14120066, 14408668, 14654066, 14844975, 14971798, 15030380, 15025575, 14970331, 14881095, 14774027, 14663323, 14557960, 14456619, 14346919, 14213134, 14047556, 13857183, 13661293, 13480662, 13324233, 13182450, 13032806, 12853660, 12636838, 12391458, 12137387, 11893529, 11670043, 11468834, 11288449, 11127338, 10983061, 10849895, 10719693, 10587245, 10453557, 10320684, 10184100, 10035095, 9874123, 9720234, 9604177, 9550838, 9567446, 9645663, 9770206, 9924271, 10091251, 10256678, 10410651, 10548756, 10671152, 10780734, 10881252, 10974754, 11057511, 11116346, 11129939, 11076520, 10942850, 10727353, 10436291, 10078828, 9666525, 9215928, 8747706, 8279043, 7815247, 7349624]
13505G349624m77258m92030m99203m88458m50465l78038k69756j32664J7355J56384
13495D335491K55786K90582K51498J53547L2868o9428j26000j30548r1753k3928
13485D878115N7694J37361J99187K31117K31412K10126J81696J56398J37939J23696
13475F544741J03547O0787k0297j42002k85535m16873n01121n14298m48927l14987
13465D065035j36766N2963K20257L38471L94803L92051L45798K78079K08226J45137
13455F304054Q6466K4334m7996j31845k20049k95296l35367l26731k74638j99194
13445D583738j23134o2862k5231p768k326j035p16l768j6519m5814r3880j54549
13433D046136k14437k58952k78606k71531k41993j96898j42846q4747k6327K7885
$$ y = [7349624, 6872366, 6380336, 5881133, 5392675, 4942210, 4564172, 4294416, 4161752, 4179107, 4335491, 4591277, 4881859, 5133357, 5286904, 5319772, 5250344, 5124344, 4993796, 4902043, 4878115, 4935809, 5073170, 5272357, 5503474, 5734886, 5945012, 6126708, 6283106, 6421045, 6544741, 6648288, 6709075, 6688778, 6546776, 6261241, 5844368, 5343247, 4828949, 4380022, 4065035, 3928269, 3981232, 4201489, 4539960, 4934763, 5326814, 5672612, 5950691, 6158917, 6304054, 6390520, 6414854, 6366858, 6235013, 6014964, 5719668, 5384301, 5057570, 4782932, 4583738, 4460604, 4397742, 4372511, 4364743, 4362417, 4361382, 4360666, 4356898, 4340379, 4294565, 4200685, 4046136, 3831699, 3572747, 3294141, 3022610, 2780617, 2583719, 2440873, 2356126, 2329799, 2357684]
13423B357684P1219R7390J06334J06729J09489J17472J23789J20806J08078R0641
13413C409631P1434M7739J5426k5213o9347j11902j49634j78612j91551j79178
13403B638793j33926n3134N8824J90522L25517M44138N25038N50096N13792M30704
13393E490364L31177K44480J82312J37197R5873N2964J2173k2358n2605q4577
13383F387000j21291j58119j84742j91558j75026j39520r5481n3944k1365k05
13373E245749N646j1396n6688j23941j93600k43925k65482k66036k62719k68245
13363C559363k81586k90801k85541k67016k45555k30593k25646k29736k37533
13354A265356k37679k15452j61119p8158J5705R7073J50563J76933J88554J96984
$$ y = [2357684, 2428903, 2526293, 2632627, 2739356, 2848845, 2966317, 3090106, 3210912, 3318990, 3409631, 3481065, 3528804, 3544230, 3519017, 3449670, 3337768, 3188134, 3009522, 2817971, 2638793, 2504867, 2451733, 2510557, 2701079, 3026596, 3470734, 3995772, 4545868, 5059660, 5490364, 5821541, 6066021, 6248333, 6385530, 6481403, 6534367, 6546540, 6524182, 6471577, 6387000, 6265709, 6107590, 5922848, 5731290, 5556264, 5416744, 5321263, 5267319, 5245954, 5245749, 5251395, 5239999, 5183311, 5059370, 4865770, 4621845, 4356363, 4090327, 3827608, 3559363, 3277777, 2986976, 2701435, 2434419, 2188864, 1958271, 1732625, 1502889, 1265356, 1027677, 812225, 651106, 572948, 588653, 685726, 836289, 1013222, 1201776, 1398760]
13344A398760K03976K02148J82030J38221P2025o843q0164j25891j26084p4116
13334A784062K0216J30844K24745K77474K83716K55118K10059J63705J21699P8786
13324C550424K3730n1447j44267k40821l20008l60831l52051k99270k22719j48100
13314A434640r7557q3203j04232j49341k02143k45098k62113k43262j90733j20220
13304b63262n3339m139L0468O7414J24348K07656L08868M09482M89727N35214
13294A852437N39055N01525M29238L34030K29583J24830J9292r3325k15175l37609
13284C383881m44090n18365n50311n37743m85235m01259k96752j85885q5605j1214
13274a32578K9833M2057M0563M3697O4348J05866J63202K25839K82226L26588
$$ y = [1398760, 1602736, 1804884, 1986914, 2125135, 2197160, 2190317, 2110153, 1984262, 1858178, 1784062, 1804278, 1935122, 2159867, 2437341, 2721057, 2976175, 3186234, 3349939, 3471638, 3550424, 3574154, 3522707, 3378440, 3137619, 2817611, 2456780, 2104729, 1805459, 1582740, 1434640, 1337083, 1253880, 1149648, 1000307, 798164, 553066, 290953, 47691, -143042, -263262, -316601, -320740, -290272, -222858, -98510, 109146, 418014, 827496, 1317223, 1852437, 2391492, 2893017, 3322255, 3656285, 3885868, 4010698, 4029990, 3936665, 3721490, 3383881, 2939791, 2421426, 1871115, 1333372, 848137, 446878, 150126, -35759, -121364, -132578, -102745, -60688, -20125, 23572, 87920, 193786, 356988, 582827, 865053, 1191641]
13264A191641L62609L98059M33961M60107M63040M37005L85021L11839K18776
13255D662058J04728k7365j63827k81289l56874l79748l55355k99498k27769j50198
13245B524863p4599r995L8505P7933J25302J93231K77656L60415M22040M51034
13235D386385M44639M05089L35722K39962J24861N245r8268j67549j93738j77286
13225E305062j25027m9729K9140Q9673J16744J09180P8698M1429R083j4178l0498
13214E559577m6031o7613r8662j36056j69376j84903j74497j42852j04976p4759
13204D359852n5396l9985k0535K210J6496P581l0872r2314j62352k26429k72662
13193C485594k90626k72533k19396j46828q2905n5304p5281j31741j99229k50813
$$ y = [1191641, 1554250, 1952309, 2386270, 2846377, 3309417, 3746422, 4131443, 4443282, 4662058, 4766786, 4739421, 4575594, 4294305, 3937431, 3557683, 3202328, 2902830, 2675061, 2524863, 2450264, 2440269, 2478774, 2556707, 2682009, 2875240, 3152896, 3513311, 3935351, 4386385, 4831024, 5236113, 5571835, 5811797, 5936658, 5941903, 5843635, 5676086, 5482348, 5305062, 5180035, 5130306, 5159446, 5249119, 5365863, 5475043, 5553741, 5595170, 5604253, 5590075, 5559577, 5513546, 5445933, 5347271, 5211215, 5041839, 4856936, 4682439, 4539587, 4434611, 4359852, 4304456, 4264471, 4243936, 4246146, 4262642, 4270223, 4239351, 4147037, 3984685, 3758256, 3485594, 3194968, 2922435, 2703039, 2556211, 2473306, 2418002, 2342721, 2210980, 2011751, 1760938]
13183A760938k67192k42058j85024j17366n8391j2467K9758P7652J29469J73253
13173A288572J94921J84885J41664P3892j373o5572j07656j28192j35542j39751
13163A305848j50026j73399k10657k52026k78642k70123k13949j12844J2529J28559
13153b14730K00627K07264J50008N2542n0986j30992j73327j83417j82185j93911
13143e19107k30629k82182l20090l14069k50232j39417j1265J01433J76783K08715
13133a580060K06535J91831J88335K07290K41569K73705K89163K84449K65650
13124E68467K40893K15119J90933J70894J56496J44992J28664R8845N2578l136
13114A964745n3901q6651r7982r5040q8551q4054p7782n9630k2260K9710P9533
$$ y = [1760938, 1493746, 1251688, 1066664, 949298, 890907, 878440, 908198, 985850, 1115319, 1288572, 1483493, 1668378, 1810042, 1883934, 1882561, 1816989, 1709333, 1581141, 1445599, 1305848, 1155822, 982423, 771766, 519740, 241098, -29025, -242974, -355818, -343289, -214730, -14103, 193161, 343169, 395711, 344725, 213733, 40406, -143011, -325196, -519107, -749736, -1031918, -1352008, -1666077, -1916309, -2055726, -2066991, -1965558, -1788775, -1580060, -1373525, -1181694, -993359, -786069, -544500, -270795, 18368, 302817, 568467, 809360, 1024479, 1215412, 1386306, 1542802, 1687794, 1816458, 1915303, 1967881, 1964745, 1910844, 1824193, 1726211, 1631171, 1542620, 1458566, 1380784, 1321154, 1298894, 1328604, 1408137]
13103A408137J08249J05364P2247J9008m1249r7149j40742j67784j79260j81418
13093I05403j81426j83130j88349k01839k32939k90629l75395m74295n62446o10466
13083b395511n95470n10874l68693j92398p094J65452L08129M10528M70712M94017
13073b221202M90432M72387M51105M32117M14162L91311L55484L00437K27922
13064A314155J50986Q9777O1531P0413J05156J47885J86362K19196K53546K99943
13054B898950L65163M44687N20949N71119N79893N47988M90735M29120L79575
13045G228179L46850L22051K87347K26371J35504K7908p4213j52604k00316k21427
13035G925650k27554k34212k58473l17231m22136n70564p40348q96313j006056
$$ y = [1408137, 1516386, 1621750, 1693997, 1713005, 1671756, 1574607, 1433865, 1266081, 1086821, 905403, 723977, 540847, 352498, 150659, -82280, -372909, -748304, -1222599, -1785045, -2395511, -2990981, -3501855, -3870548, -4062946, -4070040, -3904588, -3596459, -3185931, -2715219, -2221202, -1730770, -1258383, -807278, -375161, 39001, 430312, 785796, 1086233, 1314155, 1465141, 1554918, 1616449, 1686862, 1792018, 1939903, 2126265, 2345461, 2599007, 2898950, 3264113, 3708800, 4229749, 4800868, 5380761, 5928749, 6419484, 6848604, 7228179, 7575029, 7897080, 8184427, 8410798, 8546302, 8574210, 8499997, 8347393, 8147077, 7925650, 7698096, 7463884, 7205411, 6888180, 6466044, 5895480, 5155132, 4258819, 3252763]
13026C252763j053923j043778r90089r05274p93237o51863m79576k80695o7609
13017c013281J40200L18431M40908M86452M50716L54550K38492J43956R4296Q9455
13007b55825J15394J55538J94500K18765K20002J97101J54761J02252N1720J3800
12997A168008o257p637J0065M8629J07779J79539K46496K87079K85271K38554
12987B557526J60132P5251J3007m474K9094J02353J93066K79750L51561M11195
12977D168461M69488N35258O06480O67613O94474O65155N71125M21335K38645
12968I038034N1894j13865k44806l38928m01172m37328m50326m42001m18397l89951
12958E853154l63932l37889l03930k60169k15427j82243j67854j71341j85671
$$ y = [3252763, 2198840, 1155062, 164973, -740301, -1533538, -2185401, -2664977, -2945672, -3013281, -2873081, -2554650, -2113742, -1627290, -1176574, -822024, -583532, -439576, -345280, -255825, -140431, 15107, 209607, 428372, 648374, 845475, 1000236, 1102488, 1154208, 1168008, 1161751, 1154114, 1164179, 1212808, 1320587, 1500126, 1746622, 2033701, 2318972, 2557526, 2717658, 2792909, 2805916, 2801442, 2830536, 2932889, 3125955, 3405705, 3757266, 4168461, 4637949, 5173207, 5779687, 6447300, 7141774, 7806929, 8378054, 8799389, 9038034, 9089928, 8976063, 8731257, 8392329, 7991157, 7553829, 7103503, 6661502, 6243105, 5853154, 5489222, 5151333, 4847403, 4587234, 4371807, 4189564, 4021710, 3850369, 3664698]
12949C664698k00090k00922j72471j01941J0927J46716K70962L49651L64648L19299
12939D451477K33084J31511L7720l2693p4594r2761r7191r6866r5621r2050q2530
12928D189486o3954l5842k839K5042L7840L4450K6590L2511O4748J21685J88022
12917D617739K42788K70918K72740K63587K61495K73559K92592L02951K88624
12908G086993K40436J59929N7330n4163j62693k58937l36364l91800m25336m40421
12898E474974m43848m41977m32917m02434l31418k11412n5300J04469K28746K89644
12888C778527K83673K29481J51625O5546k3134j08491j77952k16192k12964j69780
12878C600339j04272m6235k2499m1155q9497j46536j97531k37220k62513k67774
$$ y = [3664698, 3464608, 3263686, 3091215, 2989274, 3000201, 3146917, 3417879, 3767530, 4132178, 4451477, 4684561, 4816072, 4853792, 4821099, 4746505, 4653744, 4556553, 4459687, 4364066, 4272016, 4189486, 4125532, 4089690, 4086851, 4111893, 4149733, 4184183, 4210773, 4243284, 4308032, 4429717, 4617739, 4860527, 5131445, 5404185, 5667772, 5929267, 6202826, 6495418, 6798369, 7086993, 7327429, 7487358, 7544688, 7490525, 7327832, 7068895, 6732531, 6340731, 5915395, 5474974, 5031126, 4589149, 4156232, 3753798, 3422380, 3210968, 3155668, 3260137, 3488883, 3778527, 4062200, 4291681, 4443306, 4508852, 4485718, 4377227, 4199275, 3983083, 3770119, 3600339, 3496067, 3449832, 3427333, 3386178, 3296681, 3150145, 2952614, 2715394, 2452881, 2185107]
12868B185107k49298k09833j54014q1503J0542J17759K23496L03742L37073L13167
12858B796238K36697J24666j155j20348k15848k75304k94416k80228k48411k12779
12848A509112j76407j33646p9317j5642M7417R7504J26676J36112J36800J43821
12838A792430J66725K05796K57417L18477L82284M32001M42075L90692K75183
12829D663080J17554m5243j78988k64941l01066k96323k65360k24498j87633j63137
12819B853445j52315j49350j45066j34678j22596j18320j27150j44913j61446
12810A597611j68215j63075j49895j33988j15638q6921l6793L9239J33668K28687
12800A144680L02857L40756L40952L14810K75160K25390J58097O3113o1281k01072
$$ y = [2185107, 1935809, 1725976, 1571962, 1490459, 1501001, 1618760, 1842256, 2145998, 2483071, 2796238, 3032935, 3157601, 3156446, 3036098, 2820250, 2544946, 2250530, 1970302, 1721891, 1509112, 1332705, 1199059, 1119742, 1104100, 1151517, 1249021, 1375697, 1511809, 1648609, 1792430, 1959155, 2164951, 2422368, 2740845, 3123129, 3555130, 3997205, 4387897, 4663080, 4780634, 4735391, 4556403, 4291462, 3990396, 3694073, 3428713, 3204215, 3016582, 2853445, 2701130, 2551780, 2406714, 2272036, 2149440, 2031120, 1903970, 1759057, 1597611, 1429396, 1266321, 1116426, 982438, 866800, 779879, 743086, 782325, 915993, 1144680, 1447537, 1788293, 2129245, 2444055, 2719215, 2944605, 3102702, 3165815, 3104534, 2903462]
12790B903462l28814m13538m31744l75648k57143j05367M2809J55881K17733K29533
12780A637164K04008J57746J06727O4726M0981L7235M8244O7046Q9792J14388
12770B568057J34960J41029J25902R6575P2990P5290J09778J64080K13908K36305
12760C938874K20301J68959R3778Q241p4729j43856j92553k20844k32655k31803
12750C333713k22213k11385k11049k32690k80070l43487m02178m35742m34871
12741E60028m02941l50428k88554k26583j72023j30240j02762q6244p3307n5344
12731a328398k6167J5935O9240J32300K07246K97233L98355M95654N69117O03740
12721A434255N95589N51030M81862M01059L21114K52512K00876J65843J43330
$$ y = [2903462, 2574648, 2161110, 1729366, 1353718, 1096575, 991208, 1034017, 1189898, 1407631, 1637164, 1841172, 1998918, 2105645, 2170371, 2211352, 2248587, 2296831, 2363877, 2453669, 2568057, 2703017, 2844046, 2969948, 3066523, 3139513, 3214803, 3324581, 3488661, 3702569, 3938874, 4159175, 4328134, 4421912, 4430153, 4355424, 4211568, 4019015, 3798171, 3565516, 3333713, 3111500, 2900115, 2689066, 2456376, 2176306, 1832819, 1430641, 994899, 560028, 157087, -193341, -481895, -708478, -880501, -1010741, -1113503, -1199747, -1273054, -1328398, -1354565, -1338630, -1269390, -1137090, -929844, -632611, -234256, 261398, 830515, 1434255, 2029844, 2580874, 3062736, 3463795, 3784909, 4037421, 4238297, 4404140, 4547470]
12712D547470J28688J18110J08598R7871Q5652P4946P0404P4267Q4034R3754R7566
12701E581360R2763P9912O0425L4553J660l8650q6682j42925k06250k70904l25999
12690D779263l58495l57588l18714k46662j57032p3578k0119j0602m3121j01192
12680C092160j62018k07765k31632k34625k19848j92381j61358j36004j18444
12671A428085j02890q1880n1202r647M2346J00857J56004J94159K04987J86514
12661B067333J43989Q6526K5471k6375n7301o0284l4741J3444P1898J24165J55254
12650B509379J56574J26762O9863n522q4737j47624j75295j58803j01877j7613
12640B171107P6279J62030K25679K58960K60419K36829K02606J73930J59456J54575
$$ y = [4547470, 4676158, 4794268, 4902866, 5000737, 5086389, 5161335, 5231739, 5306006, 5390040, 5483794, 5581360, 5674123, 5754035, 5814460, 5849013, 5850673, 5812023, 5725341, 5582416, 5376166, 5105262, 4779263, 4420768, 4063180, 3744466, 3497804, 3340772, 3267194, 3247075, 3236473, 3193352, 3092160, 2930142, 2722377, 2490745, 2256120, 2036272, 1843891, 1682533, 1546529, 1428085, 1325195, 1243315, 1192113, 1182466, 1224812, 1325669, 1481673, 1675832, 1880819, 2067333, 2211322, 2297848, 2323319, 2296944, 2239643, 2179359, 2144618, 2158062, 2229960, 2354125, 2509379, 2665953, 2792715, 2862578, 2857056, 2772319, 2624695, 2449400, 2290597, 2188720, 2171107, 2247386, 2409416, 2635095, 2894055, 3154474, 3391303, 3593909, 3767839, 3927295, 4081870]
12630D081870J45298J19770P7888L0756q037l1575m3848n8014r0294j51834k42233
12619C829747l49069m53695n37491n85109n87854n47879m76917l89064k95878
12610c93209k07635j35252q7184o3524n4362m6040l0414p333K1827N8799J02345
12599h41982J39684J50012J19067M9792l8528j18244j64071j63461j22010o0701
12589a050442o229K2197K3097J2960J6687N4522J30737K29427L21393L78623L87337
12578E20309L53175K95746K35189J80513J27779O7094p508r0957j67430k18592
12568A295318k33596k13262j67122j09385n6765k3584j4420k2913l9063n6251
12558C58957p2615q9866j11292j37613j62715j75213j65843j33120q3212k6482
$$ y = [4081870, 4227168, 4346938, 4424826, 4455582, 4447545, 4415970, 4372122, 4314108, 4223814, 4071980, 3829747, 3480678, 3026983, 2489492, 1904383, 1316529, 768650, 291733, -97331, -393209, -600844, -736096, -823280, -886804, -941166, -987206, -1017620, -1024953, -1003126, -944327, -841982, -702298, -552286, -433219, -383427, -421955, -540199, -704270, -867731, -989741, -1050442, -1056671, -1034474, -1011377, -998417, -981730, -927208, -796471, -567044, -245651, 132972, 520309, 873484, 1169230, 1404419, 1584932, 1712711, 1779805, 1772297, 1681340, 1513910, 1295318, 1061722, 848460, 681338, 571953, 515188, 491604, 477184, 454271, 415208, 358957, 286342, 196476, 85184, -52429, -215144, -390357, -556200, -689320, -772532, -799014]
12548g99014K6690O9454R9335J17017J26155J33522J47236J74159K17686K74190
12538E86430L29860L64072L59756L12023K28565J24930J9770o9977j33393j66356
12528A955680j69211j45232j00733m5503O243L6709L0323j7523r5350j78550k40842
12517A036011k69374k72476k72252k87218l18719l50849l60762l30507k55689
12508a681835j48839l3567O7743J43168J92111K21276K40250K57640K77394K96944
12498a67715L08978L05955K83636K42104J85099J17854M4792k9904j00484j60347
12488A029968k03734k26528k27643k10566j81078j41788r0003k2857N5189J30549
12478h8491J87047K15961K21960K20345K26353K43905K64094K74263K67041K41479
$$ y = [-799014, -772324, -702870, -603535, -486518, -360363, -226841, -79605, 94554, 312240, 586430, 916290, 1280362, 1640118, 1952141, 2180706, 2305636, 2325406, 2255429, 2122036, 1955680, 1786469, 1641237, 1540504, 1495001, 1501244, 1537953, 1568276, 1550753, 1455403, 1276853, 1036011, 766637, 494161, 221909, -65309, -384028, -734877, -1095639, -1426146, -1681835, -1830674, -1864241, -1796498, -1653330, -1461219, -1239943, -999693, -742053, -464659, -167715, 141263, 447218, 730854, 972958, 1158057, 1275911, 1320703, 1290799, 1190315, 1029968, 826234, 599706, 372063, 161497, -19581, -161369, -251372, -274229, -219040, -88491, 98556, 314517, 536477, 756822, 983175, 1227080, 1491174, 1765437, 2032478, 2273957]
12468B273957J98624J37910N7452m3089j59817k83576m00017m90564n36605n27862
12458B26413m69108l79296k84267k08343j67705j66100j93516k30010k54957k57314
12448b384203k39881k13648j87110j60300j27416q2375k1914N3248J37036K18432
12438c008131K85286L27415L36627L08219K44724J55516N1484n8665j67709k67588
12428a792822l47775l95889m00778l56390k64969j38724L130J41549K62369L55311
12418b934988M12891M32822M19197L78752L15537K30543J27633J9911p1314j26767
12408g95783j41132j26326j03218q9573r3572j13611j38656j49213j25625o2910
12398a939619K1420R5948J32968J21609P1072N249m7968o8474n1807r626L7371
$$ y = [2273957, 2472581, 2610491, 2667943, 2624854, 2465037, 2181461, 1781444, 1290880, 754275, 226413, -242695, -621991, -906258, -1114601, -1282306, -1448406, -1641922, -1871932, -2126889, -2384203, -2624084, -2837732, -3024842, -3185142, -3312558, -3394933, -3416847, -3363599, -3226563, -3008131, -2722845, -2395430, -2058803, -1750584, -1505860, -1350344, -1298860, -1357525, -1525234, -1792822, -2140597, -2536486, -2937264, -3293654, -3558623, -3697347, -3694217, -3552668, -3290299, -2934988, -2522097, -2089275, -1670078, -1291326, -975789, -745246, -617613, -597702, -669016, -795783, -936915, -1063241, -1166459, -1256032, -1349604, -1463215, -1601871, -1751084, -1876709, -1939619, -1918199, -1822251, -1689283, -1567674, -1496602, -1491353, -1539321, -1607795, -1659602, -1669228, -1631857]
12387a631857P0333Q1160P4285O1553N6216O9558J06281J57939K03657K23562
$$ y = [-1631857, -1561524, -1480364, -1406079, -1344526, -1288310, -1218752, -1112471, -954532, -750875, -527313]
$$ [...]
##END NTUPLES=NMR SPECTRUM
##END=
