##TITLE=31P ikalashn
LR-792-C1M
14.11.2024
##JCAMPDX= 6.0         $$ Bruker NMR JCAMP-DX V2.0
##DATA TYPE= NMR SPECTRUM
##DATA CLASS= NTUPLES
##ORIGIN= UXNMR, Bruker Analytische Messtechnik GmbH
##OWNER= root
$$ TOPSPIN		Version 1.3
$$ 2024-11-14 13:51:08.296 +0400  Irina@DPX200
$$ Compression mode = diff/dup
##.OBSERVE FREQUENCY= 81.01967998063
##.OBSERVE NUCLEUS= ^31P
##.ACQUISITION MODE= SIMULTANEOUS
##.ACQUISITION SCHEME= undefined
##.AVERAGES= 64
##.DIGITISER RES= 17
##SPECTROMETER/DATA SYSTEM= spect
##.PULSE SEQUENCE= zgpg
##.SOLVENT NAME= D2O
##.SHIFT REFERENCE= INTERNAL, D2O, 1, 298.5841
##AUDIT TRAIL= $$ (NUMBER, WHEN, WHO, WHERE, WHAT)
$$ ##TITLE= Audit trail, TOPSPIN		Version 1.3
$$ ##JCAMPDX= 5.01
$$ ##ORIGIN= Bruker BioSpin GmbH
$$ ##OWNER= Irina
$$ $$ F:/spectra/data/iren/nmr/P31dec/1/pdata/1/auditp.txt
$$ ##AUDIT TRAIL=  $$ (NUMBER, WHEN, WHO, WHERE, VERSION, WHAT)
(   1,<2024-11-14 13:49:06.718 +0400>,<Irina>,<DPX200>,<TOPSPIN 1.3>,
      <acquisition in progress>)
(   2,<2024-11-14 13:50:48.812 +0400>,<Irina>,<DPX200>,<TOPSPIN 1.3>,
      <Start of raw data processing
       efp BC_mod = 2 LB = 8 FT_mod = 6 PKNL = 1 PHC0 = 48.90376 PHC1 = 385.8932 SI = 32K 
       data hash MD5: 32K
       4C 75 05 46 E9 6F 04 D9 9A B5 F3 4F 61 6B 8A 91>)
(   3,<2024-11-14 13:50:51.343 +0400>,<Irina>,<DPX200>,<TOPSPIN 1.3>,
      <apk 
       data hash MD5: 32K
       0E 17 89 86 C8 EB 95 0E B8 C7 6A 14 16 68 04 A0>)
(   4,<2024-11-14 13:50:53.421 +0400>,<Irina>,<DPX200>,<TOPSPIN 1.3>,
      <abs n ABSG = 5 
       data hash MD5: 32K
       68 79 A1 58 3B 7F C3 06 DC FE 54 82 A7 94 DD E2>)
$$ ##END=
$$ 
$$ $$ hash MD5
$$ $$ D4 D6 F8 70 60 7B A3 3A 1B E0 DE 28 31 22 80 FD
##$RELAX= 
##$RELAX= 
##$RELAX= 
##$RELAX= 
##$RELAX= 
##$RELAX= 
##$RELAX= 
##$RELAX= 
##$RELAX= 
##$RELAX= 
##$RELAX= 
$$ Bruker specific parameters
$$ --------------------------
##$DU= <F:/spectra>
##$EXPNO= 1
##$NAME= <P31dec>
##$PROCNO= 1
##$TYPE= <nmr>
##$USER= <iren>
##$AMP= (0..31)
100 100 100 100 100 100 100 100 100 100 100 100 100 100 100 100 100 100 
100 100 100 100 100 100 100 100 100 100 100 100 100 100 
##$ANAVPT= -1
##$AQSEQ= 0
##$AQ_mod= 1
##$AUNM= <au_zg>
##$AUTOPOS= <>
##$BF1= 81.014009
##$BF2= 200.13
##$BF3= 200.13
##$BF4= 200.13
##$BF5= 200.13
##$BF6= 200.13
##$BF7= 200.13
##$BF8= 200.13
##$BYTORDA= 1
##$CFDGTYP= 0
##$CFRGTYP= 5
##$CHEMSTR= <none>
##$CNST= (0..63)
1 1 145 1 1 1 1 1 1 1 1 1 1 1 1 1 1 1 1 1 1 1 1 1 1 1 1 1 1 1 1 1 1 1 
1 1 1 1 1 1 1 1 1 1 1 1 1 1 1 1 1 1 1 1 1 1 1 1 1 1 1 1 1 1 
##$CPDPRG= <waltz16>
##$CPDPRG1= <>
##$CPDPRG2= <waltz16>
##$CPDPRG3= <>
##$CPDPRG4= <mlev>
##$CPDPRG5= <mlev>
##$CPDPRG6= <mlev>
##$CPDPRG7= <mlev>
##$CPDPRG8= <mlev>
##$CPDPRGB= <>
##$CPDPRGT= <>
##$D= (0..63)
0 1 0 0 0 0 0 0 0 0.06 0 0.03 2e-005 3e-006 0 0 0.0002 0 0 0 0 0 0 0 0 
0 0 0 0 0 0 0 0 0 0 0 0 0 0 0 0 0 0 0 0 0 0 0 0 0 0 0 0 0 0 0 0 0 0 0 
0 0 0 0 
##$DATE= 1731577845
##$DBL= (0..7)
120 120 120 11 120 120 24 19 
##$DBP= (0..7)
$$ [...]
##$SW_h= 37037.037037037
##$TD= 32768
##$TD0= 1
##$TE= 300
##$TE2= 300
##$TE3= 300
##$TEG= 300
##$TL= (0..7)
0 120 53 12 22 120 120 120 
##$TP= (0..7)
150 150 150 150 150 150 150 150 
##$TP07= 0
##$TPNAME0= <>
##$TPNAME1= <>
##$TPNAME2= <>
##$TPNAME3= <>
##$TPNAME4= <>
##$TPNAME5= <>
##$TPNAME6= <>
##$TPNAME7= <>
##$TPOAL= (0..7)
0.5 0.5 0.5 0.5 0.5 0.5 0.5 0.5 
##$TPOFFS= (0..7)
0 0 0 0 0 0 0 0 
##$TUNHIN= 0
##$TUNHOUT= 0
##$TUNXOUT= 0
##$USERA1= <user>
##$USERA2= <user>
##$USERA3= <user>
##$USERA4= <user>
##$USERA5= <user>
##$V9= 5
##$VALIST= <valist>
##$VCLIST= <CCCCCCCCCCCCCCC>
##$VD= 0
##$VDLIST= <DDDDDDDDDDDDDDD>
##$VPLIST= <PPPPPPPPPPPPPPP>
##$VTLIST= <TTTTTTTTTTTTTTT>
##$WBST= 1024
##$WBSW= 4
##$XGAIN= (0..3)
0 0 0 0 
##$XL= 0
##$YL= 0
##$YMAX_a= 6769
##$YMIN_a= -2581
##$ZGOPTNS= <>
##$ZL1= 120
##$ZL2= 120
##$ZL3= 120
##$ZL4= 120
##$ABSF1= 298.5841
##$ABSF2= -158.5842
##$ABSG= 5
##$ABSL= 5
##$ALPHA= 0
##$AQORDER= 0
##$ASSFAC= 0
##$ASSFACI= 0
##$ASSFACX= 0
##$ASSWID= 0
##$AUNMP= <proc_1d>
##$AXLEFT= 0
##$AXRIGHT= 0
##$AXTYPE= 0
##$AXUNIT= <>
##$AZFE= 0.1
##$AZFW= 0.5
##$BCFW= 0
##$BC_mod= 2
##$BYTORDP= 0
##$COROFFS= 0
##$CY= 12.5935478210449
##$DATMOD= 1
##$DC= 0
##$DFILT= <>
##$DTYPP= 0
##$F1P= 47.1127640792319
##$F2P= -24.0371245302204
##$FCOR= 0.5
##$FTSIZE= 32768
##$FT_mod= 6
##$GAMMA= 0
##$GB= 0
##$INTBC= 1
##$INTSCL= 7.269226e-011
##$ISEN= 30
##$LB= 8
##$LEV0= 0
##$LPBIN= 0
##$MAXI= 12.09355
##$MC2= 0
##$MEAN= 0
##$ME_mod= 0
##$MI= 0.7550151
##$NCOEF= 0
##$NC_proc= -11
##$NLEV= 6
##$NOISF1= 298.5841
##$NOISF2= 270.0111
##$NSP= 0
##$NTH_PI= 0
##$NZP= 0
##$OFFSET= 298.5841
##$PC= 1.4
##$PHC0= 69.01218
##$PHC1= 338.2631
##$PH_mod= 1
##$PKNL= yes
##$PPARMOD= 0
##$PPDIAG= 0
##$PPIPTYP= 0
##$PPMPNUM= 100
##$PPRESOL= 1
##$PSCAL= 0
##$PSIGN= 0
##$REVERSE= no
##$SF= 81.014009
##$SI= 32768
##$SIGF1= 270.0111
##$SIGF2= -158.5842
##$SINO= 77.54984
##$SIOLD= 32768
##$SREGLST= <31P.CDCl3>
##$SSB= 0
##$STSI= 32768
##$STSR= 0
##$SW_p= 37037.037037037
##$SYMM= 0
##$S_DEV= 0
##$TDeff= 32768
##$TDoff= 0
##$TI= <>
##$TILT= no
##$TM1= 0
##$TM2= 0
##$TOPLEV= 0
##$USERP1= <user>
##$USERP2= <user>
##$USERP3= <user>
##$USERP4= <user>
##$USERP5= <user>
##$WDW= 1
##$XDIM= 32768
##$YMAX_p= 466353681
##$YMIN_p= -10812998
$$ End of Bruker specific parameters
$$ ---------------------------------
##NTUPLES= NMR SPECTRUM
##VAR_NAME=  FREQUENCY,     SPECTRUM/REAL,   SPECTRUM/IMAG
##SYMBOL=    X,             R,               I
##VAR_TYPE=  INDEPENDENT,   DEPENDENT,       DEPENDENT
##VAR_FORM=  AFFN,          ASDF,            ASDF
##VAR_DIM=   32768,         32768,           32768
##UNITS=     HZ,            ARBITRARY UNITS, ARBITRARY UNITS
##FACTOR=    1.13031516577767, 1,            1
##FIRST=     37037.037037037, -2542247,      -3178685
##LAST=      0,             3400708,         6287195
##MIN=       0,             -10812998,       0
##MAX=       37037.037037037, 466353681,     0
$$ Real data points
##PAGE= N=1
##DATA TABLE= (X++(R..R)), XYDATA
$$ [...]
17943C092345l61994N8149M64366N97766M88450K87809R2776r3294k79112l57258
$$ 3092345 2730351 2788500 3252866 3850632 4339082 4626891 4719667 4626373 4347261 3990003
17933C990003l18951k61643j94711j25317p9692r6241j72836k03115j87392k06659
$$ 3990003 3671052 3409409 3214698 3089381 3009689 2913448 2740612 2537497 2350105 2143446
17923B143446k69848l09558k51004j31350m1914p5910k96627n68613o60541n26456
$$ 2143446 1873598 1564040 1313036 1181686 1139772 1063862 767235 198622 -461919 -988375
17913i88375l18362k06420j90049r8076J16553K75254K65814J07960j60562l89231
$$ -988375 -1306737 -1513157 -1703206 -1801282 -1684729 -1409475 -1143661 -1035701 -1196263 -1585494
17903a585494m17778k88510j30951O5734L66551P08308R20796R58097R02669P00252
$$ -1585494 -2003272 -2291782 -2422733 -2356999 -1990448 -1282140 -361344 596753 1499422 2199674
17893B199674L23574k8204j33426l0038P4479P0782k0499j29456j80539k02167
$$ 2199674 2523248 2495044 2361618 2331580 2406059 2476841 2456342 2326886 2146347 1944180
17883A944180k67692k88427k13395j96335k85925l39261k85601k05780j91050
$$ 1944180 1676488 1388061 1174666 978331 692406 353145 67544 -138236 -329286
17874c29286j58362l1157J17191J96229J52223P6691J49510L44861M49948K93024
$$ -329286 -487648 -518805 -401614 -205385 -53162 23529 173039 517900 967848 1260872
17864A260872n0476k97091k49832L6800L63931N51900M97197K52092M6477m635
$$ 1260872 1210396 913305 663473 700273 1064204 1616104 2113301 2365393 2411870 2407235
17854B407235p7810l82507q21465j040542r36867p87374p18905n47077j65499
$$ 2407235 2329425 1946918 1125453 84911 -851956 -1639330 -2358235 -2905312 -3070811
17845c070811K49427M68070N35571N67822N09913L36937K00033J60550P3300o5317
$$ -3070811 -2821384 -2353314 -1817743 -1249921 -740008 -403071 -203038 -42488 30812 -34505
17835c4505p5360O7981J93453J52324k438j31301j73217j70613k04245k52869
$$ -34505 -109865 -41884 151569 303893 301455 170154 -3063 -173676 -377921 -630790
17825f30790k15805r0783L5174Q4223R7983J66018K58029L19880L66985L86050
$$ -630790 -846595 -937378 -902204 -817981 -719998 -553980 -295951 23929 390914 776964
17815G76964K97607Q0630j33064j98832j34878k6642L5456J1877n3693j75979
$$ 776964 1074571 1155201 1022137 823305 688427 661785 697241 709118 655425 479446
17805D79446k74459k40141j10693P0195K13087K47216K69863L34331K73171N4809
$$ 479446 204987 -35154 -145847 -75652 137435 384651 654514 988845 1262016 1316825
17795A316825j52882l04386m11396l70535j20888J77562K98371J90314p83j26190
$$ 1316825 1163943 859557 448161 77626 -43262 134300 432671 622985 622202 496012
17785D96012k05856j94424K8967L18906M17765L00632J64304J76988L01304L87104
$$ 496012 290156 95732 124699 443605 861370 1162002 1326306 1503294 1804598 2191702
17775B191702L84017K92069R9663j57373l99792n69304o60187o77867o31208m86358
$$ 2191702 2575719 2867788 2967451 2810078 2410286 1840982 1180795 502928 -128280 -614638
17765f14638k25905q3263k25687m58952n40257l81553J7806M54411O17962M23657
$$ -614638 -840543 -923806 -1149493 -1608445 -2148702 -2530255 -2512449 -2058038 -1440076 -1016419
17755a016419J40529Q8360J95368K32274K19487K58490K60673J06498j75243m27200
$$ -1016419 -875890 -787530 -592162 -359888 -140401 118089 378762 485260 310017 -117183
17745a17183n52903n33929l33807M5570M76935P49834P04759L62878r6163m96607
$$ -117183 -670086 -1204015 -1537822 -1492252 -1015317 -265483 439276 802154 705991 209384
17735B09384p03935o58486l75457L1194L53888N14975N81433N20297K55063j16732
$$ 209384 -494551 -1153037 -1528494 -1497300 -1143412 -628437 -47004 473293 728356 611624
17725F11624l97345m98143n04075m71890l58108j73952R8339M76040P54800P53182
$$ 611624 214279 -283864 -787939 -1259829 -1617937 -1791889 -1693550 -1217510 -462710 290472
17715B90472N87367N07003O00163O42741M95092L33694K69675K69397K32994N5918
$$ 290472 877839 1384842 1985005 2627746 3122838 3456532 3726207 3995604 4228598 4284516
17705D284516j66890l09365m51722o58924q57788r43144p88419l30491K09400
$$ 4284516 4117626 3808261 3356539 2697615 1839827 896683 108264 -222227 -12827
17696a2827M78553M00802J74678M2538R4742J72686J32745L4090R817L2840J5096
$$ -12827 465726 866528 1041206 1083744 1178486 1351172 1483917 1518007 1527824 1560664 1575760
17685A575760L2260R2962P3390j18865m56246p56177q47420p76807p06625p09745
$$ 1575760 1608020 1700982 1774372 1655507 1199261 443084 -404336 -1181143 -1887768 -2597513
17675b597513p02262n71816k56824J65388N20984P22873Q36853R21586Q53427
$$ -2597513 -3299775 -3871591 -4128415 -3963027 -3442043 -2719170 -1882317 -960731 -107304
17666a07304N14403N3639k32374k83665j77491Q7890L52024M35669L46570J87485
$$ -107304 407099 460738 228364 -55301 -232792 -144902 207122 642791 989361 1176846
17656A176846J25208K35288L56824K65625l1761l43012n29871n79767n48732m38732
$$ 1176846 1302054 1537342 1894166 2159791 2128030 1785018 1255147 675380 126648 -312084
17646c12084k18755R2500M06511N12073L35692J42019J68082L27101L90019K16461
$$ -312084 -530839 -438339 -31828 480245 815937 957956 1126038 1453139 1843158 2059619
17636B059619r4736l41772m68449n15255m47378k63618l2723J42603J88046J47779
$$ 2059619 1964883 1623111 1154662 639407 192029 -71589 -104312 38291 226337 374116
17626C74116R0321J08442K25449K64646J44496O6189J29765J57223R9194O7969
$$ 374116 464437 572879 798328 1062974 1207470 1273659 1403424 1560647 1659841 1727810
17616A727810L4251o2835j67696k14921k71040l74744l24293j5637L64721P00575
$$ 1727810 1762061 1699226 1531530 1316609 1045569 670825 346532 330895 695616 1396191
17606A396191R69553J072005R41790O11553J90671j84481m11991m78230m37677
$$ 1396191 2365744 3437749 4379539 4991092 5181763 4997282 4585291 4107061 3669384
17597C669384l33352j89533j9453J33703K22155K42981J81001M5673n6682n9256
$$ 3669384 3336032 3146499 3127046 3260749 3482904 3725885 3906886 3952559 3895877 3836621
17587C836621m4643j56443m64394q51755j099734j066658q83485p84183p40105
$$ 3836621 3791978 3635535 3171141 2319386 1219652 152994 -730491 -1514674 -2254779
17578b254779n80560k04902K99257O73037P39519N99363L93625J61718q7690l43009
$$ -2254779 -2835339 -3040241 -2740984 -2067947 -1328428 -729065 -335440 -173722 -261412 -604421
17568f04421n44963n56117l04143J03604M36835N21263M01279J73419n1724p1886
$$ -604421 -1149384 -1705501 -2009644 -1906040 -1469205 -947942 -546663 -373244 -424968 -496854
17558d96854P3681P3815j51397l31340k77385p8175R9351J96131L11202M38242
$$ -496854 -423173 -349358 -500755 -832095 -1109480 -1187655 -1088304 -892173 -580971 -142729
17548a42729M72364M23522M04353L69108J02220k96330n41544o01821n75998m55364
$$ -142729 329635 753157 1157510 1526618 1628838 1332508 790964 189143 -386855 -842219
17538h42219k16212Q814J01985Q5940J1480r3788j40118r6004L7158K62472N00890
$$ -842219 -1058431 -1049617 -947632 -861692 -850212 -944000 -1084118 -1180122 -1142964 -880492 -379602
17527c79602P00881P78256O02441K69010L483p0246Q376M3582k0178r3094j32025
$$ -379602 321279 1099535 1701976 1970986 1974469 1904223 1912599 1956181 1936003 1842909 1710884
17516A710884p0540J9011j12858l95245m85588l47499j26977J45070L69869M59638
$$ 1710884 1640344 1659355 1546497 1151252 665664 318165 191188 336258 706127 1165765
17506A165765M86810M88212M00442J54347j96972m31320m00516j66823J71915
$$ 1165765 1652575 2140787 2541229 2695576 2498604 2067284 1666768 1499945 1671860
17497A671860M40836M59182K26987j83635o12010q50943q01912n03798j3739M85218
$$ 1671860 2112696 2571878 2798865 2615230 2003220 1152277 350365 -153433 -167172 318046
17487C18046O98266O00049L90651K64964K44599J91267K8777j41402l15102n82292
$$ 318046 1016312 1616361 2007012 2271976 2516575 2707842 2736619 2595217 2280115 1697823
17477A697823q22946q19168n61987l37208l22126m01493m48678m48161l32781
$$ 1697823 874877 55709 -506278 -843486 -1165612 -1567105 -2015783 -2463944 -2796725
17468b796725K5027N21573Q18914Q30759P45056O39254M70443K50856J00810Q1621
$$ -2796725 -2771698 -2250125 -1431211 -600452 144604 783858 1254301 1505157 1605967 1687588
17458A687588O7147r3580m24670q18820j049569r65498o13851j28373L50483O35089
$$ 1687588 1754735 1661155 1236485 417665 -631904 -1597402 -2211253 -2339626 -1989143 -1354054
17448a354054N62982K13573j06241k10528k16919k90123l94934m15424l11956
$$ -1354054 -791072 -577499 -683740 -894268 -1111187 -1401310 -1796244 -2211668 -2523624
17439b523624j25516R5981L92987P29954R20397Q73258O47453K88511j32153m27560
$$ -2523624 -2649140 -2553159 -2160172 -1430218 -509821 363437 1010890 1299401 1167248 739688
17429G39688m33789j54494K08818M22647M75353N46716O99150Q22399Q64579P35683
$$ 739688 305899 151405 360223 782870 1258223 1804939 2504089 3326488 4191067 4926750
17419D926750L06360k96899p73573r45773q69402p23366o66478o88071o64077
$$ 4926750 5233110 4936211 4162638 3216865 2347463 1624097 957619 269548 -394529
17410c94529n64192l70167o2913K62315M12710L33758J36314n5533j01365o504
$$ -394529 -958721 -1328888 -1391801 -1129486 -716776 -383018 -246704 -302237 -403602 -410106
17400d10106J09066K25305L86149M63324K80800n3735k85304l25904k53680j71163
$$ -410106 -301040 -75735 310414 773738 1054538 1000803 715499 389595 135915 -35248
17390c5248j42833j90876l26014m64310m98973m14944k16304L6378K66135L90573
$$ -35248 -178081 -368957 -694971 -1159281 -1658254 -2073198 -2289502 -2253124 -1986989 -1596416
17380a596416L64900L38189M35116N71656N70649L67067J32194P6799P7367j20206
$$ -1596416 -1231516 -893327 -458211 113445 684094 1051161 1183355 1260154 1337521 1217315
17370A217315m31587n79735m44530j29536R9959L6764k60694n37190o04130m53870
$$ 1217315 785728 205993 -238537 -368073 -268114 -231350 -492044 -1029234 -1633364 -2087234
17360b087234k13725k669J62811L04922M52716N66802N63451N15659N55519N83169
$$ -2087234 -2300959 -2303628 -2140817 -1835895 -1383179 -816377 -252926 262733 818252 1401421
17350A401421M02434N6211k42444l53028l36116l41412l76111l66034k75425j09336
$$ 1401421 1803855 1860066 1617622 1264594 928478 587066 210955 -155079 -430504 -539840
17340e39840N8640J82374K76813L50996L70494L39011L01019K41740J15083j25584
$$ -539840 -481200 -298826 -22013 328983 699477 1038488 1339507 1581247 1696330 1570746
17330A570746m59723p01547o92603m53900j25956J32972K42773J78699L2334J1867
$$ 1570746 1111023 409476 -283127 -737027 -862983 -730011 -487238 -308539 -276205 -264338
17320b64338J87159M44105O54759P23681N49226J03702m24438p68995q15659o10872
$$ -264338 -77179 366926 1021685 1745366 2294592 2398294 1973856 1204861 389202 -221670
17310b21670k60659J37581M31694M14303P2170k98911m48641m06259k36639J5611
$$ -221670 -482329 -344748 86946 501249 573419 274508 -174133 -580392 -817031 -801420
17300h01420J82702J85317J63567J51012R177j80486k29230j24994L1141J37656
$$ -801420 -618718 -433401 -269834 -118822 -109645 -290131 -519361 -644355 -613214 -475558
17290d75558J87461K50906L29899K99204J27865L2680J71017L67214M15753L21347
$$ -475558 -288097 -37191 292708 591912 719777 752457 923474 1290688 1706441 2027788
17280B027788J56154k4358k26485m27632n43372n98713n77848l62326O6279N00306
$$ 2027788 2183942 2159584 1933099 1505467 962095 363382 -214466 -576792 -510513 -10207
17270a0207O46220M57296J77403k1239j19336j12098n4628l7172j05477k48901
$$ -10207 636013 1093309 1270712 1249473 1130137 1018039 963411 926239 820762 571861
17260E71861m42773o10127n41520k28058N1416Q5445j46898m60516o48569p37099
$$ 571861 129088 -481039 -1022559 -1250617 -1199201 -1113756 -1260654 -1721170 -2369739 -3106838
17250c106838p38971n42937j77118K35458N57707O74935O48810N78513M62702
$$ -3106838 -3845809 -4388746 -4565864 -4330406 -3772699 -3097764 -2448954 -1870441 -1407739
17241a407739K71767k5286l65422n17147l06539J47097M99619N18085K59237L4372
$$ -1407739 -1135972 -1161258 -1526680 -2043827 -2350366 -2203269 -1703650 -1185565 -926328 -891956
17231h91956R0122K91636L63655K76277K06696J79796J57747J61186J20979p4445
$$ -891956 -801834 -510198 -146543 129734 336430 516226 673973 835159 956138 881693
17221H81693l52235n10169n19727m56306l59940k84221k46102k42693l69582o37699
$$ 881693 529458 19289 -500438 -956744 -1316684 -1600905 -1847007 -2089700 -2459282 -3096981
17211c096981q11316o68596k14995L27604O56902O24434L28929J2330q9294R4716
$$ -3096981 -3908297 -4576893 -4791888 -4464284 -3807382 -3182948 -2854019 -2841689 -2930983 -2836267
17201b836267N16179J000671J253936J143886P83474M30142K99972M25902O73952
$$ -2836267 -2320088 -1319417 -65481 1078405 1861879 2292021 2591993 3017895 3691847
17192C691847Q28328O97185L29495r0947m75915p36302p44796n68056m88079o20120
$$ 3691847 4520175 5217360 5546855 5455908 4979993 4243691 3498895 2930839 2442760 1822640
17182A822640p13290n24592j01837L70874P76410R87342R01181O59485M12160
$$ 1822640 1109350 584758 482921 853795 1630205 2617547 3518728 4178213 4590373
17173D590373J30829j18040j63256r6414j14721j73024j86283j81507j49282j01614
$$ 4590373 4721202 4603162 4439906 4343492 4228771 4055747 3869464 3687957 3538675 3437061
17163C437061j42563l08744m61439m35996k32305m8159n7437k07242l17875l08056
$$ 3437061 3294498 2985754 2524315 2088319 1856014 1807855 1750418 1543176 1225301 917245
17153I17245k31532k03791k08504j41544L9033K87981M75080N08490L97237K09142
$$ 917245 685713 481922 273418 131874 170907 458888 933968 1442458 1839695 2048837
17143B048837j9714k26486l24310k48201m7952J03285K01854L05061L27745K11360
$$ 2048837 2029123 1802637 1478327 1230126 1182174 1285459 1487313 1792374 2120119 2331479
17133B331479N035k49668n24112p00528o42903m00684j46452J3490P3669P0873
$$ 2331479 2336514 2086846 1562734 862206 219303 -181381 -327833 -314343 -240674 -169801
17123a69801k4729k13103l54618l32243k22210k09219l94672n67017l94769K09021
$$ -169801 -194530 -407633 -762251 -1094494 -1316704 -1525923 -1920595 -2487612 -2882381 -2673360
17113b673360R68360J413883J357760R58981M60115l0144m08890n75447n95299
$$ -2673360 -1705000 -291117 1066643 2025624 2485739 2455595 2046705 1471258 875959
17104H75959m68554j72610J37825K68564K36183J76594Q5714m6515j70116k85362
$$ 875959 407405 234795 372620 641184 877367 1053961 1139675 1093160 923044 637682
17094F37682l28776k34084j61412k14416k42292j58508K887J89697L52679M56308
$$ 637682 308906 74822 -86590 -301006 -543298 -701806 -698919 -509222 -156543 299765
17084B99765M62737K78769j49956o21016q56328q45732p63726o80505n35104k81017
$$ 299765 762502 1041271 891315 270299 -586029 -1431761 -2195487 -2875992 -3411096 -3692113
17074c692113M02J55806J71290J32815J56158K61422L53091M06745L29689J9945
$$ -3692113 -3691711 -3535905 -3364615 -3231800 -3075642 -2814220 -2461129 -2054384 -1724695 -1704750
17064a704750l21969l56243n7549K82691M13665M19361N34456P69678R85688J009899
$$ -1704750 -2026719 -2382962 -2440511 -2157820 -1744155 -1324794 -790338 -20660 965028 1974927
17054A974927P57206L41482l6165l03560n62707q50708j037117r79897o71763
$$ 1974927 2732133 3073615 3037450 2733890 2171183 1320475 283358 -696539 -1368302
17045a368302k20401K52889N61881N54913K34889j81802l76636k69646q8558L8130
$$ -1368302 -1588703 -1335814 -773933 -219020 15869 -165933 -542569 -812215 -900773 -862643
17035h62643J56933K30283J65528o0546l33227m31354k95200q2386J28241L29975
$$ -862643 -705710 -475427 -309899 -370445 -703672 -1135026 -1430226 -1512612 -1384371 -1054396
17025a054396M66699M70394L37871J73440K4117j09259j59873j23253q8652o2360
$$ -1054396 -587697 -117303 220568 394008 418125 308866 148993 25740 -62912 -125272
17015a25272K2514Q1675K3066j27421k58818l02110l44342m32820m60443l43012
$$ -125272 -102758 -21083 1983 -125438 -384256 -686366 -1030708 -1463528 -1923971 -2266983
17005b266983j81579j20121j46988j09124J6741J28025K34428L18892L53139M21696
$$ -2266983 -2448562 -2568683 -2715671 -2824795 -2808054 -2680029 -2445601 -2126709 -1773570 -1351874
16995a351874M82953L85444J55106J3489J15826K50582J94832N5848Q914J10314
$$ -1351874 -868921 -483477 -328371 -314882 -199056 51526 246358 302206 311120 421434
16985D21434K48825J79553j47293m35312m78792l65585j99441o0296k3080m6537
$$ 421434 670259 849812 702519 267207 -211585 -577170 -776611 -836907 -859987 -906524
16975i06524o2834j03215k90984n89561q28206r32454q82053p39991n07229j29716
$$ -906524 -969358 -1072573 -1363557 -1953118 -2781324 -3713778 -4595831 -5335822 -5843051 -5972767
16965e972767L02094O23075P91773R42236J073759J005106P65032N79641N58964
$$ -5972767 -5670673 -5047598 -4255825 -3313589 -2239830 -1234724 -469692 109949 668913
16956F68913O05237N18316K24554j50879n17178p86562q13136n48399k48657k33075
$$ 668913 1274150 1792466 2017020 1866141 1348963 562401 -250735 -799134 -1047791 -1280866
16946a280866m45210o21365o02964l86484j40528l4325m4338K6918K50765M05148
$$ -1280866 -1726076 -2347441 -2950405 -3336889 -3477417 -3511742 -3556080 -3529162 -3278397 -2873249
16936b873249L08682M212l39361n43020n05239k55170O7458L09842M25829N71079
$$ -2873249 -2564567 -2560355 -2899716 -3442736 -3947975 -4203145 -4135687 -3825845 -3400016 -2828937
16926b828937Q40434R94417Q39140N31017L39887L34285L58425K62316K2812l23468
$$ -2828937 -1988503 -994086 -154946 376071 715958 1050243 1408668 1670984 1693796 1370328
16916A370328o80707q88932q33441n25391j70419J3080l0699j96793k56970o4711
$$ 1370328 689621 -199311 -1032752 -1558143 -1728562 -1715482 -1746181 -1942974 -2199944 -2264655
16906b264655K87342N05957M17151J57914o1688k03771k65246j66647K5189J60167
$$ -2264655 -1977313 -1471356 -1054205 -896291 -957979 -1161750 -1426996 -1593643 -1568454 -1408287
16896a408287K30589K36719J17248r2650k96808l51171j71301J11574K95657L17596
$$ -1408287 -1177698 -940979 -823731 -916381 -1213189 -1564360 -1735661 -1624087 -1328430 -1010834
16886a010834K94551L16312L21876K09488O702j74346k84570k76403j49808J0118
$$ -1010834 -716283 -399971 -78095 131393 138095 -36251 -320821 -597224 -747032 -736914
16876g36914J30135J92367J92075J03525p410j4939P7463J49902J18506J1916
$$ -736914 -606779 -414412 -222337 -118812 -126222 -141161 -63698 86204 204710 216626
16866B16626m1944n2361q4642k2404J45103J59683r3153m39762o56529o00075
$$ 216626 174682 122321 37679 15275 160378 320061 226908 -212854 -869383 -1469458
16856a469458k43012K40094N24966N07779L89583K89625J49904l8777j23563Q201
$$ -1469458 -1712470 -1472376 -947410 -439631 -50048 239577 389481 350704 227141 235342
16846B35342K64828M12941K21318k09910m79115m19710j68882J07981K78622L09739
$$ 235342 500170 913111 1134429 924519 445404 25694 -143188 -35207 243415 553154
16836E53154J72147j13685l52461l58887j95921l7954O9561J36567J46894J04459
$$ 553154 725301 611616 259155 -99732 -295653 -333607 -264046 -127479 19415 123874
16826A23874R4780J89165K62874J79707j5829k86393n63847o47018n40654m37082
$$ 123874 218654 407819 670693 850400 834571 548178 -15669 -662687 -1203341 -1640423
16816a640423l38685k14474j22090j7556J97218N15359P73422Q62895Q35541P48904
$$ -1640423 -1979108 -2193582 -2315672 -2333228 -2136010 -1620651 -847229 15666 851207 1600111
16806A600111O46247N73482M90591L58671K75649J86112p4157m51670p77623r28588
$$ 1600111 2246358 2819840 3310431 3669102 3944751 4130863 4056706 3605036 2827413 1898825
16796A898825q52374o92931o23575n20082k30187J01474K25295J07504q5726k16822
$$ 1898825 1046451 353520 -270055 -790137 -1020324 -918850 -693555 -586051 -671777 -888599
16786h88599j79896O5408L61819M42654K27658o8771k39050k70255j71070L3944
$$ -888599 -1068495 -1003087 -641268 -198614 29044 -39727 -278777 -549032 -720102 -686158
16776f86158K43037L79020L58106J84363M2589m608n5702k22848n21563p65258
$$ -686158 -443121 -64101 294005 478368 520957 516349 460647 237799 -283764 -1049022
16766a049022p19390l79058N4702L85241N01000M55532M08615L67561L11284L87241
$$ -1049022 -1768412 -2147470 -2092768 -1707527 -1206527 -750995 -342380 25181 336465 723706
16756G23706N45453N18789K66402n6220l15529m54615n61943o86493o84993m52421
$$ 723706 1269159 1787948 2054350 1998130 1682601 1227986 666043 -20450 -705443 -1157864
16746a157864p1019L16294N95823O90352N63955K74407m210j22017j03405n5014
$$ -1157864 -1228883 -912589 -316766 373586 937541 1211948 1207738 1085721 982316 927302
16736I27302k3945L7433J80023L47934M47526L63406L6916l69324n55954m07620
$$ 927302 903357 940790 1120813 1468747 1916273 2279679 2316595 1947271 1391317 983697
16726I83697r3247K02120M37521N13658L32835J4274k28346k28245k5262J22198
$$ 983697 890450 1092570 1530091 2043749 2376584 2390858 2162512 1934267 1909005 2031203
16716B031203N4769r6985k08302k82118l39969l91703l52026j22224J08489J6350
$$ 2031203 2085972 1988987 1780685 1498567 1158598 766895 414869 292645 401134 417484
16706D17484l47187o25885o19080l89124j9638M75606Q45171P40954K68656j95191
$$ 417484 70297 -555588 -1174668 -1563792 -1583430 -1107824 -262653 478301 746957 551766
16696E51766m19453m14256l49367k54162j17116N445R2216R9423l04j50856k27231
$$ 551766 132313 -281943 -631310 -885472 -1002588 -997143 -904927 -805504 -805808 -956664 -1183895
16685a183895r6394K28261N28633O07412M58171K25237P2736P3047J30998N7167
$$ -1183895 -1280289 -1052028 -523395 84017 542188 767425 840161 913208 1044206 1101373
16675A101373j51584k13749M532J91423Q7213j57873l37557m34993n04701n24631
$$ 1101373 949789 736040 740572 931995 1019208 861335 523778 88785 -415916 -940547
16665i40547l92370q2196J67699J11574j35984k95359k31877p630J84593K27189
$$ -940547 -1332917 -1415113 -1247414 -1135840 -1271824 -1567183 -1799060 -1806690 -1622097 -1394908
16655a394908J76643Q9280l278J5143J85159M03398N95370O61057N19075L31430
$$ -1394908 -1218265 -1128985 -1132263 -1117120 -931961 -528563 66807 727864 1246939 1578369
16645A578369K31816J62855J15044Q7619O1828J6162k2605J8368J01231J09276
$$ 1578369 1810185 1973040 2088084 2175703 2237531 2253693 2231088 2249456 2350687 2459963
16635B459963o1344m40072q97154j147083j016387o53763l05445l6736K03026
$$ 2459963 2398619 1958547 1061393 -85690 -1102077 -1755840 -2061285 -2098021 -1894995
16626a894995M57393P20363Q68482Q11270O67944N62114L80752q74m87345q34206
$$ -1894995 -1437602 -717239 151243 962513 1630457 2192571 2573323 2572449 2085104 1250898
16616A250898q42918n74962l06770k35159k52248j46188J422l1102j86491k11282
$$ 1250898 407980 -166982 -473752 -708911 -961159 -1107347 -1105925 -1137027 -1323518 -1534800
16606a534800N217M34367R29249J137112R13445M67551J59381K00984M09642N42816
$$ -1534800 -1529583 -1095216 -165967 971145 1884590 2352141 2511522 2712506 3122148 3664964
16596C664964N72261M66933J93862j38141m16799o48900q69500j057939j174712
$$ 3664964 4237225 4704158 4898020 4759879 4343080 3694180 2824680 1766741 592029
16587E92029j138555q84909n05670j75675O0732K85800M62724M11788J09575j41261
$$ 592029 -546526 -1431435 -1937105 -2112780 -2052048 -1766248 -1303524 -891736 -782161 -923422
16577i23422j36568j00420k35557l67371k70936o9571K1838j2860m5831k112O1574
$$ -923422 -1059990 -1160410 -1395967 -1763338 -2034274 -2103845 -2082007 -2094867 -2140698 -2142810 -2081236
16566b081236Q2397R4101J51097J78097R0011m711R5270L77035O11408O25023
$$ -2081236 -1998839 -1904738 -1753641 -1575544 -1485533 -1490244 -1394974 -1017939 -406531 218492
16556B18492L59843j21659n01898m94845k11842R1698L05308M51593N76163O93319
$$ 218492 578335 456676 -45222 -540067 -751909 -660211 -354903 96690 672853 1366172
16546A366172P64792P01983M72867K06395M5529L747L0756Q6473R7529o9315m14870
$$ 1366172 2130964 2832947 3305814 3512209 3557738 3561485 3592241 3678714 3776243 3706928 3292058
16535C292058p17937p72782o52200o24403p70030r12954q46347n51116k03262
$$ 3292058 2574121 1801339 1149139 524736 -245294 -1158248 -2004595 -2555711 -2758973
16526b758973P8986L21270N78469Q76902J123561J213386J206105J188169J023767
$$ -2758973 -2679987 -2358717 -1780248 -903346 220215 1433601 2639706 3827875 4851642
16517D851642N14961k09588p67031r79330r46339q00491o34492m55753k81962
$$ 4851642 5366603 5157015 4389984 3410654 2464315 1663824 1029332 573579 291617
16508B91617j56796m1468R0143J75184J72281Q5521J8176R4072K40810L30361
$$ 291617 134821 93353 183496 358680 530961 616482 634658 728730 969540 1299901
16498A299901K94861J27510j00297k60180k84885k54306k37179k59172l24286
$$ 1299901 1594762 1722272 1621975 1361795 1076910 822604 585425 326253 1967
16489A967l73436l55269k51696r2212N60O5822K76219N73546P42033P38192P38991
$$ 1967 -371469 -726738 -978434 -1070646 -1070086 -1004264 -728045 -154499 587534 1325726 2064717
16478B064717Q32141Q66269P10501M62100L03570K69771K32936Q6549j55880m35105
$$ 2064717 2896858 3763127 4473628 4935728 5239298 5509069 5742005 5828554 5672674 5237569
16468E237569o80880p75943o85843m39989j24959n6651n64634j621392k688270
$$ 5237569 4556689 3780746 3094903 2654914 2529955 2473304 1908670 287278 -2400992
16459b400992k930594k207848j233688l53573M30490R73331J182957J136107R70978
$$ -2400992 -5331586 -7539434 -8773122 -9126695 -8696205 -7722874 -6539917 -5403810 -4432832
16450d432832O79580K69002j1561r478J18927K13413K65906L55151M55430M61491
$$ -4432832 -3753252 -3484250 -3495811 -3505289 -3386362 -3172949 -2907043 -2551892 -2096462 -1634971
16440a634971M55433N43328N95608M55797J24001k67101n09687n60245n51334
$$ -1634971 -1179538 -636210 -40602 415195 539196 272095 -237592 -797837 -1349171
16431a349171o11081q32338j143846j194404p74192k04989J08530J77475K99364
$$ -1349171 -1960252 -2792590 -3936436 -5130840 -5905032 -6110021 -6001491 -5824016 -5524652
16422e524652N22038N82172L57368K3018k18208k88477j90345j27289k62857m22362
$$ -5524652 -5002614 -4420442 -4063074 -4040056 -4258264 -4546741 -4737086 -4864375 -5127232 -5549594
16412e549594l86866j67925M5737R1815J3501o5540j08089j42806k21266l24847
$$ -5549594 -5936460 -6104385 -6058648 -5966833 -5953332 -6018872 -6126961 -6269767 -6491033 -6815880
16402f815880l79479m15523n30561o30255n70196l56325l8135L13186N86578P38838
$$ -6815880 -7195359 -7610882 -8141443 -8771698 -9341894 -9698219 -9736354 -9423168 -8836590 -8097752
16392h097752P25095M51299n1934n68514q49250o99826n215J172580K294469K580828
$$ -8097752 -7372657 -6921358 -6973292 -7541806 -8391056 -9090882 -9096097 -7923517 -5629048 -3048220
16382c048220K059712J492460J232787J049479O69976J26540k65322l50755k72892
$$ -3048220 -988508 503952 1736739 2786218 3456194 3582734 3317412 2966657 2693765
16373B693765k25465l05390m10794l04784J5417K14001k003m66672p70236p88262
$$ 2693765 2468300 2162910 1752116 1447332 1462749 1676750 1674747 1208075 437839 -350423
16363c50423o48756m56017k39480N190J72078K19448L27541M65107M50135L44960
$$ -350423 -999179 -1455196 -1694676 -1689486 -1517408 -1297960 -970419 -505312 -55177 289783
16353B89783K91424L12967L57625L79517L39793J86863l70m3074l5121k40849
$$ 289783 581207 894174 1251799 1631316 1971109 2157972 2157602 2114528 2079407 1838558
16343A838558n74938p41835p47185p41866o34161l51894p7661J36360L36586M64620
$$ 1838558 1263620 521785 -225400 -967266 -1601427 -1953321 -2030982 -1894622 -1558036 -1093416
16333a093416N28716N62018O02058O52354O30654N68495N47594M94971L19477
$$ -1093416 -564700 -2682 599376 1251730 1882384 2450879 2998473 3493444 3812921
16324C812921J06764k0026n7370j16238k91142n53773p86732r25571j051755j196252
$$ 3812921 3919685 3899659 3842289 3726051 3434909 2881136 2094404 1168833 117078 -1079174
16314a079174j208333j045327r10756r75435j178090j247806q84005k09448L46036
$$ -1079174 -2287507 -3332834 -4243590 -5219025 -6397115 -7644921 -8528926 -8738374 -8392338
16305h392338O62828Q50917R21853Q86532P81571N68553K36923n4976n3760L37562
$$ -8392338 -7729510 -6878593 -5956740 -5070208 -4288637 -3720084 -3483161 -3538137 -3591897 -3254335
16295c254335Q83607J153964R68386M89511N558k87174k93111o2328K09730L58945
$$ -3254335 -2370728 -1216764 -248378 241133 246691 -40483 -333594 -395922 -186192 172753
16285A72753M00010L91593K76393N3154j48885k74287l49148l20755q1339K68754
$$ 172753 572763 964356 1240749 1293903 1145018 870731 521583 200828 119489 388243
16275C88243M96849N63364N26770L47624N8833j30144q1742Q4799Q5227j45455
$$ 388243 885092 1448456 1975226 2322850 2381683 2251539 2169797 2254596 2339823 2194368
16265B194368m33827o73612p84161o53337k64038J39488K36512M5483k56407n10205
$$ 2194368 1760541 1086929 302768 -350569 -614607 -475119 -238607 -193124 -449531 -959736
16255i59736n32280l51991k33719k89923l14628j19637J58447L41198M46771N42577
$$ -959736 -1492016 -1844007 -2077726 -2367649 -2682277 -2801914 -2643467 -2302269 -1855498 -1312921
16245a312921N72133M88403M01758M17546M97959N61086N29007M31149L85797
$$ -1312921 -740788 -252385 149373 566919 1064878 1625964 2154971 2586120 2971917
16236B971917L55812K90903K31080J18179j27404m42327o90508q00124q03368
$$ 2971917 3327729 3618632 3849712 3967891 3840487 3398160 2707652 1907528 1104160
16227A104160p95107q32932q24854o99069n41421m41772l75494j94375J02299
$$ 1104160 309053 -523879 -1348733 -2047802 -2589223 -3030995 -3406489 -3600864 -3498565
16218c498565K84326K59137J00811q7627k41397l48565l13669q0285K19637M78290
$$ -3498565 -3214239 -2955102 -2854291 -2941918 -3183315 -3531880 -3845549 -3925834 -3706197 -3227907
16208c227907P20297R10616J006830J022586Q56065M60040q886l31554l71012
$$ -3227907 -2507610 -1596994 -590164 432422 1288487 1748527 1739641 1408087 1037075
16199A037075j30060J97309L20329J48536j52114m09173m50347j88095J37683
$$ 1037075 907015 1104324 1424653 1573189 1421075 1011902 561555 373460 511143
16190E11143K14273M8776r7767m6969J70712L92222L42797J315k46759k14150
$$ 511143 725416 774192 676425 629456 800168 1192390 1535187 1536502 1289743 1075593
16180A075593n8579N4677K1610r9779r8155J04751K90345K51647J60924K78984
$$ 1075593 1017014 1071691 1093301 993522 895367 1000118 1290463 1542110 1703034 1982018
16170A982018N34646O83188O22999M45730K84533J73104O244l61213p57107q62566
$$ 1982018 2516664 3199852 3822851 4268581 4553114 4726218 4732462 4371249 3614142 2751576
16160B751576o21670j77278J88648K47114M4817k22668m37702n84624o72763o40121
$$ 2751576 2129906 1952628 2141276 2388390 2433207 2210539 1772837 1188213 515450 -124671
16150a24671m25177j76814n3186M1113J84755K63557K03727J9765j64351j79003
$$ -124671 -549848 -726662 -779848 -738735 -553980 -290423 -86696 -66931 -231282 -410285
16140d10285j9337P6196Q520n8648m2286P449M0781Q397j00935j87919j99652
$$ -410285 -429622 -353426 -344906 -403554 -445840 -438391 -397610 -389213 -490148 -678067 -877719
16129h77719j66496r6516j3567J9799k831j5229K6194J01462J68303J99659J92314
$$ -877719 -1044215 -1140731 -1154298 -1134499 -1137330 -1152559 -1126365 -1024903 -856600 -656941 -464627
16118d64627J99011K49990K62820J69339N0511m2370j86372l40865l13560o4205
$$ -464627 -265616 -15626 247194 416533 467044 424674 238302 -102563 -416123 -480328
16108d80328K07803L42033L42667K64440J98427J82875J97414K09660J50262J4192
$$ -480328 -272525 69508 412175 676615 875042 1057917 1255331 1464991 1615253 1629445
16098A629445j17583j96330k41808k27392r3408J02280K09916J67855O3107K772
$$ 1629445 1511862 1315532 1073724 846332 752924 855204 1065120 1232975 1296082 1298854
16088A298854R806Q7876K43906M43716N90414N69375K96479j00079l38798l89324
$$ 1298854 1308660 1396536 1640442 2084158 2674572 3243947 3540426 3440347 3101549 2712225
16078B712225m86348p06619r45683j095294j042372q19165o17429n24774m12395
$$ 2712225 2225877 1519258 573575 -521719 -1564091 -2383256 -3000685 -3525459 -3937854
16069c937854j26264J98389K70483Q7340p5379o0905L2412P9062J22162K35343
$$ -3937854 -4064118 -3865729 -3595246 -3507906 -3583285 -3644190 -3611778 -3532716 -3410554 -3175211
16059c175211L43461L13415J83932N5027o3554j31205j39613j37832j84347k45572
$$ -3175211 -2831750 -2518335 -2334403 -2279376 -2342930 -2474135 -2613748 -2751580 -2935927 -3181499
16049c181499j04632K58970O06202Q32460R33950R04097P75989N86428L91947
$$ -3181499 -3286131 -3027161 -2420959 -1588499 -654549 249548 1025537 1611965 2003912
16040B003912K21611M4179j70279m16462n83531o14254o12897o28923o36544n65664
$$ 2003912 2225523 2269702 2099423 1682961 1099430 485176 -127721 -756644 -1393188 -1958852
16030a958852l64680j42861M8370K28620K64179J07586o822J27690M18016N42984
$$ -1958852 -2323532 -2466393 -2418023 -2189403 -1925224 -1817638 -1824460 -1696770 -1278754 -735770
16020g35770L37698K6670j02970l9369Q824p9364j29723K4874J91009J38364k4862
$$ -735770 -398072 -371402 -474372 -513741 -504917 -584281 -714004 -689130 -498121 -359757 -384619
16009c84619m0101J04274K05596J83709P888l37179p48430j035188r95433o13305
$$ -384619 -424720 -320446 -114850 68859 76747 -260432 -1008862 -2044050 -3039483 -3652788
15999c652788j12524K26447L50092L66825L09635J74687L4730k2911R846O5386
$$ -3652788 -3765312 -3538865 -3188773 -2821948 -2512313 -2337626 -2302896 -2325807 -2315961 -2250575
15989b250575M7526j1849k8369q1049k43533m01511m36543l11385q6582J40072
$$ -2250575 -2203049 -2214898 -2243267 -2324316 -2567849 -2969360 -3405903 -3717288 -3803870 -3663798
15979c663798L57182N31767O19398O53470O09167M54650L12080L01449L61531
$$ -3663798 -3306616 -2774849 -2155451 -1501981 -892814 -438164 -126084 175365 536896
15970E36896L91133L78855L01836P3319k33375l68693k77384j19816l0647n1142
$$ 536896 928029 1306884 1608720 1682039 1448664 1079971 802587 682771 652124 600982
15960F00982j62322l63720o08114p92283q80843q43061o41734l76320j73946l1128
$$ 600982 438660 74940 -533174 -1325457 -2206300 -3049361 -3691095 -4067415 -4241361 -4272489
15950d272489J22305L57929O30750P46925N75530K21248m7273j42191k40760l87837
$$ -4272489 -4150184 -3792255 -3161505 -2414580 -1839050 -1617802 -1665075 -1807266 -2048026 -2435863
15940b435863m21010k46619N5026L05727L68922K61580J40960J71362L29488L92497
$$ -2435863 -2856873 -3103492 -3048466 -2742739 -2373817 -2112237 -1971277 -1799915 -1470427 -1077930
15930a077930K48755K2995j34766j38377P4930M16628O37856N64600K84764L9290
$$ -1077930 -829175 -806180 -940946 -1079323 -1004393 -587765 50091 614691 899455 938745
15920I38745j14144k80117m39826m92542m61154m34030l67637k22508q6168n1648
$$ 938745 824601 544484 104658 -387884 -849038 -1283068 -1650705 -1873213 -1959381 -2011029
15910b011029o7760K9857J83574J82611k7607l03246l95851k74606j49849j06393
$$ -2011029 -2078789 -2048932 -1865358 -1682747 -1710354 -2013600 -2409451 -2684057 -2833906 -2940299
15900b940299n1041L8232K6010j19359k05083r6084J40927L33190L13685J33941
$$ -2940299 -2991340 -2953108 -2927098 -3046457 -3251540 -3347624 -3206697 -2873507 -2559822 -2425881
15890b425881k640J8853J33568K02646J29682j05670l88787n56442n76791m67782
$$ -2425881 -2428521 -2409668 -2276100 -2073454 -1943772 -2049442 -2438229 -2994671 -3571462 -4039244
15880d039244k24699O4376L08458M61020M49847K49865r6156m33145n52611m66022
$$ -4039244 -4263943 -4199567 -3891109 -3430089 -2980242 -2730377 -2826533 -3259678 -3812289 -4278311
15870d278311l15186j13550J50549L30942L69097M04767M27369L26037J56287
$$ -4278311 -4593497 -4707047 -4556498 -4225556 -3856459 -3451692 -3024323 -2698286 -2541999
15861b541999K2929l5343r4242k38487l68236l18136o3753K99747O17757P35975
$$ -2541999 -2519070 -2554413 -2648655 -2887142 -3255378 -3573514 -3637267 -3337520 -2719763 -1983788
15851a983788O43256M90485L70839K80406K81017L76922L74171J94755L4052J02511
$$ -1983788 -1340532 -850047 -479208 -198802 82215 459137 833308 1028063 1062115 1164626
15841A164626M06650O69796O50774M39065K39253J04384l2499k49927m92111o48962
$$ 1164626 1571276 2241072 2891846 3330911 3570164 3674548 3642049 3392122 2900011 2251049
15831B251049o69651m89621j49267R3686N1123j82003m43626o20254o56817o14536
$$ 2251049 1581398 1091777 942510 1036196 1087319 905316 461690 -158564 -815381 -1429917
15821a429917n85957n42657m10847k30183j02241J2224K76165O25516P86817O75029
$$ -1429917 -2015874 -2558531 -2969378 -3199561 -3301802 -3289578 -3013413 -2387897 -1601080 -926051
15811i26051M61214L04764Q2580l28745p55524r35646p70097l64297P2869L81237
$$ -926051 -464837 -160073 -77493 -406238 -1161762 -2097408 -2867505 -3231802 -3158933 -2777696
15801b777696N06881M36759K38137J52897K64921L42012J77883j58491m22974
$$ -2777696 -2270815 -1834056 -1595919 -1443022 -1178101 -836089 -658206 -816697 -1239671
15792a239671m68367l00264j4557K13492K25939J15273P1382J10745K17578L97192
$$ -1239671 -1708038 -2008302 -2022859 -1809367 -1583428 -1468155 -1396773 -1286028 -1068450 -671258
15782f71258N29985N29330M47736L34514K14664J03416K8790J9013J19939K98592
$$ -671258 -141273 388057 835793 1170307 1384971 1488387 1517177 1536190 1656129 1954721
15772A954721L72376K22349j22041m38602m20719j12168J77246K93604K98980
$$ 1954721 2327097 2549446 2427405 1988803 1568084 1455916 1633162 1926766 2225746
15763B225746L89546N51567M94805J43968k46690n29042p48433q54014p72898
$$ 2225746 2615292 3166859 3661664 3805632 3558942 3029900 2281467 1427453 654555
15754F54555o00150m98206n22740n59079m68407k62956m3691Q7439P6959l5952
$$ 654555 54405 -443801 -966541 -1525620 -1994027 -2256983 -2300674 -2213235 -2136276 -2172228
15744b172228j32604j40266k8663J87194L37191K66569O4213l2283P6260J92025
$$ -2172228 -2304832 -2445098 -2473761 -2286567 -1949376 -1682807 -1618594 -1650877 -1574617 -1382592
15734a382592R9822j24253l07953l74348l07591j58333K9782K18771K60531N5699
$$ -1382592 -1282770 -1407023 -1714976 -2089324 -2396915 -2555248 -2525466 -2306695 -2046164 -1990465
15724a990465k27970l14888j08632K60120N33556O04263N66943M99920M35768
$$ -1990465 -2218435 -2533323 -2641955 -2381835 -1848279 -1244016 -677073 -177153 258615
15715B58615M07646M11417M51341M92999M35675K95568J95665J53284J08420P1785
$$ 258615 666261 1077678 1529019 2022018 2457693 2753261 2948926 3102210 3210630 3282415
15705C282415N3918Q2035J79901K51673K00661J04864J73385M21326O04075N11361
$$ 3282415 3336333 3418368 3598269 3849942 4050603 4155467 4328852 4750178 5354253 5865614
15695E865614J21548l69042p64492r75037r44401o18228j37292K02059K95995
$$ 5865614 5987162 5618120 4853628 3878591 2934190 2315962 2178670 2380729 2676724
15686B676724K16547O9044k7245L6239K51765M30598L23943o2077l97127m16525
$$ 2676724 2893271 2962315 2935070 2971309 3223074 3653672 3977615 3915538 3518411 3101886
15676C101886k68515k23021k65120k02106L2934K77826L53184K83158J59583R1747
$$ 3101886 2833371 2610350 2345230 2143124 2176058 2453884 2807068 3090226 3249809 3341556
15666C341556N8551j17505m20573o36668o56781n37620m23895m16773m41595l97268
$$ 3341556 3400107 3282602 2862029 2225361 1568580 1030960 607065 190292 -251303 -648571
15656f48571k93492j58392l6980M2477Q3613J10854J09845M4670L7492J45236
$$ -648571 -942063 -1100455 -1137435 -1094958 -1011345 -900491 -790646 -745976 -708484 -563248
15646e63248J69049L5437L1285L08095N84546N53754K33393j03873k19806j09302
$$ -563248 -394199 -358762 -327477 -19382 565164 1118918 1352311 1248438 1028632 919330
15636I19330N3566J78289K80449L13087K03232K9399o7527r4013r3032l0428J14415
$$ 919330 972896 1151185 1431634 1744721 1947953 1977352 1909825 1815812 1722780 1692352 1806767
15625A806767K79208L84954M54690N52063O53400N94382K96700o1724l03542m61731
$$ 1806767 2085975 2470929 2925619 3477682 4131082 4725464 5022164 4960440 4656898 4195167
15615D195167n91194n68405k99853J66653O96112J009953Q90413M33958j21256
$$ 4195167 3603973 3035568 2735715 2902368 3598480 4608433 5498846 5932804 5811548
15606E811548o11870r03199r41134q06746o63572o18865n80284m14545j81830
$$ 5811548 5199678 4296479 3355345 2548599 1885027 1266162 685878 271333 89503
15597H9503m8359o3888j45604k01992k30530j93002J2612K86317M59702N09982
$$ 89503 41144 -22744 -168348 -370340 -600870 -793872 -781260 -494943 -35241 474741
15587D74741M64488L59555J81476j16524m36781n49733l87185r7969J37671J42442
$$ 474741 939229 1298784 1480260 1363736 926955 377222 -9963 -107932 29739 172181
15577A72181J731l9515M0159J74665L58489N53238O85178O64335L99509M0409
$$ 172181 173912 134397 174556 349221 707710 1260948 1946126 2610461 3009970 3050379
15567C050379j87897k15233p3081Q8464J32012O0005K581R9664L19809M98966
$$ 3050379 2862482 2647249 2574168 2662632 2794644 2854649 2857230 2956894 3276703 3775669
15557C775669N34705M17830K42130J25014R2629P6451p460r7817r3466q0412k38025
$$ 3775669 4310374 4728204 4970334 5095348 5187977 5264428 5256968 5159151 5065685 4985273 4747248
15546D747248n52084p51044n98469k08971J49291L16163K66198J29747J15558
$$ 4747248 4195164 3444120 2845651 2636680 2785971 3102134 3368332 3498079 3613637
15537C613637K60640M54240N48890M16006P0646l18953n28252m65611k92901k28223
$$ 3613637 3874277 4328517 4877407 5293413 5364059 5045106 4516854 4051243 3758342 3530119
15527C530119l27100n33899p10484o98700n08531j71343J91970L66929L55134
$$ 3530119 3203019 2669120 1958636 1259936 751405 580062 772032 1138961 1494095
15518A494095K87250K55146L07338L65720L86633L69297K95570K47413K34737
$$ 1494095 1781345 2036491 2343829 2709549 3096182 3465479 3761049 4008462 4243199
15509D243199J83749K9384k34310m39344l82498q2632L30653P01121Q14977O09226
$$ 4243199 4426948 4456332 4222022 3782678 3400180 3317548 3648201 4349322 5164299 5773525
15499E773525K85318j2394k85160m66498n26022m97120l53359p4493K59990N14591
$$ 5773525 6058843 6046449 5761289 5294791 4768769 4271649 3918290 3843797 4103787 4618378
15489D618378O00571N46400L69422O1518k44318l13571j43090l821l7843j67863
$$ 4618378 5218949 5765349 6134771 6196289 5951971 5638400 5495310 5491489 5453646 5285783
15479E285783k43117j03834J91775L40173J72044r6204k57385l81633n15127n48402
$$ 5285783 5042666 4938832 5130607 5470780 5642824 5546620 5289235 4907602 4392475 3844073
15469C844073l54609l9731J53010K12286K73472L54434L02794M7411k37180l88465
$$ 3844073 3489464 3449733 3602743 3815029 4088501 4442935 4745729 4793140 4555960 4167495
15459D167495m52784m86255m67389l88692k00137P1114K46564L20518L61789L42704
$$ 4167495 3714711 3228456 2761067 2372375 2172238 2243352 2489916 2810434 3172223 3514927
15449C514927K86584J62372p4528l51254n94582p64315q25261p41582n61942m32316
$$ 3514927 3801511 3963883 3889355 3538101 2943519 2179204 1353943 612361 50419 -381897
15439c81897m21066m33546k96083O1246N06515Q07944R07219Q88836P76486N25663
$$ -381897 -802963 -1236509 -1532592 -1471346 -964831 -156887 750332 1639168 2415654 2941317
15429B941317J57018j52152j70834Q1846L60255N13102N82650O78118Q06903R54769
$$ 2941317 3098335 2946183 2775349 2857195 3217450 3730552 4313202 4991320 5798223 6752992
15419F752992J122484J195984J069743P40471L00260l2613j83591k91971l69308
$$ 6752992 7875476 9071460 10141203 10881674 11181934 11149321 10965730 10673759 10304451
15410A0304451k77258n0671J34612K84830M63135O10226O48712N58309M08454
$$ 10304451 10027193 9976522 10111134 10395964 10859099 11469325 12118037 12676346 13084800
15401A3084800L22031K79648J40084j6482K4652J96186L09965L79935M40792M89490
$$ 13084800 13406831 13686479 13826563 13810081 13834733 14030919 14340884 14720819 15161611 15651101
15391A5651101N34117M90771K84936j0230j96925k22441k50066l47734k92307
$$ 15651101 16185218 16675989 16960925 16950695 16753770 16531329 16281263 15933529 15641222
15382A5641222L0133M02215N68114M62170K87273K09046J48456M2235l273J30458
$$ 15641222 15671355 16073570 16641684 17103854 17391127 17600173 17748629 17790864 17787591 17918049
15372A7918049L71838N26039M98780K85561K4763j8768K54939P32012J268932
$$ 17918049 18289887 18815926 19314706 19600267 19625030 19606262 19861201 20593213 21862145
15363B1862145J696007J855131J757144J596199J600658J891042K445428L125011
$$ 21862145 23558152 25413283 27170427 28766626 30367284 32258326 34703754 37828765
15355C7828765L840452M629742N472376O220847O794887P190125P320039O857549
$$ 37828765 41669217 46298959 51771335 57992182 64787069 71977194 79297233 86154782
15347H6154782N487592L364783R85452j215852l071696m613079n793121o470306
$$ 86154782 91642374 95007157 95992609 94776757 91705061 87091982 81298861 74828555
15339G4828555o516105n957735n020800l978397l089819k448974j925379j404074
$$ 74828555 68312450 62354715 57333915 53355518 50265699 47816725 45891346 44487272
15331D4487272q92804m45687n6369M17479J061663J704103K238377K807835L451271
$$ 44487272 43594468 43148781 43092412 43509891 44571554 46275657 48514034 51321869 54773140
15322E4773140M125742M860895N684421O631662P754189Q927851R770866R841071
$$ 54773140 58898882 63759777 69444198 76075860 83830049 92757900 102528766 112369837
15314A12369837Q879090O957404M340122J405709j383604l724912n577466o885353
$$ 112369837 121248927 128206331 132546453 133952162 132568558 128843646 123266180 116380827
15306A16380827p330499o731618n403577l751376k012650l85847J056212K392595
$$ 116380827 109050328 102318710 96915133 93163757 91151107 90765260 91821472 94214067
15298I4214067L638659M645338N231809N379063N167442M591886L676829K783992
$$ 94214067 97852726 102498064 107729873 113108936 118276378 122868264 126545093 129329085
15290A29329085K377548K468764K609666K476254K222423K161119K287210K342040
$$ 129329085 131706633 134175397 136785063 139261317 141483740 143644859 145932069 148274109
15282A48274109K184539J746346R32344j54176j403644k950859m858968o855275
$$ 148274109 150458648 152204994 153137338 152983162 151579518 148628659 143769691 136914416
15274A36914416q493651r444060r648443r275169q620588p912801p203025o480665
$$ 136914416 128420765 118976705 109328262 100053093 91432505 83519704 76316679 69836014
15266F9836014n729273m977752m292432l701155l177780k672244k148005j550743
$$ 69836014 64106741 59128989 54836557 51135402 47957622 45285378 43137373 41586630
15258D1586630p91549O1737P69456J205914J332467J124950P09257K30368k47132
$$ 41586630 40795081 40856818 41626274 42832188 44164655 45289605 45998862 46229230 45982098
15249D5982098o32054q11248p24025l88953J87393R28225J572200J845285J703309
$$ 45982098 45350044 44538796 43814771 43425818 43613211 44541436 46113636 47958921 49662230
15240D9662230J381413J118494R25684P30231N58424N27663P59527J266032J855423
$$ 49662230 51043643 52162137 53087821 53818052 54376476 54904139 55663666 56929698 58785121
15231E8785121K319457K679793L014498L348631L703070M032761M247040M248922
$$ 58785121 61104578 63784371 66798869 70147500 73850570 77883331 82130371 86379293
15223H6379293L954342L420563K878678K514637K278281K087430J951125J889591
$$ 86379293 90333635 93754198 96632876 99147513 101425794 103513224 105464349 107353940
15215A07353940J948862K209310K705714L311266L833588M103018L869653L038671
$$ 107353940 109302802 111512112 114217826 117529092 121362680 125465698 129335351 132374022
15207A32374022J854823O45455m66744j497619k367748k801326k636117k031986
$$ 132374022 134228845 134874300 134407556 132909937 130542189 127740863 125104746 123072760
15199A23072760j231688k91714Q61794K211833L679233N260939O953292Q757383
$$ 123072760 121841072 121549358 122411152 124622985 128302218 133563157 140516449 149273832
15191A49273832J0611176J2450412J4362045J6302407J8046839J9424519K0259769
$$ 149273832 159885008 172335420 186697465 202999872 221046711 240471230 260730999
15184B60730999K0233937J9044129J6636796J3467312J0422212Q365214P726061
$$ 260730999 280964936 300009065 316645861 330113173 340535385 348900599 356626660
15177C56626660Q359827R803210J1499639J2851850J3382011J2914658J1562286
$$ 356626660 364986487 374789697 386289336 399141186 412523197 425437855 437000141
15170D37000141R747684P967471O277977M189837J170571k732165o831181j0251474
$$ 437000141 446747825 454715296 460993273 465183110 466353681 463621516 456790335 446538861
15162D46538861j2344069j2812719j1590373q871300n237205j592032J133964
$$ 446538861 434194792 421382073 409791700 400920400 395683195 394091163 395225127
15155C95225127K270796J407398j591817o315095j1774109j6858233k0709999
$$ 395225127 397495923 398903321 397311504 390996409 379222300 362364067 341654068
15148C41654068k2819509k3050120k1715661j9422706j6768475j4164005j1824075
$$ 341654068 318834559 295784439 274068778 254646072 237877597 223713592 211889517
15141B11889517r853454q210907o737745n315284l993713k995564k388456k051642
$$ 211889517 202036063 193825156 187087411 181772127 177778414 174782850 172394394 170342752
15133A70342752j921697j884572j785770j655968j638303j796254k081914k474458
$$ 170342752 168421055 166536483 164750713 163094745 161456442 159660188 157578274 155103816
15125A55103816l038576l703051m224722m485843m463420m062483l362567k628190
$$ 155103816 152065240 148362189 144137467 139651624 135188204 131125721 127763154 125134964
15117A25134964k023750j524918j063425o53788k78896J59593P62591J431992
$$ 125134964 123111214 121586296 120522871 119869083 119590187 119749780 120512371 121944363
15109A21944363J726890J220980j7631j529308k880016l767770m059669l971817
$$ 121944363 123671253 124892233 124874602 123345294 120465278 116697508 112637839 108666022
15101A08666022l819722l621201l281958k816835k305084j891808j710611j858076
$$ 108666022 104846300 101225099 97943141 95126306 92821222 90929414 89218803 87360727
15093H7360727k380210l180523m045999m667946m739146m277248l604635k950743
$$ 87360727 84980517 81799994 77753995 73086049 68346903 64069655 60465020 57514277
15085E7514277k394562j919402j461697j063435q18106p42331q16329r70823j059888
$$ 57514277 55119715 53200313 51738616 50675181 49857075 49114744 48298415 47327592 46267704
15076D6267704j101225j313319j713633k007362j909320j412601q33929m86204
$$ 46267704 45166479 43853160 42139527 40132165 38222845 36810244 35976315 35490111
15068C5490111l70501l91440o65629j178512j540871j565012j478279j399549
$$ 35490111 35119610 34728170 34062541 32884029 31343158 29778146 28299867 26900318
15060B6900318j244524j054521r47905r02512q10624o70376o16574o77701o87486
$$ 26900318 25655794 24601273 23653368 22750856 21940232 21269856 20653282 19975581 19288095
15051A9288095m82355p5652K80874L65472K18675P451j95423m50181p08841q15197
$$ 19288095 18805740 18730088 19010962 19376434 19595109 19602560 19407137 18956956 18248115 17432918
15041A7432918p31532n40755l15744q7508q065j32996k86155m10022n44021o03697
$$ 17432918 16701386 16160631 15844887 15757379 15749314 15616318 15330163 14920141 14376120 13772423
15031A3772423n33461m01771l75172n62648q98790j226722j338337j158290p88353
$$ 13772423 13238962 12837191 12462019 11899371 11000581 9773859 8435522 7277232 6488879
15022F488879m26087k37733j99874k02151k73001m16568m44662k63660R15J79830
$$ 6488879 6062792 5825059 5625185 5423034 5150033 4733465 4288803 4025143 4026058 4205888
15012D205888J92915J38793J55485K87724M93375O78180P17432N36853J79916
$$ 4205888 4398803 4537596 4693081 4980805 5474180 6152360 6869792 7406645 7586561
15003G586561j93854m21697m37764l57264m07553n85349o61410n10178k07472
$$ 7586561 7392707 6971010 6533246 6175982 5768429 5183080 4521670 4011492 3804020
14994C804020O3068J59283R0796l6072j66908k51885j42760J98793N34005N92797
$$ 3804020 3867088 4026371 4117167 4081095 3914187 3662302 3519542 3718335 4252340 4845137
14984D845137L76223M1261k74404m80384n53541n52557n17755m62239m28947m46984
$$ 4845137 5221360 5262621 4988217 4507833 3954292 3401735 2883980 2421741 1992794 1545810
14974A545810m49977k65757k4346l8420k22618k85635j77516m7386M0678J49461
$$ 1545810 1095833 830076 805730 767310 544692 259057 81541 34155 74833 224294
14964B24294K58856K89168K20682J26852O0091l9685j44422j84795k27862l68509
$$ 224294 483150 772318 993000 1119852 1179943 1140258 995836 811041 583179 214670
14954B14670m43860k43645R4693K38208J26137n2015k16298l41977l14272j27731
$$ 214670 -229190 -472835 -378142 -139934 -13797 -65812 -282110 -624087 -938359 -1066090
14944a066090M6395J49546L02993M68248M52564K92033J87045K08836L44561N26745
$$ -1066090 -1019695 -870149 -567156 -98908 353656 645689 832734 1041570 1386131 1912876
14934A912876O49880O44278N16207K34015j99823n78921o53239m44271j94486
$$ 1912876 2562756 3207034 3723241 3957256 3757433 3178512 2525273 2081002 1886516
14925A886516k7276J49300L66035L89426Q9905l48342o90723p71922n47867j68091
$$ 1886516 1859240 2008540 2374575 2764001 2853906 2505564 1814841 1042919 495052 326961
14915C26961J43129K97848L62182M05248L98160K90739J53539M4252k5727l7510
$$ 326961 470090 767938 1130120 1535368 1933528 2224267 2377806 2422058 2396331 2358821
14905B358821n2691j34348j71363l0724J93514L25025L56012M95520Q15474J040550
$$ 2358821 2306130 2171782 2000419 1969695 2163209 2488234 2844246 3339766 4155240 5195790
14895E195790Q82198K59238o46540j245748j181262p74984m34012k47630j61997
$$ 5195790 6077988 6337226 5690686 4444938 3263676 2488692 2054680 1807050 1645053
14886A645053j70332j89039j05448J10373L97606N64295M37319Q0314k48599k85120
$$ 1645053 1474721 1285682 1180234 1290607 1688213 2252508 2689827 2770141 2521542 2236422
14876B236422p730L49716N76140O28810N00762J98421j74634n47125r26697j185837
$$ 2236422 2228692 2578408 3154548 3783358 4284120 4482541 4307907 3760782 2834085 1648248
14866A648248j171448r17588n92526l74297l03901k81165k23994q4356R5299K68160
$$ 1648248 476800 -440788 -1033314 -1407611 -1711512 -1992677 -2216671 -2301027 -2205728 -1937568
14856a937568L74782K52257r9641m45802n80562m53150j15244K43368L41021J32985
$$ -1937568 -1562786 -1310529 -1410170 -1855972 -2436534 -2889684 -3004928 -2761560 -2420539 -2287554
14846b287554j42167k87553k64681j20784K8221Q9234J41247K95603M47277M14042
$$ -2287554 -2429721 -2717274 -2981955 -3102739 -3074518 -2985284 -2844037 -2548434 -2101157 -1687115
14836a687115J72551j09389k04730p8655M0150j0626j00549l3745J51003L54184
$$ -1687115 -1514564 -1623953 -1828683 -1907338 -1867188 -1877814 -1978363 -2012108 -1861105 -1506921
14826a506921N61557O80796O51794N53524M34031K09055j33047m09895m70852
$$ -1506921 -945364 -264568 387226 940750 1374781 1583836 1450789 1040894 570042
14817E70042l13480M620L53901N85056O61209N70125L58790K65714M22488O19628
$$ 570042 256562 261182 615083 1200139 1861348 2431473 2790263 3055977 3478465 4098093
14807D098093O46473M90232J95547j54075n06439q77446j162815j211885j092070
$$ 4098093 4744566 5234798 5430345 5276270 4769831 3892385 2729570 1517685 425615
14798D25615r81655r00071p45624m95277k32968j16744j62677j37061O4246L11752
$$ 425615 -556040 -1456111 -2201735 -2697012 -2929980 -3046724 -3209401 -3346462 -3282216 -2970464
14788b970464M61418M72912M88597N48192M61972J44281k16656l45222k77206
$$ -2970464 -2509046 -2036134 -1547537 -999345 -537373 -393092 -609748 -954970 -1232176
14779a232176k90699l31459k15820N4289M21112O68620O42123M37881K40192J38693
$$ -1232176 -1522875 -1854334 -2070154 -2015865 -1594753 -926133 -284010 153871 394063 532756
14769E32756L2929j30940k62015k50215q7425P5686K18294M10720N81487O07484
$$ 532756 565685 434745 172730 -77485 -164910 -89224 129070 539790 1121277 1728761
14759A728761L39792k59463q91242j133588q59844k50128L50181O04709M51922
$$ 1728761 2068553 1809090 917848 -215740 -1075584 -1325712 -975531 -370822 81100
14750H1100J03121j68169k89810l71541m15849m19461m48378m68756m28789l64172
$$ 81100 184221 16052 -273758 -645299 -1061148 -1480609 -1928987 -2397743 -2826532 -3190704
14740c190704k41390k2876K54078N22603O74021O61341N04158K73073R8299J4779
$$ -3190704 -3432094 -3454970 -3200892 -2678289 -2004268 -1342927 -838769 -565696 -467397 -452618
14730d52618k688L9539N1423k0673j69721l06519k73789r5762Q0880K13076K83960
$$ -452618 -455306 -415767 -364344 -385017 -554738 -861257 -1135046 -1230808 -1149928 -936852 -652892
14719f52892K43642O3032j29558j81953j47002p8918M5991J75178J87634J13359
$$ -652892 -409250 -346218 -475776 -657729 -804731 -883649 -837658 -662480 -474846 -361487
14709c61487J48339L15215M06180L29971K65355K88424K48574J38481R7937J62441
$$ -361487 -213148 102067 508247 838218 1103573 1391997 1640571 1779052 1876989 2039430
14699B039430K32251J91618J6607k23413m43616n49009m72829l03962k09701q8038
$$ 2039430 2271681 2463299 2479906 2256493 1812877 1263868 791039 487077 277376 189338
14689A89338K34039N70462N72083J58656l56212n70505m20869j97977p5966J5303
$$ 189338 423377 993839 1565922 1724578 1368366 797861 376992 179015 103049 118352
14679A18352J36324K50868L01775L35938L74146L39067J97239j2955k63994m98986
$$ 118352 254676 505544 807319 1143257 1517403 1856470 2053709 2040754 1776760 1277774
14669A277774n36308l61278k51367l34609m03821k96419j15257K632N9827J35809
$$ 1277774 741466 380188 128821 -205788 -609609 -906028 -1021285 -1018653 -958826 -823017
14659h23017K05712J87487J58941K07662J72809j45723n41095o01864k83993J29524
$$ -823017 -617305 -429818 -270877 -63215 109594 -36129 -577224 -1179088 -1463081 -1333557
14649a333557L87588M78332N08864N69281O16275M98042K03206q1769j54347n9809
$$ -1333557 -945969 -467637 41227 610508 1226783 1724825 1928031 1846262 1691915 1632106
14639A632106l2190j58218k95546l13627j88122Q620J53964J65184J0659j91382
$$ 1632106 1599916 1441698 1146152 832525 644403 653023 806987 972171 982830 791448
14629G91448k57481k10274k06095k62073k97612l22430l63735l87267l69788l58235
$$ 791448 533967 323693 117598 -144475 -442087 -764517 -1128252 -1515519 -1885307 -2243542
14619b243542m29646n47395o81891q94928j040594p96173k14905K76170M47358
$$ -2243542 -2673188 -3220583 -3902474 -4797402 -5837996 -6634169 -6849074 -6572904 -6125546
14610f125546M28965M43255O31776Q51264P72942M62929K13553P7584j9035p0011
$$ -6125546 -5696581 -5253326 -4621550 -3770286 -2997344 -2534415 -2320862 -2243278 -2262313 -2332324
14600b332324M047J56355K44558K22950J05085m686L8440J56813J29421o5208
$$ -2332324 -2328277 -2171922 -1927364 -1704414 -1599329 -1604015 -1565575 -1408762 -1279341 -1344549
14590a344549j91463j15130O4315K41960L82632M36410L52442J40679p8214r6524
$$ -1344549 -1536012 -1651142 -1586827 -1344867 -962235 -525825 -173383 -32704 -110918 -207442
14580b07442Q4458K16213J77629N7888k8868o3878j21636k02384k40647k51320
$$ -207442 -122984 93229 270858 328746 299878 236000 114364 -88020 -328667 -579987
14570e79987l29366n11066n90926l81786r2078Q1240K25463L50037L98161M64016
$$ -579987 -909353 -1420419 -2011345 -2393131 -2485209 -2403969 -2178506 -1828469 -1430308 -966292
14560i66292N37421M68984K50184K5912q2270r3807n2221N7415K03433L51452
$$ -966292 -428871 40113 290297 316209 233939 140132 87911 145326 348759 700211
14550G00211N14745O29099N20389J66929k06232l95474l30155o5208J72570J08767
$$ 700211 1214956 1844055 2364444 2531373 2325141 1929667 1599512 1534304 1706874 1815641
14540A815641k69809o49685p53863o24249l95002p2148L44206P51856R42192P83916
$$ 1815641 1545832 896147 142284 -481965 -876967 -949115 -604909 146947 1089139 1873055
14530A873055M46499J25418j50784l04929k61517j14501n9218j22171j93550k43545
$$ 1873055 2319554 2444972 2294188 1989259 1727742 1613241 1554023 1431852 1238302 994757
14520I94757k94167l63352m47559n92380q02135q90158o70276k53723Q9700K25294
$$ 994757 700590 337238 -110321 -702701 -1504836 -2394994 -3065270 -3318993 -3229293 -3003999
14510c003999J84448N8914r7058k42433l58140m45555m85780m81816m46210l71757
$$ -3003999 -2819551 -2760637 -2857695 -3100128 -3458268 -3903823 -4389603 -4871419 -5317629 -5689386
14500e689386k41018R82L54911N95971N88664M28626K20421L7320l6499p700N1912
$$ -5689386 -5930404 -5929422 -5574511 -4978540 -4389876 -3961250 -3740829 -3703509 -3740008 -3747708 -3695796
14489c695796J73765L63463N13028M89590K79335L3274j02430j97189l77833m51619
$$ -3695796 -3522031 -3158568 -2645540 -2155950 -1876615 -1843341 -1945771 -2142960 -2520793 -2972412
14479b972412j55459L58783O72339O16899M32907L69257M20652M69607M29070
$$ -2972412 -3127871 -2769088 -2096749 -1479850 -1046943 -677686 -257034 212573 641643
14470F41643L11369K55943L36871L95560K48607o3442l72792n60304o05161o22833
$$ 641643 953012 1208955 1545826 1941386 2189993 2126551 1753759 1193455 588294 -34539
14460c4539o92496o94238n60605m30326l42853j77553N9938J92310J28409K118
$$ -34539 -727035 -1421273 -1981878 -2412204 -2755057 -2932610 -2872672 -2680362 -2551953 -2549835
14450b549835J594J12013K04069K51762J94108n7273l66714n12029m81208l11887
$$ -2549835 -2548241 -2436228 -2232159 -1980397 -1786289 -1843562 -2210276 -2722305 -3203513 -3515400
14440c515400K2205M30439O59599N07153Q8266k62183l56031j99596O8571K69623
$$ -3515400 -3493195 -3062756 -2403157 -1896004 -1807738 -2069921 -2425952 -2625548 -2556977 -2287354
14430b287354L15588K24477J36802J40944J66738J21915r966j37351k29169l51121
$$ -2287354 -1971766 -1747289 -1610487 -1469543 -1302805 -1180890 -1190856 -1328207 -1557376 -1908497
14420a908497m74516m38149j82864J63434M76088O98784P98312Q11520P82743
$$ -1908497 -2383013 -2821162 -3004026 -2840592 -2364504 -1665720 -867408 -55888 726855
14411G26855O81106M92643K94352J07414o7377j29376k7847J14875J77321K00594
$$ 726855 1407961 1900604 2194956 2302370 2234993 2105617 2077770 2192645 2369966 2570560
14401B570560K02333Q5034j57281l85247m83260m63208m08297l36010k39860j63065
$$ 2570560 2772893 2857927 2700646 2315399 1832139 1368931 960634 624624 384764 221699
14391B21699j37400j89444k96403l33179j99158O2857L46595N50499O06325M46013
$$ 221699 84299 -105145 -401548 -734727 -933885 -871028 -524433 26066 632391 1078404
14381A078404L8649m16369n95673k91644L41019Q62150R83253P77230M16396M2428
$$ 1078404 1117053 700684 105011 -186633 154386 1016536 1999789 2777019 3193415 3235843
14371C235843k39822l94962m57937m53961l46720j27616J33698L12908K99170
$$ 3235843 2996021 2601059 2143122 1689161 1342441 1214825 1348523 1661431 1960601
14362A960601J10655r6238j78658j41984j15424j26615j20512n4263Q8509K52196
$$ 1960601 2071256 1975018 1796360 1654376 1538952 1412337 1291825 1237562 1326071 1578267
14352A578267L29036K70342J39483l361p2324j9735J9517o0177j53969q3133J41070
$$ 1578267 1907303 2177645 2317128 2313767 2241443 2221708 2241225 2181048 2027079 1943946 2085016
14341B085016K06092j39194o71167r24996p19732k78723Q556l3346k12389k69707
$$ 2085016 2291108 2151914 1480747 555751 -163981 -442704 -434148 -467494 -679883 -949590
14331i49590j17490J57549L70909M60984M69612L86815K10987J0874j15158j18175
$$ -949590 -1067080 -909531 -538622 -77638 391974 778789 989776 1000650 885492 767317
14321G67317l1755P7639J95852K61374K09512R5471j9478j70556l52635m03897
$$ 767317 735562 813201 1009053 1270427 1479939 1575410 1555932 1385376 1032741 628844
14311F28844j89924J19366J93738J1197r9907R9924M21969M27883M8095l09171
$$ 628844 438920 558286 752024 763221 663314 763238 1185207 1613090 1661185 1352014
14301A352014m08916l46752k54639j79503j38763j34149o5905J29783L06054K16869
$$ 1352014 943098 596346 341707 162204 23441 -110708 -176613 -46830 259224 476093
14291D76093j73111o15395r17433j087943j116826r82199o98966l12114K474N8139
$$ 476093 302982 -312413 -1229846 -2317789 -3434615 -4416814 -5115780 -5427894 -5425420 -5367281
14281e367281q015k7861p6546j51935j59846p4814J17585M15194P21577Q77271
$$ -5367281 -5375296 -5403157 -5479703 -5631638 -5791484 -5866298 -5748713 -5333519 -4611942 -3734671
14271c734671Q16823O10325L72001K32815J34608j28631n29400q71488r87486
$$ -3734671 -2917848 -2307523 -1935522 -1702707 -1568099 -1696730 -2226130 -3097618 -4085104
14262d085104p72586l63769j1333J83042K48477K86905L19507K93282K45703K91570
$$ -4085104 -4857690 -5221459 -5232792 -5049750 -4801273 -4514368 -4194861 -3901579 -3655876 -3364306
14252c364306M65332O84287Q48361Q32151N95456K67688q250j45989p0161J85281
$$ -3364306 -2898974 -2214687 -1366326 -534175 61281 328969 320719 174730 104569 289850
14242B89850L97971L40958N6918k72676n22920n40487l39532j61086j07505r0323
$$ 289850 687821 1028779 1085697 813021 290101 -250386 -589918 -751004 -858509 -948832
14232i48832j12740j82003k64930l53879l68312k05160J03778L47235L48395K17545
$$ -948832 -1061572 -1243575 -1508505 -1862384 -2230696 -2435856 -2332078 -1984843 -1636448 -1418903
14222a418903J59554K06932L33948M66398M75998K98254K7595j91445l24172l54898
$$ -1418903 -1259349 -1052417 -718469 -252071 223927 522181 549776 358331 34159 -320739
14212c20739k60658j42127j12069j56897k60328l54301k30313J34601M77317O30490
$$ -320739 -581397 -723524 -835593 -992490 -1252818 -1607119 -1837432 -1702831 -1225514 -595024
14202e95024O05249M72060L07253J69552J09234J17940J34515Q2395J9408J9211
$$ -595024 10225 482285 789538 959090 1068324 1186264 1320779 1403174 1422582 1441793
14192A441793k6731p2678J5030J25818R4100J5941O7181K13483L68095M95541
$$ 1441793 1415062 1342384 1357414 1483232 1577332 1593273 1660454 1873937 2242032 2737573
14182B737573N19054L93713J86248P577m7488j7027j5011k1472J410n9035k60977
$$ 2737573 3256627 3650340 3836588 3844165 3796677 3779650 3764639 3743167 3744577 3685542 3424565
14171C424565n06749o95456p09100m67777o5487L02744M97907M84773L05050J9516
$$ 3424565 2917816 2222360 1513260 1045483 979996 1282740 1780647 2265420 2570470 2589986
14161B589986k31666l06236j80581Q7260L46302M55613L57269N9460l36590n77292
$$ 2589986 2358320 2052084 1871503 1958763 2305065 2760678 3117947 3177407 2840817 2263525
14151B263525m87128k18910n4830m4263j08571k34675l39800k79467r1803N4571
$$ 2263525 1776397 1557487 1502657 1458394 1349823 1115148 775348 495881 404078 458649
14141D58649R7646Q8474N0341l8010k01938m26456o46972q02190q13916n76835
$$ 458649 556295 644769 695110 657100 455162 28706 -618266 -1420456 -2234372 -2811207
14131b811207j43340K71858N45802O61721N91162L58014J36610J01541K56014
$$ -2811207 -2954547 -2682689 -2136887 -1475166 -884004 -525990 -389380 -287839 -31825
14122c1825N22740P65145Q22490O85355M46878K51627K47489L57045L19025L815
$$ -31825 490915 1256060 2078550 2763905 3210783 3462410 3709899 4066944 4385969 4389784
14112D389784m34669q04582j016874j008006q13558n18408j32111K94458N96551
$$ 4389784 3955115 3150533 2133659 1125653 312095 -206313 -338424 -43966 552585
14103E52585O12855L41934m2584l72510n40556m97469k85462r115J94478K90028
$$ 552585 1165440 1507374 1464790 1092280 551724 54255 -231207 -240322 -45844 244184
14093B44184L57535L67513J53622k62638o21869o78016m02338j9486K14903K73584
$$ 244184 601719 969232 1122854 860216 238347 -439669 -842007 -861493 -646590 -373006
14083c73006K64221K62126L08937L71852L73398K86008J91335Q3772p5990j40523
$$ -373006 -108785 153341 462278 834130 1207528 1493536 1684871 1768643 1692653 1552130
14073A552130o3784P756M9456J02138J31434J06882J0547j46241k86713m63429
$$ 1552130 1488346 1496102 1545558 1647696 1779130 1886012 1896559 1750318 1463605 1000176
14063A000176p47065r55314r31835p35249m97049l31581k71731k54156k32765
$$ 1000176 253111 -702203 -1634038 -2369287 -2866336 -3197917 -3469648 -3723804 -3956569
14054c956569j39138N0253K01321L41059N99656Q38019P81761M21599Q1923J1916
$$ -3956569 -4095707 -4045454 -3844133 -3503074 -2903418 -2065399 -1283638 -862039 -780116 -768200
14044g68200J02282J70753J93464J40835L5113p4777j83009j53693J38883N24600
$$ -768200 -665918 -495165 -301701 -160866 -125753 -200530 -383539 -537232 -398349 126251
14034A26251P46783P96167P87223O76760L62754r3667m45739n26313l87608j95965
$$ 126251 873034 1669201 2456424 3133184 3495938 3402271 2956532 2430219 2042611 1846646
14024A846646p2548j553P6280J17689M9185p2559j95934l11014m07266m59192
$$ 1846646 1774098 1772545 1848825 1966514 2015699 1943140 1747206 1436192 1028926 569734
14014E69734l75213q6039K39085K97736J27584O9218K27651M42389N36015M66496
$$ 569734 194521 108482 347567 645303 772887 842105 1069756 1512145 2048160 2514656
14004B514656L35497K36065J66101J42086K01235J87463j42128o98981j110002
$$ 2514656 2850153 3086218 3252319 3394405 3595640 3783103 3640975 2941994 1831992
13995A831992j164884q85882m41673o2302R4417K9617q8081r9322K3855K35892
$$ 1831992 667108 -218774 -660447 -722749 -628332 -598715 -686796 -786118 -762263 -526371
13985e26371M22566M91387M45815L53974L04346L14633L58241L19712J27341r5669
$$ -526371 -103805 387582 833397 1187371 1491717 1806350 2164591 2484303 2611644 2515975
13975B515975k09024k03597k02249l64500o74530q72485q23973o07361k79185
$$ 2515975 2306951 2103354 1901105 1536605 862075 -10410 -834383 -1441744 -1720929
13966a720929J45161N96808Q88265Q95315O99589M57650K14954M1085P2565K38550
$$ -1720929 -1575768 -978960 -90695 804620 1504209 1961859 2176813 2217898 2290463 2529013
13956B529013L19394K97009K93335L03928K17867p273l45661o82941q00175n51797
$$ 2529013 2848407 3145416 3438751 3742679 3960546 3953273 3607612 2924671 2124496 1572699
13946A572699r9292J85601J17539j46327l21068k66929m8111J90668L30622L99654
$$ 1572699 1473407 1659008 1776547 1630220 1309152 1042223 994112 1184780 1515402 1915056
13936A915056N58148P61348P26828L93745n1934l83631m28897k47636r7515q7218
$$ 1915056 2473204 3234552 3961380 4355125 4303191 3919560 3490663 3243027 3145512 3058294
13926C058294j73695l63490n75737o69765o26961m70754k62871j12029O0496L14583
$$ 3058294 2884599 2521109 1945372 1275607 648646 177892 -84979 -197008 -136512 178071
13916A78071M70404M47042L00531J07181K8136J33571K44416K38362J56579n2631
$$ 178071 648475 1095517 1396048 1503229 1531365 1664936 1909352 2147714 2304293 2251662
13906B251662l90139o94802q95747r12935o53985l27642k18182l11053m61892
$$ 2251662 1861523 1166721 270974 -641961 -1295946 -1623588 -1841770 -2152823 -2614715
13897b614715n72876n64728m14214j94827J0186J49157K17855K90301M63314P15567
$$ -2614715 -3187591 -3752319 -4166533 -4361360 -4351174 -4202017 -3984162 -3693861 -3230547 -2514980
13887b514980Q42111O96652L83047J66764J87349L01042L79516M45227M39264
$$ -2514980 -1672869 -976217 -593170 -426406 -239057 61985 441501 886728 1325992
13878A325992K82261O2168j0545Q8798K33449M15995O29552P00688M56841r3256
$$ 1325992 1608253 1670421 1659876 1748674 1982123 2398118 3027670 3728358 4185199 4091943
13868D091943p22951j131785j133721p30985j36692L45577N64210O17523O58315
$$ 4091943 3368992 2237207 1103486 372501 235809 581386 1145596 1763119 2421434
13859B421434O69019N74381M54655M24921M45262L59001J08775k05017m30729
$$ 2421434 3090453 3664834 4119489 4544410 4989672 5348673 5457448 5252431 4821702
13850D821702n53193o70642p49958o51851m14730j82908L887P6684k6436j80408
$$ 4821702 4268509 3597867 2847909 2196058 1781328 1598420 1602307 1678991 1652555 1472147
13840A472147k38921k29380j90669r2677O2307K10153K96201L51500M31955N07877
$$ 1472147 1233226 1003846 813177 720500 782807 992960 1289161 1640661 2072616 2580493
13830B580493M99596L54368Q6286k04232l88090m49789m94499n60829n71688m69837
$$ 2580493 3080089 3434457 3520743 3316511 2928421 2478632 1984133 1423304 851616 381779
13820C81779k85933q9626O882j40796m67372o48624m41808M4581M96556P76920
$$ 381779 95846 6220 13102 -127694 -595066 -1243690 -1685498 -1640917 -1144361 -367441
13810c67441R23581Q81929O44493M24383K88521Q8684j89962l71148l28784j36868
$$ -367441 556140 1438069 2082562 2506945 2795466 2884150 2694188 2323040 1994256 1857388
13800A857388M0283P3773p9196k79585l78608m17810m64741n06797m55305k45529
$$ 1857388 1897671 1971444 1892248 1612663 1234055 816245 351504 -155293 -610598 -856127
13790h56127k5869m8465k96983m66779l84933j58696Q8851L03200M26906M71266
$$ -856127 -881996 -930461 -1227444 -1694223 -2079156 -2237852 -2149001 -1845801 -1418895 -947629
13780i47629N19780O24123P06552N87947L15811J19820J19369K50892L94383M81785
$$ -947629 -427849 196274 902826 1490773 1806584 1926404 2045773 2296665 2691048 3172833
13770C172833M34031L04474K76809L10004K45771O3945j29685k82014m07068m35362
$$ 3172833 3606864 3911338 4188147 4498151 4743922 4807867 4678182 4396168 3989100 3553738
13760C553738l67969m06487o10505p21382n76690l60791k43274j55542o819K24971
$$ 3553738 3185769 2779282 2168777 1447395 870705 509914 266640 111098 104279 329250
13750C29250M52273N46459M97719L92422K75766J17304m4673j50708j67009j28832
$$ 329250 781523 1327982 1825701 2218123 2493889 2611193 2566520 2415812 2248803 2119971
13740B119971k04016n06498q99878j107400r87701n40288J19330P28943J080636
$$ 2119971 1915955 1409457 509579 -597821 -1585522 -2125810 -2006480 -1277537 -196901
13731a96901J162797J044160P62152M15756J19299o4777j13543q8653j08907k77642
$$ -196901 965896 2010056 2772208 3187964 3307263 3242486 3128943 3040290 2931383 2653741
13721B653741n46415o64770n86245n28382n23757l50602J15216O84355R50400
$$ 2653741 2107326 1442556 856311 327929 -195828 -546430 -431214 253141 1203541
13712A203541P44519K84304j40472l69144l69085j94197K5271J92742K85779K54363
$$ 1203541 1948060 2232364 2091892 1722748 1353663 1159466 1184737 1377479 1663258 1917621
13702A917621J27806Q3172K07338L50510L09032R5471k14190n27769o89515o09371
$$ 1917621 2045427 2128599 2335937 2686447 2995479 3090950 2876760 2348991 1659476 1050105
13692A050105l36562k3317J94905K42187J10307j39700l98796o13876q17865r48230
$$ 1050105 713543 690226 885131 1127318 1237625 1097925 699129 85253 -732612 -1680842
13682a680842q54990n25434j58760J03842L03678N06671O84167P37399O42832
$$ -1680842 -2535832 -3061266 -3220026 -3116184 -2812506 -2305835 -1621668 -884269 -241437
13673b41437N19100M81530M61908L60705J62369r0257l53448n52342n58586m13819
$$ -241437 277663 759193 1221101 1581806 1744175 1653918 1300470 748128 189542 -224277
13663b24277k44584r7671J7340N7525J1766M0423J95568K89431J94823k7464k12593
$$ -224277 -468861 -566532 -549192 -491667 -479901 -439478 -243910 45521 240344 212880 287
13652B87k40892j45514M5991L71480P01344Q57727Q80005Q89191Q87895P43921
$$ 287 -240605 -386119 -340128 31352 732696 1590423 2470428 3359619 4247514 4991435
13642D991435L65314j83144p46823j129153j190860r75358p16254m86909k26884
$$ 4991435 5356749 5173605 4426782 3297629 2106769 1131411 415157 -71752 -298636
13633b98636j2151N1847J2634j8053o566J2604m9993j82529j79291l7810J0520
$$ -298636 -310787 -258940 -246306 -264359 -270925 -258321 -308314 -490843 -670134 -707944 -697424
13622f97424j60585m80021p40081p38452m96617k45578p4233P1138J90867K48985
$$ -697424 -858009 -1338030 -2078111 -2816563 -3313180 -3558758 -3632991 -3561853 -3370986 -3122001
13612c122001K45260K34185J77850N1095j7653K0811L3905q3686k14460j64729
$$ -3122001 -2876741 -2642556 -2464706 -2413611 -2431264 -2410453 -2376548 -2460234 -2674694 -2839423
13602b839423Q6852L59777L91288J91146Q0786J60533K82936L99285M68816M16670
$$ -2839423 -2752571 -2392794 -2001506 -1810360 -1729574 -1569041 -1286105 -886820 -418004 -1334
13592a334K24241p7761l77003n21540m20292j56198M9307J05098J14984J28366
$$ -1334 222907 145146 -231857 -753397 -1173689 -1329887 -1280580 -1175482 -1060498 -932132
13582i32132O4279j05112k72419l59563l76212k42016P5400L48936M03919M64346
$$ -932132 -867853 -972965 -1245384 -1604947 -1981159 -2223175 -2147775 -1798839 -1394920 -930574
13572i30574P18645R67793J017306Q63281N36364J68693l2657q8296j14584j10966
$$ -930574 -211929 755864 1773170 2636451 3172815 3341508 3308851 3220555 3105971 2995005
13562B995005j10715j90617k92761l56848m34934n41435o38898p09900p44321
$$ 2995005 2884290 2693673 2400912 2044064 1609130 1067695 428797 -281103 -1025424
13553a025424p08878o16490m67188k19913M0316J63324J00008j19303m03352o06000
$$ -1025424 -1734302 -2350792 -2817980 -3037893 -2997577 -2834253 -2734245 -2853548 -3256900 -3862900
13543c862900o58335n87301l76578o7788J58428K36609K22847J81533K14330L92961
$$ -3862900 -4521235 -5108536 -5485114 -5552902 -5394474 -5157865 -4935018 -4753485 -4539155 -4146194
13533d146194P02773R99597J011252O80909L07623J63614K01999K50959K51970
$$ -4146194 -3443421 -2443824 -1432572 -751663 -444040 -280426 -78427 172532 424502
13524D24502K27977J83726J82919L05525M82007N76051N06549K89151L6935j60654
$$ 424502 652479 836205 1019124 1324649 1806656 2382707 2889256 3178407 3215342 3054688
13514C054688k44732j62607o3421k10873m87239m85596j31350K06379K87843K94646
$$ 3054688 2809956 2647349 2583928 2373055 1885816 1400220 1268870 1475249 1763092 2057738
13504B057738L22340K27517j9836k31586k56394j78021j43287j96839k95054k88484
$$ 2057738 2380078 2607595 2587759 2356173 2099779 1921758 1778471 1581632 1286578 998094
13494I98094j71797j11617j59764k27992j86000J2701L32630O41064P10961M73255
$$ 998094 826297 714680 554916 326924 140924 153625 486255 1127319 1838280 2311535
13484B311535M1763l51361n60078n69665l88110j59297l6293k3289o9431j41878
$$ 2311535 2353298 2001937 1441859 872194 484084 324787 288494 265205 195774 53896
13474E3896j42353j4814J07082J01987P1359J42519K01225J42027J21070J70768
$$ 53896 -88457 -103271 3811 105798 177157 319676 520901 662928 783998 954766
13464I54766R4008j93908n71302q25217q12432o09730l34993J2059L82166N73883
$$ 954766 1048774 854866 283564 -541653 -1354085 -1963815 -2298808 -2286749 -1904583 -1330700
13454a330700M67665J93643m3526j72879k61911l98488o30401q23525q09673o28064
$$ -1330700 -863035 -669392 -712918 -885797 -1147708 -1546196 -2176597 -3000122 -3809795 -4437859
13444d437859m19169k54129r7892J07046L04004L58628K95577K70040L41519M00306
$$ -4437859 -4857028 -5111157 -5209049 -5102003 -4797999 -4439371 -4143794 -3873754 -3532235 -3131929
13434c131929L95666M51171N08668L61613L1671k84932m16107l76032l81635n14816
$$ -3131929 -2736263 -2285092 -1776424 -1414811 -1383140 -1668072 -2084179 -2460211 -2841846 -3356662
13424c356662o10571n72692m10912j14696K30356M72505N38710M76298M62210
$$ -3356662 -3967233 -4539925 -4950837 -5065533 -4835177 -4362672 -3823962 -3347664 -2885454
13415b885454N73815O73835O63248N94774O08772P90227R84071R28211N98990
$$ -2885454 -2311639 -1637804 -974556 -379782 228990 1019217 2003288 2931499 3530489
13406C530489K50282J16234J23673L7668k21419n29800o96186o29075m24169k00728
$$ 3530489 3780771 3897005 4020678 4058346 3836927 3307127 2610941 1981866 1557697 1356969
13396A356969Q289J65229K11642J21660m4576j55266j31783n0729l4019j15577
$$ 1356969 1365258 1530487 1742129 1863789 1819213 1663947 1532164 1481435 1447416 1331839
13386A331839k88030n12139o10529m47145j02417K18009L19011J54168j42767
$$ 1331839 1043809 531670 -78859 -526004 -628421 -410412 -91401 62767 -80000
13377h0000l21692k05782J49076M69281N80769N85473M97417K82639O5663q6465
$$ -80000 -401692 -607474 -458398 10883 591652 1177125 1674542 1957181 2022844 1936379
13367A936379k79910n34776o56803n19519k59491q2736n829O6769J30399J84625
$$ 1936379 1656469 1121693 464890 -54629 -314120 -396856 -402685 -335916 -205517 -20892
13357b0892K78641M43157O51398P37198O37948M81824L81791L50176K97537J01127
$$ -20892 257749 700906 1352304 2089502 2727450 3209274 3591065 3941241 4238778 4339905
13347D339905l15411q38132j191293j228872j037435p40452l96287k8952L28858
$$ 4339905 4024494 3186362 1995069 766197 -271238 -1011690 -1407977 -1436929 -1108071
13338a108071N94712P34231P90308O88510L43507n0135k26270k14629j89466k00810
$$ -1108071 -513359 220872 1011180 1699690 2043197 1993062 1766792 1552163 1362697 1161887
13328A161887k84566m81616p14552q06299n90678q3823M73762Q53999R81827Q47774
$$ 1161887 877321 395705 -318847 -1125146 -1715824 -1799647 -1325885 -471886 509941 1357715
13318A357715N14756J23444j65203k76793l05045m07008n30243m38248j75032
$$ 1357715 1872471 1995915 1830712 1553919 1248874 841866 311623 -126625 -301657
13309c01657M0717J24547J06467P4807P1498O6920M2752k764m6454p2725j25995
$$ -301657 -260940 -136393 -29926 44881 116379 183299 226051 223287 176833 104108 -21887
13298b1887k73496n40277p99266p97218n19988j90174Q2291K76885L38330K38055
$$ -21887 -295383 -835660 -1634926 -2432144 -2952132 -3142306 -3060015 -2783130 -2444800 -2206745
13288b206745Q1676N8940K17405L89725M29296L54456K44025J84738J36246m502
$$ -2206745 -2125069 -2066129 -1848724 -1458999 -1029703 -675247 -431222 -246484 -110238 -114740
13278a14740j54841j49553M2796L37995N48419M07980q6069o13882q01884n23009
$$ -114740 -269581 -419134 -376338 -38343 510076 918056 831987 218105 -583779 -1106788
13268a106788r725L86569N37982M49036J06827l76008p59986q60357o12105j77319
$$ -1106788 -1116513 -729944 -191962 257074 363901 -12107 -772093 -1632450 -2244555 -2421874
13258b421874J80663L87774M62726L90897K63109K03670J40370l4884k08594k25061
$$ -2421874 -2241211 -1853437 -1390711 -999814 -736705 -533035 -392665 -427549 -636143 -861204
13248h61204j34105r816J54995L38061M54379M18867K53899R7003j0248j43723
$$ -861204 -995309 -1005125 -850130 -512069 -57690 361177 615076 712079 701831 558108
13238E58108k68966k88180j91855n9696K2756K3669K5330J61717M21672O49801
$$ 558108 289142 962 -190893 -250589 -227833 -204164 -178834 -17117 404555 1054356
13228A054356P25495O58170N25646L21556K7727j63322r2631J79237N03222O55549
$$ 1054356 1779851 2438021 2963667 3285223 3312950 3149628 3056997 3236234 3739456 4395005
13218D395005M44529j7245l80947m58234l91204m37726o62895r03106r38995o37726
$$ 4395005 4839534 4822289 4441342 3983108 3591904 3154178 2491283 1588177 649182 11456
13208A1456j55930J66869K31408J49091L7255l0618m9748n3692j5519J11731K13120
$$ 11456 -144474 22395 253803 402894 440149 409531 359783 306091 290572 402303 615423
13197F15423J84199O8890o7052j43020j71830k59139l29409k41254p8061O3133
$$ 615423 799622 868512 801460 658440 486610 227471 -101938 -343192 -421253 -358120
13187c58120K44108M15262L74759J05412j60287k61145k54470l04947n29078p66045
$$ -358120 -114012 301250 676009 781421 621134 359989 105519 -199428 -728506 -1494551
13177a494551p96918o08894k80737J02240M48856P03680P68732N87598L33462
$$ -1494551 -2291469 -2900363 -3181100 -3078860 -2630004 -1926324 -1157592 -569994 -236532
13168b36532J43582n1183l13896n86117o70500m86451k47469j14305p6128q4766
$$ -236532 -92950 -144133 -458029 -1044146 -1714646 -2201097 -2448566 -2562871 -2638999 -2723765
13158b723765l2732J83691N41930Q70156R68544Q55086O58573M61756L40388L02427
$$ -2723765 -2756497 -2572806 -2030876 -1160720 -192176 662910 1321483 1783239 2123627 2426054
13148B426054K24868l7996m22655o87844o80559m55747k20040r5485r4063j76374
$$ 2426054 2650922 2612926 2190271 1502427 821868 366121 146081 50596 -43467 -219841
13138b19841j81029l6367J77961L79931N17089O15425O26326M35216J22370j67899
$$ -219841 -400870 -437237 -259276 120655 637744 1253169 1879495 2314711 2437081 2269182
13128B269182m60230p57290q16826m50732R2222M46548N31029M39510K75120J42555
$$ 2269182 1808952 1051662 234836 -215896 -123674 322874 853903 1293413 1568533 1711088
13118A711088J01435J89321L54818L72846J85274M1227J56171M42080O36828N72576
$$ 1711088 1812523 2001844 2356662 2729508 2914782 2956009 3112180 3554260 4191088 4763664
13108D763664L15838M8596j58856l14156l84449l98379m69958o01703p11778o81697
$$ 4763664 5079502 5128098 4969242 4655086 4270637 3872258 3402300 2800597 2088819 1407122
13098A407122l79655M6871K33256J27166J24524M90940R07424R94512Q05007M94431
$$ 1407122 1027467 1074338 1307594 1434760 1559284 2050224 2957648 3952160 4757167 5251598
13088E251598J45285j54616m00159n83995o41173o58095q24226j105197j211041
$$ 5251598 5396883 5242267 4842108 4258113 3616940 2958845 2134619 1029422 -181619
13079a81619r58809m26095J75119O33622Q56239R04170Q42018P13081N79608M59177
$$ -181619 -1140428 -1566523 -1391404 -757782 98457 1002627 1844645 2557726 3137334 3596511
13069C596511L25298J43864j3226j23736k81867m32181m62612l02516N636K11868
$$ 3596511 3921809 4065673 4052447 3928711 3646844 3214663 2752051 2449535 2455171 2667039
13059B667039K07247J65683K11574K67423J81060k7542j18957K0764K59795M18582
$$ 2667039 2874286 3039969 3251543 3518966 3700026 3672484 3553527 3574291 3834086 4252668
13049D252668M31399L47818K28146J58450J45571O4574p0836q7317k7999l3345
$$ 4252668 4684067 5031885 5260031 5418481 5564052 5628626 5557790 5470473 5442474 5409129
13039E409129r2413k14926m48232p53114r99659j102912j051632q09876m39764
$$ 5409129 5316716 5101790 4653558 3900444 2900785 1797873 746241 -63635 -503399
13030e03399j40249J6754J70489L82540M69258K65766r0443k51659n4575K67033
$$ -503399 -643648 -626894 -456405 -73865 395393 661159 570716 319057 264482 531515
13020E31515L52764J80459k0880j02583o0654k2031j31821l37822m17729l03763
$$ 531515 884279 1064738 1043858 941275 880621 858590 726769 388947 -28782 -332545
13010c32545j37729l021J19402K38590L19643L53535L18249J95546J16841J42639
$$ -332545 -470274 -473295 -353893 -115303 204340 557875 876124 1071670 1188511 1331150
13000A331150J84548J68371P7035J14887M46438Q45078R40387O13157L0660n40567
$$ 1331150 1515698 1684069 1761104 1875991 2322429 3167507 4107894 4721051 4751711 4211144
12990D211144q18291o91883l74381j81940k70107n31767p38092p31633n53717
$$ 4211144 3392853 2700970 2326589 2144649 1874542 1342775 604683 -126950 -680667
12981f80667l07180j8259L13508O02565O52678M88822L14304J19552j74917n37871
$$ -680667 -987847 -1006106 -692598 -90033 562645 1051467 1365771 1485323 1310406 772535
12971G72535r12144j208503j269513r83747m62764o151J46072N5663Q6341M53297
$$ 772535 -139609 -1348112 -2617625 -3601372 -4064136 -4070287 -3924215 -3868552 -3782211 -3328914
12961c328914R34933J259074J370189J228592Q78955N12115K56696R4947n465
$$ -3328914 -2393981 -1134907 235282 1463874 2342829 2854944 3111640 3206587 3201122
12952C201122N0783K55781L61055J54881k39874n35706o50215o44387n32466l65978
$$ 3201122 3251905 3507686 3868741 4023622 3783748 3248042 2597827 1953440 1420974 1054996
12942A054996k10666j10949j26855k45460m62434p53769q96126p34351m08026
$$ 1054996 844330 733381 606526 361066 -101368 -855137 -1751263 -2485614 -2893640
12933b893640j25139O5369K10727K80838K30678J30264M6006k1806p67J78354
$$ -2893640 -3018779 -2953410 -2742683 -2461845 -2231167 -2100903 -2054897 -2076703 -2077470 -1899116
12923a899116M52105O88836P99388P39329M71814J20095r7212j81993k30083k02654
$$ -1899116 -1447011 -758175 41213 780542 1252356 1372451 1275239 1093246 863163 660509
12913F60509j68592k88794n01438n58610m17033k96964k79712k65148k14690j72423
$$ 660509 491917 203123 -298315 -856925 -1273958 -1570922 -1850634 -2115782 -2330472 -2502895
12903b502895j47563j17439l4532J04957K26178L01570K97502K22622J83659K07640
$$ -2502895 -2650458 -2767897 -2802429 -2697472 -2471294 -2169724 -1872222 -1649600 -1465941 -1258301
12893a258301K15343J66983J40508K57194N50136Q14259Q35641O73279M46226
$$ -1258301 -1042958 -875975 -735467 -478273 71863 886122 1721763 2395042 2841268
12884B841268J94332p1342l65595n98383o20805m65735l01215k19022j54354k1505
$$ 2841268 3035600 2964258 2598663 2000280 1379475 913740 612525 393503 239149 217644
12874B17644J01914J08925J08160J56417J83658K50801L62232M40535N58661P76758
$$ 217644 319558 428483 536643 693060 876718 1127519 1489751 1930286 2488947 3265705
12864C265705R34395Q40676M64566q3414n59616p53999o66826m69853k61716k1703
$$ 3265705 4200100 5040776 5505342 5421928 4862312 4108313 3441487 2971634 2709918 2688215
12854B688215J55136J25930m9821j98399k07888q6276R4415K62814L53157K85156
$$ 2688215 2843351 2969281 2919460 2721061 2513173 2426897 2521312 2784126 3137283 3422439
12844C422439N4141k56975o02847q62098q58805n97104k50734m0646k076M655
$$ 3422439 3476580 3219605 2616758 1754660 895855 298751 48017 7371 5295 9950
12834I950j1692q5982j18530j09438j66070k96710l27578m4190M33128P70917
$$ 9950 -1742 -87724 -206254 -315692 -481762 -778472 -1106050 -1150240 -717112 53805
12824E3805Q45552O76307L58268J03384K0041k11q7817k38131m16006o12433p82864
$$ 53805 899357 1575664 1933932 2037316 2057357 2057146 1969329 1731198 1315192 702759 -80105
12813h0105q23466o98566n29445m20938k84567m1447K32245N14094Q05941R79361
$$ -80105 -903571 -1602137 -2131582 -2552520 -2837087 -2878534 -2646289 -2132195 -1326254 -346893
12803c46893Q75072N14882Q9770j95359k71205k22089j12266K0797J27305J47835
$$ -346893 528179 1043061 1132831 937472 666267 444178 331912 352709 480014 627849
12793F27849K2610j76278l07239l28272k91106k19168j26844p8217j55266k80185
$$ 627849 650459 474181 166942 -161330 -452436 -671604 -798448 -876665 -1031931 -1312116
12783a312116j84355J78740N42850P42006Q17785P78149N25682P5527l72870o92780
$$ -1312116 -1496471 -1317731 -774881 -32875 784910 1563059 2088741 2164268 1791398 1098618
12773A098618q70698q60043o41417k60229J94761N85501P27380N52144K78766
$$ 1098618 227920 -632123 -1273540 -1533769 -1339008 -753507 -26127 526017 804783
12764H04783J11669J2196j79599m81057p11694p18112n77070n24837n68221m91651
$$ 804783 916452 928648 749049 267992 -443702 -1161814 -1738884 -2263721 -2831942 -3323593
12754c323593k06740J50300L55651L91387M41664O16464Q18111P97989M32202
$$ -3323593 -3530333 -3380033 -3024382 -2632995 -2191331 -1574867 -756756 41233 473435
12745D73435j11785n87713q23877p79266o06609l91503n5060L52427P19568R93863
$$ 473435 361650 -226063 -1049940 -1829206 -2435815 -2827318 -2882378 -2529951 -1810383 -816520
12735h16520J096747J013478Q04881N31257L60469L65307K94883L7965k56374
$$ -816520 280227 1293705 2098586 2629843 2990312 3355619 3650502 3688467 3432093
12726C432093n26560p55878q39016p18162m49264j37798Q0801J24593K8149j01539
$$ 3432093 2905533 2149655 1310639 592477 143213 5415 86216 210809 238958 137419
12716A37419j87093j78592r3956l7043k8019m7052o4021L1022K46604M02481L51142
$$ 137419 -49674 -228266 -322222 -359265 -387284 -434336 -498357 -467335 -220731 181750 532892
12705E32892J89478J06410R0563N2165k4318k44941o26371r50345j007715p80783
$$ 532892 722370 828780 919343 971508 947190 702249 75878 -874467 -1882182 -2662965
12695b662965m09912m3999K43108M08570M25892M08331M44284L92381J70757q779
$$ -2662965 -3072877 -3116876 -2873768 -2465198 -2039306 -1630975 -1186691 -794310 -623553 -632332
12685f32332J2306Q1927N0519m8922n9779M9645J05358n41j53525j28804J07980
$$ -632332 -620026 -538099 -487580 -536502 -596281 -546636 -441278 -441819 -595344 -724148 -616168
12674f16168L30656L37457J14354j93371l68607l00080r2961j2671j39263k67547
$$ -616168 -285512 51945 166299 -27072 -395679 -695759 -788720 -801391 -940654 -1208201
12664a208201k72542j97561n3262J48442L18500L74504K34058q1457l35415l15528
$$ -1208201 -1480743 -1678304 -1731566 -1583124 -1264624 -890120 -656062 -737519 -1072934 -1388462
12654a388462n6974K51078M58630M99656M09524K41719L4346j61923k82105k61025
$$ -1388462 -1445436 -1194358 -735728 -236072 173452 415171 449517 287594 5489 -255536
12644b55536j86588j71054j67454r6920K0416J58655K63177K84109K21763J10486
$$ -255536 -442124 -613178 -780632 -877552 -857136 -698481 -435304 -151195 70568 181054
12634A81054r986j88065l81744m22485k56567j34213k14141k57857j21597O259
$$ 181054 171068 -16997 -398741 -821226 -1077793 -1212006 -1426147 -1684004 -1805601 -1799342
12624a799342J0150j5522o2649j69755k15620j19850O2564K26776K86139K63827
$$ -1799342 -1789192 -1804714 -1867363 -2037118 -2252738 -2372588 -2310024 -2083248 -1797109 -1533282
12614a533282K42279K22687J51576J8370j63439l85451n72752n66335l20097K4825
$$ -1533282 -1291003 -1068316 -916740 -898370 -1061809 -1447260 -2020012 -2586347 -2906444 -2881619
12604b881619L67061O42403P79962P94790P56785O91387N60868K84517j18321
$$ -2881619 -2514558 -1872155 -1092193 -297403 459382 1150769 1711637 1996154 1877833
12595A877833m18187n04925n25322n91775o39445n13615j01267L91108N60438
$$ 1877833 1459646 954721 429399 -162376 -801821 -1315436 -1416703 -1025595 -465157
12586d65157M05752K83938L44383M79749O20304P24709O45586K44046l52545p99155
$$ -465157 -59405 224533 568916 1048665 1668969 2393678 3039264 3283310 2930765 2131610
12576B131610r76294j081762j237697j242641r28874m43299k2065K37811L56846
$$ 2131610 1155316 73554 -1164143 -2406784 -3335658 -3778957 -3801022 -3563211 -3206365
12567c206365M21197N04129N05252K98274l6802k53886j77994P4976K63539L28967
$$ -3206365 -2785168 -2281039 -1775787 -1477513 -1514315 -1768201 -1946195 -1871219 -1607680 -1278713
12557a278713L98187N10266N66364N08258L83575L31048L78743M29645M70104
$$ -1278713 -880526 -370260 196104 704362 1087937 1418985 1797728 2227373 2697477
12548B697477M92845M12726K14598l5714l04181n45729p54915j004490j251284
$$ 2697477 3190322 3603048 3817646 3781932 3477751 2932022 2177107 1172617 -78667
12539g8667j306947j153858r87312q44313n94176k11642J61868L19785K04317
$$ -78667 -1385614 -2539472 -3526784 -4371097 -4965273 -5176915 -5015047 -4695262 -4490945
12530d490945L1900J12597M29334O46701O01527M06129K19129J62457L19244O72652
$$ -4490945 -4459045 -4346448 -3917114 -3270413 -2668886 -2262757 -2043628 -1881171 -1561927 -889275
12520h89275R40400P52512J69849m44364q81757j089028j102727r87389p03276
$$ -889275 51125 803637 973486 529122 -352635 -1441663 -2544390 -3531779 -4235055
12511d235055j86573L78108P03408Q07141Q23613O82456K97471j15297k54954
$$ -4235055 -4421628 -4043520 -3340112 -2532971 -1709358 -1026902 -729431 -844728 -1099682
12502a099682j04951J60504L49557L08323O1500j94761k36113P5537N71277Q77943
$$ -1099682 -1204633 -1044129 -694572 -386249 -324749 -519510 -755623 -680086 -108809 769134
12492G69134Q10738M89779J38905r7140j95846k21598k17842j38279Q3936L94862
$$ 769134 1579872 2069651 2208556 2111416 1915570 1693972 1476130 1337851 1421787 1816649
12482A816649O23710O83117N64257K60603j31587m14937m82147m08773l69521
$$ 1816649 2440359 3123476 3687733 3948336 3816749 3401812 2919665 2510892 2141371
12473B141371n36334q30784r60187p48703l35040l6255N0219O6314J50149K65109
$$ 2141371 1605037 774253 -185934 -934637 -1269677 -1305932 -1255713 -1189399 -1039250 -774141
12463g74141K31553L8267j39262j81518j28979l7185P4970J05081n8921l70376
$$ -774141 -542588 -504321 -643583 -825101 -954080 -991265 -916295 -811214 -870135 -1240511
12453a240511o21160n83854j99781L25750O82731P09562N21947L02768Q3194j63038
$$ -1240511 -1861671 -2445525 -2645306 -2319556 -1636825 -927263 -405316 -102548 -19354 -182392
12443a82392l70862m52029l28897j400L02420L49213J46779r5085j62347o7688
$$ -182392 -553254 -1005283 -1334180 -1335580 -1033160 -683947 -537168 -632253 -794600 -862288
12433h62288j3525j13693k85753m06259m42209l60801j06949K95224O45083P09871
$$ -862288 -875813 -989506 -1275259 -1681518 -2123727 -2484528 -2591477 -2296253 -1651170 -941299
12423i41299M84873J88111n4225k84412m92562n99830n04932k70595o8107P3740
$$ -941299 -456426 -268315 -322540 -606952 -1099514 -1699344 -2204276 -2474871 -2542978 -2469238
12413b469238J58566J37600O488j65558l71866n67243n81861k93019K24241O57059
$$ -2469238 -2310672 -2173072 -2166584 -2332142 -2704008 -3271251 -3853112 -4146131 -3921890 -3264831
12403c264831P62203O56201M69919J39088k93032o16250p55882p26689n16030
$$ -3264831 -2502628 -1846427 -1376508 -1237420 -1530452 -2146702 -2902584 -3629273 -4145303
12394d145303k40669l2030R6500J17644P3728J61548M11238O10258O67819O32894
$$ -4145303 -4385972 -4418002 -4321502 -4203858 -4130130 -3968582 -3557344 -2947086 -2279267 -1646373
12384a646373N06998L61319K82148K22920J80594K80124M89188N71699L89596
$$ -1646373 -1139375 -778056 -495908 -272988 -92394 187730 676918 1248617 1638213
12375A638213M4753k86487m56827l59829j35193K4236J78298L20685L34928K47810
$$ 1638213 1682966 1396479 939652 579823 444630 468866 647164 967849 1302777 1550587
12365A550587R4058j19057l23917m80967n34626m62822m08626m79579n49607m51348
$$ 1550587 1644645 1525588 1201671 720704 186078 -276744 -685370 -1164949 -1714556 -2165904
12355b165904j98954R5398L60970O02291P67750P69488O47456M76730L29292L10589
$$ -2165904 -2364858 -2269460 -1908490 -1306199 -538449 231039 878495 1355225 1684517 1995106
$$ [...]
##END NTUPLES=NMR SPECTRUM
##END=
