##TITLE=31P ikalashn
LR-791-R2-O-C1
13.12.2024
##JCAMPDX= 6.0         $$ Bruker NMR JCAMP-DX V2.0
##DATA TYPE= NMR SPECTRUM
##DATA CLASS= NTUPLES
##ORIGIN= UXNMR, Bruker Analytische Messtechnik GmbH
##OWNER= root
$$ TOPSPIN		Version 1.3
$$ 2024-12-13 09:34:29.937 +0400  Irina@DPX200
$$ Compression mode = diff/dup
##.OBSERVE FREQUENCY= 81.01967998063
##.OBSERVE NUCLEUS= ^31P
##.ACQUISITION MODE= SIMULTANEOUS
##.ACQUISITION SCHEME= undefined
##.AVERAGES= 32
##.DIGITISER RES= 17
##SPECTROMETER/DATA SYSTEM= spect
##.PULSE SEQUENCE= zgpg
##.SOLVENT NAME= D2O
##.SHIFT REFERENCE= INTERNAL, D2O, 1, 298.5841
##AUDIT TRAIL= $$ (NUMBER, WHEN, WHO, WHERE, WHAT)
$$ ##TITLE= Audit trail, TOPSPIN		Version 1.3
$$ ##JCAMPDX= 5.01
$$ ##ORIGIN= Bruker BioSpin GmbH
$$ ##OWNER= Irina
$$ $$ F:/spectra/data/iren/nmr/P31dec/1/pdata/1/auditp.txt
$$ ##AUDIT TRAIL=  $$ (NUMBER, WHEN, WHO, WHERE, VERSION, WHAT)
(   1,<2024-12-13 09:33:18.187 +0400>,<Irina>,<DPX200>,<TOPSPIN 1.3>,
      <acquisition in progress>)
(   2,<2024-12-13 09:34:11.453 +0400>,<Irina>,<DPX200>,<TOPSPIN 1.3>,
      <Start of raw data processing
       efp BC_mod = 2 LB = 10 FT_mod = 6 PKNL = 1 PHC0 = 54.4441 PHC1 = 353.6201 SI = 32K 
       data hash MD5: 32K
       68 CC 77 EA C0 1E 8C 6E DE 2F 95 F7 E0 30 55 34>)
(   3,<2024-12-13 09:34:13.484 +0400>,<Irina>,<DPX200>,<TOPSPIN 1.3>,
      <apk 
       data hash MD5: 32K
       C4 93 68 9E E0 DF 88 B8 FB A0 8F A1 56 F0 A0 51>)
(   4,<2024-12-13 09:34:15.687 +0400>,<Irina>,<DPX200>,<TOPSPIN 1.3>,
      <abs n ABSG = 5 
       data hash MD5: 32K
       88 11 78 CF E0 F0 3B 26 DA 33 72 CA 65 F5 4F 26>)
$$ ##END=
$$ 
$$ $$ hash MD5
$$ $$ 69 ED 0B B7 95 D4 9E 51 FE 56 62 2F 35 88 2B 63
##$RELAX= 
##$RELAX= 
##$RELAX= 
##$RELAX= 
##$RELAX= 
##$RELAX= 
##$RELAX= 
##$RELAX= 
##$RELAX= 
##$RELAX= 
##$RELAX= 
$$ Bruker specific parameters
$$ --------------------------
##$DU= <F:/spectra>
##$EXPNO= 1
##$NAME= <P31dec>
##$PROCNO= 1
##$TYPE= <nmr>
##$USER= <iren>
##$AMP= (0..31)
100 100 100 100 100 100 100 100 100 100 100 100 100 100 100 100 100 100 
100 100 100 100 100 100 100 100 100 100 100 100 100 100 
##$ANAVPT= -1
##$AQSEQ= 0
##$AQ_mod= 1
##$AUNM= <au_zg>
##$AUTOPOS= <>
##$BF1= 81.014009
##$BF2= 200.13
##$BF3= 200.13
##$BF4= 200.13
##$BF5= 200.13
##$BF6= 200.13
##$BF7= 200.13
##$BF8= 200.13
##$BYTORDA= 1
##$CFDGTYP= 0
##$CFRGTYP= 5
##$CHEMSTR= <none>
##$CNST= (0..63)
1 1 145 1 1 1 1 1 1 1 1 1 1 1 1 1 1 1 1 1 1 1 1 1 1 1 1 1 1 1 1 1 1 1 
1 1 1 1 1 1 1 1 1 1 1 1 1 1 1 1 1 1 1 1 1 1 1 1 1 1 1 1 1 1 
##$CPDPRG= <waltz16>
##$CPDPRG1= <>
##$CPDPRG2= <waltz16>
##$CPDPRG3= <>
##$CPDPRG4= <mlev>
##$CPDPRG5= <mlev>
##$CPDPRG6= <mlev>
##$CPDPRG7= <mlev>
##$CPDPRG8= <mlev>
##$CPDPRGB= <>
##$CPDPRGT= <>
##$D= (0..63)
0 1 0 0 0 0 0 0 0 0.06 0 0.03 2e-005 3e-006 0 0 0.0002 0 0 0 0 0 0 0 0 
0 0 0 0 0 0 0 0 0 0 0 0 0 0 0 0 0 0 0 0 0 0 0 0 0 0 0 0 0 0 0 0 0 0 0 
0 0 0 0 
##$DATE= 1734068049
##$DBL= (0..7)
120 120 120 11 120 120 24 19 
##$DBP= (0..7)
$$ [...]
##$SW_h= 37037.037037037
##$TD= 32768
##$TD0= 1
##$TE= 300
##$TE2= 300
##$TE3= 300
##$TEG= 300
##$TL= (0..7)
0 120 53 12 22 120 120 120 
##$TP= (0..7)
150 150 150 150 150 150 150 150 
##$TP07= 0
##$TPNAME0= <>
##$TPNAME1= <>
##$TPNAME2= <>
##$TPNAME3= <>
##$TPNAME4= <>
##$TPNAME5= <>
##$TPNAME6= <>
##$TPNAME7= <>
##$TPOAL= (0..7)
0.5 0.5 0.5 0.5 0.5 0.5 0.5 0.5 
##$TPOFFS= (0..7)
0 0 0 0 0 0 0 0 
##$TUNHIN= 0
##$TUNHOUT= 0
##$TUNXOUT= 0
##$USERA1= <user>
##$USERA2= <user>
##$USERA3= <user>
##$USERA4= <user>
##$USERA5= <user>
##$V9= 5
##$VALIST= <valist>
##$VCLIST= <CCCCCCCCCCCCCCC>
##$VD= 0
##$VDLIST= <DDDDDDDDDDDDDDD>
##$VPLIST= <PPPPPPPPPPPPPPP>
##$VTLIST= <TTTTTTTTTTTTTTT>
##$WBST= 1024
##$WBSW= 4
##$XGAIN= (0..3)
0 0 0 0 
##$XL= 0
##$YL= 0
##$YMAX_a= 3049
##$YMIN_a= -2627
##$ZGOPTNS= <>
##$ZL1= 120
##$ZL2= 120
##$ZL3= 120
##$ZL4= 120
##$ABSF1= 298.5841
##$ABSF2= -158.5842
##$ABSG= 5
##$ABSL= 5
##$ALPHA= 0
##$AQORDER= 0
##$ASSFAC= 0
##$ASSFACI= 0
##$ASSFACX= 0
##$ASSWID= 0
##$AUNMP= <proc_1d>
##$AXLEFT= 0
##$AXRIGHT= 0
##$AXTYPE= 0
##$AXUNIT= <>
##$AZFE= 0.1
##$AZFW= 0.5
##$BCFW= 0
##$BC_mod= 2
##$BYTORDP= 0
##$COROFFS= 0
##$CY= 12.5935478210449
##$DATMOD= 1
##$DC= 0
##$DFILT= <>
##$DTYPP= 0
##$F1P= 47.1127640792319
##$F2P= -24.0371245302204
##$FCOR= 0.5
##$FTSIZE= 32768
##$FT_mod= 6
##$GAMMA= 0
##$GB= 0
##$INTBC= 1
##$INTSCL= 7.269226e-011
##$ISEN= 30
##$LB= 10
##$LEV0= 0
##$LPBIN= 0
##$MAXI= 12.09355
##$MC2= 0
##$MEAN= 0
##$ME_mod= 0
##$MI= 0.7550151
##$NCOEF= 0
##$NC_proc= -12
##$NLEV= 6
##$NOISF1= 298.5841
##$NOISF2= 270.0111
##$NSP= 0
##$NTH_PI= 0
##$NZP= 0
##$OFFSET= 298.5841
##$PC= 1.4
##$PHC0= 120.2485
##$PHC1= 309.3095
##$PH_mod= 1
##$PKNL= yes
##$PPARMOD= 0
##$PPDIAG= 0
##$PPIPTYP= 0
##$PPMPNUM= 100
##$PPRESOL= 1
##$PSCAL= 0
##$PSIGN= 0
##$REVERSE= no
##$SF= 81.014009
##$SI= 32768
##$SIGF1= 270.0111
##$SIGF2= -158.5842
##$SINO= 77.54984
##$SIOLD= 32768
##$SREGLST= <31P.CDCl3>
##$SSB= 0
##$STSI= 32768
##$STSR= 0
##$SW_p= 37037.037037037
##$SYMM= 0
##$S_DEV= 0
##$TDeff= 32768
##$TDoff= 0
##$TI= <>
##$TILT= no
##$TM1= 0
##$TM2= 0
##$TOPLEV= 0
##$USERP1= <user>
##$USERP2= <user>
##$USERP3= <user>
##$USERP4= <user>
##$USERP5= <user>
##$WDW= 1
##$XDIM= 32768
##$YMAX_p= 572594298
##$YMIN_p= -10919025
$$ End of Bruker specific parameters
$$ ---------------------------------
##NTUPLES= NMR SPECTRUM
##VAR_NAME=  FREQUENCY,     SPECTRUM/REAL,   SPECTRUM/IMAG
##SYMBOL=    X,             R,               I
##VAR_TYPE=  INDEPENDENT,   DEPENDENT,       DEPENDENT
##VAR_FORM=  AFFN,          ASDF,            ASDF
##VAR_DIM=   32768,         32768,           32768
##UNITS=     HZ,            ARBITRARY UNITS, ARBITRARY UNITS
##FACTOR=    1.13031516577767, 1,            1
##FIRST=     37037.037037037, -217280,       2582297
##LAST=      0,             -6525091,        -3096792
##MIN=       0,             -10919025,       0
##MAX=       37037.037037037, 572594298,     0
$$ Real data points
##PAGE= N=1
##DATA TABLE= (X++(R..R)), XYDATA
$$ [...]
17757c99693r34420q43912o60834m76736l22596j70288p335J08618J30618J16259
17747c460319J81714L67239O00832P61767P36573N16682K49675J11223J47893
17738B13279K93315M51008N35641N16399M02095J96490n7040k36251k46335j31161
17728A937440k2529r82m9164j45674k93607m55817n45974n00992l61591k41140
17718f80030k05560k34323k92656l71088m60459n50248o60239q16824r58919r57026
17708f187372p60116m48426j48851R0928L36316O32706Q95034R95721R10697O89636
17698b993727L26278j74555o52068q88422p94246m19976J13571O40137J008669
17689c834339J173573J191875J135786J027629Q64733O74754M85176L03662J57513
$$ plain form
17757 -399693 -1334113 -2178025 -2838859 -3315595 -3638191 -3808479 -3815814 -3707196 -3576578 -3460319
17747 -3460319 -3278605 -2911366 -2310534 -1548767 -812194 -295512 -45837 65386 213279
17738 213279 506594 957602 1493243 2009642 2411737 2608227 2551187 2314936 2068601 1937440
17728 1937440 1914911 1913929 1864765 1719091 1425484 969667 423693 -77299 -438890 -680030
17718 -680030 -885590 -1119913 -1412569 -1783657 -2244116 -2794364 -3454603 -4271427 -5230346 -6187372
17708 -6187372 -6947488 -7395914 -7544765 -7453837 -7117521 -6484815 -5589781 -4594060 -3683363 -2993727
17698 -2993727 -2667449 -2842004 -3494072 -4382494 -5176740 -5596716 -5483145 -4843008 -3834339
17689 -3834339 -2660766 -1468891 -333105 694524 1559257 2234011 2719187 3022849 3180362
17680C180362Q3166R4571J46718J56987P0881j35680m32838p07708q39561p69974
17670H46924n37247k66945o6847K7720M1890M8763Q6571J20986J41156J64330
17660F07301J47003L7157j34531l01143m11055m14471k66859k332K37438L30617
17650a70875K57278N5519j97914l89080m02059k03564Q9488K80706K55130N2562
17640c72809k10038m41331n65775n16386l25687j15647M2720J68868K68973K79247
17630a787865J67338K8955J0838J51616L41008M52247M59428M03911L20271K54902
17620H02649K79029M17827O12918P71132Q29559P65332N97503L82622J36082j51322
17610E443331m03538n02496m25532k67866j42807j02833j39887j88424j57037
$$ plain form
17680 3180362 3263528 3358099 3504817 3661804 3732685 3597005 3164167 2456459 1616898 846924
17670 846924 309677 42732 -24115 3605 45495 94258 180829 301815 442971 607301
17660 607301 754304 791461 656930 355787 -55268 -469739 -736598 -738930 -501492 -170875
17650 -170875 86403 141922 -55992 -445072 -847131 -1050695 -961207 -680501 -425371 -372809
17640 -372809 -582847 -1024178 -1589953 -2106339 -2432026 -2547673 -2504953 -2336085 -2067112 -1787865
17630 -1787865 -1620527 -1591572 -1580734 -1429118 -1088110 -635863 -176435 227476 547747 802649
17620 802649 1081678 1499505 2112423 2883555 3713114 4478446 5075949 5458571 5594653 5443331
17610 5443331 5039793 4537297 4111765 3843899 3701092 3598259 3458372 3269948 3112911
17601C112911l4507P9468R6186M4712K2691P0221J47361K05959K22184J72796
17591D139982K4258k04406m33883o10187p15180p27838o50046n34938m37406l34485
17581d84129j63387M9282K17894L10647L38312L37019L62838M43197N44932N77904
17571B534509M53671J90911n1171j20403m4926R595o8138k44842m28928n75826
17561A654452o93458p81215p94256o82643m24552l9462L58123N76812N15876K82614
17551b7709Q6198M8161J41368K58593K89614J92208L0759j01310j90398l04477
17541D23007n12850p93896j008755j009005p79539m37505j08218J40893K69376
17532c816492K62969J69784O4532k307J405R7950K94948N59015P96978Q83375
$$ plain form
17601 3112911 3078404 3157872 3254058 3298770 3321461 3391682 3539043 3745002 3967186 4139982
17591 4139982 4164240 3959834 3525951 2915764 2200584 1472746 822700 287762 -149644 -484129
17581 -484129 -647516 -598234 -380340 -69693 268619 605638 968476 1411673 1956605 2534509
17571 2534509 2988180 3179091 3127920 3007517 2962591 2972186 2904048 2659206 2230278 1654452
17561 1654452 960994 179779 -614477 -1297120 -1721672 -1761134 -1403011 -826199 -310323 -27709
17551 -27709 58489 106650 248018 506611 796225 988433 1019192 917882 727484 423007
17541 423007 -89843 -883739 -1892494 -2901499 -3681038 -4118543 -4226761 -4085868 -3816492
17532 -3816492 -3553523 -3383739 -3319207 -3321514 -3320109 -3222159 -2927211 -2368196 -1571218 -687843
17522f87843P47838M47865J11164j62281l26128l89745l94583l52757k46794j16522
17512a369786m2781k7750J557R3021K06588K70860K73050K44878K19972K07151
17502G6760J87099J32225q109k81242o24164q45878p78043m19950O1704M62875
17492b036723O83188P55097P61339P31675O38653M80199K92197J03489m9634j21501
17482B237979j28370j44498j90075k05997j73856j61297j83754j56927n5212K1120
17472H59113j7725j49990k80853l25520k73273j90061j54064j81756k24218k41530
17462a179877k27790j61402k9999J14340J85873J40686J3793r9069j23857p0433
17452a437735L5924K22089M83586P09722P67650O35992M14520J91381l8291k95037
$$ plain form
17522 -687843 59995 507860 619024 456743 130615 -259130 -653713 -1006470 -1253264 -1369786
17512 -1369786 -1412567 -1440317 -1438760 -1345739 -1139151 -868291 -595241 -350363 -130391 76760
17502 76760 263859 396084 387975 106733 -517431 -1363309 -2141352 -2561302 -2499598 -2036723
17492 -2036723 -1353535 -598438 162901 894576 1533229 2013428 2305625 2409114 2359480 2237979
17482 2237979 2109609 1965111 1775036 1569039 1395183 1233886 1050132 893205 837993 859113
17472 859113 841388 691398 410545 85025 -188248 -378309 -532373 -714129 -938347 -1179877
17462 -1179877 -1407667 -1569069 -1599068 -1484728 -1298855 -1158169 -1144376 -1243445 -1367302 -1437735
17452 -1437735 -1401811 -1179722 -696136 13586 781236 1417228 1831748 2023129 1984838 1689801
17442A689801n41964p25635q11370p67828o08488m30147l48137m11786n63713
17433c519267o72874o36821m49031j75991R7857L03504M14392M71798N30538N76109
17423c059786N47872M26734K63508J29166O6730O9620P4781K6871n5912j33861
17413a644277j97942k34733k13598j22416K4469J79156K67555K66012K20930J61433
17403a293411Q4901K7440L4030P8383R1173M1481m2234r6033o0738L4366O4258
17392a036384m1526k08865k91121j89959P4527M17925P55075R81357J003514Q28710
17382B293253N63500L16973J55753J00507J07649J07135P1296K0933l7728j31369
17372C567902k49407l36524l75053l92884m04179l88002l29376k58940k30934
$$ plain form
17442 1689801 1147837 422202 -389168 -1156996 -1765484 -2195631 -2543768 -2955554 -3519267
17433 -3519267 -4192141 -4828962 -5277993 -5453984 -5356127 -5052623 -4638231 -4166433 -3635895 -3059786
17423 -3059786 -2511914 -2085180 -1821672 -1692506 -1625776 -1556156 -1481375 -1454504 -1510416 -1644277
17413 -1644277 -1842219 -2076952 -2290550 -2412966 -2388497 -2209341 -1941786 -1675774 -1454844 -1293411
17403 -1293411 -1208510 -1181070 -1147040 -1068657 -977484 -936003 -978237 -1074270 -1135008 -1100642 -1036384
17392 -1036384 -1077910 -1286775 -1577896 -1767855 -1693328 -1275403 -520328 461029 1464543 2293253
17382 2293253 2856753 3173726 3329479 3429986 3537635 3644770 3716066 3736999 3699271 3567902
17372 3567902 3318495 2981971 2606918 2214034 1809855 1421853 1092477 833537 602603
17363F02603k76836l81378m70078m48510k84084j5790K67669M63516N32755N04708
17353D94575L99563K29825N1077n3654m7089K0206O4125J4065j49685l38527m27125
17342B57356l79000k28212K702K53316L93820L60072J96153m1566l06036n31930
17332b3325o52576o20870m30141j32762J75899L99007M80070M30215L38742L20408
17322B84667M05862N13991N35328M32462K67028J28934O8904P6244P8813J9329
17312B811562o9310j10130p0836q144l5946j90287l34730k95571q0610J40433
17302A756431K27296J59987M638j51572k46307k61970k22547j79992j81733k32921
17292F71310k90949l03934k66750k15690j68107q8744N0041K07344L14053L29848
$$ plain form
17363 602603 325767 -55611 -525689 -974199 -1258283 -1274073 -1006404 -542888 -10133 494575
17353 494575 894138 1123963 1175040 1121386 1074297 1094503 1158628 1172693 1023008 684481 257356
17342 257356 -121644 -349856 -347154 -93838 299982 660054 856207 814641 508605 -23325
17332 -23325 -675901 -1296771 -1726912 -1859674 -1683775 -1284768 -804698 -374483 -35741 284667
17322 284667 690529 1204520 1739848 2172310 2439338 2568272 2637176 2713420 2792233 2811562
17312 2811562 2742252 2632122 2561286 2553142 2517196 2326909 1992179 1696608 1615998 1756431
17302 1756431 1983727 2143714 2148352 1996780 1750473 1488503 1265956 1085964 904231 671310
17292 671310 380361 76427 -190323 -406013 -574120 -662864 -612823 -405479 -91426 238422
17282B38422K78693K17109J40541M173j72209l09844l44494k55547o4737J63012
17272a04881L47553M18887L45698J93821P2452J5847o244j4968j3792j3937k0850
17261A219586j3803K8138P6059M4910j12402l08836m10013l86282l03088k22410
17251c88141j58227r0436l235Q9281J43873J07886j1004j42618k37481l04569
17241i94671l68486m30711m75207m83545m75739m95713n10327m16771j86204J07353
17231d730021L98964O64423Q64610R36989Q34410N59055J69285j94035l53215
17222h49535k57450l9577J26436J73053J28040N1545q21j7239p812L4176J09895
17211e49289K12832L32860M13386L90163L19990L38087M64508N98766O58973O34223
$$ plain form
17282 238422 517115 734224 874765 878938 706729 396885 52391 -203156 -267893 -104881
17272 -104881 242672 661559 1007257 1201078 1273530 1289377 1283133 1268165 1254373 1240436 1219586
17261 1219586 1205783 1233921 1309980 1354890 1242488 933652 523639 137357 -165731 -388141
17251 -388141 -546368 -636804 -640039 -550758 -406885 -298999 -310003 -452621 -690102 -994671
17241 -994671 -1363157 -1793868 -2269075 -2752620 -3228359 -3724072 -4234399 -4651170 -4837374 -4730021
17231 -4730021 -4331057 -3666634 -2802024 -1865035 -1030625 -471570 -302285 -496320 -849535
17222 -849535 -1106985 -1146562 -1020126 -847073 -719033 -667488 -668309 -685548 -693360 -659184 -549289
17211 -549289 -336457 -3597 409789 799952 1119942 1458029 1922537 2521303 3180276 3814499
17201C814499N54690M49316L17865J48415l5013j60369j57558n4997P90j27130
17191D750508m31941p47646q90593q35965o95881n49155m07423k97613k47808
17182c53517k38704k14065j15812M4283J60595J49436K1020j85644m04805n20235
17172a657448m71704l18055j39301L6788K12502L84329N25241N92862N64446M51384
17162A81044K64214L903l02782n77670p25724p19638o11874m54288k66555m8128
17152c257498K25661N46996Q18335R30348Q63501O81324M60073K27637j9434k56527
17142A220416m36162n00628l95927j56240R0623K74886M53706O81184R00472R90332
17132C122662Q83235O16033K65865j08106m64506p68800r58041r61918p98169
$$ plain form
17201 3814499 4369189 4818505 5136370 5284785 5249772 5089403 4931845 4876848 4877638 4750508
17191 4750508 4318567 3570921 2680328 1844363 1148482 599327 191904 -105709 -353517
17182 -353517 -592221 -806286 -922098 -877815 -717220 -567784 -546764 -732408 -1137213 -1657448
17172 -1657448 -2129152 -2447207 -2586508 -2549720 -2337218 -1952889 -1427648 -834786 -270340 181044
17162 181044 445258 449161 146379 -431291 -1157015 -1876653 -2488527 -2942815 -3209370 -3257498
17152 -3257498 -3031837 -2484841 -1666506 -736158 127343 808667 1268740 1496377 1476943 1220416
17142 1220416 784254 283626 -112301 -268541 -177918 96968 550674 1231858 2132330 3122662
17132 3122662 4005897 4621930 4887795 4779689 4315183 3546383 2588342 1626424 828255
17123H28255n64993l29232r8514R1500J42301j1033k93953n32996o03374m84046
17113a856085k32654M6791K66453M15536N36443O37536O98468P31753P37221O74546
17103B656008N50297M20012L15227K63373L00845L87666M14223L28310J80432
17094E816393P4171R0738K41162M73965O75201P16822N65411L08317N6056j44539
17084H873697k95503m05308m81769n16221m70884l27040j37051l326Q370p2646
17074F172319j58284j78263j16582k0290K6036l3742k01020m25143o26828p44237
17064C693966p49162o60030n39199m29449l27310k32062j64490j33367j30108
17055C28789j52663k06957k71817l27847m13659n56517o93283p22314o05338l92071
$$ plain form
17123 828255 263262 -65970 -164484 -72984 69317 58284 -235669 -768665 -1372039 -1856085
17113 -1856085 -2088739 -2041948 -1775495 -1359959 -823516 -185980 512488 1244241 1981462 2656008
17103 2656008 3206305 3626317 3941544 4204917 4505762 4893428 5307651 5635961 5816393
17094 5816393 5890564 5981302 6222464 6696429 7371630 8088452 8653863 8962180 9018236 8873697
17084 8873697 8578194 8172886 7691117 7174896 6704012 6376972 6239921 6236595 6244965 6172319
17074 6172319 6014035 5835772 5719190 5698900 5724936 5691194 5490174 5065031 4438203 3693966
17064 3693966 2944804 2284774 1745575 1316126 988816 756754 592264 458897 328789
17055 328789 176126 -30831 -302648 -630495 -1044154 -1600671 -2293954 -3016268 -3621606 -4013677
17045d013677j66717O898J21419K43058M31712O31293P01442N50338K46974Q808
17035a238452J7736K35975M92265O86230P81950P48414O18866M65214K88496O9399
17025C166093j36399k98329m93838p78541j053414j133039r10453m41871P5825
17016b003966M30626N44183M98163M11964L33167K55283J88077J68218K36362
17007A062077L91276N40395N66364M28150J68670j04538k88703l95833m96278
16998A871580n99827p02766q14088q70556p81640n67434l29792j31135K6544J38507
16988b760607J91513K01967J90433J43143L6688j00321k13094k81710k94510k33621
16978c120119j10182J7268R3515J49606K59799M18890N47281N87769N37941M42407
$$ plain form
17045 -4013677 -4180394 -4173496 -4052077 -3809019 -3377307 -2746014 -2044572 -1494234 -1247260 -1238452
17035 -1238452 -1220716 -984741 -492476 193754 975704 1724118 2342984 2808198 3096694 3166093
17025 3166093 3029694 2731365 2237527 1458986 405572 -727467 -1637920 -2079791 -2003966
17016 -2003966 -1573340 -1029157 -530994 -119030 214137 469420 657497 825715 1062077
17007 1062077 1453353 1993748 2560112 2988262 3156932 3052394 2763691 2367858 1871580
16998 1871580 1271753 568987 -245101 -1115657 -1897297 -2464731 -2794523 -2925658 -2899114 -2760607
16988 -2760607 -2569094 -2367127 -2176694 -2033551 -1996863 -2097184 -2310278 -2591988 -2886498 -3120119
16978 -3120119 -3230301 -3213033 -3119518 -2969912 -2710113 -2291223 -1743942 -1156173 -618232 -175825
16968a75825L58990L24598L59936M65759O15138P36460P34232N48344J78795k97757
16958C848670p24499r52227r53033q03201o06472m53240l69323l03290k02580
16949a519195o1866R7598K50254L65983M06097L58247K61109J72456J27606J63191
16939F21480L25363N76110P70257P89857O54205M46673J93245j11650m33808o92064
16929C139668p93310p01114m87190k96532k57321l84284n54880o26771n48522
16920a510256l69162j86489n2165M3288R7339Q4923M077j13068k08424j96970
16910b406907k6656K62354N75640Q06299Q62367P27863M76959K08175k6827k18046
16900A241221l55464m08154l45851j82177M4655K98944N28631O79306P32186O82808
$$ plain form
16968 -175825 183165 507763 867699 1333458 1948596 2685056 3419288 3967632 4146427 3848670
16958 3848670 3124171 2171944 1218911 415710 -190762 -644002 -1013325 -1316615 -1519195
16949 -1519195 -1581061 -1483463 -1233209 -867226 -461129 -102882 158227 330683 458289 621480
16939 621480 946843 1522953 2293210 3083067 3737272 4183945 4377190 4265540 3831732 3139668
16929 3139668 2346358 1645244 1158054 861522 604201 219917 -334963 -961734 -1510256
16920 -1510256 -1879418 -2065907 -2118072 -2074784 -1977445 -1892522 -1888445 -2001513 -2209937 -2406907
16910 -2406907 -2433563 -2171209 -1595569 -789270 73097 800960 1277919 1486094 1459267 1241221
16900 1241221 885757 477603 131752 -50425 -5770 293174 821805 1501111 2233297 2916105
16890B916105N03678J78885k29097n70408p05783o24236l99031o3062L42413O84912
16880B034376Q46576Q39606P30291N16277J74434k32817n93627q46604r88866
16871B479646r98601q31555n28330k21222j0859J05344J75661K31833L01797M08542
16861A112256N56153P25781Q65822Q96921P56831M62098R8241k19196l82466l63765
16851D508676k48997j59012j22330p2060L8971J83366K96949L44370L68108M16499
16841E554540M19668K64585l8522l64037n85921o47924n76889m45263l16962j94533
16831C068742l1784J71113L36927L95388L40485K08022L9604j26307k50018l00811
16821C851361k80526k34633j86121r3308O7797K28009K88191K32049J14306m6083
$$ plain form
16890 2916105 3419783 3598668 3369571 2799163 2093380 1469144 1070113 1007051 1349464 2034376
16880 2034376 2880952 3720558 4450849 4967126 5141560 4908743 4315116 3468512 2479646
16871 2479646 1481045 649490 121160 -100062 -110921 -5577 170084 401917 703714 1112256
16861 1112256 1668409 2394190 3260012 4156933 4913764 5375862 5474103 5254907 4872441 4508676
16851 4508676 4259679 4100667 3978337 3906277 3945248 4128614 4425563 4769933 5138041 5554540
16841 5554540 5974208 6238793 6200271 5836234 5250313 4602389 4025500 3580237 3263275 3068742
16831 3068742 3036958 3208071 3544998 3940386 4280871 4488893 4528497 4402190 4152172 3851361
16821 3851361 3570835 3336202 3150081 3056773 3124570 3352579 3640770 3872819 3987125 3941042
16811C941042k59225m64855n65164n23180l75762j96733m4309O5415J44566K04939
16801A926734K59846L29176M02646M41341M28208L74256L10128K78195K68449
16792E018979K03037M4587j29497k13929j79857o1861P6561J69236J91517J86183
16782E304956K45791L95281N08720M64964L14256J85370J06204L7525J5592J02259
16772G680918K42857L00460K09961K8873j65557l57952n47114o77265o92814o21558
16762E400809n44912n36810o21739p32644p42134n96422l86929k48580k24351
16753G66288k48209k15400n2668J88211L22619K24034l4022k39446k13677L8979
16743E36709L59290N94196O91354O98319O80558O06820L81109L293l84647o26138
$$ plain form
16811 3941042 3681817 3216962 2651798 2128618 1752856 1556123 1511814 1577229 1721795 1926734
16801 1926734 2186580 2515756 2918402 3359743 3787951 4162207 4472335 4750530 5018979
16792 5018979 5222016 5266603 5137106 4923177 4743320 4681459 4758020 4927256 5118773 5304956
16782 5304956 5550747 5946028 6454748 6919712 7233968 7419338 7525542 7563067 7578659 7680918
16772 7680918 7923775 8224235 8434196 8463069 8297512 7939560 7392446 6715181 6022367 5400809
16762 5400809 4855897 4319087 3697348 2964704 2222570 1626148 1239219 990639 766288
16753 766288 518079 302679 250011 438222 760841 984875 950853 711407 497730 536709
16743 536709 895999 1490195 2181549 2879868 3560426 4167246 4548355 4551648 4167001 3540863
16733C540863o59451m99883k14085O7842K25211K45910J91551J29006J15845J64783
16723C307592K67174M27339N93168O37157M65557J07470l28713p19221r45984
16714C811539r50789p85200n64491l77819k51431j77982j48527j29411n9805O4355
16704D30439J57591J56526Q9369N144o7416j18577j64299k03313j91040r4897
16694d73J8076k488k35109n73912q16457q30358n92766j63572L15456O73387Q11475
16683a396741P22760M55883J20791j39782k40836j88621k2003K09407M25657N44153
16673D90668N27839L95675K09567L6493r6258j83233k20717k13478j47907k7276
16663G71373O0632J1580j67902l65373m82874n01183m67715m32739m02181l58297
$$ plain form
16733 3540863 2881412 2381529 2167444 2235286 2460497 2706407 2897958 3026964 3142809 3307592
16723 3307592 3574766 4002105 4595273 5232430 5697987 5805457 5476744 4757523 3811539
16714 3811539 2860750 2075550 1511059 1133240 881809 703827 555300 425889 366084 430439
16704 430439 588030 744556 833925 839069 771653 653076 488777 285464 94424 -473
16694 -473 17603 15115 -219994 -793906 -1610363 -2440721 -3033487 -3197059 -2881603 -2208216 -1396741
16683 -1396741 -673981 -218098 -97307 -237089 -477925 -666546 -688549 -479142 -53485 490668
16673 490668 1018507 1414182 1623749 1660242 1563984 1380751 1160034 946556 798649 771373
16663 771373 832005 843585 675683 310310 -172564 -673747 -1141462 -1574201 -1976382 -2334679
16653b334679k64127q0905J67231L85465M98751N21444N13002N25766N88541O75527
16643A196016P07517O30662M60079K30297m6497l29098n16517n50750n02419m89175
16633G90115n41223n85924n29894l18499J1636L12159M48714M30861L45103K33952
16623E97000J10136P3n7626l4374M8575J37442K18299K98849L51888L51713L23097
16612B345072K82289J98193O5023q9716k75279m98963o60336o21803l91049j23319
16602B30112M7370R4722N9966N127j8786m060N0789J90679M35255O95619Q02205
16591B588998O40226K83447o1589k43504k59833j91765j02920k6098J6431L483
16581B646876j08038l36501n94870p51367p54489o46080m87739l14813j37923
$$ plain form
16653 -2334679 -2598806 -2679711 -2512480 -2127015 -1628264 -1106820 -593818 -68052 520489 1196016
16643 1196016 1903533 2534195 2994274 3224571 3178074 2848976 2332459 1781709 1279290 790115
16633 790115 248892 -337032 -866926 -1185425 -1173789 -861630 -412916 17945 363048 597000
16623 597000 707136 707209 649583 615209 663784 801226 1019525 1318374 1670262 2021975 2345072
16612 2345072 2627361 2825554 2890577 2800861 2525582 2026619 1366283 744480 353431 230112
16602 230112 277482 372204 432170 437297 418511 414451 465240 655919 1091174 1786793 2588998
16591 2588998 3229224 3512671 3451082 3207578 2947745 2755980 2653060 2626962 2643393 2646876
16581 2646876 2538838 2202337 1607467 856100 101611 -544469 -1032208 -1347021 -1484944
16572a484944M3043K18504L86170N53256O79521O90298N65625L81476K60244K68612
16562B561805L35463L26228K18938J04699K5884o7927k11762l56612m29679m39295
16552B067742m47572m73234m93029m80558m19726l17286k18328j95217k70590
16543a247798l62565l49939j83220P6425L13110M37317M09920K63390J14969R0756
16533d37635K08765L70806M72725M70863L78466K42141J08713O651n4376r6943
16523A670176j56465k36870l27152m41796n66223o00770m45369j25475K06988
16514a022956M27415N23290N17461M35768L33118K64636K28090J91897J48736
16505B047455J19053J35430K02527K74005K85699K10690P1928o4948j32829j66667
$$ plain form
16572 -1484944 -1441901 -1223397 -837227 -283971 395550 1085848 1651473 2032949 2293193 2561805
16562 2561805 2897268 3223496 3442434 3547133 3573017 3505090 3293328 2936716 2507037 2067742
16552 2067742 1620170 1146936 653907 173349 -246377 -563663 -781991 -977208 -1247798
16543 -1247798 -1610363 -1960302 -2143522 -2067097 -1753987 -1316670 -906750 -643360 -528391 -437635
16533 -437635 -228870 141936 614661 1085524 1463990 1706131 1814844 1821495 1767119 1670176
16523 1670176 1513711 1276841 949689 507893 -58330 -659100 -1104469 -1229944 -1022956
16514 -1022956 -595541 -72251 445210 880978 1214096 1478732 1706822 1898719 2047455
16505 2047455 2166508 2301938 2504465 2778470 3064169 3274859 3346787 3281839 3149010 2982343
16495B982343k48240l56825m07565l65133k74801j93941j09733p596M1655j1149
16485A049015r7680j40439j35253q5900K8547J98993L81512N55269P14420Q30110
16475C298594Q63543P71531N32255J92597j29173l20757l41173k27312q3875P344
16465D563574P5437J81919K65492J62216j84245n98398q31654q25974p35550p24568
16455A348249q43661j027936j146717j098856q76500n58576k46884p999J33185
16446d325695J92993J83524J24458Q8204J20768J73946J59032L2193j75665l54361
16436c780603l56493j49812J20073L11627M27638N08130N29061M63647L35763
16427a590969J93529Q7436M8774N2246J7286j01669k20642k22638j13946k1195
$$ plain form
16495 2982343 2734103 2377278 1969713 1604580 1329779 1135838 1026105 1018509 1060164 1049015
16485 1049015 951335 810896 675643 589743 618290 817283 1198795 1754064 2468484 3298594
16475 3298594 4162137 4933668 5465923 5658520 5529347 5208590 4867417 4640105 4556230 4563574
16465 4563574 4639011 4820930 5086422 5248638 5064393 4465995 3634341 2808367 2072817 1348249
16455 1348249 504588 -523348 -1670065 -2768921 -3645421 -4203997 -4450881 -4458880 -4325695
16446 -4325695 -4132702 -3949178 -3824720 -3736516 -3615748 -3441802 -3282770 -3250577 -3426242 -3780603
16436 -3780603 -4137096 -4286908 -4166835 -3855208 -3427570 -2919440 -2390379 -1926732 -1590969
16427 -1590969 -1397440 -1310004 -1261230 -1208984 -1191698 -1293367 -1514009 -1736647 -1850593 -1871788
16417a871788p1942k67911m77680n51846m29079j81770J9264N1823n6891j94883
16407d032703k82126k78555j43295J12284L94386O12188P35646P64575P02371
16398a415229N63075L89057K56112K25973K69991L02319L02732K85433K21375
16389A400838J24473L1441r5193k71917m03344l64782j31549J63946L51577M22638
16379A228128N10990O78586P95831O71281K92598j44725m49677n89263o18353
16370B375396n40988l31554n2257J82152L06809K99586J97307J12176J22386J92813
16360B863826K48914K47426J71044n219k86162n57163o36985m67519j54383J42271
16350A566050L11879L36252K41459M4956k11653m41672n58828n11316l02395n833
$$ plain form
16417 -1871788 -1943730 -2211641 -2689321 -3241167 -3670246 -3852016 -3832752 -3780929 -3837820 -4032703
16407 -4032703 -4314829 -4593384 -4736679 -4624395 -4230009 -3617821 -2882175 -2117600 -1415229
16398 -1415229 -852154 -463097 -206985 18988 288979 591298 894030 1179463 1400838
16389 1400838 1525311 1556752 1461559 1189642 786298 421516 289967 453913 805490 1228128
16379 1228128 1739118 2417704 3213535 3884816 4177414 4032689 3583012 2993749 2375396
16370 2375396 1834408 1502854 1450597 1632749 1939558 2239144 2436451 2548627 2671013 2863826
16360 2863826 3112740 3360166 3531210 3525991 3239829 2682666 2045681 1578162 1423779 1566050
16350 1566050 1877929 2214181 2455640 2500596 2288943 1847271 1288443 777127 474732 468899
16340D68899K68559M11815L36655O7938k30152l85313l43700j73715K2559J72303
16330F15848K58225L17901L68844L90268L87542L87027L86366L36879J80432n1393
16320C577939k04303j63216J4174J75838K13394J23180j2072r9578r1476K450
16310C536330P4961k4614k82642m82495m79101l19970r1181J37118K74844K62471
16300B605721J04625j52035m00092n13274m69673l48436k04788m0450J30508K71228
16290I83334L39472K93213J44871k3709j41919j86142j70283j50703j95120l27929
16280E65085n10035o59740o93785n58716k71548O8457L63192O04450Q42137J075068
16270H24565J235757J272379J176046R71826P02257L78771K0555k87643m43198
$$ plain form
16340 468899 737458 1149273 1485928 1553866 1323714 938401 594701 420986 443545 615848
16330 615848 874073 1191974 1560818 1951086 2338628 2725655 3112021 3448900 3629332 3577939
16320 3577939 3373636 3210420 3224594 3400432 3613826 3737006 3724934 3625356 3533880 3536330
16310 3536330 3611291 3586677 3304035 2821540 2342439 2022469 1931288 2068406 2343250 2605721
16300 2605721 2710346 2558311 2158219 1644945 1175272 826836 622048 581598 712106 983334
16290 983334 1322806 1616019 1760890 1737181 1595262 1409120 1238837 1088134 893014 565085
16280 565085 55050 -604690 -1298475 -1857191 -2128739 -2060282 -1697090 -1092640 -250503 824565
16270 824565 2060322 3332701 4508747 5480573 6182830 6561601 6582156 6294513 5851315
16261E851315m09022k68360j76522k25305l86705n95243p98396r09387q11779
16252A270596m63916K2662M32468N97782N19221L17418J39534J06310K31759L98210
16242C572044M78473M50782L63849K54704J06093r9815k79985l37277l21941l55351
16232C831576m66933o21383p93247r13117q60052o03913k66537k243J05542M6464
16222e43843r7495j42394L7198L50725N94357O46554N31563L48254J49236r2757
16212A781398l85377o31775p16967o45707n11668l77570k73759k34936k44575
16203b240936k46020k36342k39229k17227j36655l7050O5847K22967M38514O11518
16193b014613O40586N45941M30452L45975K63746J55007N0853j3097o1886j41273
$$ plain form
16261 5851315 5442293 5173933 4997411 4772106 4385401 3790158 2991762 2082375 1270596
16252 1270596 806680 829342 1261810 1859592 2378813 2696231 2835765 2942075 3173834 3572044
16242 3572044 4050517 4501299 4865148 5119852 5225945 5126130 4846145 4508868 4186927 3831576
16232 3831576 3364643 2743260 1950013 1036896 176844 -427069 -693606 -695849 -590307 -543843
16222 -543843 -641338 -783732 -746534 -395809 198548 845102 1376665 1724919 1874155 1781398
16212 1781398 1396021 764246 47279 -598428 -1110096 -1487666 -1761425 -1996361 -2240936
16203 -2240936 -2486956 -2723298 -2962527 -3179754 -3316409 -3353459 -3287612 -3064645 -2626131 -2014613
16193 -2014613 -1374027 -828086 -397634 -51659 212087 367094 417947 404850 342964 201691
16183B01691k76139m62132o49514p55040p22459n47815k62603O8953L76888O08514
16173b419656P31464P71752P80889P74156P59865P33145O67560N65958M40527
16164C805660K48212l6863l22474m95975n76447o50728p27958p53908o97793n74613
16154g82887m33877l31874k88549k79574k67911k25140j31421P18J34489K72144
16144b333882M18506N21045N32894M59810L24118J67661O2297M6611R7027J82262
16134D78349K59149K70731K26298J83505J65794J80857K43004L55883M92193N70901
16124C426664N07095K80115n5378l84147n78061n87840m83535l55947k02233L8158
16114A604891L61185O51380P84394P48071O25470M86822L15471N8979k77194o03562
$$ plain form
16183 201691 -74448 -536580 -1186094 -1941134 -2663593 -3211408 -3474011 -3405058 -3028170 -2419656
16173 -2419656 -1688192 -916440 -135551 638605 1398470 2131615 2799175 3365133 3805660
16164 3805660 4053872 4017009 3694535 3198560 2622113 1971385 1243427 489519 -208274 -782887
16154 -782887 -1216764 -1548638 -1837187 -2116761 -2384672 -2609812 -2741233 -2740515 -2606026 -2333882
16144 -2333882 -1915376 -1394331 -861437 -401627 -77509 90152 152449 199060 296087 478349
16134 478349 737498 1008229 1234527 1418032 1583826 1764683 2007687 2363570 2855763 3426664
16124 3426664 3933759 4213874 4158496 3774349 3196288 2608448 2124913 1768966 1566733 1604891
16114 1604891 1966076 2617456 3401850 4149921 4775391 5262213 5577684 5636663 5359469 4755907
16104D755907p90057p62099n51467k57590Q165J55605J28878m5785k26165k74029
16094B141363j80366j7000J46484K63156L12808K97150K34810J39654J5525j41705
16084C211879l15450m01402l06838j11528J6022K830r2394j74264j92155j42146
16074A494554l4026J17218K69242L66409L79280L05686J53906o4038k88926m06527
16064B292778l70146k69149k36737l24489m51535n10465m90687m23418k98472
16055a082320j32237k4557n2335j81949l17624l88664l89265l35440k05228K6646
16045c082973L31599O57713R57160J147420J134489Q98546N22005J64669m5946
16036B684682j21515j55263j75102j12639O3504K55799L07296J54923j04674l16942
$$ plain form
16104 4755907 3965850 3203751 2652284 2394694 2402859 2558464 2687342 2641557 2415392 2141363
16094 2141363 1960997 1943997 2090481 2353637 2666445 2963595 3198405 3338059 3353584 3211879
16084 3211879 2896429 2495027 2188189 2076661 2092683 2095513 2003119 1828855 1636700 1494554
16074 1494554 1460528 1577746 1846988 2213397 2592677 2898363 3052269 2988231 2699305 2292778
16064 2292778 1922632 1653483 1416746 1092257 640722 130257 -360430 -783848 -1082320
16055 -1082320 -1214557 -1239114 -1291449 -1473398 -1791022 -2179686 -2568951 -2904391 -3109619 -3082973
16045 -3082973 -2751374 -2093661 -1136501 10919 1145408 2043954 2565959 2730628 2684682
16036 2684682 2563167 2407904 2232802 2120163 2183667 2439466 2746762 2901685 2797011 2480069
16026B480069m03528l60517k00539K0834K21690L70009M76557N41021N34673M31823
16016D112092K50463O2201o4133j15771j12547p2092r652M1948L9736k1881r5908
16005D014456j36765j30270p4334N637K7076q7223l10783n32540o55620o29946
15995A489688m38655j34598J77120M07799N20843N44281N41201N69054O70617
15986D347350Q53300J028564J038943P96079L53555j51925n75147q08544q32394
15977F049781p37039o59351o57157o69838o22147n10785l41320r9710J44138K56237
15967B152809J97297N1102j00956k25598k78295k33510j45755p7106k9767J0552
15957A320773N5082J36833K87577M51543M96383L63401J43400p856q212Q8481
$$ plain form
16026 2480069 2076541 1716024 1515485 1536319 1758009 2128018 2604575 3145596 3680269 4112092
16016 4112092 4362555 4424756 4360623 4244852 4132305 4060213 4050561 4092509 4132245 4110364 4014456
16005 4014456 3877691 3747421 3673087 3678724 3705800 3618577 3307794 2775254 2119634 1489688
15995 1489688 1051033 916435 1093555 1501354 2022197 2566478 3107679 3676733 4347350
15986 4347350 5200650 6229214 7268157 8064236 8417791 8265866 7690719 6882175 6049781
15977 6049781 5312742 4653391 3996234 3326396 2704249 2193464 1852144 1752434 1896572 2152809
15967 2152809 2350106 2401208 2300252 2074654 1796359 1562849 1417094 1339988 1310221 1320773
15957 1320773 1375855 1512688 1800265 2251808 2748191 3111592 3254992 3247136 3238924 3327405
15947C327405J68920J75701J35080Q6694L0325l0602o3929m3383J7908R4495J98054
15936D096668L29361M00648L15456J17317p2670k27169m07332o44942q67724r34114
15926B105499p50267l36065J88131O66933R58758R57152O53304J65119l30333
15917D278231o78412q20534q08446p28647o43977n49077l65794n8030K77096M93477
15907C95887N46187N07940M68391M60246M53168M00644L25252L28719M74574O92405
15897E053413Q48244Q88524Q38160O85851L87778j5143l89170o05553o11274m64486
15887F616344l12604k70057l09953l26758k80129k38332k95223m60737o38127
15878C484424o91030n55368l12742j08290K321N3850Q3144Q8990M2812n0307j37378
$$ plain form
15947 3327405 3496325 3672026 3807106 3893800 3924125 3893523 3829594 3786211 3804119 3898614 4096668
15936 4096668 4426029 4826677 5142133 5259450 5186780 4959611 4552279 3907337 3039613 2105499
15926 2105499 1355232 1019167 1207298 1874231 2832989 3790141 4443445 4608564 4278231
15917 4278231 3599819 2779285 1970839 1242192 598215 49138 -316656 -374686 -97590 395887
15907 395887 942074 1450014 1918405 2378651 2831819 3232463 3557715 3886434 4361008 5053413
15897 5053413 5901657 6790181 7628341 8314192 8701970 8686827 8297657 7692104 7080830 6616344
15887 6616344 6303740 6033683 5723730 5396972 5116843 4878511 4583288 4122551 3484424
15878 3484424 2793394 2238026 1925284 1816994 1819315 1873165 1956309 2045299 2088111 2037804 1900426
15867A900426j73724j52315q3988J3154J18380K10975K73904L21909L90076M93463
15857C312260N98012O11356M63117J80277j51292m43850o28253o64624n49072
15848B727931l05900L0664M21713P91285J028864J073398R72622Q24854O88265
15839H253696N75380M83769L76797K04364l3831k87757n12142p22975r55875j168853
15829F212573j247070j122790q61211o03823m34930l25732j99365l0297J15659
15820A503014J62425J38620J38446K04042L22996M64481N68124N89856N52660
15811D644664M77328L40418J33296p7517j88807j66491o3651L3879O0628P331
15801E201078q8478j50381o6590J90053M71796O29501O80959P30253Q12426Q41417
$$ plain form
15867 1900426 1726702 1574387 1490399 1503553 1621933 1832908 2106812 2428721 2818797 3312260
15857 3312260 3910272 4521628 4984745 5165022 5013730 4569880 3941627 3277003 2727931
15848 2727931 2422031 2452695 2874408 3665693 4694557 5767955 6740577 7565431 8253696
15839 8253696 8829076 9312845 9689642 9894006 9860175 9572418 9060276 8337301 7381426 6212573
15829 6212573 4965503 3842713 2981502 2377679 1942749 1617017 1417652 1387355 1503014
15820 1503014 1665439 1804059 1942505 2146547 2469543 2934024 3502148 4092004 4644664
15811 4644664 5121992 5462410 5595706 5518189 5329382 5162891 5099240 5133119 5193747 5201078
15801 5201078 5112600 4962219 4895629 5085682 5557478 6186979 6867938 7598191 8410617 9252034
15791I252034P04207M03558Q2198q3497k0908J74203L12592K75524R4935j33772
15781A1061074l45235n18354o43489o96498o60754n43573l96364l17006l62531
15772F577270m71396n15950m13874j72221J23261L44808L85961K21920p1501l88563
15762E619715o37194p04032n18228j58361K25056N59120Q40266J044948J131421
15753G402711J126709J102116J062830R48110P16304L99021P1058k06264l85150
15744A2237445m52136m54969m49893m39448l96196l39711k97184k45369j77715
15735H984824j09957l0584N9001J28182J64504J66595J16821J4026j06471k04375
15725I182566k73786l33997l84893m12660m28187m60568m82754m10247k37671
$$ plain form
15791 9252034 9956241 10359799 10441997 10358500 10337592 10511795 10824387 11099911 11194846 11061074
15781 11061074 10715839 10197485 9553996 8857498 8196744 7653171 7256807 6939801 6577270
15772 6577270 6105874 5589924 5176050 5003829 5127090 5471898 5857859 6079779 6008278 5619715
15762 5619715 4982521 4278489 3760261 3601900 3826956 4386076 5226342 6271290 7402711
15753 7402711 8529420 9631536 10694366 11642476 12358780 12757801 12828859 12622595 12237445
15744 12237445 11785309 11330340 10880447 10440999 10044803 9705092 9407908 9162539 8984824
15735 8984824 8874867 8844283 8903284 9031466 9195970 9362565 9479386 9493412 9386941 9182566
15725 9182566 8908780 8574783 8189890 7777230 7349043 6888475 6405721 5995474 5757803
15716E757803n1039Q1842J41927J69213K52736M38312O74876Q53707Q73520O95859
15706I888756L91391J10161p1808k17916m03831o15842p93749q92171q54277n95310
15696E945404j01668M49158P94227Q42180P36614O71441P01205P52000P59460
15687A1550021P18253O34358M87149K42360q0388l97329o35757p69514q00719
15678A0948434p40359o10408m77612m36924m91904n27828m60811l29132k22108
15669F651348j89272k14429k18885j21910O5185K41135L27636L36465L07841K35660
15659G420774R4800q8423k29871k72777k54971k40422k28459j79321o7869J17096
15649F070557L55731N57326O14405N04317K96050P9769p1305j01032K933J85637
$$ plain form
15716 5757803 5706764 5788606 5930533 6099746 6352482 6790794 7465670 8319377 9192897 9888756
15706 9888756 10280147 10390308 10318500 10100584 9696753 9080911 8287162 7394991 6540714 5945404
15696 5945404 5843736 6292894 7087121 7929301 8665915 9337356 10038561 10790561 11550021
15687 11550021 12268274 12902632 13389781 13632141 13551753 13154424 12518667 11749153 10948434
15678 10948434 10208075 9597667 9120055 8683131 8191227 7663399 7202588 6873456 6651348
15669 6651348 6462076 6247647 6028762 5906852 5972037 6213172 6540808 6877273 7185114 7420774
15659 7420774 7515574 7427151 7197280 6924503 6669532 6429110 6200651 6021330 5953461 6070557
15649 6070557 6426288 6983614 7598019 8102336 8398386 8478155 8406850 8305818 8308751 8494388
15639H494388L59379M77367N39652N50438N39941N61210O31845P32737Q48292
15630A3735249R74547J083046J110565J015678Q04030N04090J60313j82293m99521
15621A8705704p68435r34874r39691p68309m65843j40687Q9629J69923J18752
15612A5066169J3154n9615p4217r5515k07399l99936n79072o82171p11990o79782
15602A1589626n74087l76298r4403K05748M39369N76090O32734O14700N06007
15593A3519486L42959K22864J98962K48116L25806L90555M10492L49832J54345
15584A6163417j81734n54481q01361q17535o27851l54273j12621L9999P9189J7184
15574A2849933p4212j19079j26339j39547j40561j00799l1241N2706J21570J04879
$$ plain form
15639 8494388 8853767 9331134 9870786 10421224 10961165 11522375 12154220 12886957 13735249
15630 13735249 14709796 15792842 16903407 17919085 18723115 19227205 19387518 19205225 18705704
15621 18705704 17937269 17002395 16062704 15294395 14828552 14687865 14777494 14947417 15066169
15612 15066169 15079323 15019708 14945491 14849976 14642577 14242641 13663569 12981398 12269408 11589626
15602 11589626 11015539 10639241 10544838 10750586 11189955 11766045 12398779 13013479 13519486
15593 13519486 13862445 14085309 14284271 14532387 14858193 15248748 15659240 16009072 16163417
15584 16163417 15981683 15427202 14625841 13808306 13180455 12826182 12713561 12753560 12832749 12849933
15574 12849933 12775721 12656642 12530303 12390756 12250195 12149396 12118155 12170861 12292431 12397310
15564A2397310m9133k86062m64896n00839m48644m02478l79658l36247k56878
15555I272475k06069k59356l86788m97647n50567n32356m27788k64146r5935M1022
15545F092845J43705K51331L78460M66152M68869M15342L42963K54418J74661
15536H988746J67492K54715L65957L91315L09820K36126K67166L42173L48446
15527A1671956K82606K27008K32672K60366K29912J33970N3357N1793R8470J12129
15517A3354239R2608J38142K88530M47542M81783L30102N7101j84212k97358l29252
15507A4379225l57702l58381k61999p9174Q9165J47481P6505p7056k29480l07077
15497A3021507l03382k63676k19804j67630r0943J6596J27316J53905J1442k71493
$$ plain form
15564 12397310 12348177 12062115 11597219 11096380 10647736 10245258 9865600 9529353 9272475
15555 9272475 9066406 8807050 8420262 7922615 7372048 6839692 6411904 6147758 6051823 6092845
15545 6092845 6236550 6487881 6866341 7332493 7801362 8216704 8559667 8814085 8988746
15536 8988746 9156238 9410953 9776910 10168225 10478045 10714171 10981337 11323510 11671956
15527 11671956 11954562 12181570 12414242 12674608 12904520 13038490 13091847 13143640 13242110 13354239
15517 13354239 13446847 13584989 13873519 14321061 14802844 15132946 15190047 15005835 14708477 14379225
15507 14379225 14021523 13663142 13401143 13321969 13411134 13558615 13635120 13558064 13328584 13021507
15497 13021507 12718125 12454449 12234645 12067015 11976072 11992668 12119984 12273889 12285331 12013838
15487A2013838n58309p27185p49804o44544m20676j17353J82842M55530P37675
15478A0172014R97045J118034J019528P44314M43850K59555K24123K90833L97639
15469A5666935M88803N00110L59967O8120k43560l90695k98055p6210Q8781J16466
15459A6280662N9961J508j4127K2021O5394M4206m3537j27106j70937j85938j39386
15448A5792721l557J59048K82243L78166M62212M87494M14510K66095Q6293q0037
15438A8245188j87841k16387j69767n1274J15333K51475K94059K70667K52890
15429A8804343K86458L75308N01010O42872P55836P76867O79098M76037K09230
15420B3507059n3153k51461l63209l63941k21453J7387K25500L28366L84711M94244
$$ plain form
15487 12013838 11455529 10728344 9978540 9333996 8913320 8795967 8978809 9434339 10172014
15478 10172014 11169059 12287093 13306621 14050935 14494785 14754340 14978463 15269296 15666935
15469 15666935 16155738 16655848 17015815 17083935 16840375 16449680 16151625 16075415 16164196 16280662
15459 16280662 16340623 16342131 16328004 16350025 16415419 16459625 16416088 16288982 16118045 15932107 15792721
15448 15792721 15789164 15948212 16230455 16608621 17070833 17558327 17972837 18238932 18325225 18245188
15438 18245188 18057347 17840960 17671193 17619919 17735252 17986727 18280786 18551453 18804343
15429 18804343 19090801 19466109 19967119 20609991 21365827 22142694 22821792 23297829 23507059
15420 23507059 23453906 23202445 22839236 22475295 22253842 22271229 22496729 22825095 23209806 23704050
15410B3704050O58902Q08712Q77994Q17775O40691M35739K69107J39178L0835
15401B8382983m1995j3872J84664N16236Q65888J192659J527475J849399K066620
15392C6530057K090961J914417J621538J342812J203462J245680J402682J613614
15384D8965223J918379K386049L001632L672013M331146M995457N737311O637092
15376H1644302P760461R193392J1048998J3387534J6119287J8976075K1480206
15369A79610255K2848925K1939063J7484309R041968j844666j2002555j8754034
15362B18323265k1460093k1095490j9008607j6202599j3286207j0633279q442388
15355A08194602o731301n388927m269933l267829k326908j390194l91602O76151
$$ plain form
15410 23704050 24362952 25171664 26049658 26867433 27508124 27943863 28212970 28352148 28382983
15401 28382983 28340988 28327116 28511780 29028016 29893904 31086563 32614038 34463437 36530057
15392 36530057 38621018 40535435 42156973 43499785 44703247 45948927 47351609 48965223
15384 48965223 50883602 53269651 56271283 59943296 64274442 69269899 75007210 81644302
15376 81644302 89404763 98598155 109647153 123034687 139153974 158130049 179610255
15369 179610255 202459180 224398243 241882552 250924520 249079854 237077299 218323265
15362 218323265 196863172 175767682 156759075 140556476 127270269 116636990 108194602
15355 108194602 101463301 96074374 91804441 88536612 86209704 84819510 84427908 85104059
15347H5104059J727117K660014L502210M423019N556066O916314Q542884J0576319
15339A29008002J3141406J6254094J9838534K3707560K7372816K9779295K9230729
15332B88332436K3882552J3117192r90724j4218633k3037773k6619752k6185162
15325B34280136k3427188j9668188j5720114j1985687q582869n458913k518010
15318A46919167L30262L185867O127024R136546J2045531J4534655J6203965J6599275
15310B25082292J5180529J1552981O055559O5755m560716o498602n517642k288698
15302B39071458K103476O446780R411617R617445O138026p18074r106981j6452509
15294B46511238k0872247k2024346k0785124j8347219j5576603j2861830j0306381
$$ plain form
15347 85104059 86831176 89491190 92993400 97416419 102972485 109888799 118431683 129008002
15339 129008002 142149408 158403502 178242036 201949596 229322412 259101707 288332436
15332 288332436 312214988 325332180 324341456 310122823 287085050 260465298 234280136
15325 234280136 210852948 191184760 175464646 163478959 154896090 149437177 146919167
15318 146919167 147249429 150435296 156562320 165698866 177744397 192279052 208483017 225082292
15310 225082292 240262821 251815802 257871361 257937116 253376400 246877798 241360156 239071458
15302 239071458 241174934 247621714 257033331 266650776 272788802 272070728 262963747 246511238
15294 246511238 225638991 203614645 182829521 164482302 148905699 136043869 125737488
15287A25737488q039256o360166n564722n669669o332440p026210p335288p096605
15279G2313132o350563n285855m154684l135926k301547j661561j174529p46316
15271D7502151k61985L23684Q99644J232740J146493O63763l6510p38080j263812
15262D9468088j530219j548816j353896r56006l91128K54197Q58097J257359J263086
15253D7320762P45236k37473j401969k375350k893460k941748k703461k347698
15245C3164839j937649j516729j155519r06456p62721o56792n17027l19523j12199
15236B5280224J4141M1352M5986Q3107J16236J01140P9299J06104J56277J80856
15226B6204722J75471J42805O6417n4360k13030m17607o89239j037405j388511
$$ plain form
15287 125737488 117698232 111338066 105773344 100103675 93771235 86745025 79409737 72313132
15279 72313132 65962569 60676714 56522030 53386104 51084557 49422996 48248467 47502151
15271 47502151 47240166 47563850 48463494 49696234 50842727 51506490 51469980 50731900 49468088
15262 49468088 47937869 46389053 45035157 44079151 43688023 43942220 44800317 46057676 47320762
15253 47320762 48065998 47828525 46426556 44051206 41157746 38215998 35512537 33164839
15245 33164839 31227190 29710461 28554942 27648486 26885765 26228973 25711946 25392423 25280224
15236 25280224 25294365 25335717 25381703 25464810 25581046 25682186 25761485 25867589 26023866 26204722
15226 26204722 26380193 26522998 26589415 26535055 26322025 25904418 25215179 24177774 22789263
15217B2789263j601441j561529j235466o82388m4949M49173N84903L61202K7441
15208A9086209j59712j78204j75290k22583k40179j18260J77212N60967Q75757
15199A9605917J014220R66331Q15567O59766N06846L28075J45922M386q5104j26565
15189B3835361r0497P8707L67963O42741P68236P47111O41517M54700K00399k5712
15179B7620526j20909m2068J73404M09890N52600N87503N91394O17202O16554
15170C1006096N01520K78441P5166K3895J58364M20234P05894R07264R51464Q46136
15160C5874474O93003O13242O57976P86142R18851J017944J083518J110784J094446
15151D3850380J026904R08742P76606O72998O16509O00156N90536N48437M70094
$$ plain form
15217 22789263 21187822 19626293 18390827 17708439 17663490 18112663 18697566 19058768 19086209
15208 19086209 18926497 18748293 18573003 18350420 18110241 17991981 18169193 18730160 19605917
15199 19605917 20620137 21586468 22402035 23061801 23568647 23896722 24042644 24047030 23961926 23835361
15189 23835361 23744864 23823571 24191534 24834275 25602511 26349622 26991139 27445839 27646238 27620526
15179 27620526 27499617 27457549 27630953 28040843 28593443 29180946 29772340 30389542 31006096
15170 31006096 31507616 31786057 31861223 31885118 32043482 32463716 33169610 34076874 35028338 35874474
15160 35874474 36567477 37180719 37838695 38624837 39543688 40561632 41645150 42755934 43850380
15151 43850380 44877284 45786026 46562632 47235630 47852139 48452295 49042831 49591268 50061362
15142E0061362M26334N21668P63121J011914J087472R26438O06274K29616j06278
15133E5527921k96218k76686o1160K76958O42537R56282J191596J380669J571073
15124F0912972J767383J875379J780550J506333J214437J053759J041011J100634
15116G2252458J173681J260761J370780J461477J466483J379504J281530J264795
15108H2911469J357372J548732J830761K172411K526424K859426L120707L250756
15100A01578058L220593L049864K826280K650169K574588K651599K938195L424867
15092A24914213M026806M634535N147958N490904N631509N616982N570133N600592
15084A66633632N733868N934967O154698O350604O487124O570788O677755O855935
$$ plain form
15142 50061362 50487696 51009364 51772485 52784399 53871871 54798309 55404583 55634199 55527921
15133 55527921 55231703 54955017 54893857 55170815 55813352 56769634 57961230 59341899 60912972
15124 60912972 62680355 64555734 66336284 67842617 69057054 70110813 71151824 72252458
15116 72252458 73426139 74686900 76057680 77519157 78985640 80365144 81646674 82911469
15108 82911469 84268841 85817573 87648334 89820745 92347169 95206595 98327302 101578058
15100 101578058 104798651 107848515 110674795 113324964 115899552 118551151 121489346 124914213
15092 124914213 128941019 133575554 138723512 144214416 149845925 155462907 161033040 166633632
15084 166633632 172367500 178302467 184457165 190807769 197294893 203865681 210543436 217399371
15076B17399371P075364P339062P680889Q060376Q403588Q685904Q918565R084448
15068B82647567R127213R014761Q784035Q534525Q359385Q265191Q207828Q187163
15060C51127668Q251887Q426287Q659432Q867882R021335R149954R273847R368513
15052D22146805R410829R421555R446851R506916R557223R538796R450043R311324
15044D97790342R081135Q685860Q144796P571763P056065O594142O108456N529826
15036E56562385M843035M040258L146103K228531J319990M53996k55919o79967
15028E71658412q10629q06865q80645j143712j565007k057539k575840l121882
15020E58696293l702174m297487m885854n481431o114133o777515p427424q065922
$$ plain form
15076 217399371 224474735 231813797 239494686 247555062 255958650 264644554 273563119 282647567
15068 282647567 291774780 300789541 309573576 318108101 326467486 334732677 342940505 351127668
15060 351127668 359379555 367805842 376465274 385333156 394354491 403504445 412778292 422146805
15052 422146805 431557634 440979189 450426040 459932956 469490179 479028975 488479018 497790342
15044 497790342 506871477 515557337 523702133 531273896 538329961 544924103 551032559 556562385
15036 556562385 561405420 565445678 568591781 570820312 572140302 572594298 572338379 571658412
15028 571658412 570847783 570040918 569160273 568016561 566451554 564394015 561818175 558696293
15020 558696293 554994119 550696632 545810778 540329347 534215214 527437699 520010275 511944353
15012E11944353q754188r511731j0284991j0998422j1602518j2069350j2350441
15005D36372712j2409566j2311849j2202552j2196103j2295978j2399874j2395792
14998C50160998j2230543j1920009j1528899j1110931j0697691j0328757j0022287
14991B72321881r730338r361587q859409q256177p626893p024626o501289o118785
14983B08842777n909779n830434n777430n682043n553751n421645n252391m973479
14975A64441825m569575m090128l581996l081680k646060k335876k173754k116974
14967A39845782k091472k062318k037486k010920j952076j847625j717085j614011
14959A24512789j592731j666273j815224j994912k134874k157668k042842j881681
$$ plain form
15012 511944353 503190165 493678434 483393443 472395021 460792503 448723153 436372712
15005 436372712 423963146 411651297 399448745 387252642 374956664 362556790 350160998
14998 350160998 337930455 326010446 314481547 303370616 292672925 282344168 272321881
14991 272321881 262591543 253229956 244370547 236114370 228487477 221462851 214961562 208842777
14983 208842777 202932998 197102564 191325134 185643091 180089340 174667695 169415304 164441825
14975 164441825 159872250 155782122 152200126 149118446 146472386 144136510 141962756 139845782
14967 139845782 137754310 135691992 133654506 131643586 129691510 127843885 126126800 124512789
14959 124512789 122920058 121253785 119438561 117443649 115308775 113151107 111108265 109226584
14951A09226584j801105j846330j956423k017445j975753j887272j810760j728019
14943I4203477j582739j351207j074680q37762p12493p16638q02780q87490r17746
14934H5319942q87570p98034o51750m59747k32409j334J65026K29476K30740K14344
14924H3128684J77622P6822j03647k88529l58924k59263n4161J44669K85185L82060
14914H3130518M48183M61322M05342L07951K44750K85133M23931N78383O34543
14905H6920056N42335L56670J63748J5396p6624j27388j75307k47503l10425k96398
14895H6764560j78237N385J69582K02809M0487k55943n40342o96790p13681o55350
14885H4142480n89268n64668o06265o73178o93598o71761o81640p46601q15162
$$ plain form
14951 109226584 107425479 105579149 103622726 101605281 99629528 97742256 95931496 94203477
14943 94203477 92620738 91269531 90194851 89357089 88644596 87927958 87125178 86237688 85319942
14934 85319942 84432372 83634338 82982588 82522841 82290432 82289098 82454124 82683600 82914340 83128684
14924 83128684 83306306 83383128 83279481 82990952 82632028 82372765 82318604 82463273 82748458 83130518
14914 83130518 83578701 84040023 84445365 84753316 84998066 85283199 85707130 86285513 86920056
14905 86920056 87462391 87819061 87982809 87998205 87921581 87794193 87618886 87371383 87060958 86764560
14895 86764560 86586323 86591708 86761290 86964099 87004586 86748643 86208301 85511511 84797830 84142480
14885 84142480 83553212 82988544 82382279 81709101 81015503 80343742 79662102 78915501 78100339
14876G8100339q30766p65670o60979o05348o18256o26223n46395l75461k10768
14867G2860473j50612k08918l46241n38239q06590j167122j536954j764977j781294
14858F4559526j635303j404699j161691r72710q43907p12543n44119l75357k42496
14849E6666701j60307j66966k67739l80127m56140n36263o45007p53128q19295
14840E2481729q16630p39257n90511l77129j47141j0764o6180k82413n13873o60236
14830D8277595p33251p82350q48295r58951j130431j361125j586236j722086j773021
14821C7381849j782447j724077j522790j160176p23087l31879n0853J01206J43416
14812C0331162J37864J11856K3754j46560l39854m91570n80336n93049n12468
$$ plain form
14876 78100339 77269573 76503903 75842924 75237576 74619320 73993097 73446702 73071241 72860473
14867 72860473 72709861 72500943 72154702 71616463 70809873 69642751 68105797 66340820 64559526
14858 64559526 62924223 61519524 60357833 59385123 58541216 57828673 57284554 56909197 56666701
14849 56666701 56506394 56339428 56071689 55691562 55235422 54699159 54054152 53301024 52481729
14840 52481729 51665099 50925842 50335331 49958202 49811061 49800297 49734117 49451704 48937831 48277595
14830 48277595 47544344 46761994 45913699 44954748 43824317 42463192 40876956 39154870 37381849
14821 37381849 35599402 33875325 32352535 31192359 30469272 30137393 30086540 30187746 30331162
14812 30331162 30469026 30580882 30604636 30458076 30118222 29626652 29046316 28453267 27940799
14803B7940799l63141k14766j04146l4431l6347j47806l38960n05621n69439n58323
14793B5067819n65684o64736q50513j024013j062797r24306o66804l91083j98104
14784A8719779j64551k92162m85515o09681n96000m89198l69912k86320k77198
14775A5149242l38744l82843l20215j73296o0821m8483p7516q3801q3053j00820
14765A3479650j25800j36978j22435q3605l1791M3508J72100L35830M45247M09330
14755A4385056K23283l4318k78755m64521n61701n38059m17759l09378k81654
14746A1722194k79299k21209j02523L6566J64538K58245L28083L99306M49687
14737A2755588M16013K53722j8358l01668m84440n45807n23130m30191k69525
$$ plain form
14803 27940799 27577658 27362892 27258746 27224315 27187968 27040162 26701202 26195581 25626142 25067819
14793 25067819 24502135 23837399 22986886 21962873 20900076 19975770 19308966 18917883 18719779
14784 18719779 18555228 18263066 17777551 17167870 16571870 16082672 15712760 15426440 15149242
14775 15149242 14810498 14427655 14107440 13934144 13873323 13824840 13747324 13663523 13580470 13479650
14765 13479650 13353850 13216872 13094437 13010832 12979041 13022549 13194649 13530479 13975726 14385056
14755 14385056 14608339 14574021 14295266 13830745 13269044 12730985 12313226 12003848 11722194
14746 11722194 11442895 11221686 11119163 11155729 11320267 11578512 11906595 12305901 12755588
14737 12755588 13171601 13425323 13406965 13105297 12620857 12075050 11551920 11121729 10852204
14728A0852204o9560J05695J71060P2028j72549m89670q01376j071441j267414
14719G328977j302354j145872r04629o91432n17047l41073j37148Q9073K74145
14710B652640L35101K97473K77880L07568L31823L39958L54815L84323M20335
14701E701916M28390L76604K68098J22577m3145k08049l34928l81323l31430k11064
14691E387646p2815K1481J5227r7100k40386l39957l71608l14177j53430O2043
14681C896924K28994K62483J62652Q993r5462o2128J22234L69012N78142P18132
14671F189976P89777P92542P45605O78135N94108M66699K63261k4301l44668n68910
14661I582224n94084m60007k97730k17672k33976k65937k46056j87931j65422
$$ plain form
14728 10852204 10782644 10888339 11059399 11131427 10958878 10469208 9667832 8596391 7328977
14719 7328977 6026623 4880751 3976122 3284690 2767643 2426570 2289422 2378495 2652640
14710 2652640 2987741 3285214 3563094 3870662 4202485 4542443 4897258 5281581 5701916
14701 5701916 6130306 6506910 6775008 6897585 6854440 6646391 6311463 5930140 5598710 5387646
14691 5387646 5314831 5336312 5351539 5254439 5014053 4674096 4302488 3988311 3834881 3896924
14681 3896924 4125918 4388401 4551053 4560046 4464584 4402456 4524690 4893702 5471844 6189976
14671 6189976 6979753 7772295 8517900 9196035 9790143 10256842 10520103 10495802 10151134 9582224
14661 9582224 8988140 8528133 8230403 8012731 7778755 7512818 7266762 7078831 6913409
14652F913409k46167l94246m81971m34947k94987j41864j3041J12300K60713M03163
14642E682362M70799M38254L37433J96166K3539j53606k81888l37622l61408m16401
14632E597628n16433o20682o76205o46263n24004l35619j49060n8878j20255k93884
14622A656345m78970n68007m85638k46759L5904K51707L92752N25667O74432P96067
14612B553500Q35590P60558N78305L48038J61341N4209P426L2160J42013K76371
14602E749511L27703K45948O4614j84293m83690p46160q51874p90113o26748l82641
14592B322257o0703K92356O01027P89038P96011O40970M60858L80209L79827L87830
14582F989680L95845M10961M09953L67488K94935K04003N8778j56541l69454m75804
$$ plain form
14652 6913409 6667242 6272996 5791025 5356078 5061091 4919227 4906186 5018486 5279199 5682362
14642 5682362 6153161 6591415 6928848 7125014 7148553 6994947 6713059 6375437 6014029 5597628
14632 5597628 5081195 4460513 3784308 3138045 2614041 2278422 2129362 2070484 1950229 1656345
14622 1656345 1177375 609368 123730 -123029 -87125 164582 557334 1083001 1757433 2553500
14612 2553500 3389090 4149648 4727953 5075991 5237332 5291541 5298967 5331127 5473140 5749511
14602 5749511 6077214 6323162 6387776 6203483 5719793 4973633 4121759 3331646 2704898 2322257
14592 2322257 2261554 2553910 3154937 3943975 4739986 5380956 5841814 6222023 6601850 6989680
14582 6989680 7385525 7796486 8206439 8573927 8868862 9072865 9131643 8975102 8605648 8129844
14572H129844m44061l35704k41590k07904k20301k53595l18386m34470n58799
14563E115034n60034l34657K5104L17703M53452M69727M03827K43988J6674j80502
14553E970316k99728l91533m85452n21026m61688l79589l64229m19859m67925
14544B179287m55412m13576l67934k97092k01331j26077j05010j56589k86579
14535b30313m31083n00536m65602l36380j20179J42347L45429L76084K28196M4050
14525i47987k0992L4026J10471J77904K72120L58667L46554K32518J00941j427
14515F62795q8833j55493j47567k1088J77347L04203K42986K9666j95293l13158
14505D95565k86897j70606m4319O3364J42767J56169P3389p9896k19383k57277
$$ plain form
14572 8129844 7685783 7350079 7108489 6900585 6680284 6426689 6108303 5673833 5115034
14563 5115034 4555000 4220343 4245447 4563150 5016602 5486329 5890156 6134144 6150818 5970316
14553 5970316 5670588 5279055 4793603 4272577 3810889 3431300 3067071 2647212 2179287
14544 2179287 1723875 1310299 942365 645273 443942 317865 212855 56266 -230313
14535 -230313 -661396 -1161932 -1627534 -1963914 -2084093 -1941746 -1596317 -1220233 -992037 -947987
14525 -947987 -968979 -934953 -824482 -646578 -374458 -15791 330763 563281 664222 662795
14515 662795 573962 418469 270902 249814 427161 731364 974350 1004016 808723 495565
14505 495565 208668 38062 -6257 57107 199874 356043 429432 349536 130153 -127124
14495a27124j67410r47J50720K15334J71572N3335q1259k03887l06602l63552
14485f59820l76691l86980l85758l34793k39857j30823l3147O6697K15083L94866
14475a871223N09025M80237L15198R8460p0722j49862j74744j95130j98199j56392
14465a413352j09640j33929k36638l45229l86394l15348j32690Q3517K14165K04757
14455b570781J06067O224l7166k0300M2987J57026L01570M07584M20388L45191
14445h41210K19952J04035P6899J53467K32349K00943O6496q4770k15502l17726
14435d05067l41764k56702j05365N9031K00090K44178J27291q9519k65093l07847
14425a140767k15551k2148K46631N28420P13462P47397O75627N59051L90511J27499
$$ plain form
14495 -127124 -294534 -295481 -144761 70573 242145 295480 214221 10334 -296268 -659820
14485 -659820 -1036511 -1423491 -1809249 -2144042 -2383899 -2514722 -2547869 -2481172 -2266089 -1871223
14475 -1871223 -1362198 -881961 -566763 -468303 -539025 -688887 -863631 -1058761 -1256960 -1413352
14465 -1413352 -1522992 -1656921 -1893559 -2238788 -2625182 -2940530 -3073220 -2989703 -2775538 -2570781
14455 -2570781 -2464714 -2458490 -2495656 -2515956 -2472969 -2315943 -2014373 -1606789 -1186401 -841210
14445 -841210 -621258 -517223 -440324 -286857 -54508 146435 212931 128161 -87341 -405067
14435 -405067 -746831 -1003533 -1108898 -1049867 -849777 -605599 -478308 -567827 -832920 -1140767
14425 -1140767 -1356318 -1378466 -1131835 -603415 110047 857444 1533071 2092122 2482633 2610132
14415B610132k14501n40917p46798q11788p78129o81433n56138m28978k99307
14406b447857j43131N1970K41393L54520L92659M35143N51534P19108Q23326P87947
14396A766612O56634N14859L91263K67654J48831N9060J4175m103m9418j31756
14386C633811k10634k82325l85220n23180o52743p30426p45258p26401o98701
14377a321077o21344m26725j26002J99340M95667P50124R17188R17604P53847
14368A538622N24771K86736J4590l13081o62315r46619j058813r47744o80873
14359b244726l82067j11418J16162K66380L23135L23829L14469K97812K62428
14350h33996K05495J32206P7231N2538K702r1695j54194j13771L4094K50768M57793
$$ plain form
14415 2610132 2395631 1854714 1107916 296128 -482001 -1163434 -1719572 -2148550 -2447857
14406 -2447857 -2590988 -2539018 -2297625 -1943105 -1550446 -1115303 -563769 155339 978665 1766612
14396 1766612 2423246 2938105 3329368 3597022 3745853 3804913 3819088 3814985 3765567 3633811
14386 3633811 3423177 3140852 2755632 2232452 1579709 849283 104025 -622376 -1321077
14377 -1321077 -1942421 -2369146 -2495148 -2295808 -1800141 -1050017 -132829 784775 1538622
14368 1538622 2063393 2350129 2364719 2051638 1389323 442704 -616109 -1563853 -2244726
14359 -2244726 -2626793 -2738211 -2622049 -2355669 -2032534 -1708705 -1394236 -1096424 -833996
14350 -833996 -628501 -496295 -419064 -366526 -363824 -455519 -609713 -723484 -689390 -438622 19171
14339A9171N84064O35611O47717O13448N14003L67873K01896K1362j66478l50399
14329C088268n21689o37401o36605n24122l64422k02510p6050m8910j18559j69301
14319b11301r5463R6446L22669M93339N43493M44966K27200j6895j83050k16396
14309A405008j21164L5926J31818Q8630m1597j49028j71589j00534O9116L29441
14299A476027O09701P94801Q16385P02407N34647L69156K03881M1567o7692j07091
14289E373789j39311k20646l38888m47586n26648o01847o89751p67643p87383
14280H54086o80880m38187j83634p4278j36897k30398j91851l1405R1375O7553
14270i54516n2344j25520o8407P5203K21450L42920M29722M26411L11641J86988
$$ plain form
14339 19171 603235 1238846 1886563 2500011 3014014 3381887 3583783 3605145 3438667 3088268
14329 3088268 2566579 1929178 1292573 768451 404029 201519 125469 76559 -42000 -211301
14319 -211301 -306764 -210318 112351 605690 1149183 1594149 1821349 1804454 1621404 1405008
14309 1405008 1283844 1319770 1451588 1540218 1498621 1349593 1178004 1077470 1146586 1476027
14299 1476027 2085728 2880529 3696914 4399321 4933968 5303124 5507005 5548572 5480880 5373789
14289 5373789 5234478 5013832 4674944 4227358 3700710 3098863 2409112 1641469 854086
14280 854086 173206 -264981 -448615 -522893 -659790 -890188 -1082039 -1113444 -1022069 -954516
14270 -954516 -1006860 -1132380 -1200787 -1125584 -904134 -561214 -131492 294919 606560 793548
14260G93548J87147L56622O34184Q74188R43434Q33640O39663M46224K68418Q9920
14250F066988j07510l18194m91571n82591n93917n62038n39298n77319o89051
14241A605499q11710q41357p38844n60718m04598l24703k82709j90903N837K45440
14231b298766M02829M33288L59097J94581k6862k25479l17798k83057j89403j02348
14221b053918j6119P9425J57959J71746R5629l2789j61998k71665l60723m20703
14211b813156m11439k84798l9738K40439M43695N34199N39857M80415L66594K36316
14201g07616J41588O9626l7106j56802k09770j92748j74762j99884k47995k67596
14191a983065k30549j51826m7822Q1700K13448L10915L69675M05204M24716M27120
$$ plain form
14260 793548 980695 1337317 1971501 2845689 3789123 4622763 5262426 5708650 5977068 6066988
14250 6066988 5959478 5641284 5149713 4567122 3973205 3411167 2871869 2294550 1605499
14241 1605499 793789 -47568 -786412 -1347130 -1751728 -2076431 -2359140 -2550043 -2544206 -2298766
14231 -2298766 -1895937 -1462649 -1103552 -908971 -935833 -1161312 -1479110 -1762167 -1951570 -2053918
14221 -2053918 -2070037 -1990612 -1832653 -1660907 -1565278 -1598067 -1760065 -2031730 -2392453 -2813156
14211 -2813156 -3224595 -3509393 -3549131 -3308692 -2864997 -2330798 -1790941 -1310526 -943932 -707616
14201 -707616 -566028 -496402 -533508 -690310 -900080 -1092828 -1267590 -1467474 -1715469 -1983065
14191 -1983065 -2213614 -2365440 -2413262 -2331562 -2118114 -1807199 -1437524 -1032320 -607604 -180484
14181a80484M05942L65928L13943K39200J31363M339r3654r7092J1402J64028
14171A264915K61603K60541K02913J45785R4832M2763j2250p9121j24307r7964
14161A959710j7891N4511Q1744P2055N3132K8444k215j4254m888r387n1257j28123
14149B021581k36779l65586m68494m72942l41718j33481K5272N8341J0038m0199
14139E6033p7763j21266j76132k42370k97869k89957k15538j72990k58933m20416
14129b217201m67489l16727j31931r4024j69691k08088j54597p6333k2901L5409
14119c823573J18377J84582J85490J38940J31439K00307K79261L05814K95881
14110a983482K94630L22423L77401M38392M79792M94556M70065L74332K03768
$$ plain form
14181 -180484 225458 591386 905329 1144529 1275892 1280231 1186577 1089485 1100887 1264915
14171 1264915 1526518 1787059 1989972 2135757 2230589 2273352 2261102 2181981 2057674 1959710
14161 1959710 1941819 1996330 2078074 2150129 2203261 2231705 2229490 2215236 2210348 2200961 2149704 2021581
14149 2021581 1784802 1419216 950722 477780 136062 2581 27853 86194 96232 56033
14139 56033 -21730 -142996 -319128 -561498 -859367 -1149324 -1364862 -1537852 -1796785 -2217201
14129 -2217201 -2684690 -3001417 -3133348 -3227372 -3397063 -3605151 -3759748 -3836081 -3858982 -3823573
14119 -3823573 -3705196 -3520614 -3335124 -3196184 -3064745 -2864438 -2585177 -2279363 -1983482
14110 -1983482 -1688852 -1366429 -989028 -550636 -70844 423712 893777 1268109 1471877
14101A471877j814k03591l78198n00357n60584n87515n94829n43689m16083k52497
14091b567280p7412J26009L41316M82274M75837L63344K47953J75657J51153J87250
14081i3899K59032K88784K38005J51093P8955K5303k6323q3017j59872k96105
14071C81956n10166p48362r02979q84614p02444m61409k49123p0668R5275K42720
14061c809814L46063L90962L95668L89858L84561L63177L19858K77223K32048
14052g10396J41581k5906k68241n60208q47329j030596j032567q74813o25271
14043e833746l08613P9123M83249P75238Q82044Q62996Q19492P88483P27901N89595
14033a34238L97549K22349J18417J02933J35986J75758K42543L25223L39243K43268
$$ plain form
14101 1471877 1470063 1266472 888274 387917 -172667 -760182 -1355011 -1898700 -2314783 -2567280
14091 -2567280 -2644692 -2518683 -2177367 -1695093 -1219256 -855912 -607959 -432302 -281149 -93899
14081 -93899 165133 453917 691922 843015 921970 947273 920950 837933 678061 381956
14071 381956 -128210 -876572 -1779551 -2664165 -3366609 -3828018 -4077141 -4147809 -4052534 -3809814
14061 -3809814 -3463751 -3072789 -2677121 -2287263 -1902702 -1539525 -1219667 -942444 -710396
14052 -710396 -568815 -594721 -862962 -1423170 -2270499 -3301095 -4333662 -5208475 -5833746
14043 -5833746 -6142359 -6063236 -5579987 -4804749 -3922705 -3059709 -2240217 -1451734 -723833 -134238
14033 -134238 263311 485660 604077 707010 842996 1018754 1261297 1586520 1925763 2169031
14023B169031Q8672m5554j35700k18609l09134l77233m11947m49733n19827n84052
14013g94086n48143l39301J991L28967M97181M42134J95260j19801l45120l93281
14003a074199l00053j68583o9495p450O3854K16480M68796P27791Q61532P74219
13993A492892M33058p0091n29414p70350p54489n46941k48865K8193J70746R2373
13983g02888k13581o05078q54530q40207o16522l08250k468K40491L69751M01947
13973c131335M15769M68348N46359N85345N11184K96230J8818j99975l15639l49382
13963a154278l16792k13600l4888J65741K69737K09555M1389j06627j48413r8868
13953a387044l4256J938K9039L7219k9580j61163k55640k20898o0049J38759K84511
$$ plain form
14023 2169031 2257703 2212149 2076449 1857840 1548706 1171473 759526 309793 -210034 -794086
14013 -794086 -1342229 -1681530 -1679539 -1350572 -853391 -411257 -215997 -335798 -680918 -1074199
14003 -1074199 -1374252 -1542835 -1612330 -1619780 -1555926 -1339446 -870650 -142859 718673 1492892
13993 1492892 1925950 1855859 1326445 556095 -198394 -745335 -994200 -966007 -795261 -702888
13983 -702888 -916469 -1521547 -2376077 -3216284 -3832806 -4141056 -4143524 -3903033 -3533282 -3131335
13973 -3131335 -2715566 -2247218 -1700859 -1115514 -604330 -308100 -289282 -489257 -804896 -1154278
13963 -1154278 -1471070 -1684670 -1719558 -1553817 -1284080 -1074525 -1033136 -1139763 -1288176 -1387044
13953 -1387044 -1421300 -1419362 -1390323 -1353104 -1382684 -1543847 -1799487 -2020385 -2080434 -1941675 -1657164
13942a657164L41288L25427K83566K44143J95269J12372l2023k34301m28340n39971
13932a389734n77755o08468o40640o19057n12378l46473j79189n6008M3551J94861
13922d691290M23947O42161P33948O96165O34791O25092O40404O17582N27522
13913H50322L83942K17649N5307p8328j65080j95604j93257k35209l59545m86289
13903b06092n31827n04785m20944k55616k3305J86735K95465K97606K31919J33376
13893g97468L3653n0162j29395j95845k22797k22808k43540l15177m11390m66328
13883c021257m47916l80781k73532q8357J84891M85497P13276P83564O99930N57023
13873g87662M40539L66907L05240K27006J42515Q2120O9252J07124J40241O8388
$$ plain form
13942 -1657164 -1315876 -990449 -706883 -462740 -267471 -155099 -187122 -421423 -849763 -1389734
13932 -1389734 -1967489 -2575957 -3216597 -3835654 -4348032 -4694505 -4873694 -4929702 -4886151 -4691290
13922 -4691290 -4267343 -3625182 -2891234 -2195069 -1560278 -935186 -294782 322800 850322
13913 850322 1234264 1451913 1507220 1428892 1263812 1068208 874951 639742 280197 -206092
13903 -206092 -737919 -1242704 -1663648 -1919264 -1942569 -1755834 -1460369 -1162763 -930844 -797468
13893 -797468 -763815 -813977 -943372 -1139217 -1362014 -1584822 -1828362 -2143539 -2554929 -3021257
13883 -3021257 -3469173 -3849954 -4123486 -4211843 -4026952 -3541455 -2828179 -2044615 -1344685 -787662
13873 -787662 -347123 19784 325024 552030 694545 776665 845917 953041 1093282 1161670
13863A161670j25307l34401m48605m43218l50838j92598K4322K68649M71171N69767
13853F00612N54267M50020K97751J51781M1146l3863m9501K1399J73962L75206
13843B582780N36505N41989L84184K11747J50644J74894K04168J98895J55608
13834E141414J05961J08112J73604K15999J15939j42451m60345p53140r70842
13825C534251j050945r74478p93314n74193l82064k78710k82827l57140m38317
13816a597737m65316m04338k58493o1659J23764K22906K05069J15517K7257r620
13806b102650K7832J27729K41992L25826L67133L66561L01564J57220k2396j62744
13796c71933k06292j36062J1011J62224K62436L06172L09484K75871K10146J29998
$$ plain form
13863 1161670 1036363 701962 253357 -189861 -540699 -733297 -708975 -440326 30845 600612
13853 600612 1154879 1604899 1902650 2054431 2095577 2061714 2012213 2033612 2207574 2582780
13843 2582780 3119285 3661274 4045458 4257205 4407849 4582743 4786911 4985806 5141414
13834 5141414 5247375 5355487 5529091 5745090 5861029 5718578 5258233 4505093 3534251
13825 3534251 2483306 1508828 715514 141321 -240743 -519453 -802280 -1159420 -1597737
13816 -1597737 -2063053 -2467391 -2725884 -2787543 -2663779 -2440873 -2235804 -2120287 -2093030 -2102650
13806 -2102650 -2074818 -1947089 -1705097 -1379271 -1012138 -645577 -344013 -186793 -209189 -371933
13796 -371933 -578225 -714287 -703276 -541052 -278616 27556 337040 612911 823057 953055
13786I53055L0992j07518k73246l99524m12671l14702j76550o1914k819R088K9511
13775g26298R1066J38099J05164J8431n7796j21957k04895l09163m30953n53135
13765b051437o12368n69253m70644l69885k55937j17216m062L8089L3671M9194
13755d329848J21951K46840L99610M97003M45628K99652K36885L64087O24201
13746a093991Q25899P71420M61856J13955p0330j01073j52524l38810o00371p78346
13736i62315p30568m37942l5434L02386M78241N03443M53524L64016K10794k1958
13726A24187l22944o28138q09084p79884n85393l29555p4542J38996K37180J69213
13716b859964J0247o6929L9324K57038M24667M58678M09033L48586K80779J93586
$$ plain form
13786 953055 984047 876529 603283 203759 -208912 -523614 -700164 -762078 -764897 -755809 -726298
13775 -726298 -635232 -497133 -391969 -373538 -431334 -553291 -758186 -1067349 -1498302 -2051437
13765 -2051437 -2663805 -3233058 -3703702 -4073587 -4329524 -4446740 -4450802 -4412713 -4379042 -4329848
13755 -4329848 -4207897 -3961057 -3561447 -3064444 -2618816 -2319164 -2082279 -1718192 -1093991
13746 -1093991 -268092 503328 965184 1079139 1008809 907736 755212 416402 -183969 -962315
13736 -962315 -1692883 -2130825 -2166259 -1863873 -1385632 -882189 -428665 -64649 146145 124187
13726 124187 -198757 -826895 -1635979 -2415863 -3001256 -3330811 -3405353 -3266357 -3029177 -2859964
13716 -2859964 -2849717 -2916646 -2877322 -2620284 -2195617 -1736939 -1327906 -979320 -698541 -504955
13706e04955J12027N2750j4055j24811k40439k63371j58890o981O9905K452j76614
13695a252982l55584m33058l69437j59354J64107M80950O47100O22162M68067
13686a88029K38747l0562k42091k94818j99378m6483J09236K86257N15312P74516
13676I22707R74059J019353R09998P24579N17305K93919N4885j88687m35199p03746
13666D089173j004271j276202j395767j297303j048346p78192n59764l95284k66227
13657c932183j53143p6165j06069k50399l87412l97889k85048j15466O9127K51722
13647e382925M51845O90594Q90517R48041Q50030O24288K76381j37066m57722
13638a246017n50094m21479j88212L3876J93370K89050L09868K13943J1724j60082
$$ plain form
13706 -504955 -392928 -340178 -354233 -479044 -719483 -982854 -1141744 -1148725 -1078820 -1076368 -1252982
13695 -1252982 -1608566 -2041624 -2411061 -2570415 -2406308 -1925358 -1278258 -656096 -188029
13686 -188029 50718 20156 -221935 -516753 -716131 -762614 -653378 -367121 148191 922707
13676 922707 1896766 2916119 3826117 4550696 5068001 5361920 5416805 5228118 4792919 4089173
13666 4089173 3084902 1808700 412933 -884370 -1932716 -2710908 -3270672 -3665956 -3932183
13657 -3932183 -4085326 -4161491 -4267560 -4517959 -4905371 -5303260 -5588308 -5703774 -5634647 -5382925
13647 -5382925 -4931080 -4240486 -3349969 -2401928 -1551898 -927610 -651229 -788295 -1246017
13638 -1246017 -1796111 -2217590 -2405802 -2371926 -2178556 -1889506 -1579638 -1365695 -1353971 -1514053
13628a514053j55676J9008K45374M20550N12405N35694M93420L92569K91456K61199
13618A501946L05489L68027M13171M39205M37020L72449K12301k9791k73597m15686
13608C330534m14041l13537k00677j37431j25725j23928q6769l777R5717J54531
13598B174897J21842J4077j10757k22118l18893l84853l79045k93599j76889p2179
13588C52483K6552J32256K19956K45504J85496N3312j27787l38609n24598n86617
13578c62052m52966j73026J15199L10620L88549L52458K23666P2142j3811l994
13568D56785N0535N5790m7597k07934k90024k02529J0770K23789L48628L81881
13558G80094L68812L44373L17860K70344J57083k4324j86332k19935j16571M981
$$ plain form
13628 -1514053 -1669729 -1650721 -1405347 -984797 -472392 63302 556722 949291 1240747 1501946
13618 1501946 1807435 2175462 2588633 3027838 3464858 3837307 4049608 4019817 3746220 3330534
13608 3330534 2916493 2602956 2402279 2264848 2139123 2015195 1928426 1924649 2020366 2174897
13598 2174897 2296739 2310816 2200059 1977941 1659048 1274195 895150 601551 424662 352483
13588 352483 379035 511291 731247 976751 1162247 1215559 1087772 749163 224565 -362052
13578 -362052 -815018 -988044 -872845 -562225 -173676 178782 402448 474590 460779 456785
13568 456785 507320 563110 515513 307579 17555 -184974 -174204 49585 398213 780094
13558 780094 1148906 1493279 1811139 2081483 2238566 2214242 2027910 1807975 1691404 1696385
13548A696385l10k05210n56119q97485j117419j212667j199823j072492q61954
13539e427094o52603n12102m04504k05572J50285N90200R82447J245016J341231
13530b892696J214581Q41812L43720p9870l18278m22590n08638n98621n96220
13521c016800m20038j19355J75755L67413M21072L66101K88992K63211L08459
13512a365190M00727M61028M23996L26963K36270J37022j6871k04047l55339m25175
13502c80616m07291l29884k39806j80076j92561k77440l63591l91448l73024l41847
13492c477584l00199k33328j35888j1121J42899L14504M77194O24953P61332Q51274
13482i85964Q36598P10514N23423L17059R1951j49518l47458m03934k90079r0337
$$ plain form
13548 1696385 1696075 1490865 934746 37261 -1080158 -2292825 -3492648 -4565140 -5427094
13539 -5427094 -6079697 -6591799 -6996303 -7201875 -7051590 -6461390 -5478943 -4233927 -2892696
13530 -2892696 -1678115 -836303 -492583 -572453 -890731 -1313321 -1821959 -2420580 -3016800
13521 -3016800 -3436838 -3556193 -3380438 -3013025 -2591953 -2225852 -1936860 -1673649 -1365190
13512 -1365190 -964463 -503435 -79439 247524 483794 620816 603945 399898 44559 -380616
13502 -380616 -787907 -1117791 -1357597 -1537673 -1730234 -2007674 -2371265 -2762713 -3135737 -3477584
13492 -3477584 -3777783 -4011111 -4146999 -4158120 -4015221 -3700717 -3223523 -2598570 -1837238 -985964
13482 -985964 -149366 561148 1084571 1401630 1493581 1344063 996605 592671 302592 212255
13472B12255O1166O8102m1305j24530p4060Q1586K61055M28862N77825O81312
13462B132268O92768N82364L69086J23085p6746j85524k01002j45497m5655L8170
13452C283317L0555n0568j14134j13927n5853L1280Q8368N6090m8755j38282j58947
13441B809144j23372m9303N2200J41979J91582K24907K60032K81627K97829L46169
13431D432794M46383N69594O49322O48787O02217N44507M42116K53536J9184j94334
13421H414106l62259m68292m99755m65232l86301k92225j97448j00947r924P2899
13411E704622J45737K12540K78062K89276J79378j8264k07599l36679m02371m14542
13401E430160l93839l85149m31117n00284m85097l20268p5023Q8598N0488j53232
$$ plain form
13472 212255 273421 341523 300218 175688 101628 183214 444269 873131 1450956 2132268
13462 2132268 2825036 3407400 3776486 3899571 3822825 3637301 3436299 3290802 3245147 3283317
13452 3283317 3313872 3263304 3149170 3035243 2979390 3010670 3099038 3155128 3106373 2968091 2809144
13441 2809144 2685772 2636469 2688669 2830648 3022230 3247137 3507169 3788796 4086625 4432794
13431 4432794 4879177 5448771 6098093 6746880 7349097 7893604 8335720 8589256 8608440 8414106
13421 8414106 8051847 7583555 7083800 6618568 6232267 5940042 5742594 5641647 5631723 5704622
13411 5704622 5850359 6062899 6340961 6630237 6809615 6791351 6583752 6247073 5844702 5430160
13401 5430160 5036321 4651172 4220055 3719771 3234674 2914406 2839383 2927981 2978469 2825237
13391B825237l39460l42221j80087K242J15991J87916K96165M66090O05903O06891
13381D244667M82760L25614J98625J14348L3184r2197k61343m24635n08474m89568
13371C622981m22934l74123l72750m08331m36788m23140l82360l23944k15291
13362B63320p4274K7353P9578J47480K84852M57704N49465M74710K71484K0947
13352B502619k34730m46554n38871m54732k03876J20934M10959O30385P79096
13343B565230P99036O15217K62921j13763l72365m54744m19398l83167m00515
13334B098452m49129m89649m94273m72450m83951n53886o10410n96154n14877
13325b566327l49051q3339K22416M80111O46999O98384O16951M33337K13856L3454
$$ plain form
13391 2825237 2485777 2143556 1963469 1965711 2081702 2269618 2565783 3031873 3637776 4244667
13381 4244667 4727427 5053041 5251666 5366014 5399198 5307001 5045658 4621023 4112549 3622981
13371 3622981 3200047 2825924 2453174 2044843 1608055 1184915 802555 478611 263320
13362 263320 189046 216399 295977 443457 728309 1186013 1735478 2210188 2481672 2502619
13352 2502619 2267889 1821335 1282464 827732 623856 744790 1155749 1786134 2565230
13343 2565230 3364266 3979483 4242404 4128641 3756276 3301532 2882134 2498967 2098452
13334 2098452 1649323 1159674 665401 192951 -291000 -844886 -1455296 -2051450 -2566327
13325 -2566327 -2915378 -2998717 -2776301 -2296190 -1649191 -950807 -333856 99481 313337 346791
13315C46791k9224R7868M00073P13475Q46260P50694N10367K15750p6404l26943
13305C448707n19191o44809o90077o57624n76914m85227l88026k65218j37021
13296i15400q7030j78366l78075n93349p24454o94823m99712k22239K1822J68275
13286d103351K33201K64936L15976M06498M67224L95055J71848r1341k45241k34307
13276b419502j00005J02468L22596M90721N45594M87539L80706K67545J16314
13267A93976j05973l40785m53722l68684j29116J85052M76969O04229M75565J58232
13257F95743j81987m28350n86251p29054q76509r66975r23560p02721l33856J02290
13247d931230N39024R10738J128623J137520J002053Q54434P51368O49036M92968
$$ plain form
13315 346791 317567 415435 815508 1528983 2375243 3125937 3636304 3852054 3775650 3448707
13305 3448707 2929516 2284707 1594630 937006 360092 -125135 -513161 -778379 -915400
13296 -915400 -1002430 -1180796 -1558871 -2152220 -2876674 -3571497 -4071209 -4293448 -4271626 -4103351
13286 -4103351 -3870150 -3605214 -3289238 -2882740 -2415516 -2020461 -1848613 -1939954 -2185195 -2419502
13276 -2419502 -2519507 -2417039 -2094443 -1603722 -1058128 -570589 -189883 77662 193976
13267 193976 88003 -252782 -706504 -1075188 -1204304 -1019252 -542283 61946 537511 695743
13257 695743 513756 85406 -500845 -1229899 -2106408 -3073383 -3996943 -4699664 -5033520 -4931230
13247 -4931230 -4392206 -3481468 -2352845 -1215325 -213272 641162 1392530 2041566 2534534
13238B534534K95493J09066m6304j91589l31868m00062k91143o646K98243M72776
13228B442500M97189M27091L18522K04906R9721L3402K6742N5709R3745J27850
13218D327377J36828P4126j09432l81287o13705p06547o74909n73344m31732k86389
13208G60986j71549r4633n2784k9777K0296J51334L47101N12594N88302O05721
13198B637591O16103O11548N42305L94252J99140m728j58813j98352j01922J02421
13188D639545L55723N59141O26255N78851M80241L15992M3243l05853o29901q47418
13178E815819r56685j005641j008882q94969n78692j29172K20557K97633J37107
13169A897075j22710l80174n82810o97209o95422n72003l88483k52058k08925
$$ plain form
13238 2534534 2830027 2939093 2892789 2701200 2369332 1969270 1678127 1671481 1969724 2442500
13228 2442500 2939689 3366780 3685302 3890208 3989929 4023331 4050073 4105782 4199527 4327377
13218 4327377 4464205 4538331 4428899 4047612 3433907 2727360 2052451 1479107 1047375 760986
13208 760986 589437 494804 442020 412243 432539 583873 930974 1443568 2031870 2637591
13198 2637591 3253694 3865242 4407547 4801799 5000939 4996211 4837398 4639046 4537124 4639545
13188 4639545 4995268 5554409 6180664 6759515 7239756 7555748 7598991 7293138 6663237 5815819
13178 5815819 4859134 3853493 2844611 1949642 1370950 1241778 1462335 1759968 1897075
13169 1897075 1774365 1394191 811381 114172 -581250 -1153253 -1541736 -1793794 -2002719
13160b002719j89465q1611J47919M39912P27684R64986J102755J089877R13355
13151C112693O38157L65969J64192M7592j9127j29936l44327n62644o25784m91417
13141B155368k60281r1895p7091j64190k42626k74277l00487l52103m11696m62086
13131d81364m91826m51610k98024n9178J86638L67973M58680M90330N29959O09187
13121H60765O85631P00300O50073N71268M75792L53422K14796J15163J14789J84239
13111D926238K01245Q5611j15720l09073m66321o05489p15478p56817o79917m45341
13101A118938r2220K45007M42995M91609M33817K68663L939k80450m79932n49924
13091A602442n22835m32624k73531o5562R9566J37905P8640P503l3059m1729l4624
$$ plain form
13160 -2002719 -2192184 -2273795 -2125876 -1685964 -958280 6706 1109461 2199338 3112693
13151 3112693 3750850 4116819 4281011 4328603 4309476 4179540 3835213 3272569 2646785 2155368
13141 2155368 1895087 1803192 1726101 1561911 1319285 1045008 744521 392418 -19278 -481364
13131 -481364 -973190 -1424800 -1722824 -1782002 -1595364 -1227391 -768711 -278381 251578 860765
13121 860765 1546396 2246696 2896769 3468037 3943829 4297251 4512047 4627210 4741999 4926238
13111 4926238 5127483 5213094 5097374 4788301 4321980 3716491 3001013 2244196 1564279 1118938
13101 1118938 1026718 1271725 1714720 2206329 2640146 2908809 2912748 2632298 2152366 1602442
13091 1602442 1079607 646983 373452 307890 407456 545361 624001 631504 598445 556716 522092
13080E22092j6417P481J4786J1625M0524J24150K45671L90563N30401N85677M90628
13069B947181K67434j729k37431l67321l57660k75562k51313l77407o16187q15329
13059h5324q56780p17970m25654n7950K55373M15795M25031L58298L19261L58618
13049a1302M02853L52508J85849n1975k48586k82228j25931J45771M22638N96063
13039A385660N83259L72971L4298l51627p44345j067182j180412j007984o01949
13030b577311r3820L60624O56606P97044Q67875R52585J044700J053151R32603
13021C994057P31412M84114J92678q0506k18935j88636j06636j17723k35448l61226
13011D093151m23095m29286m27330m42228m68103n07576n58132n76509n05417
$$ plain form
13080 522092 505675 513156 527942 539567 580091 704241 949912 1340475 1870876 2456553 2947181
13069 2947181 3214615 3212886 2975455 2608134 2250474 1974912 1723599 1346192 730005 -85324
13059 -85324 -942104 -1660074 -2085728 -2143678 -1888305 -1472510 -1047479 -689181 -369920 -11302
13049 -11302 391551 744059 929908 877933 629347 347119 221188 366959 789597 1385660
13039 1385660 1968919 2341890 2376188 2024561 1280216 213034 -967378 -1975362 -2577311
13030 -2577311 -2671131 -2310507 -1653901 -856857 11018 963603 2008303 3061454 3994057
13021 3994057 4725469 5209583 5402261 5321755 5102820 4914184 4807548 4689825 4454377 4093151
13011 4093151 3670056 3240770 2813440 2371212 1903109 1395533 837401 260892 -244525
13002b44525l38424j32432M3948J59871K13181J93846J20981N4112K3651K1599
12992A15808M3396J03102J74957J60291o918k82742n69435p77660q59363q57618
12982b756182q68405r16639r26428q33279o82886n62293m89451m21781l13211
12973h770555j45302O8369L03297N26412O94149P78874P90681P78832P89003P94495
12963c391745P18273N27754K64177L735j64168j72423l8004J30520K23000K25383
12953a673498J86356J27325N3862j7977p8879j05546m9435J22946L73610O07598
12943d53638P31075P08668N90880M33683K44738N3865m5514q362R4875J93699
12933B543969K79348L44093L68391L35533K36413R1749o6493k30847l99139n46259
$$ plain form
13002 -244525 -582949 -715381 -671433 -511562 -298381 -104535 16446 70558 94209 115808
12992 115808 159204 262306 437263 597554 590636 307894 -261541 -1039201 -1898564 -2756182
12982 -2756182 -3624587 -4541226 -5467654 -6300933 -6983819 -7546112 -8035563 -8457344 -8770555
12973 -8770555 -8915857 -8847488 -8544191 -8017779 -7323630 -6544756 -5754075 -4975243 -4186240 -3391745
12963 -3391745 -2673472 -2145718 -1881541 -1877806 -2041974 -2214397 -2252401 -2121881 -1898881 -1673498
12953 -1673498 -1487142 -1359817 -1305955 -1323932 -1402811 -1508357 -1557792 -1434846 -1061236 -453638
12943 -453638 277437 986105 1576985 2010668 2255406 2309271 2263757 2255395 2350270 2543969
12933 2543969 2823317 3167410 3535801 3871334 4107747 4199496 4133003 3902156 3503017 2956758
12923B956758o52918p27210p55289o94909n64410m30856k94302j22994M2550J40742
12913a102838J79053J83505J26744o676j52235k33893k28771j42833J637J60092
12903a216215K79064L14025K83649K88351L90455N16742N35353L90590J56837
12894A938851k9528j07756j22194j38310j85105k38915k38084j43537m570Q1488
12884H12340N4596j04506l82482o93398q88886q67159o50398l50826j01931L087
12874c169563k8600p1993J1033K27130M60857N96971N97072M89108L31795J96568
12864c59622J33828J51463K19141K65516K03843M569k75766n36425o72390o50394
12854a516237n77669n59117n10612k92001M2249K94565L57410K90881K01694J11617
$$ plain form
12923 2956758 2303840 1576630 821341 126432 -437978 -868834 -1163136 -1286130 -1243580 -1102838
12913 -1102838 -923785 -740280 -613536 -620212 -772447 -1006340 -1235111 -1377944 -1376307 -1216215
12903 -1216215 -937151 -623126 -339477 -51126 339329 856071 1391424 1782014 1938851
12894 1938851 1909323 1801567 1679373 1541063 1355958 1117043 878959 735422 730852 812340
12884 812340 866936 762430 379948 -313450 -1202336 -2069495 -2719893 -3070719 -3172650 -3169563
12874 -3169563 -3198163 -3270156 -3259123 -3031993 -2571136 -1974165 -1377093 -887985 -556190 -359622
12864 -359622 -225794 -74331 144810 410326 614169 618738 342972 -193453 -865843 -1516237
12854 -1516237 -2093906 -2653023 -3163635 -3455636 -3413387 -3118822 -2761412 -2470531 -2268837 -2157220
12844b157220k2539k10736l94862m94755m48587k39952N4554L00862M36085N19807
12834b657343O06689O43050N56369L65108J57912K1544p681M0952J19476K04621
12824E0697K95034M08871N52363O82380P62122Q19631Q85274Q93614P19983L50258
12814F420227n1209k90057l09928j83537M61J96568L62394M17073L01010L4526
12804F897528l08282o28159q39010r56444j064643j169795j189464j077992q76138
12795a212399o41006m04774j94744l9943L3358K1301l5373n0612O2051K83903
12785b178238M69056M81946L10546N2966j70408l06974l78876m13791l89073k61569
12775b784415j5951L24464O71323R10553J000059R65775Q17380N36415J70280
$$ plain form
12844 -2157220 -2179759 -2390495 -2785357 -3280112 -3728699 -3968651 -3914097 -3613235 -3177150 -2657343
12834 -2657343 -2050654 -1407604 -851235 -486127 -328215 -306671 -314352 -273400 -153924 50697
12824 50697 345731 754602 1306965 1989345 2751467 3571098 4456372 5349986 6069969 6420227
12814 6420227 6369018 6078961 5769033 5585496 5585957 5782525 6144919 6561992 6863002 6897528
12804 6897528 6589246 5961087 5122077 4165633 3100990 1931195 741731 -336261 -1212399
12795 -1212399 -1853405 -2258179 -2452923 -2492866 -2459508 -2438207 -2473580 -2524192 -2462141 -2178238
12785 -2178238 -1709182 -1227236 -916690 -863724 -1034132 -1341106 -1719982 -2133773 -2522846 -2784415
12775 -2784415 -2800366 -2475902 -1804579 -894026 106033 1071808 1889188 2425603 2595883
12766B595883j34096k81246l30195l78667m44868n20444n96120o03816m88627
12757a182196l06293j49267l9741P1437K31180L98783M61889L59461J56526k3821
12747b2042j22205j61850j53600o2500J12023K79124L24582K39794J39674J46007
12737G19007K71102M22247N17116N47052N13116L77611J10340k46114n57880o91690
12727A981907o12259l83538j23359N1385Q1757m824j14942j41319n5282P3908
12717G53434J72737K14474J99156J25114j4098j79178k87494l11372k89941k57097
12707A25735k33744k31452k28634j90307j15242n0585l7526p3012j26535j41435
12697a302737p9149L2023J32854K00459K57646L19490L43574K79895J50149J8870
$$ plain form
12766 2595883 2461787 2180541 1850346 1471679 1026811 506367 -89753 -693569 -1182196
12757 -1182196 -1488489 -1637756 -1677497 -1606060 -1374880 -976097 -514208 -154747 1779 -22042
12747 -22042 -144247 -306097 -459697 -522197 -410174 -131050 193532 433326 573000 719007
12737 719007 990109 1412356 1929472 2476524 2989640 3367251 3477591 3231477 2673597 1981907
12727 1981907 1369648 986110 862751 914136 995893 991069 876127 734808 679526 753434
12717 753434 926171 1140645 1339801 1464915 1450817 1271639 984145 672773 382832 125735
12707 125735 -108009 -339461 -568095 -758402 -873644 -924229 -961755 -1034767 -1161302 -1302737
12697 -1302737 -1381886 -1349863 -1217009 -1016550 -758904 -439414 -95840 184055 334204 353074
12687C53074q4133j70339k49127l30487m30684n08657m69418k83962k8031K03575
12677a998189L63404M43220M52667M01521K80246R3779q7031j80784j92547j82810
12667f06524j78841j80205j89992k03158k01204j60952p7486K05k73q1576j25838
12656b005844j5474J85932L04451K54745R1698m3287k6582J13738K24332K19164
12646f97127J44831N8537l9668j85706m07691o71840q90218r91668r36919p12078
12636e329547l92901j41692p3032j46404k04968j22760O3543K08939K27981J42246
12626e768595K8218j9860N0303J74721K34106J95890J14085L2426o4265k20013
12616e242984m11061n23606m66318k71348o2305R3424K32062L89394N48777O57015
$$ plain form
12687 353074 268941 98602 -150525 -481012 -911696 -1420353 -1889771 -2173733 -2201764 -1998189
12677 -1998189 -1634785 -1191565 -738898 -337377 -57131 36648 -50383 -231167 -423714 -606524
12667 -606524 -785365 -965570 -1155562 -1358720 -1559924 -1720876 -1798362 -1798157 -1798430 -1880006 -2005844
12656 -2005844 -2021318 -1835386 -1530935 -1276190 -1184492 -1227779 -1254361 -1140623 -916291 -697127
12646 -697127 -552296 -493759 -533427 -719133 -1126824 -1798664 -2688882 -3680550 -4617469 -5329547
12636 -5329547 -5722448 -5864140 -5937172 -6083576 -6288544 -6411304 -6347761 -6138822 -5910841 -5768595
12626 -5768595 -5740377 -5760237 -5709934 -5535213 -5301107 -5105217 -4991132 -4958706 -5022971 -5242984
12616 -5242984 -5654045 -6177651 -6643969 -6915317 -6977622 -6884198 -6652136 -6262742 -5713965 -5056950
12606e056950O61617N74310M51801L19046J75633N2784N885Q7847L07017N87489
12596a833521Q17756R39133R86807J038965J116924J150050J058404Q48112N79663
12587F702293K95080M3561j24010k01606k20798k37921k86540l47650l88745l77463
12577D856201k74624p5358J72152M09877N82750O30096N04895J96036k42746o86826
12567F072453r96299j098408j030658q87812p55259o67105n85160m46733k33487
12558f28468j6906O9491k3021j61472j68810l4098J12133J88513K04681J67466
12548b90491O8963m6359j26413j93702k68072k74573j34738R7445K97966M16594
12538d53380M55868M01072K48913N9975o5235p8477k8154J513k4962r6842k10562
$$ plain form
12606 -5056950 -4395333 -3821023 -3369222 -3050176 -2874543 -2821759 -2815874 -2728027 -2421010 -1833521
12596 -1833521 -1015765 -76632 910175 1949140 3066064 4216114 5274518 6122630 6702293
12587 6702293 6997373 7040934 6916924 6715318 6494520 6256599 5970059 5622409 5233664 4856201
12577 4856201 4581577 4506219 4678371 5088248 5670998 6301094 6805989 7002025 6759279 6072453
12567 6072453 5076154 3977746 2947088 2059276 1304017 636912 51752 -394981 -628468
12558 -628468 -645374 -575883 -598904 -760376 -929186 -963284 -851151 -662638 -457957 -290491
12548 -290491 -221528 -267887 -394300 -588002 -856074 -1130647 -1265385 -1167940 -869974 -453380
12538 -453380 2488 403560 652473 712448 647213 568736 540582 542095 517133 420291 209729
12527B09729l62622n06993n87447n87123m92472k88547l2388J66643K54561K50486
12517a976173K09621K07757L19247N58132Q01594Q50655O40828K99060k7558k73951
12507A609212m09159l97327k21919M3474K36893K53076J22321q1416l11353n19857
12497C23945o50665o67350n66610l57713n2770K82934N57178P26293P75595P06681
12487A077518N75554M45611L01672J04801q4575j46785n0390J12725K03470J41537
12477B681138m6213k90368n53146q21902j035613j066416q43405m32939L2577
12468b376287M29858O70302P20428O03561L91529K06523J33429J60894K55826
12459A196063L78477M67553M96386M89686M35735L03074J36485q164j39306k65367
$$ plain form
12527 209729 -152893 -659886 -1247333 -1834456 -2326928 -2615475 -2647863 -2481220 -2226659 -1976173
12517 -1976173 -1766552 -1558795 -1239548 -681416 120178 970833 1611661 1910721 1883163 1609212
12507 1609212 1200053 802726 580807 624281 861174 1114250 1236571 1155155 843802 323945
12497 323945 -326720 -994070 -1560680 -1918393 -1971163 -1688229 -1131051 -404758 370837 1077518
12487 1077518 1653072 2098683 2400355 2505156 2420581 2273796 2223406 2336131 2539601 2681138
12477 2681138 2634925 2344557 1791411 969509 -66104 -1132520 -1975925 -2408864 -2376287
12468 -2376287 -1946429 -1276127 -555699 47862 439391 645914 779343 940237 1196063
12459 1196063 1574540 2042093 2538479 3028165 3463900 3766974 3903459 3895295 3755989 3490622
12449C490622l53716l79140l48864k61010j07859N6884J21552L2723j25699k32377
12439A893116k70730l17341m30118n54150n65042m18664j88394N0515K84917M99709
12429a6182O31950O01908L79094L3268l10184n54385o51296n99385m47301k74638
12419a207151j48217q3749o3901q0952j19574j24237m2869J00979K17236K50536
12409a301899K46797K96394M29276N95455P07545O91823N47034L54786J92761
12400B759972N8896q6456k49503m00836n04685n48478n57569n49591m89067l44600
12390i11917j64908l7662k7165j59473l98155o11603o33984m39093j86250m1635
12380c611845j8619k9487n2802j64963l85641n89750o44662n66933m58367l36843
$$ plain form
12449 3490622 3136906 2757766 2408902 2147892 2040033 2096917 2218469 2251192 2125493 1893116
12439 1893116 1622386 1305045 874927 320777 -244265 -662929 -851323 -800808 -515891 -16182
12429 -16182 615768 1217676 1596770 1630038 1319854 765469 114173 -485212 -932513 -1207151
12419 -1207151 -1355368 -1439117 -1503018 -1583970 -1703544 -1827781 -1870650 -1769671 -1552435 -1301899
12409 -1301899 -1055102 -758708 -329432 266023 973568 1665391 2212425 2567211 2759972
12400 2759972 2818868 2732412 2482909 2082073 1577388 1028910 471341 -78250 -567317 -911917
12390 -911917 -1076825 -1114487 -1141652 -1301125 -1699280 -2310883 -2944867 -3383960 -3570210 -3611845
12380 -3611845 -3630464 -3659951 -3712753 -3877716 -4263357 -4853107 -5497769 -6064702 -6523069 -6859912
12370f859912j49216J05369L62954N48910O26490O06402N37504M89556M85469
12361c246474M66397L51166J15386j80141m15965m86554l78148j68548N4282K50793
12351c637806M32280O27765Q36852R91859R87176P81151M58341J36706j43295
12342A471029l91918o01272p18172o84425n14949l10048j84134j77673k13678
12333b325240j89121q2918O7335K17964L35948L96031L77876K81707J43595J9718
12323g57105m6510m1814K105J0109o4130j66267j98630j35471l8843K3652K5534
12312a387370l2218j32288k24840k18293n3831J87594L06977J76869j38503m60242
12302a976145o28387n70036l19568m901K29949L21277K97281K11847J01982k65
$$ plain form
12370 -6859912 -7009128 -6903759 -6540805 -5991895 -5365405 -4759003 -4221499 -3731943 -3246474
12361 -3246474 -2780077 -2428911 -2313525 -2493666 -2909631 -3396185 -3774333 -3942881 -3888599 -3637806
12351 -3637806 -3205526 -2577761 -1740909 -749050 238126 1019277 1477618 1614324 1471029
12342 1471029 1079111 477839 -240333 -924758 -1439707 -1749755 -1933889 -2111562 -2325240
12333 -2325240 -2514361 -2597279 -2529944 -2311980 -1976032 -1580001 -1202125 -920418 -776823 -757105
12323 -757105 -803615 -845429 -843324 -833215 -897345 -1063612 -1262242 -1397713 -1436556 -1412904 -1387370
12312 -1387370 -1419588 -1551876 -1776716 -1995009 -2048840 -1861246 -1554269 -1377400 -1515903 -1976145
12302 -1976145 -2604532 -3174568 -3494136 -3499037 -3269088 -2947811 -2650530 -2438683 -2336701 -2336966
12292b336966o5481r6821j18417j17683m4095J16408K97666L91670L23350J05014
12282a545355j62578l66154m59442m40795l11725j12514P5172K11499K97782L17721
12272b496389K97734L33124M71715O47190P62825P84565P34697O42399N15121
12263B692981L37465J20253r0856k63364l82070m43978m56233m23015l59439l07176
12253D24568l00268l27247l65715m39586n57945o44770o26846n30904m30683l56181
12243d155577k96668k26823j50338j13947j45978k40605l71789m93934n20491
$$ plain form
12292 -2336966 -2402447 -2499268 -2617685 -2735368 -2779463 -2663055 -2365389 -1973719 -1650369 -1545355
12282 -1545355 -1707933 -2074087 -2533529 -2974324 -3286049 -3398563 -3323391 -3111892 -2814110 -2496389
12272 -2496389 -2198655 -1865531 -1393816 -746626 16199 800764 1535461 2177860 2692981
12263 2692981 3030446 3150699 3059843 2796479 2414409 1970431 1514198 1091183 731744 424568
12253 424568 124300 -202947 -568662 -1008248 -1566193 -2210963 -2837809 -3368713 -3799396 -4155577
12243 -4155577 -4452245 -4679068 -4829406 -4943353 -5089331 -5329936 -5701725 -6195659 -6716150
$$ [...]
##END NTUPLES=NMR SPECTRUM
##END=
