##TITLE=31P ikalashn
LR-791-C1
14.11.2024
##JCAMPDX= 6.0         $$ Bruker NMR JCAMP-DX V2.0
##DATA TYPE= NMR SPECTRUM
##DATA CLASS= NTUPLES
##ORIGIN= UXNMR, Bruker Analytische Messtechnik GmbH
##OWNER= root
$$ TOPSPIN		Version 1.3
$$ 2024-11-14 13:40:32.609 +0400  Irina@DPX200
$$ Compression mode = diff/dup
##.OBSERVE FREQUENCY= 81.01967998063
##.OBSERVE NUCLEUS= ^31P
##.ACQUISITION MODE= SIMULTANEOUS
##.ACQUISITION SCHEME= undefined
##.AVERAGES= 33
##.DIGITISER RES= 17
##SPECTROMETER/DATA SYSTEM= spect
##.PULSE SEQUENCE= zgpg
##.SOLVENT NAME= D2O
##.SHIFT REFERENCE= INTERNAL, D2O, 1, 298.5841
##AUDIT TRAIL= $$ (NUMBER, WHEN, WHO, WHERE, WHAT)
$$ ##TITLE= Audit trail, TOPSPIN		Version 1.3
$$ ##JCAMPDX= 5.01
$$ ##ORIGIN= Bruker BioSpin GmbH
$$ ##OWNER= Irina
$$ $$ F:/spectra/data/iren/nmr/P31dec/1/pdata/1/auditp.txt
$$ ##AUDIT TRAIL=  $$ (NUMBER, WHEN, WHO, WHERE, VERSION, WHAT)
(   1,<2024-11-14 13:39:09.562 +0400>,<Irina>,<DPX200>,<TOPSPIN 1.3>,
      <acquisition in progress>)
(   2,<2024-11-14 13:40:04.250 +0400>,<Irina>,<DPX200>,<TOPSPIN 1.3>,
      <Start of raw data processing
       efp BC_mod = 2 LB = 8 FT_mod = 6 PKNL = 1 PHC0 = 91.0315 PHC1 = 322.7153 SI = 32K 
       data hash MD5: 32K
       49 BD E7 7F 41 74 23 B3 0A E6 2C B3 EB 7A 08 D1>)
(   3,<2024-11-14 13:40:06.500 +0400>,<Irina>,<DPX200>,<TOPSPIN 1.3>,
      <apk 
       data hash MD5: 32K
       35 BD C4 18 0B D4 F0 09 93 F6 AA 4A 3A 23 A2 E8>)
(   4,<2024-11-14 13:40:08.750 +0400>,<Irina>,<DPX200>,<TOPSPIN 1.3>,
      <abs n ABSG = 5 
       data hash MD5: 32K
       22 5B 80 2D 41 F7 89 7D B3 26 8D 00 C0 3D 75 F1>)
$$ ##END=
$$ 
$$ $$ hash MD5
$$ $$ DA B2 5D 96 51 1D 2B 93 52 A0 C8 3A 79 18 D4 80
##$RELAX= 
##$RELAX= 
##$RELAX= 
##$RELAX= 
##$RELAX= 
##$RELAX= 
##$RELAX= 
##$RELAX= 
##$RELAX= 
##$RELAX= 
##$RELAX= 
$$ Bruker specific parameters
$$ --------------------------
##$DU= <F:/spectra>
##$EXPNO= 1
##$NAME= <P31dec>
##$PROCNO= 1
##$TYPE= <nmr>
##$USER= <iren>
##$AMP= (0..31)
100 100 100 100 100 100 100 100 100 100 100 100 100 100 100 100 100 100 
100 100 100 100 100 100 100 100 100 100 100 100 100 100 
##$ANAVPT= -1
##$AQSEQ= 0
##$AQ_mod= 1
##$AUNM= <au_zg>
##$AUTOPOS= <>
##$BF1= 81.014009
##$BF2= 200.13
##$BF3= 200.13
##$BF4= 200.13
##$BF5= 200.13
##$BF6= 200.13
##$BF7= 200.13
##$BF8= 200.13
##$BYTORDA= 1
##$CFDGTYP= 0
##$CFRGTYP= 5
##$CHEMSTR= <none>
##$CNST= (0..63)
1 1 145 1 1 1 1 1 1 1 1 1 1 1 1 1 1 1 1 1 1 1 1 1 1 1 1 1 1 1 1 1 1 1 
1 1 1 1 1 1 1 1 1 1 1 1 1 1 1 1 1 1 1 1 1 1 1 1 1 1 1 1 1 1 
##$CPDPRG= <waltz16>
##$CPDPRG1= <>
##$CPDPRG2= <waltz16>
##$CPDPRG3= <>
##$CPDPRG4= <mlev>
##$CPDPRG5= <mlev>
##$CPDPRG6= <mlev>
##$CPDPRG7= <mlev>
##$CPDPRG8= <mlev>
##$CPDPRGB= <>
##$CPDPRGT= <>
##$D= (0..63)
0 1 0 0 0 0 0 0 0 0.06 0 0.03 2e-005 3e-006 0 0 0.0002 0 0 0 0 0 0 0 0 
0 0 0 0 0 0 0 0 0 0 0 0 0 0 0 0 0 0 0 0 0 0 0 0 0 0 0 0 0 0 0 0 0 0 0 
0 0 0 0 
##$DATE= 1731577202
##$DBL= (0..7)
120 120 120 11 120 120 24 19 
##$DBP= (0..7)
150 150 150 150 150 150 150 150 
$$ [...]
##$SW_h= 37037.037037037
##$TD= 32768
##$TD0= 1
##$TE= 300
##$TE2= 300
##$TE3= 300
##$TEG= 300
##$TL= (0..7)
0 120 53 12 22 120 120 120 
##$TP= (0..7)
150 150 150 150 150 150 150 150 
##$TP07= 0
##$TPNAME0= <>
##$TPNAME1= <>
##$TPNAME2= <>
##$TPNAME3= <>
##$TPNAME4= <>
##$TPNAME5= <>
##$TPNAME6= <>
##$TPNAME7= <>
##$TPOAL= (0..7)
0.5 0.5 0.5 0.5 0.5 0.5 0.5 0.5 
##$TPOFFS= (0..7)
0 0 0 0 0 0 0 0 
##$TUNHIN= 0
##$TUNHOUT= 0
##$TUNXOUT= 0
##$USERA1= <user>
##$USERA2= <user>
##$USERA3= <user>
##$USERA4= <user>
##$USERA5= <user>
##$V9= 5
##$VALIST= <valist>
##$VCLIST= <CCCCCCCCCCCCCCC>
##$VD= 0
##$VDLIST= <DDDDDDDDDDDDDDD>
##$VPLIST= <PPPPPPPPPPPPPPP>
##$VTLIST= <TTTTTTTTTTTTTTT>
##$WBST= 1024
##$WBSW= 4
##$XGAIN= (0..3)
0 0 0 0 
##$XL= 0
##$YL= 0
##$YMAX_a= 1534
##$YMIN_a= -3207
##$ZGOPTNS= <>
##$ZL1= 120
##$ZL2= 120
##$ZL3= 120
##$ZL4= 120
##$ABSF1= 298.5841
##$ABSF2= -158.5842
##$ABSG= 5
##$ABSL= 5
##$ALPHA= 0
##$AQORDER= 0
##$ASSFAC= 0
##$ASSFACI= 0
##$ASSFACX= 0
##$ASSWID= 0
##$AUNMP= <proc_1d>
##$AXLEFT= 0
##$AXRIGHT= 0
##$AXTYPE= 0
##$AXUNIT= <>
##$AZFE= 0.1
##$AZFW= 0.5
##$BCFW= 0
##$BC_mod= 2
##$BYTORDP= 0
##$COROFFS= 0
##$CY= 12.5935478210449
##$DATMOD= 1
##$DC= 0
##$DFILT= <>
##$DTYPP= 0
##$F1P= 47.1127640792319
##$F2P= -24.0371245302204
##$FCOR= 0.5
##$FTSIZE= 32768
##$FT_mod= 6
##$GAMMA= 0
##$GB= 0
##$INTBC= 1
##$INTSCL= 7.269226e-011
##$ISEN= 30
##$LB= 8
##$LEV0= 0
##$LPBIN= 0
##$MAXI= 12.09355
##$MC2= 0
##$MEAN= 0
##$ME_mod= 0
##$MI= 0.7550151
##$NCOEF= 0
##$NC_proc= -12
##$NLEV= 6
##$NOISF1= 298.5841
##$NOISF2= 270.0111
##$NSP= 0
##$NTH_PI= 0
##$NZP= 0
##$OFFSET= 298.5841
##$PC= 1.4
##$PHC0= 48.90376
##$PHC1= 385.8932
##$PH_mod= 1
##$PKNL= yes
##$PPARMOD= 0
##$PPDIAG= 0
##$PPIPTYP= 0
##$PPMPNUM= 100
##$PPRESOL= 1
##$PSCAL= 0
##$PSIGN= 0
##$REVERSE= no
##$SF= 81.014009
##$SI= 32768
##$SIGF1= 270.0111
##$SIGF2= -158.5842
##$SINO= 77.54984
##$SIOLD= 32768
##$SREGLST= <31P.CDCl3>
##$SSB= 0
##$STSI= 32768
##$STSR= 0
##$SW_p= 37037.037037037
##$SYMM= 0
##$S_DEV= 0
##$TDeff= 32768
##$TDoff= 0
##$TI= <>
##$TILT= no
##$TM1= 0
##$TM2= 0
##$TOPLEV= 0
##$USERP1= <user>
##$USERP2= <user>
##$USERP3= <user>
##$USERP4= <user>
##$USERP5= <user>
##$WDW= 1
##$XDIM= 32768
##$YMAX_p= 469843191
##$YMIN_p= -19809475
$$ End of Bruker specific parameters
$$ ---------------------------------
##NTUPLES= NMR SPECTRUM
##VAR_NAME=  FREQUENCY,     SPECTRUM/REAL,   SPECTRUM/IMAG
##SYMBOL=    X,             R,               I
##VAR_TYPE=  INDEPENDENT,   DEPENDENT,       DEPENDENT
##VAR_FORM=  AFFN,          ASDF,            ASDF
##VAR_DIM=   32768,         32768,           32768
##UNITS=     HZ,            ARBITRARY UNITS, ARBITRARY UNITS
##FACTOR=    1.13031516577767, 1,            1
##FIRST=     37037.037037037, 2855970,       -10374258
##LAST=      0,             -1002436,        -624963
##MIN=       0,             -19809475,       0
##MAX=       37037.037037037, 469843191,     0
$$ Real data points
##PAGE= N=1
##DATA TABLE= (X++(R..R)), XYDATA
$$ [...]
18068d684052l27782m803L36939N87756P05623P91474P76147N06336J20333j65065
18058a357094l17542k41469K37418R46492J472787J556494J169509N41827J13103
18049D121525J03444K10140J582n49222j000967j056799q84671p74138q79251
18040g08357j058512j020900p93677n94679m43787l22512k91809l42715l04429
18031e881377r2300K71964O60222Q10954O57734L43026J5676j92522j33274K32738
18021c307159P12523R18134P24605M15885K56611K19378J86728J37267O2781o9336
18011B57417k63264m55159n73684o28149n78220k50043K76348N77459M58008K60263
18001i19024L28527O38657R09435Q67248O01706K84067q9632n13886r27899j115289
$$ y = [-4684052, -5011834, -5016637, -4679698, -4091942, -3386319, -2594845, -1818698, -1312362, -1192029, -1357094, -1674636, -1916105, -1678687, -732195, 740592, 2297086, 3466595, 4008422, 4121525, 4224969, 4435109, 4436691, 3887469, 2886502, 1829703, 945032, 170894, -708357, -1766869, -2787769, -3581446, -4176125, -4619912, -4942424, -5234233, -5576948, -5881377, -5973677, -5701713, -5041491, -4230537, -3572803, -3229777, -3214101, -3406623, -3539897, -3307159, -2594636, -1676502, -951897, -536012, -279401, -60023, 126705, 263972, 326753, 257417, -5847, -461006, -1034690, -1662839, -2241059, -2491102, -2214754, -1637295, -1179287, -919024, -590497, 48160, 957595, 1824843, 2426549, 2710616, 2620984, 2107098, 1179199, 63910]
17991F3910q32324k88790J09645M04933P62982R97610R19965N65726M3920n09381
17981B238196q17062p39491n60740m40463k15398J21431L24040K03274j61704
17972d7917n86305j001526j353089j376500r54029m33105o6701J71530L10743
17963e336899N07136Q36073J060086J041143J002176J077286J072843Q29634M96839
17954B586317J57895k05702l73399k78143j23012L9593K40739M17415M50401K62543
17944C174647n4413k22553j92094k69226n71535q33761q43509n71296j56447J02152
17934d38035M8357j22333j73096l5132K74595N39680N20264K07142k26300n84043
17924A1099q23410r50009q68536m95207N1057N16467Q15720R67778Q41837L52805
$$ y = [63910, -768414, -1057204, -947559, -542626, 220356, 1217966, 2137931, 2703657, 2747577, 2238196, 1421134, 681643, 120903, -319560, -534958, -413527, -89487, 113787, -47917, -634222, -1635748, -2988837, -4365337, -5319366, -5752471, -5819172, -5647642, -5336899, -4829763, -3993690, -2933604, -1892461, -890285, 187001, 1259844, 2089478, 2586317, 2744212, 2538510, 2165111, 1886968, 1763956, 1803549, 2044288, 2461703, 2912104, 3174647, 3120234, 2897681, 2705587, 2436361, 1864826, 1031065, 187556, -383740, -540187, -438035, -389678, -512011, -685107, -720239, -445644, 94036, 614300, 821442, 595142, 11099, -812311, -1762320, -2630856, -3126063, -3075006, -2558539, -1742819, -775041, 66796, 419601]
17914D19601k76026o82438p25787n34369k64753J7901K64286L64475K78920K38692
17904h99498M63376Q30573J104618J219261J187631R11555M62454O6475k47435
17895E099010m44054m76387n00092p25972j078232j136318o91922j7464N35097
17886E63666Q15906Q72714P84710N89953L19297J7656k49617m38823n59272o66496
17876B049694o66200l52874K56659Q86195J290010J336790J089290P05989K12025
17867F807578l73289r23610j242877j153500p43616l29100j36647j22064J61L09513
17857B092549M66082K62647p5718l67787n58631n17932l12567j86771j51992j10789
17847E39091j58330k67799k25109P0937N28209R23228J002810O68525R1536l97156
$$ y = [419601, 143575, -538863, -1264650, -1799019, -2063772, -2045871, -1781585, -1417110, -1138190, -899498, -436122, 394451, 1499069, 2718330, 3905961, 4817516, 5279970, 5346445, 5099010, 4654956, 4178569, 3678477, 2952505, 1874273, 737955, 46033, 28569, 563666, 1379572, 2252286, 3036996, 3626949, 3946246, 3963902, 3714285, 3275462, 2716190, 2049694, 1383494, 1030620, 1287279, 2173474, 3463484, 4800274, 5889564, 6595553, 6807578, 6434289, 5510679, 4267802, 3114302, 2370686, 2041586, 1904939, 1782875, 1783036, 2092549, 2558631, 2821278, 2745560, 2377773, 1819142, 1301210, 988643, 801872, 649880, 539091, 380761, 112962, -112147, -41210, 486999, 1410227, 2413037, 3081562, 3173098, 2775942]
17837B775942n93873n33678l83426l46700n49544p54508n29543J09510O65100
17828a40720P13188J95901n27785j029633j123834q42007m04850n8524P6986J377
17818c139901j71119k30770O130M24955O69537N56609K01656q2629l9958L38176
17808a467314Q16200J158803J307082J243599Q77697K09799n68153j176932j376963
17799A023818j130380o52489l07565k34406k86596m01364m94315m45545l86957
17790c315799l95220k98182q8685O7258O2226j40092l40772l85120k07847K20941
17780d821292N97132N93479L57834K99949N23953P40230P40639P23299Q41348
17771E96571R14343P59403M46062J76444K6514q5585j65642k21619k66088k54751
$$ y = [2775942, 2182069, 1648391, 1264965, 918265, 368721, -385787, -915330, -805820, -140720, 572468, 768369, 240584, -789049, -1912883, -2754890, -3159740, -3218264, -3141278, -3139901, -3311020, -3541790, -3535660, -3110705, -2441168, -1884559, -1682903, -1765532, -1805490, -1467314, -651114, 507689, 1814771, 3058370, 3936067, 4145866, 3577713, 2400781, 1023818, -106562, -759051, -1066616, -1301022, -1587618, -1988982, -2483297, -2928842, -3315799, -3711019, -4009201, -4097886, -4030628, -3968402, -4108494, -4449266, -4834386, -5042233, -4821292, -4224160, -3630681, -3272847, -2972898, -2448945, -1708715, -968076, -244777, 596571, 1510914, 2270317, 2716379, 2892823, 2919337, 2833752, 2668110, 2446491, 2180403, 1925652]
17761A925652k16269j48364j37249l22942n05758m52664k48811l4928J87754M05852
17751D52273N24343M51276K61607O3764o4238p4546j69930n34361j043741j442255
17741a575808j511713j170919n86967l9743L34961O10541Q85097J088583J061507
17732i04461P85656L74984o9825n09585q68015r93826q07227m07372J7138K31050
17722c151483J64746r814j39596k15381k68472l03961l62993m67504m26774o8257
17712e249489M33088P46802Q04137Q27543Q48274O60169L31324J56296J47044
17703b94812L1783l42891q01608r43016o46911l10426n6029L30855P96622J219819
17693a016614J448268J235123N90382j67163p43916j044724j058616q19158n49908
$$ y = [1925652, 1709383, 1561019, 1423770, 1100828, 595070, 142406, -106405, -141333, 46421, 452273, 976616, 1427892, 1689499, 1753263, 1689025, 1614479, 1444549, 910188, -133553, -1575808, -3087521, -4258440, -4845407, -4885150, -4550189, -3939648, -3054551, -1965968, -904461, -118805, 256179, 186354, -323231, -1191246, -2185072, -2992299, -3399671, -3382533, -3151483, -2986737, -2996551, -3136147, -3351528, -3620000, -3923961, -4286954, -4754458, -5181232, -5249489, -4816401, -4069599, -3265462, -2437919, -1589645, -929476, -598152, -441856, -294812, -263029, -605920, -1407528, -2350544, -2997455, -3307881, -3363910, -3033055, -2236433, -1016614, 431654, 1666777, 2257159, 2089996, 1346080, 301356, -757260, -1576418, -2126326]
17684b126326m64522n43220n77526m17157p1063L01318M64272L92547L44485M69924
17674b227268N40140M02319K16500J08177M8234o3489k02851l14764l85624l10183
17664b188809n4660K14147L76409L77655L25744M46276O22299O09794M56358L95408
17654A580621M65194M70770K38196o7453j35875L8616K08867K75375K76486J11970
17644C462767j81147m42097o71096r03654j092373j123636q96520m08064J38440
17635b117380M57251M34258K17337m490k14857l75216l74219k23122o5133m9716
17625b315287j04415J354L08144O74789R83098J152950J079705Q42818P22048
17616C345204P19569O25051M09885R9187l60486q67023j186647j309188j293389
$$ y = [-2126326, -2590848, -3134068, -3711594, -4128751, -4199814, -3898496, -3434224, -3041677, -2697192, -2227268, -1687128, -1284809, -1068309, -960132, -911898, -975387, -1178238, -1493002, -1878626, -2188809, -2243469, -2029322, -1652913, -1275258, -949514, -503238, 119061, 728855, 1185213, 1580621, 2045815, 2516585, 2754781, 2687328, 2551453, 2590069, 2798936, 3074311, 3350797, 3462767, 3281620, 2839523, 2168427, 1264773, 172400, -951236, -1847756, -2255820, -2117380, -1660129, -1225871, -1008534, -1013024, -1227881, -1603097, -1977316, -2200438, -2265571, -2315287, -2419702, -2418348, -2110204, -1435415, -452317, 700633, 1780338, 2623156, 3345204, 4064773, 4689824, 5099709, 5198896, 4838410, 3971387, 2784740, 1475552, 182163]
17607A82163r59470k49081N20400R98100J055559P87585L48803l8142j72040j22638
17597B351239K172J28474R7022j62726n10117p06373n82916k69149r0392j65037
17587I2197l12678k70836K5171M61073Q96765J222104J330411J121440N92580
17578E158227j23778q30721j438867j940709k212102k085709j579977p92783N9040
17569e787379O51481Q52198Q31501Q41984R71388J076734R93809O50149R4680
17560A176545n15675j033904j334639j396402j187222o92304j02936L04757N22406
17551d259374O90037P58490O92170O12337N19837K17707k51959n63260n74506
17542b158521l94286k8512M99655R16504R12931N88039L81006M71785O80028P81750
$$ y = [182163, -777307, -1026388, -505988, 492112, 1547671, 2335256, 2684059, 2645917, 2473877, 2351239, 2353411, 2481885, 2578907, 2416181, 1906064, 1199691, 616775, 347626, 257234, 92197, -220481, -491317, -466146, -5073, 891692, 2113796, 3444207, 4565647, 5158227, 5034449, 4203728, 2764861, 824152, -1387950, -3473659, -5053636, -5846419, -5787379, -5135898, -4283700, -3452199, -2610215, -1638827, -562093, 431716, 1081865, 1176545, 660870, -373034, -1707673, -3104075, -4291297, -4983601, -5086537, -4781780, -4259374, -3569337, -2810847, -2118677, -1506340, -986503, -768796, -1020755, -1584015, -2158521, -2552807, -2581319, -2081664, -1165160, -252229, 335810, 716816, 1188601, 1868629, 2650379]
17532B650379O13670K28453o5203p4985J05970L37235M79130M61558L60276K32901
17522E329384M1849k62276n22500n67431m48504k08496J67582N94425P94214N08911
17512E427158j14765o36075q35465p77066n50555l83870n58108j028705j496455
17503i53906j722752j652802j386207r69717n00729j45889K04152O77022R76514
17494e474314Q64814O55926O88811Q32264P01360L48957J73339J84803K34334
17485g89706L24182M19431M19448K12987j11772k72921j54317N9610J19056j35592
17475I0406n90392r09426j020499j024432r01503n37530J42249Q43046J120948
17466b787133J040944R23613Q09394P21560P85938Q29187N18163j8245l11258
$$ y = [2650379, 3264049, 3492502, 3427299, 3352314, 3458284, 3795519, 4274649, 4736207, 5096483, 5329384, 5371233, 5108957, 4586457, 4019026, 3570522, 3362026, 3529608, 4124033, 4918247, 5427158, 5312393, 4676318, 3840853, 3063787, 2513232, 2129362, 1571254, 542549, -953906, -2676658, -4329460, -5715667, -6685384, -7186113, -7332002, -7127850, -6450828, -5474314, -4609500, -3953574, -3264763, -2432499, -1731139, -1382182, -1208843, -1024040, -789706, -465524, -46093, 373355, 586342, 474570, 201649, 47332, 106942, 225998, 90406, -499986, -1409412, -2429911, -3454343, -4355846, -4893376, -4751127, -3908081, -2787133, -1746189, -822576, -13182, 708378, 1494316, 2323503, 2841666, 2823421, 2512163]
17457B512163k25610n1246Q2069L47494O45929N59014Q7178k91109m52017n96670
17447B617195o27879l44575J28651M52594N39405N79103O38980N19825J08068
17438D611367k57242k69593p412L52221O93592R26194J025529J027328Q69881
17429H971865N18812N0192l53111n36998o74972r18782j094035j060678q19233
17420D083060l37196J81565K51177l09276j056423j503501j632234j571195j193840
17411c087863l64801O55255J353582J400367R54514M62858J99338K13538L73801
17402B160589M06510K77623L46463P40609J055086J040042P91150L95879K7162
17393G241113o7933K8895m2490m84122j144575j619465j592150j125814n80791
$$ y = [2512163, 2286553, 2235307, 2317376, 2664870, 3310799, 3869813, 3956991, 3665882, 3213865, 2617195, 1989316, 1644741, 1773392, 2225986, 2765391, 3344494, 3983474, 4503299, 4611367, 4354125, 4084532, 4077120, 4429341, 5122933, 6049127, 7074656, 8101984, 8971865, 9490677, 9540869, 9187758, 8650760, 7975788, 7057006, 5962971, 4902293, 4083060, 3745864, 3927429, 4178606, 3869330, 2812907, 1309406, -322828, -1894023, -3087863, -3452664, -2797409, -1443827, -43460, 911054, 1373912, 1573250, 1786788, 2160589, 2567099, 2844722, 3191185, 3931794, 4986880, 6026922, 6818072, 7213951, 7241113, 7173180, 7202075, 7159585, 6675463, 5530888, 3911423, 2319273, 1193459, 612668]
17384F12668k86319k65442k69721q5903K59135N84848P23935O53537M07570J097
17374B335405m38088p13841o18268m9897O70206R83634P81436L46239m3704k22562
17364C030560j44160R1998K17785Q4330r5206n1070Q9913P1030k1166J3063K02229
17353C489306L89882M41806L53821Q9588l97597q90037r95756o64053l15501k65006
17343A236453k98313k24188j78940j63687l8035K09033L79128K62681j00652m18808
17333F64672m46460k46116k7549L7706p2049l10533o57419q99560r41547j067358
17323c966213j315701j336666r82298m55455m1941K16384M38139O02609O47398
17314f193744O19302N96832O34976O67735N86194L73895K08797L47595P41460
$$ y = [612668, 326349, 60907, -208814, -294717, -35582, 549266, 1273201, 1926738, 2334308, 2335405, 1897317, 1183476, 565208, 515311, 1185517, 2169151, 2950587, 3296826, 3253122, 3030560, 2886400, 2978398, 3196183, 3280513, 3185307, 3134237, 3224150, 3295180, 3274014, 3287077, 3489306, 3879188, 4320994, 4674815, 4764403, 4366806, 3476769, 2481013, 1816960, 1501459, 1236453, 938140, 713952, 535012, 371325, 333290, 542323, 921451, 1184132, 1083480, 664672, 218212, -27904, -55453, -17747, -89796, -400329, -1057748, -1957308, -2898855, -3966213, -5281914, -6618580, -7600878, -8056333, -8098274, -7881890, -7443751, -6841142, -6193744, -5574442, -4977610, -4342634, -3674899, -3088705, -2714810, -2506013, -2158418, -1416958]
17305a416958J140672J363359J320902J131819J055261J126065J147626R33073
17297G801819M70302k7013l50208n04373o55684q50536r57015q79162o54338m56078
17287B937714m96489p70275j005526j065994j040283q60747m73087k8294L64454
17278b438527O46199P37387O09746L39844k9104m81452q36752q14619l90720J96992
17268b461006O44197P91233P35735O32402N69482N28853M80084M01169K52617
17259B574766J22337J75263M21001O02586M48366j0745m50335n82066n40722n94981
17249B165470o42307m42455j659M63433O50501M19733K3435j39433M6768K69293
17239B812779K00865p0799l31002n58463p54667p36190m76048j90144k0437o9226
$$ y = [-1416958, -276286, 1087073, 2407975, 3539794, 4595055, 5721120, 6868746, 7801819, 8272121, 8245108, 7894900, 7390527, 6734843, 5884307, 4927292, 4048130, 3393792, 2937714, 2441225, 1670950, 665424, -400570, -1440853, -2301600, -2774687, -2802981, -2438527, -1792328, -1054941, -445195, -105351, -134455, -615907, -1452659, -2267278, -2657998, -2461006, -1816809, -1025576, -289841, 342561, 912043, 1440896, 1920980, 2322149, 2574766, 2697103, 2872366, 3293367, 3895953, 4344319, 4333574, 3883239, 3301173, 2760451, 2165470, 1523163, 1080708, 1079049, 1542482, 2192983, 2612716, 2636151, 2496718, 2543486, 2812779, 3013644, 2942845, 2611843, 2053380, 1298713, 562523, 86475, -103669, -124106, -193332]
17229a93332k48346l58949m11992m30400k94812j0281K70593L86214L30487J84280
17219g76538l3118k22681k09575j14363k41016n99203r17249r92783p89307m22456
17209e318289k0024L34409N95542P84275R01389Q38603N04358N2846j87485j20372
17199a634748j7666m2935q1451L3823K35388L07408L26993M38639M55485K04622
17189B25558j50662l13979q6288K95912M36292L70276J93894j90588p02852r82493
17179i04930q24230m41303j80604p7854q190r6146m86097r55758j264189j375856
17169f615157j226268q46760m79692k45548j7616J85321P8519l34280n64653l21675
17159a0387809K38130Q34765J209174J301292J300678J313264J268613J076415
$$ y = [-193332, -441678, -800627, -1212619, -1643019, -1937831, -1948112, -1677519, -1291305, -960818, -776538, -809656, -1032337, -1241912, -1356275, -1597291, -2196494, -3113743, -4106526, -4895833, -5318289, -5338313, -5003904, -4408362, -3624087, -2722698, -1884095, -1379737, -1326891, -1514376, -1634748, -1652414, -1695349, -1776800, -1742977, -1507589, -1200181, -873188, -434549, 20936, 225558, 74896, -239083, -325371, -29459, 406833, 777109, 971003, 780415, 77563, -904930, -1729160, -2170463, -2351067, -2428921, -2437111, -2533257, -3019354, -3975112, -5239301, -6615157, -7841425, -8688185, -9167877, -9413425, -9431041, -9245720, -9167201, -9501481, -10066134, -10387809, -10149679, -9314914, -8105740, -6804448, -5503770, -4190506, -2921893, -1845478]
17151a845478Q16575O74335O55440N87226L50376K0118j92568j42338N1061J51237
17141A125984K3647k38251m27503m80384m84818n28085o14022o82505o64949o06604
17131c577490n45290m08318j38978K48620N60639N63403L25063J37178J17939
17122b717234N8976j68321l80910n12508o55117o95409n41168k28206K22197O82772
17112d934928R77832R54930O92995N06326M44165K32681r8375j72569K9134K49410
17102a118399K95948J17281p5333k2397L01015P92953J298053J488557J160600
17093D238278N93306K01519J20518K25416M05459N77156N95351M46117K31904
17084G635024m4663m41054q55087j132459j162625q72041l29292K18150M43749
$$ y = [-1845478, -1028903, -354568, 300872, 888098, 1238474, 1258592, 1066024, 923686, 974747, 1125984, 1149631, 911380, 483877, 3493, -481325, -1009410, -1623432, -2305937, -2970886, -3577490, -4122780, -4531098, -4670076, -4421456, -3860817, -3297414, -2972351, -2835173, -2717234, -2658258, -2826579, -3207489, -3719997, -4375114, -5070523, -5611691, -5839897, -5617700, -4934928, -3957096, -3002166, -2309171, -1802845, -1358680, -1125999, -1224374, -1396943, -1367809, -1118399, -822451, -705170, -780503, -802900, -501885, 291068, 1589121, 3077678, 4238278, 4831584, 5033103, 5153621, 5379037, 5784496, 6361652, 6957003, 7403120, 7635024, 7590361, 7149307, 6294220, 5161761, 3999136, 3127095, 2797803, 3015953, 3459702]
17075C459702K70156m0283j90015j68033k05308l84953o61341r62636j149110
17066c1821j128896p84266j0217J021279J920768K318594K112266J493303P16332
17057G627342M086m50777n46966l97649l50980n49579p52465p79679o48006n40173
17047B615154n25863m52071k54172l5446Q4565Q6565m6624k94229n45383o40028
17037g532n04099k23673R8818L03603J85075m0102J04361N51948Q62081P78694
17027B109174L79183j34708o78760r51664o68995j18838J52854l3121l57107n52274
17017h54256o91051o74307l18611J97080O56879J058344J387309J459923J108137
17008C329447M72636r3850m47924p10627r92071j202749j063923m76455J82088
$$ y = [3459702, 3729858, 3689575, 3499560, 3331527, 3126219, 2741266, 2079925, 1117289, -31821, -1160717, -1944983, -1955200, -933921, 986847, 3305441, 5417707, 6911010, 7627342, 7631428, 7180651, 6633685, 6236036, 5885056, 5335477, 4583012, 3803333, 3155327, 2615154, 2089291, 1637220, 1383048, 1347602, 1432167, 1518732, 1472108, 1177879, 632496, -7532, -511631, -735304, -636486, -332883, -147808, -187910, -83549, 468399, 1330480, 2109174, 2488357, 2353649, 1674889, 723225, 54230, -64608, 88246, 55125, -301982, -854256, -1545307, -2219614, -2538225, -2341145, -1684266, -625922, 761387, 2221310, 3329447, 3802083, 3708233, 3260309, 2549682, 1557611, 354862, -709061, -1185516, -1003428]
16999a003428M32920J78527l33246p87789r09975o38452j40020K75270K98099
16990b628094r9812n94239p88545o28001k31168K95425P01057Q02986O69179M85514
16980b015698M01908L68888K22529r1471m10496n60229m12837j9457K22488J03813
16970b190562r1189j77188k57021l37599l10665j34386K1534r5747m01205n01729
16960d475757k08088J93268K89263J22463O3204K62111N02819N28380K69962j29426
16950b581801m02985l17343Q6631M91323P14375P25148M66125J03579j04877k45963
16940a065788m74313p01548p51447n50473r0491M47149O09641L41922J40099K51327
16930a843922M37948M25484K27952P4693P7691J45043K32888K95749K77700L08002
$$ y = [-1003428, -570508, -391981, -725227, -1513016, -2422991, -3061443, -3201463, -2926193, -2628094, -2727906, -3322145, -4110690, -4738691, -4969859, -4674434, -3973377, -3170391, -2501212, -2015698, -1613790, -1244902, -1022373, -1113844, -1524340, -2084569, -2497406, -2516863, -2294375, -2190562, -2281751, -2458939, -2715960, -3053559, -3364224, -3498610, -3477076, -3572823, -3974028, -4475757, -4683845, -4490577, -4201314, -4078851, -4015647, -3753536, -3250717, -2722337, -2452375, -2581801, -2984786, -3302129, -3215498, -2724175, -2009800, -1284652, -818527, -714948, -819825, -1065788, -1540101, -2241649, -2993096, -3543569, -3634060, -3186911, -2577270, -2235348, -2095249, -1843922, -1405974, -980490, -752538, -677845, -600154, -455111, -222223, 73526, 351226, 659228]
16920F59228N12859P73646Q32531O27894L67182K20787J05223k01082o08122q21711
16910B468435q57338p39043l69352K01022P89008J208109J347124J117798N40429
16901E706192j49716n99424o54568m31187j90599j84335k91536j46099L01304
16892C360032P22478P89736M95325O2778j77177m0759K38086L97139L89803J93089
16882F430530j15137l45457m96212p52518j141432j415645j280114p25476j99081
16873d0542o4752p1576R8780J17266l71528j054200j503233j625447j444493r46007
16863f905732k29802M44062Q62947J026781J131929J243422J217890J064610R19518
16854G75625P59653M78814J20104j05987j49960j57039k12441k66309l08413m04026
$$ y = [659228, 1172087, 1945733, 2778264, 3406158, 3773340, 3994127, 4099350, 3898268, 3290146, 2468435, 1611097, 872054, 502702, 703724, 1492732, 2700841, 4047965, 5165763, 5706192, 5556476, 4957052, 4302484, 3871297, 3680698, 3496363, 3204827, 3058728, 3360032, 4082510, 4872246, 5367571, 5430349, 5253172, 5212413, 5450499, 5847638, 6237441, 6430530, 6315393, 5969936, 5473724, 4721206, 3579774, 2164129, 884015, 158539, -40542, -105294, -176870, -78090, 39176, -332352, -1386552, -2889785, -4515232, -5959725, -6905732, -7135534, -6691472, -5828525, -4801744, -3669815, -2426393, -1208503, -143893, 775625, 1535278, 2014092, 2134196, 2028209, 1878249, 1721210, 1508769, 1242460, 934047, 530021]
16844E30021m59769l29404j6683L21128L79007k9435n56564o40744k92502J48205
16834i46740M67049N65809N33846M87324N23001P38462J045134J116268P10038
16825E240191K5430m92534n17597j48339R5516r7780l87357k82662J56071N44658
16815D135597P69525Q33694N05638k72266r56795r99953o43295m34316m99792
16806B438037o61802o80925l56733K79348Q39654R70709O75187R1064n66993r92501
16796B035045r25418m90838j66285j99317l89879m75813l90569j85989K1624J63724
16786a003715K30494K70911L99052O59761J040365J371427J422556J253658J001335
16777F645844N16901k79351j031026j349294j211981q53104n87049n54243n23972
$$ y = [530021, 70252, -259152, -275835, 45293, 424300, 394865, -161699, -802443, -1094945, -946740, -479691, 86118, 619964, 1107288, 1630289, 2368751, 3413885, 4530153, 5240191, 5265621, 4773087, 4255490, 4107151, 4202667, 4104887, 3717530, 3434868, 3590939, 4135597, 4905122, 5738816, 6244454, 5972188, 5015393, 4015440, 3372145, 2937829, 2438037, 1776235, 1095310, 738577, 1017925, 1857579, 2828288, 3503475, 3594539, 3027546, 2035045, 1109627, 618789, 452504, 253187, -136692, -612505, -1003074, -1189063, -1167439, -1003715, -773221, -502310, -103258, 556503, 1596868, 2968295, 4390851, 5644509, 6645844, 7162745, 6883394, 5852368, 4503074, 3291093, 2437989, 1850940, 1296697, 772725]
16768G72725j84447L51295P46623Q51551O08740R5617l51164m72713l89841m94180
16758A534206r11093j229932j009496l40632L06852N69063M13722J77620J41453
16749c48237J75603J17607l429j12774j34018P773L68771R08569J287912J088379
16739C356156M15437k66679o06266n11626j55152J41492J58103k490p9591N5579
16729B504963K42722K65192K27439K89125M03013M77521L92342J63315j4688j58047
16719D792897m05147o33680o67244n91107n54100n27724l58560K4842L91764M04542
16709A876483M4851m15772o29215m61896j33671J57317L63589M28442L48006J90253
16699A768387N6926O576o1951k71159o69881j113169j240350q89210k71678K37052
$$ y = [772725, 588278, 939573, 1686196, 2537747, 3146487, 3242104, 2890940, 2418227, 2028386, 1534206, 623113, -606819, -1616315, -1956947, -1650095, -1081032, -667310, -489690, -348237, -172634, -55027, -58456, -171230, -305248, -297475, 71296, 979865, 2267777, 3356156, 3771593, 3504914, 2898648, 2387022, 2231870, 2373362, 2531465, 2528975, 2449384, 2504963, 2747685, 3012877, 3240316, 3529441, 3932454, 4409975, 4802317, 4965632, 4950944, 4792897, 4387750, 3754070, 3086826, 2495719, 1941619, 1413895, 1055335, 1080177, 1471941, 1876483, 1921334, 1505562, 876347, 414451, 280780, 438097, 801686, 1230128, 1578134, 1768387, 1825313, 1831889, 1769938, 1498779, 828898, -284271, -1524621, -2413831, -2685509, -2448457]
16689b448457M55286N84656O74791M94312L9494m26537o56961n65708k73381m0932
16679b163437J3919Q525J02069J95127P3268k35958m08047j90761K51926N51732
16669a801637N72172M31917K63077K29042L67760M55298L29085K14076L72557
16660A433347O24964O27859L09440n1541j95663k36722k93753k34666K240L11532
16650B297037N55109O36095N74256M12985J16424k53335n75702q04164r53608
16641B005097q85953m52784J43827N00124M93338K77614j6928l36072n19890n07377
16631G00996m40997l66614k55138k32656l67429m65520m72752n43295o71160p25883
16621c840448o00377l31856m4472J74082K08159J29043J01599K01114L61830K91120
$$ y = [-2448457, -1993171, -1408515, -733724, -239412, -199918, -626455, -1283416, -1849124, -2122505, -2163437, -2149518, -2140993, -2038924, -1843797, -1770529, -2006487, -2414534, -2605295, -2353369, -1801637, -1229465, -797548, -534471, -305429, 62331, 517629, 846714, 1060790, 1433347, 2058311, 2686170, 2995610, 2944069, 2748406, 2511684, 2217931, 1983265, 1985505, 2297037, 2852146, 3488241, 4062497, 4475482, 4591906, 4338571, 3762869, 2958705, 2005097, 1119144, 666360, 810187, 1310311, 1803649, 2081263, 2064335, 1728263, 1208373, 700996, 259999, -106615, -361753, -594409, -961838, -1427358, -1900110, -2443405, -3114565, -3840448, -4440825, -4772681, -4817153, -4643071, -4434912, -4305869, -4204270, -4003156, -3641326, -3350206]
16611c350206j07828n25863p48551p85689o88820m84618j84223M8757L1564j6465
16601f811942K31037O46675R02079R15176Q34503P51845P24717P91704Q82457
16592a31749J007744J055204Q50886M87884Q2250l54654p46109r07888p98776
16583E44792o23284o03406p85762r57789q63254m02628K22749P75667J253647
16574a439268J595824J666697J451451J000482L74043l63580j004450j243933
16566B037266j086427p81017m50253r2952K39772N15983O56699M45324o6617n57227
16556H60551p93551p41583o07225n94929o37750n34068k80584l7534N8281j12674
16546c421066m04477m05055n0739K57114K30160m6517k00913L0564N77559J229803
$$ y = [-3350206, -3458034, -3983897, -4732448, -5518137, -6206957, -6691575, -6875798, -6827041, -6795477, -6811942, -6580905, -5934230, -5032151, -4116975, -3282472, -2530627, -1805910, -1014206, -131749, 875995, 1931199, 2782085, 3269969, 3352219, 2997565, 2251456, 1343568, 544792, -78492, -681898, -1467660, -2425449, -3288703, -3691331, -3468582, -2692915, -1439268, 156556, 1823253, 3274704, 4275186, 4649229, 4285649, 3281199, 2037266, 950839, 169822, -280431, -373383, -133611, 382372, 1039071, 1484395, 1417778, 860551, 67000, -674583, -1281808, -1876737, -2514487, -3048555, -3329139, -3366673, -3308392, -3421066, -3825543, -4230598, -4281337, -4024223, -3794063, -3840580, -4041493, -4010929, -3433370, -2203567]
16536b203567J663170J699689J428313R38070L51114j05763k08662L6937K77609
16527C876910K25825n9138l97809o38621p11515p15411o91617n92909n02959n47386
16517g54630o55095n52224j50381J86567J48385j53188m63914n80684m68139l50343
16507c793646l29737k45026m5915K4919q9032l0076L65634Q12769J096543J193197
16497a040370J010392O11442L17197K92271L85079N54845O88419M58159o5467
16488C211967m47894m76078k48232Q3615M34971O78387N63190P1154m11250n46434
16478B913396l58903o9501J15774P6110j59421m79433q67933j239195j316573
16469a385679j103663q69900n58288J323O16779R01048O41081j09931j119610
$$ y = [-2203567, -540397, 1159292, 2587605, 3525675, 3876789, 3771026, 3562364, 3599301, 3876910, 4102735, 4043597, 3645788, 3007167, 2295652, 1580241, 888624, 295715, -207244, -754630, -1409725, -1961949, -2112330, -1925763, -1777378, -1930566, -2394480, -2975164, -3443303, -3793646, -4123383, -4368409, -4414324, -4389405, -4478437, -4508513, -4142879, -3330110, -2233567, -1040370, -29978, 581464, 898661, 1190932, 1576011, 2130856, 2819275, 3277434, 3211967, 2764073, 2287995, 2039763, 2123378, 2558349, 3236736, 3799926, 3871080, 3459830, 2913396, 2554493, 2484992, 2600766, 2676876, 2517455, 2038022, 1170089, -69106, -1385679, -2489342, -3359242, -3917530, -3916207, -3299428, -2398380, -1757299, -1867230, -2986840]
16460b986840j771649j401567l66397M10761P00906O94309O78396R46111J363884
16451a732086J617590J631911J460667J230689R14451L28073m81891j233736j650260
16442B085408j507297r33507m47493k12532j0427J73037K14407J14706R1521K81250
16432a50927N48958P51902Q55801Q67693P91293O31838L74577L2340j72547m2924
16422D488004K20014K61097L4065l04398n90833o47136n30854m93091n28350m73759
16412A434759l09996j06899k2414k28713o75989j105720j233741q92518j98116
16403c339347M67473O92307L32937m24646j112098j139216l51458O51122J153540
16394c069386R91668L62435l62446q57478j149577j357087j565988k115989l141868
$$ y = [-2986840, -4758489, -6160056, -6526453, -6115692, -5414786, -4720477, -4042081, -3095970, -1732086, -114496, 1517415, 2978082, 4208771, 5123222, 5451295, 4969404, 3735668, 2085408, 578111, -355396, -802889, -1015421, -1025848, -852811, -638404, -523698, -432177, -150927, 398031, 1149933, 2005734, 2873427, 3664720, 4296558, 4671135, 4703475, 4530928, 4488004, 4708018, 4969115, 5003180, 4698782, 4107949, 3460813, 2929959, 2436868, 1908518, 1434759, 1124763, 1017864, 995450, 766737, 90748, -1014972, -2248713, -3141231, -3339347, -2871874, -2179567, -1846630, -2271276, -3383374, -4522590, -4874048, -4222926, -3069386, -2077718, -1715283, -2077729, -2935207, -4084784, -5441871, -7007859, -9123848, -12265716]
16385a2265716l775223k925376q43160J034081J739486J522422J160573J151608
16377a3201305J316889J159558O77569K20384k7169m0861J48080M37774P91382
16368h517699J134453J303839J336694J303736J183566J010360P92499M84563
16360C2011K31149J74129L18509N24498N41883L74743K54635K83731M50995O38959
16350C825242O00928K72272k82451r05294j263422j189849p97433l16909L2104
16341b4812J21733j1317k15670l67298m22695m30393n28984p60102q50687n87656
16331d077881j00435K96141L59559J93716J15713K83797N21712O29857O36700
16322a141121O12677N30877K68906j99449p63377j248164j369153j059997o14021
$$ y = [-12265716, -16040939, -18966315, -19809475, -18775394, -17035908, -15513486, -14352913, -13201305, -11884416, -10724858, -10047289, -9826905, -9854074, -9894935, -9746855, -9309081, -8517699, -7383246, -6079407, -4742713, -3438977, -2255411, -1245051, -452552, 32011, 263160, 437289, 755798, 1280296, 1822179, 2196922, 2451557, 2735288, 3186283, 3825242, 4426170, 4698442, 4415991, 3510697, 2247275, 1057426, 259993, -56916, -24812, 96921, 85604, -130066, -497364, -920059, -1350452, -1879436, -2639538, -3490225, -4077881, -4178316, -3882175, -3522616, -3328900, -3213187, -2929390, -2407678, -1777821, -1141121, -528444, 2433, 271339, 71890, -691487, -1939651, -3308804, -4368801, -4982822]
16313d982822l37172m33116j105800k079991k320505r26857J264271K384043K112525
16304f425424J602390J788172K503250L013392K976010K509184J830016J095106
16296A0892096L15350n15149j205881j562342j654795j572358j290239q80092
16288B526590m73740j55615L7412J40823K05790L72071O92463R19920P64945L27306
16278E357965p6433k84251k35071m5061J09595J95562J51926o7262l59633m84272
16268D263065k89797P71Q676l02712p17732r82225q46065l42202J41207J75128
16258A108114k35291o47899p13019n15534l08912k67720n08575q19895q20868
16249c729599n26555j71991J90946N49181Q04414Q49339O00768J74321j06974
$$ y = [-4982822, -5319994, -5753110, -6858910, -8938901, -11259406, -12186263, -10921992, -8537949, -6425424, -4823034, -3034862, -531612, 2481780, 5457790, 7966974, 9796990, 10892096, 11207446, 10692297, 9486416, 7924074, 6269279, 4696921, 3406682, 2526590, 2052850, 1897235, 1934647, 2075470, 2281260, 2653331, 3345794, 4265714, 5030659, 5357965, 5281532, 4997281, 4762210, 4717149, 4826744, 5022306, 5174232, 5106970, 4747337, 4263065, 3973268, 3974039, 3982715, 3680003, 2962271, 1980046, 1133981, 791779, 932986, 1108114, 872823, 224924, -488095, -1003629, -1312541, -1580261, -2088836, -2908731, -3729599, -4256154, -4428145, -4237199, -3688018, -2883604, -2034265, -1433497, -1259176, -1366150]
16240a366150j24089r4881j79566l43427m56066m29842k82982q7328O5587Q6529
16230c212215p0111l98766p06464o76773l01756R1511L76513P16376J127172J350073
16220a704440J120692O06995K02301r3977m69607p93653q37557o75047m97886
16211c142179l91716m26923n63726o66507n68133k21956J62612L97069N02670
16202d918789M99248K82825j03593l59628l21041j18563Q4019J36002M1828J09194
16192d668498N00237R19594J042758R79115R87447J011771Q09685L70094q815
16183A943388k7200L52347Q15997J002607P93039K76228k80022o95690r79099
16174C201595j086726j007767p73229l54970J21274L47506K94198K75259N46780
$$ y = [-1366150, -1490239, -1585120, -1764686, -2108113, -2564179, -2994021, -3277003, -3364331, -3298744, -3212215, -3282326, -3681092, -4387556, -5064329, -5366085, -5274574, -4898061, -4181685, -3054513, -1704440, -583748, 23247, 225548, 131571, -338036, -1131689, -1969246, -2644293, -3142179, -3533895, -3960818, -4524544, -5191051, -5759184, -5981140, -5818528, -5421459, -4918789, -4419541, -4136716, -4240309, -4599937, -4920978, -5039541, -4955522, -4819520, -4777692, -4668498, -4168261, -3248667, -2205909, -1226794, -239347, 772424, 1582109, 1952203, 1943388, 1916188, 2268535, 3084532, 4087139, 4880178, 5156406, 4876384, 4180694, 3201595, 2114869, 1107102, 333873, -21097, 100177, 447683, 741881, 1017140, 1563920]
16165A563920J001228J229397Q41488k5565o36133o38355l00235l4059k14194
16156B787492q00076j308566j337326r45676n31687l96239n42128q36382r62703
16147d873291o36571q7309L12819O03593Q99127J034223Q26386K50898n32121
16138b202246j185314j487321j346637p23715J50824Q57405J034309O80618J70763
16129d051314j21230r2813Q1823J78561K14972L05420L72832L98062M73585M57964
16119a782138J11630m33004q70558j064358r46379m75990J50090O55475R62503
16110c692729J118422J024750O68057M00956M83856P26219Q75722Q20168N46494
16101B971915J87573j60765l57327k73552l1740J20942J00847M3270j3292k36490
$$ y = [1563920, 2565148, 3794545, 4636033, 4610468, 3974335, 3335980, 3035745, 3001686, 2787492, 1987416, 678850, -658476, -1604152, -2135839, -2532078, -3074206, -3910588, -4873291, -5509862, -5597171, -5284352, -4680759, -3781632, -2747409, -1921023, -1670125, -2202246, -3387560, -4874881, -6221518, -6945233, -6794409, -5937004, -4902695, -4222077, -4051314, -4172544, -4265357, -4183534, -4004973, -3790001, -3484581, -3111749, -2713687, -2240102, -1782138, -1670508, -2103512, -2974070, -4038428, -4984807, -5460797, -5310707, -4655232, -3692729, -2574307, -1549557, -881500, -480544, 3312, 729531, 1605253, 2425421, 2971915, 3159488, 2998723, 2641396, 2367844, 2336104, 2457046, 2557893, 2601163, 2587871, 2351381]
16091B351381n61426o42793k98090K98247P67204Q40007L68153n37467j317813
16082A267403j540301j316997r15090m06542J25494L99977K77388n5287l59473
16073b523428n12543l81639k082L45714N39757O48779O67079N49845L94388L23040
16063D8910K38230p6347n66760p62368l41383M19070Q85704O81151N272o27459
16053i5980q13687n66766l94768o23196r08038q92994n68463o8335L58241N89354
16043c984632P20098P07289N00506K77371J98703K19166K57082J96570L6165r892
16033h81574J56862L65989N28336O07616N27969M29693L60297R1078l94548q16612
16023I75106j056378j208210j293839j219059j011937p44296m10276j38715n0099
$$ y = [2351381, 1789955, 1147162, 849072, 1147319, 1914523, 2754530, 3122683, 2585216, 1267403, -272898, -1589895, -2504985, -2911527, -2786033, -2386056, -2108668, -2163955, -2523428, -3035971, -3417610, -3419692, -3073978, -2534221, -1885442, -1218363, -668518, -274130, 48910, 287140, 210793, -355967, -1118335, -1459718, -1040648, -154944, 526207, 531479, -95980, -909667, -1476433, -1871201, -2494397, -3402435, -4295429, -4863892, -4932227, -4573986, -3984632, -3264534, -2557245, -2056739, -1779368, -1580665, -1361499, -1104417, -907847, -871682, -881574, -724712, -358723, 169613, 777229, 1305198, 1734891, 2095188, 2186266, 1791718, 975106, -81272, -1289482, -2583321, -3802380, -4814317, -5558613, -5968889, -6107604, -6157703]
16014f157703m6047M5134K37626M85209P72187R99935J037816R03807O97763M56839
16004e67434J91193r1637k74210k14873R036J72308J24585r9119k74003k06150
15994a230304P7187L35703M21970M53752M39752J97427k88241o71235n57129n169
15984h26287N10733P24876O85449M31118Q7290p3218M5578L30570O86587Q59800
15974C462496N24251j37338o13445o16012k73845M7099J64054J36300O6081l0448
15964B729193j43460r5454J31361K06135k6001l75573o59755q42441q74881p42206
15954f93082n44706l48216k22928j58398R0364N66078R17215Q77262M75449k4087
15944I34951m12344o70949p30504n48901k85530o9797R7944J76420J36493m1349
$$ y = [-6157703, -6203750, -6158616, -5920990, -5435781, -4663594, -3663659, -2625843, -1722036, -1024273, -567434, -376241, -467878, -742088, -956961, -947925, -775617, -651032, -750151, -1024154, -1230304, -1153117, -817414, -395444, 58308, 498060, 695487, 407246, -263989, -821118, -826287, -315554, 409322, 1094771, 1525889, 1613179, 1539961, 1585539, 1916109, 2602696, 3462496, 3986747, 3849409, 3235964, 2619952, 2346107, 2393206, 2557260, 2693560, 2759641, 2729193, 2585733, 2490279, 2621640, 2827775, 2801774, 2426201, 1766446, 924005, 49124, -693082, -1237788, -1586004, -1808932, -1967330, -1876966, -1310888, -393673, 483589, 959038, 934951, 522607, -148342, -878846, -1427747, -1713277, -1783074, -1685130, -1508710, -1372217, -1413566]
15934a413566j75978k3435K05355K39674J68777L8691j98516n09337q48997j022474
15924c539806p79892k51620K68257N95987N76509J99594k58695n48670n86527
15915d324863l44364K8833L01372M22867N01053O00790O82578O73703N57919L97248
15905e02864K82913K17265J83793J14814j03474l43366l77642j59611M2675J3604
15895f31893j3712J82007M08841M49699L94150L68581K96812N0783l51224o75186
15885D78858o08909k38685L5058L5539r926K66078Q03687J092920Q39292K45037
15875B938949j85633j81393J40687N34056P31404O28103L95288K48765J19639
15866E369865j36461l37761l84484l88388l40038j94429J89747R06001J577878
$$ y = [-1413566, -1589544, -1612979, -1407624, -1167950, -999173, -960482, -1158998, -1668335, -2517332, -3539806, -4319698, -4571318, -4303061, -3707074, -3130565, -2930971, -3189666, -3738336, -4324863, -4669227, -4640394, -4339022, -3916155, -3415102, -2814312, -2131734, -1458031, -900112, -502864, -219951, -2686, 181107, 295921, 192447, -150919, -528561, -688172, -645497, -631893, -645605, -463598, -54757, 394942, 789092, 1157673, 1454485, 1505268, 1154044, 478858, -130051, -368736, -333678, -298139, -308065, -41987, 761700, 1854620, 2693912, 2938949, 2753316, 2571923, 2712610, 3246666, 3978070, 4606173, 5001461, 5250226, 5369865, 5233404, 4895643, 4511159, 4122771, 3782733, 3588304, 3778051, 4684052, 6261930]
15857F261930J713478J278412N95886n1347n52157q84655j123109j356073j624185
15848D258180j839726j755404j336508q78091n94123m84550m31466l59268l17437
15839c738393k87994j94916q0505K6235K59690O69829R69770Q48019N46125M66918
15829e15222M94595M68133N51353P20816O68972L79031J06318q8181j30652J36041
15819B791204N43893P89134P27013M36031J91113J48912J98991J63673j03220
15810E886744n41013q54447q85027p73401p42848p10455l65213K57493P50638
15801B022471P78391L50511j86093n09683o04552n75949n15655m24752k70862
15792F3827r6510O1481K67852M64693M79601L00534N2348k3526K40860P10954
$$ y = [6261930, 7975408, 9253820, 9849706, 9798359, 9246202, 8361547, 7238438, 5882365, 4258180, 2418454, 663050, -673458, -1551549, -2145672, -2630222, -3061688, -3420956, -3738393, -4026387, -4221303, -4301808, -4275573, -4015883, -3346054, -2376284, -1528265, -982140, -515222, -20627, 447506, 998859, 1719675, 2388647, 2767678, 2873996, 2785815, 2655163, 2791204, 3335097, 4124231, 4851244, 5287275, 5478388, 5627300, 5826291, 5989964, 5886744, 5345731, 4491284, 3606257, 2832856, 2090008, 1379553, 1014340, 1271833, 2022471, 2800862, 3151373, 2965280, 2455597, 1851045, 1275096, 759441, 334689, 63827, -32683, 28798, 296650, 761343, 1240944, 1541478, 1593826, 1570300, 1811160, 2522114]
15782B522114J015599R35720O25628L09318O3152m7631R6358M25280O35825M60143
15772G041506m1812m26963n15241n93141q30451j014844q73206l56776K30773
15763B619845N17226N02740M19473L84994L33849J83293o0416j98011j38944j11276
15753D452773j34956L7706L03113L21050P6566j82711l64728m74593l49876n429
15743C678915L08038N14615O44957M91346m1234p37784j340517j599126j350801
15734E68409p51297k6920O27684R02422P80634O49312O33578N05414K57915J18374
15724D265525J82495K64969J85033k3944k20710l78383n15411n35281l97588j52752
15714B673953K45974O79569Q87051R33839J049414J231549J282408J075804O31572
$$ y = [2522114, 3537713, 4473433, 5099061, 5408379, 5471531, 5423900, 5520258, 5945538, 6581363, 7041506, 6999694, 6572731, 6057490, 5464349, 4633898, 3619054, 2745848, 2389072, 2619845, 3137071, 3639811, 4059284, 4444278, 4778127, 4961420, 4901004, 4702993, 4564049, 4452773, 4317817, 4355523, 4658636, 4979686, 5056252, 4873541, 4508813, 4034220, 3684344, 3678915, 3986953, 4501568, 5146525, 5637871, 5596637, 4858853, 3518336, 1919210, 568409, -182888, -209808, 417876, 1320298, 2100932, 2750244, 3383822, 3889236, 4147151, 4265525, 4448020, 4712989, 4898022, 4874078, 4653368, 4274985, 3759574, 3224293, 2826705, 2673953, 2919927, 3599496, 4486547, 5420386, 6469800, 7701349, 8983757, 10059561, 10691133]
15705A0691133J00295m06745q62268j202518j329743j226885j071685r63710q20070
15696B907804n58314k78170j8256K90678N80192O57436M62733J77323O8377K64329
15686D554132N31773N77365L70362L3318l53146o60170q05100p61931o43720o30618
15676B212265n69529k57266K34286P34937J098438J067957N89237O0003k19881
15667D950447l38148l03629o7854J05726K5077j52269j90405j1597K49404L04610
15657D571362J11890n4336j51660k65189l15869j57653R1797J56358P2681K00126
15647D259507O24166R62229Q06622J39544o17247r26067o70505j28188L82294
15638D832355O36917O61622O79084P92045R41603J109248J286133J360183J186312
$$ y = [10691133, 10791428, 10384683, 9522415, 8319897, 6990154, 5763269, 4691584, 3727874, 2907804, 2349490, 2071320, 2053064, 2343742, 2923934, 3581370, 4044103, 4221426, 4289803, 4554132, 5085905, 5663270, 6033632, 6066950, 5713804, 5053634, 4248534, 3486603, 2842883, 2212265, 1642736, 1385470, 1619756, 2354693, 3453131, 4521088, 5110325, 5170328, 4950447, 4612299, 4308670, 4240816, 4346542, 4371619, 4219350, 4028945, 4017348, 4266752, 4571362, 4683252, 4628916, 4477256, 4212067, 3896198, 3738545, 3830342, 3986700, 4059381, 4259507, 4883673, 5845902, 6652524, 6792068, 6174821, 5248754, 4578249, 4450061, 4832355, 5469272, 6130894, 6809978, 7602023, 8543626, 9652874, 10939007, 12299190, 13485502]
15629A3485502Q17186N81488Q38041J587244K426605L000039L295816L342879
15621B9374800L044395K361018J424235M98809q6735k44158k30117m02059q84735
15612C4855453j505796k151361k720405k998187k921544k550301k040508j611053
15604A6356298j363535j226390j096242r63231q78118q78574q72793p30790m64389
15595G882236j36607J20077J15437o2014j59230m7763L25810Q09674J121162J195445
15585A1164227J116529R05706N55351J31293m03475j057302j593236j765589j576893
15576G476611j270541j120284j183591j240361j157663r87786p26957l36375O1889
15567d85058K96320L56423K76445Q4448n6907j14099j80216p3579L73624Q26621
$$ y = [13485502, 14302688, 14884176, 15722217, 17309461, 19736066, 22736105, 26031921, 29374800, 32419195, 34780213, 36204448, 36703257, 36616522, 36372364, 36142247, 35740188, 34855453, 33349657, 31198296, 28477891, 25479704, 22558160, 20007859, 17967351, 16356298, 14992763, 13766373, 12670131, 11706900, 10828782, 9950208, 9077415, 8346625, 7882236, 7745629, 7865706, 7981143, 7919129, 7759899, 7712136, 8037946, 8847620, 9968782, 11164227, 12280756, 13186462, 13741813, 13873106, 13469631, 12412329, 10819093, 9053504, 7476611, 6206070, 5085786, 3902195, 2661834, 1504171, 516385, -210572, -546947, -485058, -188738, 167685, 444130, 528578, 471671, 357572, 177356, 103777, 477401, 1304022]
15557A304022Q46856M76819p234l89464m73013k40920j2876j43964n51113r11428
15547a02315j122607j226856j140256q95646q77202j301445j633704j338029n45128
15538a0183188K49652N81391L41447r6101k01894K15287R83923J740151K152010
15529d217322K119173J674210R85663M30148K40213K99720M61073O97886J006433
15520C697197J281001J438172J467588J407475J381768J359271J031396L05321
15512A3369189l99888o98286o34205m56713l01075j37330k0800q5545k77167m21432
15502I936748l99535k57764j13949j09160l07940n32065o19766o22824n67730
15493F406015m80688l67428j46374O7878Q6332J7365J07439K32829J2479m70513
$$ y = [1304022, 2150878, 2627697, 2620463, 2230999, 1757986, 1517066, 1504190, 1360226, 809113, -102315, -1224922, -2451778, -3592034, -4487680, -5364882, -6666327, -8300031, -9638060, -10183188, -9933536, -9352145, -9010698, -9106799, -9308693, -9093406, -8109483, -6369332, -4217322, -2098149, -423939, 561724, 991872, 1232085, 1531805, 1992878, 2690764, 3697197, 4978198, 6416370, 7883958, 9291433, 10673201, 12032472, 13063868, 13369189, 12969301, 12271015, 11636810, 11180097, 10879022, 10741692, 10720892, 10635347, 10358180, 9936748, 9537213, 9279449, 9165500, 9056340, 8748400, 8216335, 7596569, 6973745, 6406015, 5925327, 5557899, 5411525, 5479403, 5565735, 5583100, 5690539, 5923368, 5935847, 5465334]
15483E465334p95749q12969o71863n99922n26548j80106L14005O13471N84072
15474C389725K79616j40023m52333m99310l77645k40248p1195P9481m6562m73588
15464A447918q16350q56532p23899n73321m44350l60450l27911l28575k95608
15455c279078j54664M5299J01819K8306J782N7616J56820L51868P68143J262022
15445f60067J457944J253959R72407Q21396O85010M60331J04679l71563q13986
15436C910110j019980r08447n71700r6887M03846O17926L67188r2598l71958l36073
15426A901427p3650L30866O67583P50579N86203K83982J20098K88483N94616P72244
15416F222431P83991Q12592Q97545P28172J85907m77286r61188j193628j217632
$$ y = [5465334, 4669585, 3856616, 3184753, 2584831, 2058283, 1878177, 2192182, 2805653, 3389725, 3669341, 3529318, 3076985, 2577675, 2200030, 1959782, 1888587, 1968068, 1921506, 1447918, 631568, -224964, -948863, -1522184, -1966534, -2326984, -2654895, -2983470, -3279078, -3433742, -3388443, -3286624, -3258318, -3256536, -3198920, -3042100, -2690232, -1922089, -660067, 797877, 2051836, 3024243, 3845639, 4530649, 4990980, 5095659, 4724096, 3910110, 2890130, 1981683, 1409983, 1313096, 1716942, 2334868, 2702056, 2609458, 2237500, 1901427, 1827777, 2158643, 2826226, 3576805, 4163008, 4446990, 4567088, 4855571, 5450187, 6222431, 7006422, 7819014, 8716559, 9444731, 9630638, 9153352, 8192164, 6998536, 5780904]
15407E780904r83952n18980k3542K87132K89819Q9482j04278j83210q3249K00021
15397D750147N60345P98357P36291L90219K7873P296M29752R27003J222448J475873
15387A1325604J872221K392883K790469K841243K664394K563466K743045L143577
15379C2336902L661864M452550N628900O955175Q351502J0302102J3254695J7112410
15371A02056100K1451147K5903632L0110918L2975602L2015692K4111358Q528307
15364B77152756r856045k3629180k9473532k8954982k5146089k0582789j6718395
15357A22791744j3839307j1633701r793656q067964o335453m666123l138121j674443
15349F3642976j89431J261949K477466L353796M135041N338150P354121J0147694
$$ y = [5780904, 4796952, 4277972, 4254430, 4541562, 4831381, 4920863, 4816585, 4633375, 4550126, 4750147, 5310492, 6108849, 6845140, 7235359, 7263232, 7270528, 7700280, 8627283, 9849731, 11325604, 13197825, 15590708, 18381177, 21222420, 23886814, 26450280, 29193325, 32336902, 35998766, 40451316, 46080216, 53035391, 61386893, 71688995, 84943690, 102056100, 123507247, 149410879, 179521797, 212497399, 244513091, 268624449, 277152756, 267296711, 243667531, 214193999, 185239017, 160092928, 139510139, 122791744, 108952437, 97318736, 87525080, 79457116, 73121663, 68455540, 65317419, 63642976, 63453545, 64715494, 67192960, 70546756, 74681797, 80019947, 87374068, 97521762]
15341I7521762J3406606J7126696K1691114K7398610L4253393M1899400M9468384
15334C02765965N5033518N4392338M1826013J5825357j5033038l7834604m7235293
15327C69740256m6439453m0644826l3337970k6060963j9343166j3280860p597614
15320A83035404j962469L421524P508608R022399P211098K292045m054403r079631
15312A97394575j0821472r266317n490992o18493M528620R269992J2701736J3410708
15304B11108357R730712J364860q688199j5948091j8600821j7869581j5538481
15297A45558756j2571250r473243o588466l933920j367365R78818K649285L315083
15289A18567698K702921M16597l133727o562977q677414r190357q544445p406734
$$ y = [97521762, 110928368, 128055064, 149746178, 177144788, 211398181, 253297581, 302765965, 357799483, 412191821, 454017834, 469843191, 454810153, 416975549, 369740256, 323300803, 282655977, 249318007, 223257044, 203913878, 190633018, 183035404, 181072935, 184494459, 192003067, 201025466, 208236564, 210528609, 206474206, 197394575, 186573103, 177306786, 171815794, 171197301, 175725921, 184995913, 197697649, 211108357, 220839069, 222203929, 213515730, 197567639, 178966818, 161097237, 145558756, 132987506, 123514263, 116925797, 112991877, 111624512, 112603330, 115252615, 118567698, 121270619, 121687216, 118553489, 111990512, 103313098, 94122741, 85578296, 78171562]
15281G8171562o200302m956536l625506k297235j135206l68484j00075k02014
15273E9286204m03880l35983J15935O47427R79253J140153J222624J177246J011850
15264F4840829R33566J081130J345563J699823K272009K996819L549192L662105
15256H2381036L351596K788205K182092J779212J638902J630008J887285K619840
15248A00258176L570783M283325M674956M970816N280762N535815N781263O184643
15240A40540539O809307P493671P776853P247974O223894N258512M508038L961848
15232A89820636L408530K488873J221186r0647j190736j746236j523598o28527
15224A91759481N58085J493610J999305K255073K229450J755159R50451L5714
$$ y = [78171562, 71971260, 67014724, 63389218, 61091983, 59956777, 59588293, 59488218, 59286204, 58882324, 58546341, 58662276, 59309703, 60288956, 61429109, 62651733, 63828979, 64840829, 65774395, 66855525, 68201088, 69900911, 72172920, 75169739, 78718931, 82381036, 85732632, 88520837, 90702929, 92482141, 94121043, 95751051, 97638336, 100258176, 103828959, 108112284, 112787240, 117758056, 123038818, 128574633, 134355896, 140540539, 147349846, 154843517, 162620370, 169868344, 176092238, 181350750, 185858788, 189820636, 193229166, 195718039, 196939225, 196848578, 195657842, 193911606, 192388008, 191759481, 192317566, 193811176, 195810481, 198065554, 200295004, 202050163, 203000614, 203036328]
15216B03036328r58647k045716l127476m176172n308391o460019p345093p754535
15208A65860279p774933p662939p487374p070116o374356n718656n390848n323793
15200A13057264n381448n341757m973042m448499m195747m324594m510537m414449
15192G5467191l984301l304579k603920k132388j765970j356268j086481j099990
15184E8133294j169402r73410o29774n27588p36023j029439j199436j250410j350964
15175D9266848j490536j435476j124235p50927m80662l17663l39882m92473l73716
15166D2461278J81104Q25478J073488Q98534N98884K49372k17935q75211j629040
15157D3565952k157496k235776j830511j178699n85153j76912J7006K10253O26718
$$ y = [203036328, 202077681, 200031965, 196904489, 192728317, 187419926, 180959907, 173614814, 165860279, 158085346, 150422407, 142935033, 135864917, 129490561, 123771905, 118381057, 113057264, 107675816, 102334059, 97361017, 92912518, 88716771, 84392177, 79881640, 75467191, 71482890, 68178311, 65574391, 63442003, 61676033, 60319765, 59233284, 58133294, 56963892, 55990482, 55360708, 54833120, 54097097, 53067658, 51868222, 50617812, 49266848, 47776312, 46340836, 45216601, 44465674, 43985012, 43667349, 43327467, 42834994, 42461278, 42642382, 43467860, 44541348, 45439882, 46038766, 46288138, 46070203, 45194992, 43565952, 41408456, 39172680, 37342169, 36163470, 35578317, 35401405, 35418411, 35628664, 36255382]
15148C6255382J076014J341496J480692J630171J815586J937127J871505J545414
15140D8953387J050330N04073r2382o36110r96771j235757j394763j495162j569660
15131D3087185j590215j576826j483867j199570p13120p7153N03433O75737K43142
15122C7868746n29246j120717j287442j182428j102721j037040p71680l42009
15114C0495463J09812N96267J103369J432528J517203J430233J227190R84829
15106C8896894P42515N03694K03905j29161l98619n77373n95394l71058N3093
15097C8328496L85156K56293l08728q80446j107698j037483q46115m61868J25956
15088C4453563O30894Q54206Q29757O32340K76399k30031p40775j063131j189715
$$ y = [36255382, 37331396, 38672892, 40153584, 41783755, 43599341, 45536468, 47407973, 48953387, 50003717, 50507790, 50415408, 49779298, 48782527, 47546770, 46152007, 44656845, 43087185, 41496970, 39920144, 38436277, 37236707, 36523587, 36446434, 36949867, 37625604, 37868746, 37339500, 36218783, 34931341, 33748913, 32646192, 31609152, 30837472, 30495463, 30605275, 31201542, 32304911, 33737439, 35254642, 36684875, 37912065, 38896894, 39639409, 40143103, 40347008, 40217847, 39819228, 39241855, 38646461, 38275403, 38328496, 38713652, 38969945, 38661217, 37780771, 36673073, 35635590, 34789475, 34327607, 34453563, 35084457, 35938663, 36768420, 37400760, 37677159, 37447128, 36706353, 35643222, 34453507]
15079C4453507j372777j694732j722225j090956q0253O89667R03493O88899K69579
15070C1044202j51849m22777n15574n01282m53456m64109o00297q27280r44987
15061B6162591p51339l90640j54916j61283l43768n97087q03350r03719r84636
15052B1071853j047986r52436o88753m30540l04748l44201n64659p96365p38784
15043A5203381m72461l25527k64274j13758Q2830J18189k0348k01522l66831l97050
15033A3242629j37848L85188Q00032O60055k5457q44267j344771j350124j068272
15024A0317165p17631k94340P2015J37736L295m0631P7116K38172L63674N14116
15014A0670687P39767Q38408N95080J89422J50990N72701J040416J271720J133947
$$ y = [34453507, 33080730, 31385998, 29663773, 28572817, 28492564, 29182231, 30085724, 30774623, 31044202, 30892353, 30469576, 29954002, 29452720, 28999264, 28535155, 27934858, 27107578, 26162591, 25411252, 25020612, 24865696, 24704413, 24360645, 23763558, 22960208, 22056489, 21071853, 20023867, 19071431, 18382678, 17952138, 17647390, 17303189, 16738530, 15942165, 15203381, 14730920, 14405393, 14141119, 14027361, 14110191, 14228380, 14208032, 14006510, 13639679, 13242629, 13104781, 13489969, 14290001, 14950056, 14924599, 14080332, 12735561, 11385437, 10317165, 9599534, 9305194, 9377209, 9514945, 9518240, 9477609, 9554725, 9792897, 10156571, 10670687, 11410454, 12248862, 12843942, 13033364, 13184354, 13757055, 14797471, 16069191, 17203138]
15005A7203138N95529k26574j109466j730148j833652j481438j002503o75731
14997I739155n06474k54839K26497O92271Q12505O84907N40050K83691k02859
14988A2014904o74836q57527r00969j090623j341334j417333j219089p83323j78052
14979C551818N76225J221883J411850J160881P42240K80695j10257j91444J4292
14970H658183K09580J29496p6853j33836j79676l36520m34194m43336m59844m84448
14960F448552m82415l20407J22873O59364R00365O33639K7475n16170p16470n49679
14950F207127j04616M61047R39876J177348J086728P27923K72032j40094l79355
14941A0248016k86750M3642K55058J83882N0750K2516q4734l19144m73187n71905
$$ y = [17203138, 17798667, 17572093, 16462627, 14732479, 12898827, 11417389, 10414886, 9739155, 9232681, 8977842, 9204339, 9896610, 10709115, 11394022, 11934072, 12217763, 12014904, 11340068, 10482541, 9581572, 8490949, 7149615, 5732282, 4513193, 3729870, 3551818, 4128043, 5349926, 6761776, 7922657, 8664897, 8945592, 8835335, 8643891, 8658183, 8867763, 8997259, 8920406, 8786570, 8606894, 8270374, 7836180, 7392844, 6933000, 6448552, 5966137, 5645730, 5768603, 6427967, 7328332, 7961971, 7989446, 7473276, 6756806, 6207127, 6102511, 6563558, 7503434, 8680782, 9767510, 10495433, 10767465, 10627371, 10248016, 9961266, 10004908, 10259966, 10443848, 10494598, 10517114, 10432380, 10113236, 9640049, 9068144]
14931I068144p76811r93528r28536n44208j49567R6749K99516N47575P93771R16059
14921H329164Q12012M81426N4802j73972n9949J25516P4709k92706p57616q67643
14911G725743n31086n8305K79234M06929M43041N28679O19282O17018N14652K18627
14901A0763814l91861j079088j477577j646519j724881j535530r66972k32784
14893A708602L01363N17696N47512M61435L14752L25380N56969Q11090Q37734
14884F382533M94728J192l15985l33451o2609L33762O67866Q45794P57589L42598
14874I114017k16185o33316q76087r01142o42268l10145j14293K0277K37917M01781
14864F080556K71670k0432j53730j37397k05900l17208k31807l6807r5977m48828
$$ y = [9068144, 8291333, 7297805, 6369269, 5825061, 5675494, 5772243, 6071759, 6619334, 7413105, 8329164, 9141176, 9622602, 9677404, 9503432, 9443483, 9568999, 9643708, 9351002, 8593386, 7725743, 7194657, 7136352, 7415586, 7822515, 8265556, 8794235, 9413517, 10030535, 10545187, 10763814, 10371953, 9292865, 7815288, 6168769, 4443888, 2908358, 1941386, 1708602, 2009965, 2527661, 3075173, 3536608, 3851360, 4176740, 4733709, 5544799, 6382533, 6877261, 6878453, 6562468, 6229017, 6166408, 6500170, 7168036, 8013830, 8771419, 9114017, 8897832, 8264516, 7388429, 6487287, 5845019, 5534874, 5420581, 5440858, 5678775, 6080556, 6352226, 6331794, 6178064, 6040667, 5834767, 5517559, 5285752, 5248945, 5152968, 4704140]
14854D704140p87027r13063p92107m10105J34456P10590J084833J014670P83429
14845E529816P17449P22801P00568O13943L87916L7577k00249k03459j72197k95422
14835G838743n58846q85309j218423j367111j180432p35445l2168P70895J100538
14826C732442O50493k03130q95840j146807q72255j53133O58277J198698J378244
14817D346989J259591J000816Q44147P31867M49292k8919o29156j149925j389571
14808E435131j403479j276871j013984o60428k27121K89271P63744J001713Q86057
14799C794033M98191P0663k52040n49029q05362o32308R8521Q95214J297985J196698
14789E612566P01929M1745m37051m86743k67869r4938j21697k64240m08104n25415
$$ y = [4704140, 3917113, 3004050, 2211943, 1801838, 1936294, 2646884, 3731717, 4746387, 5529816, 6247265, 6970066, 7670634, 8284577, 8672493, 8710070, 8509821, 8306362, 8134165, 7838743, 7279897, 6394588, 5176165, 3809054, 2628622, 1893177, 1861009, 2631904, 3732442, 4382935, 4179805, 3283965, 2137158, 1264903, 1111770, 1770047, 2968745, 4346989, 5606580, 6607396, 7451543, 8183410, 8632702, 8603783, 7974627, 6824702, 5435131, 4031652, 2754781, 1740797, 1080369, 853248, 1142519, 1906263, 2907976, 3794033, 4292224, 4362887, 4110847, 3561818, 2756456, 2124148, 2222669, 3117883, 4415868, 5612566, 6314495, 6356240, 5919189, 5432446, 5164577, 5069639, 4947942, 4683702, 4275598, 3750183]
14779C750183n52326m23404j32875K09382M78147N95880N28972L55082K31413
14770E040454K62845L27378K50477K5832l00982n48124n12873l41946j99152o2181
14760C941728K9489J4639j8656N3558J99468K72488J37927k17345n07978l66872
14750C538446K4160K23146K72861L55230L93541L15505J75623k8039k87155m86764
14740D496554n52055m76759k87144o5672Q1709K0003k57201m16994k00764K33379
14730B575056N09789N50762N49282N70076N33586L65577J19112k08016n39064
14721E026160o03412m88054m85710n61278n98317o68490p26727o37124m78536
14712b21488l81075k81302l9452K96479N99629Q59270J037550J041764Q93191
$$ y = [3750183, 3197857, 2774453, 2641578, 2850960, 3329107, 3924987, 4453959, 4809041, 5040454, 5303299, 5630677, 5881154, 5906986, 5606004, 5057880, 4545007, 4203061, 4003909, 3941728, 3971217, 3985856, 3967200, 4020758, 4220226, 4492714, 4630641, 4413296, 3905318, 3538446, 3562606, 3785752, 4058613, 4413843, 4807384, 5122889, 5298512, 5270473, 4983318, 4496554, 3944499, 3467740, 3180596, 3114924, 3196633, 3216636, 2959435, 2542441, 2341677, 2575056, 3084845, 3635607, 4184889, 4754965, 5288551, 5654128, 5773240, 5565224, 5026160, 4422748, 3934694, 3448984, 2887706, 2289389, 1620899, 894172, 257048, -221488, -602563, -883865, -923317, -626838, -27209, 832061, 1869611, 2911375, 3804566]
14703C804566P66613P00930M98246M9502m71462q13036r46942r33932q05735o75824
14693A172926o50659o52455n63570l26933R5146O90598J207446J329042J079761
14684C381302O63926K33690j30060m63026q43371j194933j208327p65270j91823
14675e17892K46945M74841M41689K84741J53376p913k33407m73933o64171o38892
14665i34616l45751j3929J79092L13699M05294L03010J9404j99772j31249J69422
14655b35396L75040L88709M06760L44244n493m70589p77431q87695q97384q60825
14645b620060p14093l38720J91098O20195P59446O97842O66219O40916N32976
14636D35819M40148M40626L98583J80835j70926n22718p46069p76491o94873o21924
$$ y = [3804566, 4571179, 5272109, 5770355, 5819857, 5348395, 4535359, 3588417, 2654485, 1848750, 1172926, 522267, -130188, -693758, -1020691, -925545, -234947, 972499, 2301541, 3381302, 4045228, 4278918, 4148858, 3685832, 2842461, 1647528, 439201, -326069, -517892, -270947, 203894, 645583, 930324, 1083700, 1075787, 842380, 368447, -295724, -934616, -1280367, -1294296, -1115204, -801505, -396211, -93201, -73797, -273569, -404818, -235396, 139644, 528353, 935113, 1279357, 1273864, 803275, 25844, -861851, -1759235, -2620060, -3334153, -3672873, -3481775, -2861580, -2102134, -1404292, -738073, -97157, 435819, 875967, 1316593, 1715176, 1896011, 1725085, 1202367, 456298, -320193, -1015066, -1636990]
14626a636990n25525k91339L2116K85332M33693N17787M69762K31053m5013k33917
14616g63041m40985o07336n64898l78560k59296k29757j39370Q3273L29204L99605
14606b571161K33948l8438k38974k61677p8661J74891L04337K58396j1252m80636
14596b709227q36940p49610k71384K51674O89560J040247J269350J344059J240034
14587A267763J023312Q76387Q74305Q78070P15136L15210j92516m95254m49583
14578D812830l12568k68047j52153J20502M59321P73735Q89830O62923K91163
14569G277536N9235K0519P2756M2553j84355n08043o82780p29497q58996r75627
14559C533301q96963o38506k50907J44558L04970Q3477l04159m53204k49891K07838
$$ y = [-1636990, -2162515, -2453854, -2421738, -2136406, -1702713, -1184926, -715164, -484111, -529124, -763041, -1204026, -1811362, -2376260, -2754820, -3014116, -3243873, -3383243, -3299970, -2970766, -2571161, -2337213, -2375651, -2614625, -2876302, -2954963, -2780072, -2475735, -2217339, -2228591, -2709227, -3546167, -4295777, -4567161, -4315487, -3625927, -2585680, -1316330, 27729, 1267763, 2291075, 3167462, 4041767, 4919837, 5634973, 5950183, 5757667, 5262413, 4812830, 4500262, 4232215, 4080062, 4200564, 4659885, 5433620, 6323450, 6986373, 7277536, 7336771, 7357290, 7430046, 7472599, 7288244, 6780201, 6097421, 5367924, 4508928, 3533301, 2636338, 1997832, 1746925, 1891483, 2196453, 2279930, 1975771, 1522567, 1272676, 1480514]
14549A480514P22344R02702O29155L01516K37225K70707J39853j83182n79546
14540C921288r02394j014332q46628n16304j77195J12880K46192J14775j55254
14531G83028l42895m51234n92808p28430o44499j81656M98154R26134P42874J08032
14521A16700m35303n27550l11508k45426m50785o25549o02986m61646l06870j54292
14511d005215j3241k0126k52912m52369k75994K59539Q09119R92508P73150M70059
14501a715482K90538K07902K00711L34144O34181Q75493Q30793O43941N09429
14492B811650M64641M71590M34432L18842K29104K94990N10219P94387J017472
14483G347327J004119O53866O5661m71299p60945q39198q15550o90282n98760
$$ y = [1480514, 2202858, 3105560, 3734715, 4036231, 4273456, 4544163, 4684016, 4500834, 3921288, 3018894, 2004562, 1157934, 641630, 464435, 577315, 823507, 938282, 783028, 440133, -11101, -603909, -1332339, -1976838, -2158494, -1660340, -734206, 8668, 116700, -318603, -846153, -1157661, -1403087, -1853872, -2479421, -3082407, -3544053, -3850923, -4005215, -4018456, -4038582, -4291494, -4743863, -5019857, -4760318, -3951199, -2958691, -2185541, -1715482, -1424944, -1217042, -1016331, -682187, -48006, 827487, 1658280, 2302221, 2811650, 3276291, 3747881, 4182313, 4501155, 4730259, 5025249, 5535468, 6329855, 7347327, 8351446, 9005312, 9070973, 8599674, 7838729, 6999531, 6183981, 5493699, 4894939]
14474D894939o97759p72516o55590n79253o11818n29838m49865o32019q62374
14465h96093p72265k99981L35751P97917Q62543O54591M43369L49834L01019K42542
14455B019227K38442K88831L13625K08237j18626n49272q28681q66958q11982
14446a07157p97961o68336k07155M15574Q03575R06620Q75030O96728L70650P3659
14436B361227j3219P0373K35298L82999L55824J60222j22472m06531m90077k70225
14426B263419J15347M50996N38876M34274K80449n608l56844o29653j020858j467738
14416F02660j598955j474313j316336j023207n56639j71092o8197k32990m05836
14407f244905l00297J18840O48537R91791R95003P96647O43103O36895O80640
$$ y = [4894939, 4197180, 3424664, 2769074, 2189821, 1578003, 1048165, 598300, -33719, -896093, -1668358, -1968339, -1632588, -834671, 27872, 682463, 1125832, 1475666, 1776685, 2019227, 2257669, 2546500, 2860125, 3068362, 2949736, 2400464, 1571783, 704825, -107157, -905118, -1573454, -1780609, -1365035, -561460, 345160, 1220190, 1916918, 2287568, 2361227, 2348008, 2418381, 2653679, 3036678, 3392502, 3552724, 3430252, 3023721, 2533644, 2263419, 2378766, 2829762, 3368638, 3802912, 4083361, 4077753, 3720909, 3091256, 2070398, 602660, -996295, -2470608, -3786944, -4810151, -5366790, -5537882, -5606079, -5839069, -6244905, -6545202, -6426362, -5777825, -4786034, -3791031, -2994384, -2351281, -1714386, -1033746]
14398a033746O55434P43739J020227J056434N63683j22655n18739n60900n34778
14389A268699o40127p05470n87692m12331k59096j22100k6055J5321j9335L098
14379a485088K37486N84717Q50016Q91957Q50075R11295J000660R63126Q24312
14370E628556O68691M53953J37080k72370o57042q71679r79256j034140r00116
14361B173677o43238o15917q85923j098639r20633l78997J55383M26043O42742
14352a145502J038460J433463J502129J089145L97348j1541Q7317L21081L11423
14343E023323P2012k55531n67840o18690l04410K3064K1344j75125k41540j68190
14333B808417j60274k91711m43300m39040k55012Q662L19792O52045Q92093Q39549
$$ y = [-1033746, -378312, 365427, 1385654, 2442088, 3005771, 2883116, 2364377, 1803477, 1268699, 628572, -76898, -664590, -1076921, -1336017, -1458117, -1484172, -1468851, -1488186, -1485088, -1247602, -662885, 187131, 1079088, 1929163, 2840458, 3841118, 4804244, 5628556, 6297247, 6751200, 6888280, 6615910, 5958868, 5087189, 4107933, 3073793, 2173677, 1530439, 914522, 28599, -1070040, -1990673, -2369670, -2214287, -1788244, -1145502, -107042, 1326421, 2828550, 3917695, 4315043, 4303502, 4390819, 4711900, 5023323, 5095335, 4839804, 4271964, 3653274, 3348864, 3371928, 3393272, 3218147, 2976607, 2808417, 2648143, 2356432, 1913132, 1474092, 1219080, 1227742, 1547534, 2199579, 3091672, 3931221]
14323C931221M54420N4725l8741k0692k19269m55817n11563m77354m48083n05667
14313A763180o50477o39323k84750J83058L93379K34544k0779K835L23303P37138
14303B042108J053818J129628Q62981L05806l07273p69312r91264q73494l62872
14294B090126L04119P61476P81483L88594q5191l44492l73634j51806L10513O77129
14284D358317P26026O25263N36592L78353m2868o59598j193175j381613j043539
14275B303758m21248L2459J57261q6333o76133j221398j349541j014396l42666
14266b618237M22056J093426J520316J499126R25292O5910n23109o06456n09840
14257A268484n95626q26253r20080q65788q19249p54247o21563m27108k42237
$$ y = [3931221, 4385641, 4440366, 4401625, 4380933, 4161664, 3705847, 3194284, 2716930, 2268847, 1763180, 1112703, 473380, 188630, 371688, 765067, 999611, 978832, 981667, 1304970, 2042108, 3095926, 4225554, 5088535, 5394341, 5087068, 4317756, 3326492, 2452998, 2090126, 2394245, 3155721, 3937204, 4325798, 4240607, 3896115, 3522481, 3370675, 3681188, 4358317, 5084343, 5709606, 6246198, 6624551, 6581683, 5922085, 4728910, 3347297, 2303758, 1882510, 1914969, 2072230, 1985897, 1309764, 88366, -1261175, -2275571, -2618237, -2196181, -1102755, 417561, 1916687, 2841979, 2907889, 2384780, 1778324, 1268484, 672858, -153395, -1073475, -1939263, -2758512, -3512759, -4134322, -4561430, -4803667]
14248d803667k22409l89562m63631j80119L62212Q98557J416295J937975K174729
14239G30380J814787R62490l0705q13289j114446r84079o71863m22663m45949
14230i75337p34040r61979p85318l13411J9931J9326j74358m44460o53578n66710
14220e569934k98002j66319j34601M1552L86416O04461O02366O31992P68201Q93799
14210b240069R50737R59434R27573Q63600P06317L45504r6299l68849m30954l35580
14200A281414j27975O0949J96661L84607N68725N53384L27171l1499m22547o36611
14190B154279n55234k55597J46885M55563M89985M57678P46452J233174J376691
14181F249876J000084L95749r5740k42124q7998q3425n51220j283667j782958
$$ y = [-4803667, -5026076, -5415638, -5879269, -6059388, -5697176, -4798619, -3382324, -1444349, 730380, 2545167, 3507657, 3476952, 2663663, 1549217, 565138, -106725, -529388, -975337, -1709377, -2671356, -3456674, -3770085, -3750154, -3730828, -3905186, -4349646, -5003224, -5569934, -5867936, -6034255, -6168856, -6127304, -5740888, -5136427, -4534061, -3902069, -3133868, -2240069, -1289332, -329898, 597675, 1461275, 2167592, 2513096, 2416797, 2047948, 1616994, 1281414, 1153439, 1214388, 1411049, 1795656, 2364381, 2917765, 3244936, 3213437, 2790890, 2154279, 1599045, 1343448, 1490333, 1945896, 2435881, 2893559, 3640011, 4873185, 6249876, 7249960, 7645709, 7549969, 7307845, 7219847, 7136422, 6585202, 5301535, 3518577]
14172C518577j701458j165987n41872m9232K22707L26410M06926M43607M17173
14163A876851M17443N17981P18776Q46273O56013K20107j67797l85317m67465
14154D232865m90220m36149j61019L18308O93398O74853K25323m06822r63417
14145C687120j341917j416524j147758q16902p27439r35388j187124j169831r59074
14136f014837p63467o66359o75035o79568o29948n10357k80169N789K35248L16842
14126i661861K52106L01967O62174J013939J015798Q64653R84335J358856J602269
14117a605764J504512J246755R85623O11728J37371l05253o73924q88301p96789
14108B15958m06517j2625K10207L99813N15357K62381k21395m69662l59172r8088
$$ y = [3518577, 1817119, 651132, 109260, 60028, 282735, 609145, 1016071, 1459678, 1876851, 2294294, 2812275, 3531051, 4377324, 5033337, 5253444, 5085647, 4700330, 4232865, 3742645, 3306496, 3145477, 3463785, 4157183, 4832036, 5057359, 4650537, 3687120, 2345203, 928679, -219079, -1035981, -1763420, -2698808, -3885932, -5055763, -6014837, -6778304, -7444663, -8119698, -8799266, -9429214, -9939571, -10219740, -10213951, -9978703, -9661861, -9409755, -9107788, -8445614, -7431675, -6415877, -5551224, -4566889, -3208033, -1605764, -101252, 1145503, 2131126, 2742854, 2880225, 2574972, 1901048, 1012747, 215958, -190559, -203184, 7023, 406836, 922193, 1184574, 963179, 493517, 134345, 36257]
14098C6257K02953M22501L72874K05119J50293O0833j76081k74042j20263K9754
14088I10198J828q2348l4572J04532J39434k4504k70138m62416n95531n83238
14078h96755l10649J42123N48449O40921M27854K51753M23882Q83968J172867
14069C284413J001004N00456k6351m03831o92902q37150o40429j77999K02833
14060B210044K50969J04593M3991O6295J6819j4691Q9765J48126O987j33810q1541
14049B707547K8426N7859j0369k42651n69775q10250r21236q83652o40976l05590
14039a590667p8160K939k055j3081k310r3239l51632n71841n94028n16031l62204
14028d172309q5700J81766K98257K80122K69778L83284N89510O78655N21779L29757
$$ y = [36257, 239210, 661711, 1034585, 1239704, 1389997, 1450830, 1274749, 1000707, 880444, 910198, 912026, 829678, 795106, 899638, 1039072, 1014568, 744430, 282014, -313517, -896755, -1207404, -1065281, -516832, 124089, 551943, 803696, 1227578, 2111546, 3284413, 4285417, 4785873, 4759522, 4355691, 3662789, 2825639, 2185210, 2007211, 2210044, 2461013, 2565606, 2609597, 2675892, 2692711, 2678020, 2767785, 2915911, 2922898, 2789088, 2707547, 2735973, 2793832, 2783463, 2540812, 1971037, 1160787, 239551, -644101, -1285077, -1590667, -1668827, -1665888, -1667943, -1681024, -1683334, -1776573, -2128205, -2700046, -3294074, -3810105, -4172309, -4258009, -4076243, -3777986, -3497864, -3228086, -2844802, -2255292, -1576637, -1054858, -725101]
14018g25101K78901K18355n7817m98758p78398o63331l21942J7042J93755Q7559
14008b249735j38804k06683j67816j97403k89324l92079n30461o06622m58056
13999e236983k16557k3794K24521N90450Q76718Q37086O04388M79613M76763N05841
13989h81954M79248K76400p1894m18232o37475o47794m45476j91547l83K68839
13979b270268O84075J013425J116232J074768R48837P43179N36462M18892L13223
13970D578825J19109k27890p67629j263061j255654o90287P133M84455O08150
13961A593151M97878M55723O32486R49204J181324J118572P66712K28226m20862
13952G002414j021758j351636j264288q00746j58827L55464M99545L29076J80828
$$ y = [-725101, -446200, -227845, -285662, -784420, -1562818, -2226149, -2548091, -2531049, -2337294, -2249735, -2388539, -2595222, -2763038, -2960441, -3249765, -3641844, -4172305, -4778927, -5236983, -5453540, -5477334, -5252813, -4662363, -3785645, -2948559, -2344171, -1864558, -1387795, -881954, -402706, -126306, -198200, -616432, -1253907, -1901701, -2347177, -2538724, -2539107, -2270268, -1586193, -572768, 543464, 1618232, 2567069, 3310248, 3846710, 4265602, 4578825, 4697934, 4470044, 3702415, 2439354, 1183700, 493413, 500546, 985001, 1593151, 2091029, 2546752, 3179238, 4128442, 5309766, 6428338, 7195050, 7423276, 7002414, 5980656, 4629020, 3364732, 2563986, 2405159, 2760623, 3260168, 3589244, 3770072]
13943C770072K85226N87847P73488N53834P6900l34649n81030q04710j147124
13934C179854j538447j830971j824686j292593m20543K95769O53748O69805M22136
13925a685928P8556k10324l00802j37687J84307M89036O16349N21949K98359J78490
13915C2305L94120O94021O15913J91160j89094k76189r1499J70662L27830L13597
13905B182826N3197l55527o47820p76842q78408r64192q93284n52962J15411R32399
13895a785202J419941J320705R60934P18389M77228J01378k39142m14391m45205
13886B114635n40302r19554j386190j589927j493079j243433q91198m50010k2424
13877f421482K18220J88026J9898q1551P8512N39186R87429J108625R72302P41917
$$ y = [3770072, 4055298, 4643145, 5416633, 5970467, 6047367, 5712718, 5131688, 4326978, 3179854, 1641407, -189564, -2014250, -3306843, -3727386, -3431617, -2777869, -2108064, -1685928, -1607372, -1817696, -2118498, -2256185, -2071878, -1582842, -966493, -444544, -146185, 32305, 426425, 1120446, 1736359, 1927519, 1738425, 1462236, 1370737, 1541399, 1869229, 2182826, 2236023, 1880496, 1232676, 455834, -422574, -1386766, -2280050, -2833012, -2717601, -1785202, -365261, 955444, 1916378, 2634767, 3111995, 3213373, 2974231, 2559840, 2114635, 1574333, 654779, -731411, -2321338, -3814417, -5057850, -5949048, -6399058, -6421482, -6203262, -6015236, -5995338, -6076889, -5998377, -5459191, -4471762, -3363137, -2390835, -1648918]
13867a648918M86274K62083R5528O0777Q7964O9946M2645o2529k79126l65502
13857a250858j89974N161o7816l08357l73222j18748K63536M74119L93161J32470
13847a040528r9573k46233l80602n37266o76266o56582l91306k8377K20139L05516
13837c531078K38872L6846j16147j97976k34999k3895M61138J069951J685787
13828f11501K034134J916170J481067R29792L33894l15072r52672j373663j395720
13819B046429j050693n58286j47569Q985q9260j73961j21175j32935l14067m58728
13809i91260l26546J00678N57158P92635P55876M60895N8970l58827p01611p47147
13799c99179m06824J53264O53718R18149R63240Q29657M90374J03674o2613Q9798
$$ y = [-1648918, -1162644, -900561, -805033, -744256, -656292, -586346, -543701, -606230, -885356, -1250858, -1440832, -1435671, -1503487, -1811844, -2185066, -2303814, -2040278, -1566159, -1172998, -1040528, -1140101, -1386334, -1766936, -2304202, -2980468, -3637050, -4028356, -4056733, -3836594, -3531078, -3292206, -3255360, -3371507, -3569483, -3804482, -3828377, -3367239, -2297288, -611501, 1422633, 3338803, 4819870, 5749662, 6083556, 5768484, 4815812, 3442149, 2046429, 995736, 437450, 289881, 298866, 209606, 35645, -85530, -218465, -532532, -991260, -1317806, -1217128, -659970, 132665, 888541, 1349436, 1408406, 1049579, 347968, -399179, -806003, -652739, 979, 919128, 1882368, 2712025, 3202399, 3306073, 3243460, 3333258]
13789C333258L52296M54046L41854J09119j77483m55565n76741m25077j87854
13780B767853j25680k69080n11608o94670p80483q36419q12334o83247m38278
13771b383946K0008O63575J283993J616040J597690J264471O45986l8843n07820
13762D161154p02081p20159n90024l08436r4921k50559p93563j375606j544238
13753b218433j250828q85832p14943o01047l01243J88197O03817Q09986J022667
13744c347659J274418J267882R74820P08705O98200Q33953Q67043P09213L99625
13735D386200r864l93100n94875n30976k39382n7606j74887l41055l88994m41581
13725A213880n53177n47540l27640q2945j10797m11360o43678n97823l51264q1047
$$ y = [3333258, 3685554, 4139600, 4481454, 4590573, 4413090, 3957525, 3380784, 2955707, 2767853, 2642173, 2373093, 1861485, 1166815, 386332, -450087, -1262421, -1945668, -2383946, -2363938, -1700363, -416370, 1199670, 2797360, 4061831, 4707817, 4668974, 4161154, 3459073, 2738914, 2148890, 1840454, 1745533, 1494974, 701411, -674195, -2218433, -3469261, -4355093, -5070036, -5671083, -5972326, -5784129, -5180312, -4370326, -3347659, -2073241, -805359, 169461, 878166, 1576366, 2410319, 3277362, 3986575, 4386200, 4376336, 3983236, 3388361, 2857385, 2618003, 2560397, 2385510, 2044455, 1655461, 1213880, 660703, 113163, -214477, -297422, -408219, -819579, -1463257, -2061080, -2412344, -2493391]
13715b493391j9339k43401l77113j71537N1194O3478Q0679K35522L89883N32051
13705a951974P57019Q71012O29351K00343l0112Q7388L49218N53909O23924M71968
13695B562046J39245k34723l64145k5485M55858N29864J19870l91489o87472p46239
13685A357330o38559m03923n1988M42877R31846J061150P34838K98707N2400l3872
13675C750806j86444m38441m76303j84282Q5917J38200J14388K23859N07655P32595
13665D267950O87845M46135J67549j20785l95660n61154n77379m46846j98962
13656C268693r7q824j58444k95396l52582l23894k05770l0872j1487k74953o04170
13645A002204p54266o51081l06062J21690L83771L77572L08823L96522N70511
$$ y = [-2493391, -2512730, -2756131, -3133244, -3304781, -3253587, -3190109, -3109430, -2873908, -2484025, -1951974, -1194955, -323943, 305408, 505751, 475639, 563027, 912245, 1466154, 2090078, 2562046, 2701291, 2466568, 2102423, 2076938, 2532796, 3062660, 3182530, 2791041, 2103569, 1357330, 718771, 314848, 262860, 705737, 1637583, 2698733, 3433571, 3732278, 3784678, 3750806, 3564362, 3125921, 2649618, 2465336, 2551253, 2689453, 2803841, 3027700, 3535355, 4267950, 4955795, 5401930, 5569479, 5448694, 5053034, 4491880, 3914501, 3467655, 3268693, 3268596, 3259772, 3101328, 2805932, 2453350, 2129456, 1923686, 1892814, 1881327, 1606374, 1002204, 247938, -403143, -709205, -587515, -203744, 173828, 482651, 879173, 1449684]
13636A449684N81358L46748L8332k04808m10713o24116p34206n94273j73406L94090
13626F8690Q79616R76004N89416K0807m77786q76751j076588q73963l92694m7056
13616a210305J2194j15444k06575m4995K22101K85373J27343L7722J57837L10985
13606d23764K78021J31650J36537K81248L31338L28776M80960P22176Q01725N01617
13596C570284m7359l59252k81244l9814K10205M00215N19580N90217N07618K26753
13586E297203n8954k23251l23686l88683k46924J92052P99296J421403J777129
13577H245585J650784J189829O51576J69256j02086j5412K68332L53835J03250
13568A2514949j83868k51025j06336J08895K04230J31811R1605K88771O09162
$$ y = [1449684, 2031042, 2377790, 2416122, 2211314, 1800601, 1176485, 442279, -151994, -325400, 68690, 948306, 1924310, 2513726, 2534533, 2056747, 1179996, 103408, -770555, -1163249, -1210305, -1198111, -1313555, -1520130, -1565125, -1343024, -1057651, -930308, -892586, -734749, -423764, -145743, -14093, 122444, 403692, 735030, 1063806, 1544766, 2266942, 3068667, 3570284, 3522925, 3163673, 2882429, 2842615, 3052820, 3453035, 3972615, 4562832, 5070450, 5297203, 5238249, 5014998, 4691312, 4302629, 4055705, 4247757, 5047053, 6468456, 8245585, 9896369, 11086198, 11737774, 11907030, 11804944, 11789532, 12057864, 12411699, 12514949, 12331081, 12080056, 11973720, 12082615, 12286845, 12418656, 12510261, 12799032, 13408194]
13559A3408194P13750N84630M61284L75208K55268N7024k60435n99654p94775
13550A4200494r08085r97891p85194k08294L03159M98318N21462M33732J78239
13541A3235940q4173j40075j32299j52891J9092M42328Q72152J072182J004128
13532A6136384P14858K99779j09152m38277o25055o11022m96069m69320n67533
13523A3834593o10540m62184j61246Q1328P3327j37517m35639o94749q21792q38415
13513I827166q23834q56879q84847q87527r72106j146162j174284p99465q6045
13504B196017N31607P40525O61185M98669L44811J10633k17833m10008k67088
13495D188518P1991K53515J24890j30304k52004k42665j86325m2415J80386K67135
$$ y = [13408194, 14121944, 14706574, 15167858, 15543066, 15798334, 15855358, 15594923, 14995269, 14200494, 13292409, 12294518, 11509324, 11301030, 11604189, 12102507, 12623969, 13057701, 13235940, 13151767, 13011692, 12879393, 12726502, 12745594, 13187922, 14060074, 15132256, 16136384, 16851242, 17151021, 17041869, 16603592, 15978537, 15367515, 14871446, 14402126, 13834593, 13224053, 12761869, 12600623, 12681951, 12755278, 12617761, 12182122, 11487373, 10665581, 9827166, 9003332, 8146453, 7261606, 6374079, 5401973, 4255811, 3081527, 2282062, 2196017, 2727624, 3468149, 4129334, 4628003, 4972814, 5083447, 4865614, 4455606, 4188518, 4260509, 4514024, 4638914, 4508610, 4256606, 4013941, 3827616, 3785201, 3965587, 4232722]
13485D232722J45511J5291k5921O381J23965L08434N46259R00057J235044J337848
13475H825591J209565R12338M40958m7712k44695k24246l39110o64467r39882
13466H928340r77571q32244o45478o24421r18086j226084j090498n29066M1842
13457B126734L53945M80540M97874M41093L94166L71157K64400k2682l61028n22518
13447D023681m87495m02534l46795k89173j58339J8266J62533K16673J11340j04064
13437B744093l25756m45215l19343K4641K26459P7014j28865j79174k00083l54093
13427A119678o05696o31995l04720J43932N36330Q17166R31496R53703R92551
13418C952445R02888O16205J92713l84702r04409j215168j339645j178292q40377
$$ y = [4232722, 4378233, 4393524, 4367603, 4373984, 4497949, 4806383, 5352642, 6252699, 7487743, 8825591, 10035156, 10947494, 11388452, 11340740, 11096045, 10871799, 10532689, 9868222, 8928340, 7950769, 7118525, 6473047, 5848626, 4930540, 3704456, 2613958, 2084892, 2126734, 2480679, 2961219, 3459093, 3900186, 4294352, 4665509, 4929909, 4907227, 4546199, 4023681, 3536186, 3133652, 2786857, 2497684, 2339345, 2357611, 2520144, 2736817, 2848157, 2744093, 2418337, 1973122, 1653779, 1678420, 1904879, 1981893, 1853028, 1673854, 1473771, 1119678, 513982, -118013, -422733, -278801, 257529, 1074695, 2006191, 2959894, 3952445, 4855333, 5471538, 5664251, 5279549, 4375140, 3159972, 1820327, 642035, -198342]
13409a98342n01258j35586K89614P36442J089446J128435Q05569M26327L23862
13400C964509L96376L33905J16723r4830j85594k32649l39065m41848n55370p38716
13390B223441r36978j037321q83093m61368q6346k8890o3077J15765M05251O04523
13380a48093O44724M52571L8199m05388o32460m54973O3296N21717O11311L13758
13370A004662j77514n82050p01824m75525p2809J27666r9689m95456o96304n26108
13360b694951n8789L93606O03091N79998M24431J88687L5707J23736M00932P01635
13350F98083P64918M38470q8550l89989k36784K01961O06564O80633L39477q7026
13340B927757j30384K35281O40106Q17689P25367N09516L27791J43452m5355k08551
$$ y = [-198342, -699600, -835186, -545572, 190870, 1280316, 2408751, 3214320, 3640647, 3964509, 4360885, 4694790, 4811513, 4716683, 4531089, 4298440, 3959375, 3517527, 2962157, 2223441, 1286463, 249142, -633951, -1095319, -1181665, -1210555, -1273632, -1157867, -752616, -148093, 496631, 949202, 987401, 582013, -50447, -505420, -442124, 79593, 690904, 1004662, 827148, 245098, -456726, -932251, -1005060, -877394, -977083, -1472539, -2168843, -2694951, -2753740, -2360134, -1757043, -1177045, -752614, -563927, -528220, -404484, -3552, 698083, 1463001, 1901471, 1812921, 1422932, 1186148, 1388109, 1994673, 2675306, 3014783, 2927757, 2797373, 3032654, 3672760, 4490449, 5215816, 5725332, 6053123, 6196575, 6151220, 5942669]
13330E942669l87218m86178l68895n0903J67504M4139k90771o24200q15434q70323
13320B260390q68699o85214k10583K76446M26978L07528K29269K75499L09797
13311B321411L84949O87526J179899J641115J804061J573998J168353Q79416P61664
13302A2402392O60758M81927K34437m421q4332L9996K34042M20800N90237N78255
13292A5554091K09079m07257q95032j055987j033325r98058r32816p37981m26674
13283I276040j26996j16257n15988q71781p11170j88683K84972N76243O34923
13274H241303M08364J05142n0664j35297l23875o00222p38063n30185j83725j72822
13264F019956n42503r63391j243886j316114j172541q98268n21546j00018K19311
$$ y = [5942669, 5555451, 5069273, 4700378, 4649475, 4816979, 4861118, 4570347, 3946147, 3130713, 2260390, 1391691, 706477, 495894, 772340, 1199318, 1506846, 1736115, 2011614, 2321411, 2706360, 3393886, 4573785, 6214900, 8018961, 9592959, 10761312, 11640728, 12402392, 13063150, 13545077, 13779514, 13775093, 13690761, 13730757, 13964799, 14385599, 14975836, 15554091, 15763170, 15355913, 14460881, 13404894, 12371569, 11373511, 10440695, 9702714, 9276040, 9149044, 9032787, 8516799, 7645018, 6933848, 6745165, 7030137, 7606380, 8241303, 8649667, 8754809, 8704145, 8568848, 8244973, 7644751, 6906688, 6376503, 6192778, 6019956, 5477453, 4514062, 3270176, 1954062, 781521, -116747, -638293, -738311, -519000]
13255e19000M02709N02624M71955J40785n12654j168678j373549r94837k84674
13246c335319L55452N42863L11791J33727K00540K88125M39372Q17662J112420
13237H66633R70708N94860L31117K25516J24216o9218l25696m56015k61805J16487
13227B116803M21741O48545P99291P56716M59250k3303l91799m14997k43990j54517
13217C973740j66436j13207q442q6247l91194o62247o90160l92923J42421N29482
13207B134787M43454L9170l06875m81692n51287m53329r3618M23119P81649Q37149
13197B772527O76171L44555j6689j67782j09238j58440n03227q62435r33935q08246
13187B33261o55197m88378k96177r1471J04129J76341J82763L61272O90924J030475
$$ y = [-519000, -116291, 386333, 858288, 999073, 486419, -682259, -2055808, -3050645, -3335319, -2979867, -2437004, -2125213, -1991486, -1790946, -1502821, -1063449, -245787, 866633, 1837341, 2432201, 2763318, 2988834, 3113050, 3043832, 2718136, 2262121, 2000316, 2116803, 2538544, 3187089, 3986380, 4743096, 5202346, 5179043, 4787244, 4372247, 4128257, 3973740, 3807304, 3694097, 3685655, 3599408, 3208214, 2545967, 1855807, 1462884, 1605305, 2134787, 2578241, 2617411, 2310536, 1828844, 1277557, 824228, 730610, 1153729, 1935378, 2772527, 3448698, 3793253, 3776564, 3608782, 3499544, 3341104, 2837877, 1975442, 1041507, 233261, -421936, -910314, -1206491, -1297962, -1193833, -1017492, -834729, -473457, 217467, 1247942]
13177A247942J287982J284284R40106M36644j7273m15705p86136r95704q91555
13168B090585n24646r1161L03454O09401O98370N11359J82617j36197m04259n81977
13158B657546o87619q19907q97018o82716j46832L18538M02875K75686J32695
13149E53248L3189q5930l28982n74357n64872k34105J44048K08222p5085k62586
13139a187210p6639K68397O43965J025955J160590P76162k8157p61305j021719
13130H00039q50226n56921m27714n06694o49750o56325m27012k44598l25585l78299
13120d223085j22736L20505O81624Q62673R54994R59027Q18092O63729N93489
13111A508312M66317K36642j6541k81233n93913r38914j187075j233868j121193
$$ y = [1247942, 2535924, 3820208, 4760314, 5196958, 5179685, 4763980, 3977844, 2982140, 2090585, 1565939, 1474778, 1778232, 2387633, 3086003, 3597362, 3779979, 3643782, 3239523, 2657546, 1969927, 1150020, 253002, -429714, -576546, -258008, 144867, 420553, 553248, 586437, 500507, 171525, -402832, -967704, -1201809, -1057761, -849539, -924624, -1187210, -1263849, -995452, -351487, 674468, 1835058, 2611220, 2583063, 1821758, 800039, -50187, -607108, -1034822, -1541516, -2191266, -2847591, -3274603, -3519201, -3844786, -4223085, -4345821, -4025316, -3343692, -2481019, -1526025, -566998, 251094, 914823, 1508312, 1974629, 2211271, 2194730, 1913497, 1319584, 380670, -806405, -2040273, -3161466]
13102c161466r40445q25627q54057q43059n80905j12081L77845P53690R58681
13093e227424J061261J153008J187582J051829Q71498R33143J239877J455497
13085C726271J207922N65816L2696r8074o694M7342K9452m840l9848j28234l57543
13074D974266p21842r89832r96237r13699r33260r54778p85902l94227J05280
13065a610231N07836O73493O68622O68406O48397L77493j67681o80924p87665
13056B97746m51298j35980r7100j10180j01378j81111k20754o4671K23560N51646
13046b89520P20615M31214j85747n45471l00228L71543R30560R97694O64602J87282
13036B982544k65804o10405p89481q64568q55921n63695l8317L18647L54036K54965
$$ y = [-3161466, -4101911, -4927538, -5781595, -6624654, -7205559, -7317640, -6939795, -6186105, -5227424, -4166163, -3013155, -1825573, -773744, 97754, 1030897, 2270774, 3726271, 4934193, 5500009, 5532705, 5434631, 5427937, 5475279, 5504731, 5499891, 5460043, 5331809, 4974266, 4252424, 3262592, 2266355, 1352656, 419396, -535382, -1321284, -1715511, -1610231, -1102395, -428902, 239720, 908126, 1556523, 1934016, 1766335, 1085411, 297746, -153552, -289532, -386632, -496812, -598190, -779301, -1000055, -1064726, -841166, -289520, 431095, 862309, 676562, 131091, -169137, 202406, 1132966, 2130660, 2795262, 2982544, 2716740, 2106335, 1316854, 452286, -403635, -967330, -1005647, -687000, -332964, -77999]
13026g7999J22954j0320R9196M87239P68380P72444O61456M97259K14984j11216
13016C424377l25518l26039j78393j18068k67850l64864j58762k6582l27758o92577
13006F37966o63707l74626j99066r8990J75375M98607N76433M83335N28356P22298
12996B285981P71836O17797M81603L97943P1627o01193j199725j285117q55483
12987F85269k78588Q5481K20180L35971M48723L73324K08766J91031K97009M10559
12977B977725M52686L43322M9421l58774p09941r05043j001607j038207q68078
12968a058496m84010j89811j56118k19564k08725j98740k29706j39063J33117
12959b751116M22433O17710O28012K78288k95429n77190l24120K42147Q59729
$$ y = [-77999, 44955, 34635, 133831, 621070, 1389450, 2161894, 2823350, 3320609, 3535593, 3424377, 3098859, 2772820, 2594427, 2476359, 2208509, 1843645, 1684883, 1658301, 1330543, 637966, -25741, -400367, -599433, -698423, -523048, -24441, 551992, 1035327, 1563683, 2285981, 3057817, 3675614, 4157217, 4555160, 4626787, 4025594, 2825869, 1540752, 685269, 406681, 492162, 712342, 1048313, 1497036, 1870360, 2079126, 2270157, 2567166, 2977725, 3430411, 3773733, 3823154, 3464380, 2754439, 1849396, 847789, -190418, -1058496, -1542506, -1732317, -1888435, -2107999, -2316724, -2515464, -2745170, -2884233, -2751116, -2328683, -1710973, -1082961, -804673, -1100102, -1677292, -2001412, -1759265, -899536]
12950h99536J246021J221526R30136N67455J52831l59718q41034r88977o95975
12941C32729k82903n76J81806K14436J63865K56327M22361M28654K26108j81170
12931A761637p37709j100049j033732p05433k42437L23697P75238Q64279N82534
12922D88025J70368j85944m17004l63242m627L72344O19684R86287J576627K076413
12912E318931K093642J612560J010742N44508J84726j60904n65272j001073j331926
12903G705934j425637j216725q01591m12904k03395j35603j6027L42135Q44690
12894D680877J097154R35874N63879K16989k8226k28429n09175j042975j858643
12885C827325k599894k741051k123621j125427j95157O00831J229874J425433
$$ y = [-899536, 346485, 1568011, 2498147, 3065602, 3218433, 2858715, 2017681, 1028704, 332729, 49826, 49250, 231056, 445492, 609357, 865684, 1288045, 1716699, 1942807, 1761637, 1023928, -76121, -1109853, -1815286, -2057723, -1734026, -958788, -94509, 488025, 658393, 472449, 55445, -307797, -312424, 59920, 679604, 1665891, 3242518, 5318931, 7412573, 9025133, 10035875, 10580383, 10765109, 10604205, 10038933, 9037860, 7705934, 6280297, 5063572, 4261981, 3849077, 3645682, 3510079, 3494052, 3836187, 4680877, 5778031, 6713905, 7277784, 7494773, 7466547, 7238118, 6728943, 5685968, 3827325, 1227431, -1513620, -3637241, -4762668, -4957825, -4356994, -3127120, -1701687]
12877a701687J149834P97547O50487N56094L24282R2556r01j52199n48886j060032
12867A07095j334920j093112m66099K7186R6402j51930n50186r71155j352951
12858e689670j544374j308145o52812P8327O15176R34622J121728J230901J226559
12849c987688J016381N87811P9345l00535l13506O7515N36851P38541M76462j28800
12839a227623o83387q13920m45438J15315O00786J020138J266372J081994M85111
12830A399348j04842l53621k84515j27106q3868j48004k70155l41302k33606j16141
12820f63812q0720n015J55118L11808L21821J90336L236j92434l70278n28879
12810h58819o17967n32760l05480n8795R1405N9168r7091k51302l57337l51634
$$ y = [-1701687, -551853, 245694, 896181, 1452275, 1776557, 1869113, 1868212, 1716013, 1167127, 107095, -1227825, -2320937, -2787036, -2759850, -2663448, -2815378, -3365564, -4336719, -5689670, -7234044, -8542189, -9195001, -9116674, -8501498, -7566876, -6445148, -5214247, -3987688, -2971307, -2383496, -2304151, -2604686, -2918192, -2850677, -2313826, -1575285, -1098823, -1227623, -1911010, -2724930, -3170368, -3055053, -2454267, -1434129, -167757, 914237, 1399348, 1294506, 940885, 656370, 529264, 445396, 297392, 27237, -314065, -547671, -663812, -744532, -749547, -594429, -282621, 39200, 229536, 232772, 40338, -329940, -858819, -1476786, -2009546, -2315026, -2373821, -2282416, -2223248, -2320339, -2571641, -2928978, -3280612]
12800c280612k44707j42339m9086O9798P4088j74973m17818l90470k16032L1197
12790d740954M21686P66802Q19159O30572M07723L13749L80131N95407P91288
12781C85563P66108N41946L10328K45354K55046P8606m01020r10281j030240o34323
12771c92913j1887M66045N95779L25455j57130n44381p37406p34987n01988j71993
12761a865406J0409N5339J04293J32522J29749K11824L87816M89884M15901L26881
12751C99212L33262K23564p7229l29421m52690n15569m85145l93726k36541Q0939
12741a453344N22072Q94051J042094Q58697M52487J88559J48206J79155J98335
12732C030312K07904K78825L64784K72895k9394l35103n53901p10167p09685n38273
$$ y = [-3280612, -3525319, -3667658, -3716744, -3646946, -3572858, -3747831, -4165649, -4556119, -4772151, -4740954, -4319268, -3552466, -2733307, -2102735, -1695012, -1381263, -1001132, -405725, 385563, 1151671, 1693617, 2003945, 2249299, 2504345, 2582951, 2181931, 1271650, 241410, -392913, -404800, 61245, 657024, 982479, 825349, 280968, -456438, -1191425, -1693413, -1865406, -1854997, -1799658, -1695365, -1562843, -1433094, -1221270, -833454, -343570, 72331, 399212, 732474, 956038, 878809, 549388, 96698, -418871, -904016, -1297742, -1534283, -1453344, -931272, -37221, 1004873, 1863570, 2316057, 2504616, 2652822, 2831977, 3030312, 3238216, 3517041, 3881825, 4154720, 4125326, 3790223, 3236322, 2526155, 1816470, 1278197]
12722A278197l73782l04308j94015J6760J75027K01349K48185L49408K51763j33621
12712A514963n90280q88462r15492p20476m63766k08799L7508K63607M94713O25834
12702h50650M54080l3772m93134o01637m81144l43854q8792L67958Q06129R50134
12692c14682P78279N02564L38673L08304J65442j29973m05574n67990m90941j91929
12682g827N8890Q6391O9992K28622N05218O76414O33821M56084K83887K94935
12672C286427N57430P80051O53143J86128m44183j032551j312552j172997q82280
12663F18616p58282p80024p57630o40978m72765k95427j59179n1454N2555P5498
12653c169070n2377k82710m15503l21948j80968k34087m62825o84503q56940r36118
$$ y = [1278197, 904415, 600107, 406092, 422852, 597879, 799228, 1047413, 1396821, 1648584, 1514963, 924683, 36221, -879271, -1599747, -2063513, -2272312, -2234804, -1971197, -1476484, -850650, -396570, -430342, -923476, -1525113, -2006257, -2350111, -2438903, -2070945, -1264816, -314682, 463597, 966161, 1304834, 1613138, 1778580, 1648607, 1243033, 675043, 184102, -7827, 51063, 137454, 207446, 436068, 941286, 1617700, 2251521, 2707605, 2991492, 3286427, 3843857, 4623908, 5277051, 5463179, 5018996, 3986445, 2673893, 1500896, 618616, -139666, -919690, -1677320, -2318298, -2791063, -3086490, -3245669, -3297123, -3244568, -3169070, -3221447, -3504157, -3919660, -4241608, -4422576, -4656663, -5119488, -5803991, -6660931, -7597049]
12643g597049p39568k84878J76570N34606Q66091J044616Q65626M76901K85588
12634d371497M95640Q28888R00572O05153J02059m04292q21390j082263j063588
12625d810718p93314n76152m81834k41670K79297Q89446J262168J272763J123312
12616b076702Q81782M56370k4877m12201o54161o63287l16711K24795N30081M82343
12606a572568K58463J3118p3384J66942N34972N74446K21311j52186k13373P5798
$$ y = [-7597049, -8336617, -8621495, -8444925, -7910319, -7044228, -5999612, -5133986, -4657085, -4371497, -3875857, -3046969, -2146397, -1541244, -1439185, -1843477, -2664867, -3747130, -4810718, -5604032, -6180184, -6662018, -6903688, -6624391, -5734945, -4472777, -3200014, -2076702, -1194920, -738550, -763427, -1175628, -1829789, -2493076, -2809787, -2584992, -2054911, -1572568, -1314105, -1300987, -1374371, -1207429, -672457, -98011, 123300, -28886, -242259, -166461]
$$ [...]
##END NTUPLES=NMR SPECTRUM
##END=
