##TITLE=31P ikalashn
LR-791-BO-C2
18.11.2024
##JCAMPDX= 6.0         $$ Bruker NMR JCAMP-DX V2.0
##DATA TYPE= NMR SPECTRUM
##DATA CLASS= NTUPLES
##ORIGIN= UXNMR, Bruker Analytische Messtechnik GmbH
##OWNER= root
$$ TOPSPIN		Version 1.3
$$ 2024-11-18 15:03:28.187 +0400  Irina@DPX200
$$ Compression mode = diff/dup
##.OBSERVE FREQUENCY= 81.01967998063
##.OBSERVE NUCLEUS= ^31P
##.ACQUISITION MODE= SIMULTANEOUS
##.ACQUISITION SCHEME= undefined
##.AVERAGES= 64
##.DIGITISER RES= 17
##SPECTROMETER/DATA SYSTEM= spect
##.PULSE SEQUENCE= zgpg
##.SOLVENT NAME= DMSO
##.SHIFT REFERENCE= INTERNAL, DMSO, 1, 298.5841
##AUDIT TRAIL= $$ (NUMBER, WHEN, WHO, WHERE, WHAT)
$$ ##TITLE= Audit trail, TOPSPIN		Version 1.3
$$ ##JCAMPDX= 5.01
$$ ##ORIGIN= Bruker BioSpin GmbH
$$ ##OWNER= Irina
$$ $$ F:/spectra/data/iren/nmr/P31dec/1/pdata/1/auditp.txt
$$ ##AUDIT TRAIL=  $$ (NUMBER, WHEN, WHO, WHERE, VERSION, WHAT)
(   1,<2024-11-18 15:01:31.250 +0400>,<Irina>,<DPX200>,<TOPSPIN 1.3>,
      <acquisition in progress>)
(   2,<2024-11-18 15:03:13.484 +0400>,<Irina>,<DPX200>,<TOPSPIN 1.3>,
      <Start of raw data processing
       efp BC_mod = 2 LB = 10 FT_mod = 6 PKNL = 1 PHC0 = 234.3019 PHC1 = -6.439117 SI = 32K 
       data hash MD5: 32K
       DF B3 7B E5 A8 B4 9F A4 5B F2 72 C2 E2 65 35 E3>)
(   3,<2024-11-18 15:03:15.765 +0400>,<Irina>,<DPX200>,<TOPSPIN 1.3>,
      <apk 
       data hash MD5: 32K
       55 5F 18 4C 22 DB 1B 85 90 6E 74 FC 31 14 C9 5C>)
(   4,<2024-11-18 15:03:17.875 +0400>,<Irina>,<DPX200>,<TOPSPIN 1.3>,
      <abs n ABSG = 5 
       data hash MD5: 32K
       B4 DC 81 E5 92 49 24 8B 50 69 14 D4 8C BB BC 18>)
$$ ##END=
$$ 
$$ $$ hash MD5
$$ $$ 96 4E 48 28 1F 05 21 BE C0 BB 1A 3B 4B 44 12 DF
##$RELAX= 
##$RELAX= 
##$RELAX= 
##$RELAX= 
##$RELAX= 
##$RELAX= 
##$RELAX= 
##$RELAX= 
##$RELAX= 
##$RELAX= 
##$RELAX= 
$$ Bruker specific parameters
$$ --------------------------
##$DU= <F:/spectra>
##$EXPNO= 1
##$NAME= <P31dec>
##$PROCNO= 1
##$TYPE= <nmr>
##$USER= <iren>
##$AMP= (0..31)
100 100 100 100 100 100 100 100 100 100 100 100 100 100 100 100 100 100 
100 100 100 100 100 100 100 100 100 100 100 100 100 100 
##$ANAVPT= -1
##$AQSEQ= 0
##$AQ_mod= 1
##$AUNM= <au_zg>
##$AUTOPOS= <>
##$BF1= 81.014009
##$BF2= 200.13
##$BF3= 200.13
##$BF4= 200.13
##$BF5= 200.13
##$BF6= 200.13
##$BF7= 200.13
##$BF8= 200.13
##$BYTORDA= 1
##$CFDGTYP= 0
##$CFRGTYP= 5
##$CHEMSTR= <none>
##$CNST= (0..63)
1 1 145 1 1 1 1 1 1 1 1 1 1 1 1 1 1 1 1 1 1 1 1 1 1 1 1 1 1 1 1 1 1 1 
1 1 1 1 1 1 1 1 1 1 1 1 1 1 1 1 1 1 1 1 1 1 1 1 1 1 1 1 1 1 
##$CPDPRG= <waltz16>
##$CPDPRG1= <>
##$CPDPRG2= <waltz16>
##$CPDPRG3= <>
##$CPDPRG4= <mlev>
##$CPDPRG5= <mlev>
##$CPDPRG6= <mlev>
##$CPDPRG7= <mlev>
##$CPDPRG8= <mlev>
##$CPDPRGB= <>
##$CPDPRGT= <>
##$D= (0..63)
0 1 0 0 0 0 0 0 0 0.06 0 0.03 2e-005 3e-006 0 0 0.0002 0 0 0 0 0 0 0 0 
0 0 0 0 0 0 0 0 0 0 0 0 0 0 0 0 0 0 0 0 0 0 0 0 0 0 0 0 0 0 0 0 0 0 0 
0 0 0 0 
##$DATE= 1731927790
##$DBL= (0..7)
120 120 120 11 120 120 24 19 
##$DBP= (0..7)
$$ [...]
##$SW_h= 37037.037037037
##$TD= 32768
##$TD0= 1
##$TE= 300
##$TE2= 300
##$TE3= 300
##$TEG= 300
##$TL= (0..7)
0 120 53 12 22 120 120 120 
##$TP= (0..7)
150 150 150 150 150 150 150 150 
##$TP07= 0
##$TPNAME0= <>
##$TPNAME1= <>
##$TPNAME2= <>
##$TPNAME3= <>
##$TPNAME4= <>
##$TPNAME5= <>
##$TPNAME6= <>
##$TPNAME7= <>
##$TPOAL= (0..7)
0.5 0.5 0.5 0.5 0.5 0.5 0.5 0.5 
##$TPOFFS= (0..7)
0 0 0 0 0 0 0 0 
##$TUNHIN= 0
##$TUNHOUT= 0
##$TUNXOUT= 0
##$USERA1= <user>
##$USERA2= <user>
##$USERA3= <user>
##$USERA4= <user>
##$USERA5= <user>
##$V9= 5
##$VALIST= <valist>
##$VCLIST= <CCCCCCCCCCCCCCC>
##$VD= 0
##$VDLIST= <DDDDDDDDDDDDDDD>
##$VPLIST= <PPPPPPPPPPPPPPP>
##$VTLIST= <TTTTTTTTTTTTTTT>
##$WBST= 1024
##$WBSW= 4
##$XGAIN= (0..3)
0 0 0 0 
##$XL= 0
##$YL= 0
##$YMAX_a= 8595
##$YMIN_a= -4634
##$ZGOPTNS= <>
##$ZL1= 120
##$ZL2= 120
##$ZL3= 120
##$ZL4= 120
##$ABSF1= 298.5841
##$ABSF2= -158.5842
##$ABSG= 5
##$ABSL= 5
##$ALPHA= 0
##$AQORDER= 0
##$ASSFAC= 0
##$ASSFACI= 0
##$ASSFACX= 0
##$ASSWID= 0
##$AUNMP= <proc_1d>
##$AXLEFT= 0
##$AXRIGHT= 0
##$AXTYPE= 0
##$AXUNIT= <>
##$AZFE= 0.1
##$AZFW= 0.5
##$BCFW= 0
##$BC_mod= 2
##$BYTORDP= 0
##$COROFFS= 0
##$CY= 12.5935478210449
##$DATMOD= 1
##$DC= 0
##$DFILT= <>
##$DTYPP= 0
##$F1P= 47.1127640792319
##$F2P= -24.0371245302204
##$FCOR= 0.5
##$FTSIZE= 32768
##$FT_mod= 6
##$GAMMA= 0
##$GB= 0
##$INTBC= 1
##$INTSCL= 7.269226e-011
##$ISEN= 30
##$LB= 10
##$LEV0= 0
##$LPBIN= 0
##$MAXI= 12.09355
##$MC2= 0
##$MEAN= 0
##$ME_mod= 0
##$MI= 0.7550151
##$NCOEF= 0
##$NC_proc= -12
##$NLEV= 6
##$NOISF1= 298.5841
##$NOISF2= 270.0111
##$NSP= 0
##$NTH_PI= 0
##$NZP= 0
##$OFFSET= 298.5841
##$PC= 1.4
##$PHC0= 228.0508
##$PHC1= 28.41478
##$PH_mod= 1
##$PKNL= yes
##$PPARMOD= 0
##$PPDIAG= 0
##$PPIPTYP= 0
##$PPMPNUM= 100
##$PPRESOL= 1
##$PSCAL= 0
##$PSIGN= 0
##$REVERSE= no
##$SF= 81.014009
##$SI= 32768
##$SIGF1= 270.0111
##$SIGF2= -158.5842
##$SINO= 77.54984
##$SIOLD= 32768
##$SREGLST= <31P.CDCl3>
##$SSB= 0
##$STSI= 32768
##$STSR= 0
##$SW_p= 37037.037037037
##$SYMM= 0
##$S_DEV= 0
##$TDeff= 32768
##$TDoff= 0
##$TI= <>
##$TILT= no
##$TM1= 0
##$TM2= 0
##$TOPLEV= 0
##$USERP1= <user>
##$USERP2= <user>
##$USERP3= <user>
##$USERP4= <user>
##$USERP5= <user>
##$WDW= 1
##$XDIM= 32768
##$YMAX_p= 358524524
##$YMIN_p= -31816156
$$ End of Bruker specific parameters
$$ ---------------------------------
##NTUPLES= NMR SPECTRUM
##VAR_NAME=  FREQUENCY,     SPECTRUM/REAL,   SPECTRUM/IMAG
##SYMBOL=    X,             R,               I
##VAR_TYPE=  INDEPENDENT,   DEPENDENT,       DEPENDENT
##VAR_FORM=  AFFN,          ASDF,            ASDF
##VAR_DIM=   32768,         32768,           32768
##UNITS=     HZ,            ARBITRARY UNITS, ARBITRARY UNITS
##FACTOR=    1.13031516577767, 1,            1
##FIRST=     37037.037037037, 392827,        18763867
##LAST=      0,             7621196,         -7592359
##MIN=       0,             -31816156,       0
##MAX=       37037.037037037, 358524524,     0
$$ Real data points
##PAGE= N=1
##DATA TABLE= (X++(R..R)), XYDATA
$$ [...]
17654f885098n67824o49227n84492k71167K31991P41037J052026J070021Q31971
$$ -6885098 -7452922 -8102149 -8686641 -8957808 -8725817 -7984780 -6932754 -5862733 -5030762
17645e030762M47834J23724P1660K99102O27411Q78911R96217J017008R63593
$$ -5030762 -4582928 -4459204 -4387544 -4088442 -3461031 -2582120 -1585903 -568895 394698
17636C94698P95570M83384Q6543k60779m44074m70400m62600n38301o69642p21381
$$ 394698 1190268 1673652 1760195 1499416 1055342 584942 122342 -415959 -1085601 -1806982
17626a806982o28959m23589j72090M9190J80869K04406J75157J85043K47407K74001
$$ -1806982 -2435941 -2859530 -3031620 -2982430 -2801561 -2597155 -2421998 -2236955 -1989548 -1715547
17616a715547J72747r1065m87655q99831j160374j164530r49568o62562m06308
$$ -1715547 -1542800 -1633865 -2121520 -3021351 -4181725 -5346255 -6295823 -6958385 -7364693
17607g364693j54337J33870L84768N00221N12885N09999N12293M99698M75179
$$ -7364693 -7519030 -7385160 -7000392 -6500171 -5987286 -5477287 -4964994 -4465296 -3990117
17598c990117M75166N18595N93345P10642Q91212J088996J185233J038956O14858
$$ -3990117 -3514951 -2996356 -2403011 -1692369 -801157 287839 1473072 2512028 3126886
17589C126886R0040k86283m01854k71679J0933K75389L97630M08696L53938J73907
$$ 3126886 3216926 2930643 2528789 2257110 2268043 2543432 2941062 3349758 3703696 3877603
17579C877603j69797n57698p60752o76126m39302j94498Q6122M60096Q50059J120342
$$ 3877603 3707806 3150108 2389356 1713230 1273928 1079430 1165552 1625648 2475707 3596049
17569C596049J252452J335634J401170J361805J124229P05471K50466o6720j96428
$$ 3596049 4848501 6184135 7585305 8947110 10071339 10776810 11027276 10960556 10764128
17560A0764128k75897m71299p69043j006065j065252r51398p00576l55758k4927
$$ 10764128 10488231 10016932 9247889 8241824 7176572 6225174 5524598 5168840 5143913
17551E143913J60272J21842j33224n19024q68587r67411p24246k83921J30441
$$ 5143913 5304185 5426027 5292803 4773779 3905192 2937781 2213535 1929614 2060055
17542B060055M18490N71679O16450N97267N43020M92498M78394M83363M49453
$$ 2060055 2478545 3050224 3666674 4263941 4806961 5299459 5777853 6261216 6710669
17533F710669L18410P3560k12330m05416m18298k59024m9241J2835j47677l64299
$$ 6710669 7029079 7102639 6890309 6484893 6066595 5807571 5758330 5771165 5623488 5259189
17523E259189m25634k89628l8937K36935M69566O20931O86971O90378O92337O97037
$$ 5259189 4833555 4543927 4504990 4741925 5211491 5832422 6519393 7209771 7902108 8599145
17513H599145N97025L45821N4804j17488j08256O701P1459k2698k35461m30206
$$ 8599145 9196170 9541991 9596795 9479307 9371051 9377752 9449211 9426513 9191052 8760846
17503H760846n05781m75716m28580m27290m96969o28651p57352p84824o56646
$$ 8760846 8255065 7779349 7350769 6923479 6426510 5797859 5040507 4255683 3599037
17494C599037m61442l71924m40587n65911o61381p45154q23423q08037o16217
$$ 3599037 3137595 2765671 2325084 1759173 1097792 352638 -470785 -1278822 -1895039
17485a895039k47509K07734O08149Q61087R66933R69823Q96500P44057N00004
$$ -1895039 -2142548 -1934814 -1326665 -465578 501355 1471178 2367678 3111735 3611739
17476C611739J81275j85302o03051j018029j236302j093668p08420l96688l30092
$$ 3611739 3793014 3607712 3004661 1986632 750330 -343338 -1051758 -1448446 -1778538
17467a778538l79731l10452m5387K92597N15301N30254M01743K17423l5557l65888
$$ -1778538 -2158269 -2468721 -2514108 -2221511 -1706210 -1175956 -774213 -556790 -592347 -958235
17457i58235o76376q62501r03248p99608n55794k44084N4908L05049M17855K98300
$$ -958235 -1634611 -2497112 -3400360 -4199968 -4755762 -4999846 -4944938 -4639889 -4222034 -3923734
17447c923734K6266j67359j33737Q2403L47868N71257P61103R25150R87595R03928
$$ -3923734 -3897468 -4064827 -4198564 -4116161 -3768293 -3197036 -2435933 -1510783 -523188 380740
17437C80740P24257N42630M33223L66760K56867J19510O8795J51831K75037L18373
$$ 380740 1104997 1647627 2080850 2447610 2704477 2823987 2892782 3044613 3319650 3638023
17427C638023L01250L56285N32468P01221P06100N20273J94281k35204p30259
$$ 3638023 3939273 4295558 4828026 5529247 6235347 6755620 6949901 6714697 5984438
17418E984438j216922j558291j582283j256082p43526k22117J80446L75869M01224
$$ 5984438 4767516 3209225 1626942 370860 -372666 -594783 -414337 -38468 362756
17409C62756L77967L74376L70718L11894K35197K47489L33574M18784N01856N56199
$$ 362756 740723 1115099 1485817 1797711 2032908 2280397 2613971 3032755 3534611 4090810
17399D090810M72038J81238j94923m51015n33475n54762o50619q42677j006050
$$ 4090810 4562848 4744086 4549163 4098148 3564673 3009911 2359292 1516615 510565
17390E10565r75162o96924k85313N7229J60129J4403k46117n01674o38560n31591
$$ 510565 -464597 -1161521 -1446834 -1389605 -1229476 -1215073 -1461190 -1962864 -2601424 -3133015
17380c133015j61074L60131Q71938J268619J551878J733824J747854J550250J215974
$$ -3133015 -3294089 -2933958 -2062020 -793401 758477 2492301 4240155 5790405 7006379
17371G006379Q50038M91257J62464p4078j67259j45930j27527k19946m14568o46474
$$ 7006379 7856417 8347674 8510138 8436060 8268801 8122871 7995344 7775398 7360830 6714356
17361F714356q65080j026371j099755j042463q43282o05580m77662n33674p50877
$$ 6714356 5849276 4822905 3723150 2680687 1837405 1231825 754163 220489 -530388
17352e30388j016791j149599j015712o33166j14639L86284O84840P01619N26979
$$ -530388 -1547179 -2696778 -3712490 -4345656 -4460295 -4074011 -3389171 -2687552 -2160573
17343b160573K90899O0285j28502j99418r8079J29163L84551O13596Q26711J050132
$$ -2160573 -1869674 -1809389 -1937891 -2137309 -2235388 -2106225 -1721674 -1108078 -281367 768765
17333G68765J265483J337767J082431M55252l42371r58719j167621j010311o61055
$$ 768765 2034248 3372015 4454446 4909698 4567327 3608608 2440987 1430676 769621
17324G69621k67109L5587J54895J78071K79252N02250P34865Q35675P74989O31531
$$ 769621 502512 538099 692994 871065 1150317 1652567 2387432 3223107 3998096 4629627
17314D629627M32171J20851k93521o93492r71701j124064j176647j064518o76317
$$ 4629627 5061798 5182649 4889128 4195636 3223935 2099871 923224 -141294 -817611
17305h17611n8478M96181O97734N47786K75397P4947l6412j67676l84410n95113
$$ -817611 -876089 -379908 317826 865612 1141009 1215956 1179544 1011868 627458 32345
17295C2345o45490n11291l12638j22787J14880L97438O02156O72005O35561N10648
$$ 32345 -613145 -1124436 -1437074 -1559861 -1444981 -1047543 -445387 226618 862179 1372827
17285A372827K96105J2373k49343l91140m33366m76471n32899n41513n23163n37298
$$ 1372827 1668932 1681305 1431962 1040822 607456 130985 -401914 -943427 -1466590 -2003888
17275b003888n38440m23532j88926N1687K00549K85901L90847M54683L06418q2550
$$ -2003888 -2542328 -2965860 -3154786 -3103099 -2902550 -2616649 -2225802 -1771119 -1464701 -1547251
17265a547251n55226r38943j115605j016148o89749l16403k6314K27410N09852
$$ -1547251 -2102477 -3041420 -4157025 -5173173 -5862922 -6179325 -6205639 -5978229 -5468377
17256e468377P56914Q39650P15073N16674M37863N44486P66809R79692J071156
$$ -5468377 -4711463 -3871813 -3156740 -2640066 -2202203 -1657717 -890908 88784 1159940
17247A159940R96423P93817N65092M00768L30202L13619K43181r211m81176j017581
$$ 1159940 2156363 2950180 3515272 3916040 4246242 4559861 4803042 4793831 4312655 3295074
17237C295074j362254j426816j365392j348314j362431j230660q06620j91347
$$ 3295074 1932820 506004 -859388 -2207702 -3570133 -4800793 -5607413 -5798760
17229e798760L13962N24233M85877L06184L4480k79925n17925n66804m06551j07610
$$ -5798760 -5484798 -4960565 -4474688 -4168504 -4134024 -4413949 -4931874 -5498678 -5905229 -6012839
17219f012839K23721N20930P39747Q27898Q00287P32574O33753M45894J79009
$$ -6012839 -5789118 -5268188 -4528441 -3700543 -2900256 -2167682 -1533929 -1088035 -909026
17210i09026n0592j16298J636J54608J51407l4504k69048l85292k70749Q7093
$$ -909026 -959618 -1075916 -1074280 -919672 -768265 -802769 -1071817 -1457109 -1727858 -1640765
17200a640765N40151Q26411Q00506N44280K31046j5118j49438j69687j36107j89764
$$ -1640765 -1100614 -274203 526303 1070583 1301629 1286511 1137073 967386 831279 641515
17190F41515m10324p40485j066980j268419j293211j206237j083215r36096p08184
$$ 641515 231191 -509294 -1576274 -2844693 -4137904 -5344141 -6427356 -7363452 -8071636
17181h071636l14456K46734Q17273J182229J247220J068890P97930O19608O40549
$$ -8071636 -8386092 -8139358 -7322085 -6139856 -4892636 -3823746 -3025816 -2406208 -1765659
17172a765659P88786Q85346Q27036O37928L87909J77187J29191K69136M69458
$$ -1765659 -976873 -91527 735509 1373437 1761346 1938533 2067724 2336860 2806318
17163B806318N74056N22103L34981O0205k41263n11187p04521p89765p46997n83025
$$ 2806318 3380374 3902477 4237458 4297663 4056400 3545213 2840692 2050927 1303930 720905
17153G20905l44193r8997R8205K54471M21492N82404O39738N49678L74840K28889
$$ 720905 376712 277715 375920 630391 1051883 1634287 2274025 2823703 3198543 3427432
17143C427432K03488L08367M74384N97998N85528M25323K26171P2209j22904m40763
$$ 3427432 3630920 3939287 4413671 5011669 5597197 6022520 6248691 6320900 6197996 5757233
17133E757233p61480r08894q54508p10335n87594n02720m17554k82832o5445J56073
$$ 5757233 4995753 4086859 3232351 2522016 1934422 1431702 1014148 731316 665871 821944
17123H21944K28973J25372n9277k79010n42969q08147r68674r56497q18275o67086
$$ 821944 1050917 1176289 1117012 838002 295033 -513114 -1481788 -2438285 -3256560 -3923646
17113c923646n73206m73329k12450K50160P37843J012135R65832O87012L86581
$$ -3923646 -4496852 -4970181 -5182631 -4932471 -4194628 -3182493 -2216661 -1529649 -1143068
17104a143068K09661J24419M9847K7113J35708L12634M01206L21593J31061o1422
$$ -1143068 -933407 -808988 -759141 -732028 -596320 -283686 117520 439113 570174 508752
17094E08752k36808m41842o48929p77963p83054o62987m66098k63922q6920Q0345
$$ 508752 271944 -169898 -818827 -1596790 -2379844 -3042831 -3508929 -3772851 -3859771 -3779426
17084c779426K71986M93598O97077Q21121Q36543P86610P83463Q70419R54531
$$ -3779426 -3507440 -3013842 -2316765 -1495644 -659101 127509 910972 1781391 2735922
17075B735922R23651P24513L80862J6149k43028l79286m20105l74858k85220k46551
$$ 2735922 3659573 4384086 4764948 4781097 4538069 4158783 3738678 3363820 3078600 2832049
17065B832049l00041l74717m12229m48627n23554o02739o20673n11961k27797
$$ 2832049 2532008 2157291 1745062 1296435 772881 170142 -450531 -962492 -1190289
17056a190289J99106O24673Q50594P47756L76641p3255m38770o03820n30554l63408
$$ -1190289 -991183 -366510 484084 1231840 1608481 1535226 1096456 492636 -37918 -401326
17046d01326l26145m67136o15882o01689m37529k36212p4726K8224Q2481J18835
$$ -401326 -727471 -1194607 -1810489 -2412178 -2849707 -3085919 -3160645 -3132421 -3049940 -2931105
17036b931105K07619L96969O68683R42258J111600J122047J013225Q97518Q48653
$$ -2931105 -2723486 -2326517 -1657834 -715576 396024 1518071 2531296 3428814 4277467
17027D277467Q06619O49938L87752J75952Q2388Q846j18848k46377k94440k83240
$$ 4277467 5084086 5734024 6121776 6297728 6380116 6388962 6270114 6023737 5729297 5446057
17017E446057l14910m60860o63437p57981o74258n33326n07095o80217r73050
$$ 5446057 5131147 4670287 4006850 3248869 2574611 2041285 1534190 853973 -119077
17008a19077j149511r98318n52926n6691L16369N69704P49050Q66754R36949R61888
$$ -119077 -1268588 -2266906 -2819832 -2876523 -2560154 -1990450 -1241400 -374646 562303 1524191
16998A524191R04707P68156O22198M59048J83255j81413m93496p11963r01106
$$ 1524191 2428898 3197054 3819252 4278300 4461555 4280142 3786646 3074683 2173577
16989B173577j057699j074710q65628m78471p0340K03307L05088L33974M04859
$$ 2173577 1115878 41168 -824460 -1302931 -1373271 -1169964 -864876 -530902 -126043
16980a26043N82618Q80194J191528J316384J134520P26072K96025j7890k32366
$$ -126043 456575 1336769 2528297 3844681 4979201 5705273 6001298 5983408 5751042
16971E751042m10911n57528o25307n78274m62319l59884k99095k79249k90379
$$ 5751042 5340131 4782603 4157296 3579022 3116703 2756819 2457724 2178475 1888096
16962A888096k91254k18161k5014K34621L75630K26664j88873o52085r35368r86078
$$ 1888096 1596842 1378681 1353667 1588288 1963918 2190582 2001709 1349624 414256 -571822
16952e71822q81083o58503k96409J37673M60509N76086N66185N27186M57686L59312
$$ -571822 -1452905 -2111408 -2407817 -2270144 -1809635 -1233549 -667364 -140178 317508 676820
16942F76820K97722L12175L78096M28901L43877L7939m09689q13146j040503j096531
$$ 676820 974542 1286717 1664813 2093714 2437591 2475530 2065841 1252695 212192 -884339
16932h84339j093781j100316j030765p77074l59291J03011N01019P89265R46456
$$ -884339 -1978120 -3078436 -4109201 -4886275 -5245566 -5142555 -4641536 -3852271 -2905815
16923b905815R84381R94517J075510J228816J350699J330925J143078Q51968N68362
$$ -2905815 -1921434 -926917 148593 1377409 2728108 4059033 5202111 6054079 6622441
16914F622441L60526J87415L720j27304j75617k40282m08991o45995q27582q71776
$$ 6622441 6982967 7170382 7174102 7046798 6871181 6630899 6221908 5575913 4748331 3876555
16904C876555p63792m94502j07774K89261N81913O70494N35439K53512q4067m18355
$$ 3876555 3112763 2618261 2510487 2799748 3381661 4052155 4587594 4841106 4757039 4338684
16894D338684o94809q90081j074346j299315j497734j538480j301124q45838m57603
$$ 4338684 3643875 2753794 1679448 380133 -1117601 -2656081 -3957205 -4803043 -5260646
16885e260646l42289m41649o05138p58503q60254q72966q32185p67073o03747
$$ -5260646 -5602935 -6044584 -6649722 -7408225 -8268479 -9141445 -9973630 -10740703 -11344450
16876a1344450k74114J77204O26661R32881J007928Q92453P09620N43343L93086
$$ -11344450 -11618564 -11441360 -10814699 -9881818 -8873890 -7981437 -7271817 -6728474 -6335388
16867f335388K42413J05282J931l5395j216L9571P521j31186l57414o12255q57403
$$ -6335388 -6092975 -5987693 -5985762 -6021157 -6022373 -5982802 -5975281 -6106467 -6463881 -7076136 -7933539
16856g933539j083414j233525j252098j139611q87944n05381j02644J56689K06608
$$ -7933539 -9016953 -10250478 -11502576 -12642187 -13530131 -14035512 -14138156 -13981467 -13774859
16847a3774859J80505K84469N58424Q61895J031004J006768Q87220Q09211P96004
$$ -13774859 -13594354 -13309885 -12751461 -11889566 -10858562 -9851794 -8964574 -8155363 -7359359
16838g359359P70298O67433M74610K20613L487r9762j43534k18030l19194m08002
$$ -7359359 -6589061 -5921628 -5447018 -5226405 -5222918 -5322680 -5466214 -5684244 -6003438 -6411440
16828f411440m77541m61094k51092J37912N72676R24937J116769J145250J130494
$$ -6411440 -6888981 -7350075 -7601167 -7463255 -6890579 -5965642 -4848873 -3703623 -2573129
16819b573129J244996J523418J811308J906113J689299J199125N98880M2791l88374
$$ -2573129 -1328133 195285 2006593 3912706 5602005 6801130 7400010 7442801 7054427
16810G054427o79596q47657r11060q84922p77967n94578l61521j45005k6501l0187
$$ 7054427 6374831 5527174 4616114 3731192 2953225 2358647 1997126 1852121 1825620 1795433
16800A795433o1787K0479K57771N71220Q65882J047102J001698O91043J95024
$$ 1795433 1733646 1754125 2011896 2583116 3448998 4496100 5497798 6188841 6383865
16791F383865l63023q46202j099180j052138p86333m89356l82862n58080q69085
$$ 6383865 6020842 5174640 4075460 3023322 2236989 1747633 1364771 806691 -62394
16782f2394j094320j131967r79939o59426k40002J38817L63902M58225N42671
$$ -62394 -1156714 -2288681 -3268620 -3928046 -4168048 -4029231 -3665329 -3207104 -2664433
16773b664433O47340O70000N72052M47101L96502M35444N26670O30707O56523
$$ -2664433 -2017093 -1347093 -775041 -327940 68562 504006 1030676 1661383 2317906
16764B317906N03533K02057j15311l54206m88525n24765m64998l03200p2358J62396
$$ 2317906 2821439 3023496 2908185 2553979 2065454 1540689 1075691 772491 700133 862529
16754H62529L22835L56602L00242K24792J17799j28844n70087j090443j463070
$$ 862529 1185364 1541966 1842208 2067000 2184799 2055955 1485868 395425 -1067645
16745a067645j502594j224977q75438o94948o92231o69533m49609o8329K67843
$$ -1067645 -2570239 -3795216 -4670654 -5365602 -6057833 -6727366 -7176975 -7245304 -6977461
16736f977461L88186K78355L4362k41389n18276p23345o44616j90451M11701Q34523
$$ -6977461 -6589275 -6310920 -6276558 -6517947 -7036223 -7759568 -8404184 -8594635 -8182934 -7348411
16726g348411R14982P02991M04346K33566K62314M09356N37755N89932N72152
$$ -7348411 -6433429 -5730438 -5326092 -5092526 -4830212 -4420856 -3883101 -3293169 -2721017
16717b721017M44856J85623r0322k10385r7744J84163M75381O12941N40853L59534
$$ -2721017 -2276161 -2090538 -2180860 -2391245 -2488989 -2304826 -1829445 -1216504 -675651 -316117
16707c16117K54349L18310M55317M93668L70431J87280P2819L8577R74j03305
$$ -316117 -61768 256542 711859 1205527 1575958 1763238 1836057 1874634 1875608 1772303
16697A772303k92768n21675o10583l69808J81545Q08262J235103J328265J153633
$$ 1772303 1479535 957860 347277 -22531 159014 967276 2202379 3530644 4684277
16688D684277Q32058M53502J54750O3440J63105L10842M18205N75751Q53019J079227
$$ 4684277 5516335 5969837 6124587 6188027 6351132 6661974 7080179 7655930 8508949 9588176
16678I588176J023092O39470P5854m44150p61701q21779o45807l66007j81763
$$ 9588176 10611268 11250738 11326592 10882442 10120741 9298962 8653155 8287148 8105385
16669H105385k21112m80644q28919j057085j031057q01619n17778k33551R4300
$$ 8105385 7884273 7403629 6574710 5517625 4486568 3684949 3167171 2933620 3027920
16660C027920M44766P20663Q59121Q14779N26379O4708l17622m45217m34156n30460
$$ 3027920 3472686 4193349 5052470 5867249 6393628 6458336 6140714 5695497 5261341 4730881
16650D730881p81268j010261j086891j033402r14733p74546o77804p01217q57863
$$ 4730881 3949613 2939352 1852461 819059 -95674 -870220 -1548024 -2249241 -3107104
16641c107104j092363j299761j353897j184263q36933m59442k17433j68862k36368
$$ -3107104 -4199467 -5499228 -6853125 -8037388 -8874321 -9333763 -9551196 -9720058 -9956426
16632i956426l32199m12397m18372l00293q3835K03569N76463R63783J205314
$$ -9956426 -10288625 -10701022 -11119394 -11419687 -11503522 -11299953 -10723490 -9759707 -8554393
16623h554393J218687J043316P58144M53693J93273q22p3056M085P5887m9326
$$ -8554393 -7335706 -6292390 -5534246 -5080553 -4887280 -4888102 -4961158 -4957073 -4881186 -4930512
16613d930512l36237o00073p18635o60989m51870j75927L7241R1478L1186j4481
$$ -4930512 -5266749 -5866822 -6585457 -7246446 -7698316 -7874243 -7837002 -7745524 -7714338 -7728819
16603g728819K2495J44939L23059N16470O97970Q18279Q21808P21538N88076M49990
$$ -7728819 -7706324 -7561385 -7238326 -6721856 -6023886 -5205607 -4383799 -3662261 -3074185 -2624195
16593b624195L05842J69657L1888j13707k19397k35604j90344j35859m6241J04414
$$ -2624195 -2318353 -2148696 -2116808 -2230515 -2449912 -2685516 -2875860 -3011719 -3057960 -2953546
16583b953546J92802K6944l94087q46224j128924j182201r97606o13776j23301
$$ -2953546 -2760744 -2733800 -3127887 -3974111 -5103035 -6285236 -7282842 -7896618 -8019919
16574h019919L74671P42718Q45817O98510M46582K40811J92964L57181O90123
$$ -8019919 -7645248 -6902530 -6056713 -5358203 -4911621 -4670810 -4477846 -4120665 -3430542
16565c430542J051278J308375J440735J454660J291877R33372M78534P5879j48089
$$ -3430542 -2379264 -1070889 369846 1824506 3116383 4049755 4528289 4604168 4456079
16556D456079j69488p9926J9472M5325l7093j29959q7399J05019L23298M74276
$$ 4456079 4286591 4206665 4226137 4271462 4234369 4104410 4017011 4122030 4445328 4919604
16546D919604N47058N53144N27422M72892L27452Q2000j55965k73388k80333l23090
$$ 4919604 5466662 6019806 6547228 7020120 7347572 7429572 7273607 7000219 6719886 6396796
16536F396796n35716q63997j087470j090681r98479r26682q46368p04397m34014
$$ 6396796 5861080 4997083 3909613 2818932 1820453 893771 47403 -656994 -1091008
16527a091008L0494O25563J130982J294863J033379N34876J13895K742K35611
$$ -1091008 -1060514 -434951 696031 1990894 3024273 3559149 3673044 3675786 3911397
16518C911397O10565Q16684P13763M13644O6794k50269m81229o42746q59473j153794
$$ 3911397 4521962 5338646 6052409 6466053 6532847 6282578 5801349 5158603 4299130 3145336
16508C145336j339672j246659r01270m38237k408K76299L60427K92751J15137
$$ 3145336 1805664 559005 -342265 -780502 -782910 -506611 -146184 146567 261704
16499B61704p0568j00690N2488K26634K62486J11896j82671n32809q82989j224356
$$ 261704 191136 90446 142934 369568 632054 743950 561279 28470 -854519 -2078875
16489b078875j488332j510919j201120o38778k6122L92641M61119K06409j90038
$$ -2078875 -3567207 -5078126 -6279246 -6918024 -6944146 -6551505 -6090386 -5883977 -6074015
16480f074015n25185o93999o87881n62866l93094k35742j42914j42688k11802
$$ -6074015 -6599200 -7293199 -7981080 -8543946 -8937040 -9172782 -9315696 -9458384 -9670186
16471i670186k89985l38188l93243n37078q11882j233329j876038k770909l712459
$$ -9670186 -9960171 -10298359 -10691602 -11228680 -12040562 -13273891 -15149929 -17920838 -21633297
16462b1633297m260529l836983k085347M02461K369839L250860L412894L307695
$$ -21633297 -25893826 -29730809 -31816156 -31413695 -29043856 -25792996 -22380102 -19072407
16454a9072407L031702K512881J797381J119821P53569P62889R11778Q71102N33402
$$ -19072407 -16040705 -13527824 -11730443 -10610622 -9857053 -9094164 -8182386 -7311284 -6777882
16445f777882P4402k60491l51845k49980l4860K88641O88499J025274J138228
$$ -6777882 -6703480 -6963971 -7315816 -7565796 -7600656 -7312015 -6623516 -5598242 -4460014
16436d460014R49264N30567J14316m6766J32038N07852Q56740J093749J253717
$$ -4460014 -3510750 -2980183 -2865867 -2912633 -2780595 -2272743 -1416003 -322254 931463
16427I31463J291704J082282N88762o9397o88243j107881j275554j188997q88128
$$ 931463 2223167 3305449 3894211 3824814 3136571 2028690 753136 -435861 -1323989
16418a323989n03468j93764r568J13547K57641M81678P62453R70155R66380P02729
$$ -1323989 -1827457 -2021221 -2030789 -1917242 -1659601 -1177923 -415470 554685 1521065 2223794
16408B223794K69226j59587m72389o62321p61426q24174q98949r85812j054202
$$ 2223794 2493020 2333433 1861044 1198723 437297 -386877 -1285826 -2271638 -3325840
16399c325840j053539q91624n18386p6734K17130L38577L86372L21406K9460l90838
$$ -3325840 -4379379 -5271003 -5789389 -5866123 -5648993 -5310416 -4924044 -4602638 -4573178 -4964016
16389d964016o81761p24916o04090m53093l14267j31803P4595J90778K41951L72782
$$ -4964016 -5645777 -6370693 -6974783 -7427876 -7742143 -7873946 -7799351 -7608573 -7366622 -6993840
16379f993840O15636Q71917J013517R63269P12590K45471l81675r08020j083349
$$ -6993840 -6378204 -5506287 -4492770 -3529501 -2816911 -2571440 -2953115 -3861135 -4944484
16370d944484r10401n44244q3342M50604R62774J277735J326101J195862J023934
$$ -4944484 -5854885 -6399129 -6482471 -6031867 -5069093 -3791358 -2465257 -1269395 -245461
16361b45461Q81129O64669K13790m69758j209659j734898j817862j494034j062781
$$ -245461 635668 1300337 1514127 1044369 -165290 -1900188 -3718050 -5212084 -6274865
16352f274865p69957o07158m37828j87843J27863M83840Q52425J140597J244393
$$ -6274865 -7044822 -7651980 -8089808 -8277651 -8149788 -7665948 -6813523 -5672926 -4428533
16343d428533J179481J091587J084964J058801Q29395M15477L1123j55335j16839
$$ -4428533 -3249052 -2157465 -1072501 -13700 815695 1231172 1262295 1106960 990121
16334I90121K4722P2881n4595k88301m98997n59024m13165j61280j4490p4420
$$ 990121 1014843 1087724 1033129 744828 245831 -313193 -726358 -887638 -902128 -976548
16324i76548k36112l24512k38518q179K17278K84447J84179J2888j71151l59890
$$ -976548 -1212660 -1537172 -1775690 -1783869 -1566591 -1282144 -1097965 -1085077 -1256228 -1616118
16314a616118n61730q20630j146408j372484j189299l91798Q36698J888501K255864
$$ -1616118 -2177848 -2998478 -4144886 -5517370 -6706669 -7098467 -6261769 -4373268 -2117404
16305b117404K011921J546153J050724M39804k98417r29700j218487j127202p69307
$$ -2117404 -105483 1440670 2491394 2931198 2632781 1703081 484594 -642608 -1411915
16296a411915l25475L6411K49263L59761M58935N89172P41174Q88770R21276P01414
$$ -1411915 -1737390 -1700979 -1451716 -1091955 -633020 -43848 697326 1586096 2507372 3208786
16286C208786K85706q2893k38693k18798j68757j84488k19821j92271j03540N218
$$ 3208786 3494492 3411599 3172906 2954108 2785351 2600863 2381042 2188771 2085231 2090449
16276B090449J23258K74786M55797N81695N87391N43464N52922N85446N07538
$$ 2090449 2213707 2488493 2944290 3525985 4113376 4656840 5209762 5795208 6302746
16267F302746K58654m5834k24217k14160r4976J2730J2717j39346l95929o20692
$$ 6302746 6561400 6515566 6291349 6077189 5982213 5994943 6007660 5868314 5472385 4851693
16257D851693o94448o13605m87882m62583n62135o16238m98456l34016k99340
$$ 4851693 4157245 3543640 3055758 2593175 2031040 1414802 916346 582330 282990
16248B82990m07759n63852o33448m92037j31851K86670N54618N63853L30570j0745
$$ 282990 -124769 -688621 -1322069 -1814106 -1945957 -1659287 -1104669 -540816 -210246 -220991
16238b20991k34403k05062Q415K95843N89913P60431O51346K78396j27097l05936
$$ -220991 -455394 -660456 -652041 -356198 233715 994146 1645492 1923888 1796791 1490855
16228A490855k29951j54789l22756o96351j072420j365926j615968j822411j928670
$$ 1490855 1260904 1106115 783359 87008 -985412 -2351338 -3967306 -5789717 -7718387
16219g718387j859738j569911j101776n54431j8455M38527P31642P84294O62286
$$ -7718387 -9578125 -11148036 -12249812 -12804243 -12822698 -12384171 -11652529 -10868235 -10205949
16210a0205949N33446M58319L65024K27136J42159J90158L49073N89454Q88173
$$ -10205949 -9672503 -9214184 -8849160 -8622024 -8479865 -8289707 -7940634 -7351180 -6463007
16201f463007J175623J376204J488763J552203J523179J309108R05786L91273
$$ -6463007 -5287384 -3911180 -2422417 -870214 652965 1962073 2867859 3259132
16193C259132j35524n26388o33985m42454p3370L27780O45271P67394O17753K10324
$$ 3259132 3123608 2597220 1963235 1520781 1447411 1775191 2420462 3187856 3805609 4015933
16183D015933l30951p85395r49343p61205l09323K26288O39138P78000O36620
$$ 4015933 3684982 2899587 1950244 1189039 879716 1106004 1745142 2523142 3159762
16174C159762L29816q647k50499k88425j12520J65108M01046N42834O43253P72137
$$ 3159762 3489578 3480931 3230432 2942007 2829487 2994595 3395641 3938475 4581728 5353865
16164E353865R07038R17090O78541K08180l54069q80793j279790j485641j515893
$$ 5353865 6260903 7177993 7856534 8064714 7710645 6829852 5550062 4064421 2548528
16155B548528j429098j274513j128907j040102r65392q63049p53271o85196o79594
$$ 2548528 1119430 -155083 -1283990 -2324092 -3289484 -4152533 -4905804 -5591000 -6270594
16146f270594o86321o51524n51376l66201j17992J19235K73735L12547K42217
$$ -6270594 -6956915 -7608439 -8159815 -8526016 -8644008 -8524773 -8251038 -7938491 -7696274
16137g696274J24373O2245J08312K19967L07369K98522K20434K02014L43911O24020
$$ -7696274 -7571901 -7509656 -7401344 -7181377 -6874008 -6575486 -6355052 -6153038 -5809127 -5185107
16127e185107R38359J134244J068728P63032M34133K99087L65742M86168N79615
$$ -5185107 -4246748 -3112504 -2043776 -1280744 -846611 -547524 -181782 304386 884001
16118H84001O77299Q28435J009117J091924R62646O76209M09925K53093J54708
$$ 884001 1561300 2389735 3398852 4490776 5453422 6129631 6539556 6792649 6947357
16109F947357O5884j5689j07495j94921k08661r2645J29260L37337M09000L05846
$$ 6947357 7013241 6997552 6890057 6695136 6486475 6393830 6523090 6860427 7269427 7575273
16099G575273P3444k13254m97212p30974q70570q69378p10106n11858m55020n31334
$$ 7575273 7648717 7435463 6938251 6207277 5336707 4467329 3757223 3245365 2790345 2259011
16089B259011n66844m73584l05619j14566J19740L94325O16297O83897N87311
$$ 2259011 1692167 1218583 912964 798398 918138 1312463 1928760 2612657 3199968
16080C199968L77872R8075j86853l90223n00512n56646n58912n12199m63329m59703
$$ 3199968 3577840 3675915 3489062 3098839 2598327 2041681 1482769 970570 507241 47538
16070D7538n00671n42614n51294m91098k92333N5122M21668O40957O50563N05303
$$ 47538 -453133 -995747 -1547041 -2038139 -2330472 -2275350 -1853682 -1212725 -562162 -56859
16060e6859K95463Q5197j13697l34846n91567q38648j000978j004245q44240o09332
$$ -56859 238604 323801 210104 -124742 -716309 -1554957 -2555935 -3560180 -4404420 -5013752
16050e013752l68816j07534K21709N90259Q83722J048440J128282J167656J188662
$$ -5013752 -5382568 -5490102 -5268393 -4678134 -3794412 -2745972 -1617690 -450034 738628
16041G38628J212101J207491J059447O65827N1478o09393j041384j048254p14034
$$ 738628 1950729 3158220 4217667 4883494 4934972 4325579 3284195 2235941 1521907
16032A521907l52236k03393k50236l17315k40742L5522M46878Q18365R79306Q97746
$$ 1521907 1169671 966278 716042 398727 157985 193507 640385 1458750 2438056 3335802
16022C335802O22199K15497k04889m85200o02602p45892j078251j508314j833300
$$ 3335802 3958001 4173498 3968609 3483409 2880807 2134915 1056664 -451650 -2284950
16013b284950j909694j645620j096003m83955K3307M28602P65142R99051J083771
$$ -2284950 -4194644 -5840264 -6936267 -7420222 -7396915 -6968313 -6203171 -5204120 -4120349
16004d120349J027748Q64886O05280L09584R3715Q825J3946L1031K0017J0478
$$ -4120349 -3092601 -2227715 -1622435 -1312851 -1219136 -1210311 -1196365 -1165334 -1145317 -1134839
15994a134839M3210J29251K21932K46726J95272J39979J83730L60957N75451O96562
$$ -1134839 -1091629 -962378 -740446 -493720 -298448 -158469 25261 386218 961669 1658231
15984A658231P50331Q76208J089228J221400J075564O12782j4356n94586r95740
$$ 1658231 2408562 3284770 4373998 5595398 6670962 7283744 7269388 6674802 5679062
15975E679062j184609j173177j021420q31818o65437n21926l84901k25110j1397
$$ 5679062 4494453 3321276 2299856 1468038 802601 280675 -104226 -329336 -340733
15966c40733K21860M09467N62150O97243P53899O76475M39004N9757l08423m68146
$$ -340733 -118873 290594 852744 1549987 2303886 2980361 3419365 3479122 3170699 2702553
15956B702553l86452k10115r6596r0121j33610j66129j66437j36766j29189j97582
$$ 2702553 2316101 2105986 2009390 1919269 1785659 1619530 1453093 1316327 1187138 989556
15946I89556l08431l81851l77088l52126m23843n78905o37077m78972j75280J19332
$$ 989556 681125 299274 -77814 -429940 -853783 -1432688 -2069765 -2548737 -2724017 -2604685
15936b604685L47942N80107Q36343J007282R81742P82282N36759L42476K01733
$$ -2604685 -2256743 -1676636 -840293 166989 1148731 1931013 2467772 2810248 3011981
15927C011981N5248j46091m16700p44756j065666j284358j343166j203135q59932
$$ 3011981 3067229 2921138 2504438 1759682 694016 -590342 -1933508 -3136643 -3996575
15918c996575m44361j25128R0324L06203N34005O61811O06965M13686K28478J90567
$$ -3996575 -4440936 -4566064 -4475740 -4169537 -3635532 -2973721 -2366756 -1953070 -1724592 -1534025
15908a534025L02799M26688M61585M01468K52339N8730p9227r9326m9705k6324
$$ -1534025 -1231226 -804538 -342953 58515 310854 369584 290357 191031 141326 115002
15898A15002p7766j80866k80925l80887n22291o74546p66368p66034o42245l77530
$$ 115002 37236 -143630 -424555 -805442 -1327733 -2002279 -2768647 -3534681 -4176926 -4554456
15888d554456o0648J70560K99903M10326M75111L56782Q3709p5735N8322L06007
$$ -4554456 -4615104 -4444544 -4144641 -3734315 -3259204 -2902422 -2818713 -2894448 -2836126 -2530119
15878b530119L67054J97352k8895j61917j88711j73450r7345J62937O20958J049415
$$ -2530119 -2163065 -1965713 -1994608 -2156525 -2345236 -2518686 -2616031 -2453094 -1832136 -782721
15868g82721J122314O89293o7155p93989j238358j313056j054502o23157k62702
$$ -782721 339593 1028886 961731 167742 -1070616 -2383672 -3438174 -4061331 -4324033
15859d324033j60976l23183n39409n21542j75118K84248N61768N70924M43933
$$ -4324033 -4485009 -4808192 -5347601 -5869143 -6044261 -5760013 -5198245 -4627321 -4183388
15850d183388L67271M05790M51250L54637N1937l74004o81121o61802l50007L3386
$$ -4183388 -3816117 -3410327 -2959077 -2604440 -2552503 -2926507 -3607628 -4269430 -4619437 -4586051
15840d586051K66340K92300K41695K96137N36052Q42277R84078Q49500N48586
$$ -4586051 -4319711 -4027411 -3785716 -3489579 -2953527 -2111250 -1127172 -277672 270914
15831B70914K89481J74505J48959J24181Q1430R929j41813l47903m73545m48475
$$ 270914 560395 734900 883859 1008040 1089470 1099399 957586 609683 136138 -312337
15821c12337l45294k48104j38262L8682K46574L96998M56942M22347K97251J36319
$$ -312337 -657631 -905735 -1043997 -1005315 -758741 -361743 95199 517546 814797 951116
15811I51116l986j32948k56148k82618j22159J35330K81696K07783m5369l82060
$$ 951116 947130 814182 558034 275416 153257 288587 570283 778066 732697 350637
15801C50637p08178r16712q92152o05859j97053J29232K80916L08532K65456J31708
$$ 350637 -357541 -1274253 -2166405 -2772264 -2969317 -2840085 -2559169 -2250637 -1985181 -1853473
15791a853473r1549l85321p36368j044951j148976r60877n52670r0791K74975
$$ -1853473 -1945022 -2330343 -3066711 -4111662 -5260638 -6221515 -6774185 -6864976 -6590001
15782f590001M50103L96981J57894q9229j02116J82429N45063P39185P38583O09356
$$ -6590001 -6139898 -5742917 -5585023 -5674252 -5776368 -5593939 -5048876 -4309691 -3571108 -2961752
15772b961752L33136p0985m33818o03441n79526m45554k56204Q728L51364O75573
$$ -2961752 -2628616 -2699601 -3133419 -3736860 -4316386 -4761940 -5018144 -5009416 -4658052 -3982479
15762c982479Q70437R17290Q55111O98559M35529P6539k78537m61475l79214q6077
$$ -3982479 -3112042 -2194752 -1339641 -641082 -205553 -129014 -407551 -869026 -1248240 -1334317
15752a334317K62712M56841L22447j07549n83256q95063j038460j071821j006904
$$ -1334317 -1071605 -614764 -292317 -399866 -983122 -1878185 -2916645 -3988466 -4995370
15743d995370q55287o02579k09664K71846O80661Q49233P36512M79444K48588
$$ -4995370 -5850657 -6453236 -6662900 -6391054 -5710393 -4861160 -4124648 -3645204 -3396616
15734c396616P3376r9251k47960k74568j35308P6541K26055K74571K90268L56380
$$ -3396616 -3323240 -3422491 -3670451 -3945019 -4080327 -4003786 -3777731 -3503160 -3212892 -2856512
15724b856512N07806P08693Q70496Q81250O13028O1297n05345p38074n50133j67671
$$ -2856512 -2348706 -1640013 -769517 111733 724761 786058 280713 -457361 -1007494 -1175165
15714a175165J09089J44983J4585j10293j22231p9099j16606k67673m50998n66643
$$ -1175165 -1066076 -921093 -906508 -1016801 -1139032 -1218131 -1334737 -1602410 -2053408 -2620051
15704b620051n47710l83235r3830K85205O42781Q27699P71906N60045L57048K40366
$$ -2620051 -3167761 -3550996 -3644826 -3359621 -2716840 -1889141 -1117235 -557190 -200142 40224
15694D0224J25084j08321m35046p21953q58772q25261p06962n92010m89625l71781
$$ 40224 165308 56987 -378059 -1100012 -1958784 -2784045 -3491007 -4083017 -4572642 -4944423
15684d944423j75771J29200M65544P85005J152973J581124J916388J988006J763884
$$ -4944423 -5120194 -4990994 -4525450 -3740445 -2587472 -1006348 910040 2898046 4661930
15675D661930J333826Q62155N17081L54651L07462K53654J10508j13142l76999
$$ 4661930 5995756 6857911 7374992 7729643 8037105 8290759 8401267 8288125 7911126
15666G911126o57426q94609j003372r70000q57606p52427p01413o45743m71048
$$ 7911126 7253700 6359091 5355719 4385719 3528113 2775686 2074273 1428530 957482
15657I57482j60055J70716L77714L91336K10588j36474n44100q17304q42783p43412
$$ 957482 797427 968143 1345857 1737193 1947781 1811307 1267207 449903 -392880 -1136292
15647a136292p22716p85902p37829m47792o805L79510N85475O63003P39044Q39537
$$ -1136292 -1859008 -2644910 -3382739 -3830531 -3837336 -3457826 -2872351 -2209348 -1470304 -630767
15637f30767Q75869P83746N58880K11651k02531n55840p02296n97518l72811k16080
$$ -630767 245102 1028848 1587728 1799379 1596848 1041008 338712 -258806 -631617 -847697
15627h47697k52419n25818r30580j246052j326485j183237r46965p56464o28515
$$ -847697 -1100116 -1625934 -2556514 -3802566 -5129051 -6312288 -7259253 -8015717 -8644232
15618h644232n08522l43324m7811M05527R28647J421099J798883K009963K056706
$$ -8644232 -9152754 -9496078 -9543889 -9138362 -8209715 -6788616 -4989733 -2979770 -923064
15609i23064J899190J442259P21741l929m76832o41238n37085k25629J41489L78478
$$ -923064 976126 2418385 3140126 3136197 2659365 2018127 1481042 1255413 1396902 1775380
15599A775380L88333J91326p1235k08730j54820K947J49531K16999J70254J8212
$$ 1775380 2163713 2355039 2283804 2075074 1920254 1923201 2072732 2289731 2459985 2478197
15589B478197j37155j27252J52348O38426J122995J405286J445063J305261J025259
$$ 2478197 2341042 2213790 2366138 3004564 4127559 5532845 6977908 8283169 9308428
15580I308428O72906L57603J00228j74959n26493r32184j289895j471428j403556
$$ 9308428 9981334 10338937 10439165 10264206 9737713 8805529 7515634 6044206 4640650
15571D640650j100212o46968j90396J13720K31538K66255K79998K06729K2844
$$ 4640650 3540438 2893470 2703074 2816794 3048332 3314587 3594585 3801314 3824158
15562C824158j78741l76328o42093r37116j112681j086616r12802o97027n11683
$$ 3824158 3645417 3269089 2626996 1689880 577199 -509417 -1422219 -2119246 -2630929
15553b630929l94000l29153k74972k20495k02845k86781m96513p48179q53944
$$ -2630929 -3024929 -3354082 -3629054 -3849549 -4052394 -4339175 -4835688 -5583867 -6437811
15544f437811o29053o9886N97926J117927J403282J502557J447632J232473Q81498
$$ -6437811 -7066864 -7136750 -6538824 -5420897 -4017615 -2515058 -1067426 165047 1046545
15535A046545M37436l3194m15331o02541n46014k61798J32992M30615M92942L88245
$$ 1046545 1483981 1450787 1035456 432915 -113099 -374897 -241905 188710 681652 1069897
15525A069897K89781K49117J62112l8646l15462o50365j036950j372591j517332
$$ 1069897 1359678 1608795 1770907 1732261 1416799 766434 -270516 -1643107 -3160439
15516c160439j400148j035411n34050o9253K56083M83639P11273R51414J110506
$$ -3160439 -4560587 -5595998 -6130048 -6199301 -5943218 -5459579 -4748306 -3796892 -2686386
15507b686386J098955R17365O83650N86782P14577R37936J044369R49599O90672
$$ -2686386 -1587431 -670066 13584 600366 1314943 2252879 3297248 4246847 4937519
15498D937519L42740K1060j80634k64461k83360k85312l03834l42252l57312l37390
$$ 4937519 5280259 5301319 5120685 4856224 4572864 4287552 3983718 3641466 3284154 2946764
15488B946764l59718m76858o27819p03798o56372n19763l47661j43046R2048K98816
$$ 2946764 2587046 2110188 1482369 778571 122199 -397564 -745225 -888271 -796223 -497407
15478d97407M50614N84678P20395P90077O73037L42270n7381k73062j25476K92374
$$ -497407 -46793 537885 1258280 2048357 2721394 3063664 3006283 2733221 2607745 2900119
15468B900119P03109Q85748P75328M63025J12107j59998l38396m68418n74213
$$ 2900119 3603228 4488976 5264304 5727329 5839436 5679438 5341042 4872624 4298411
15459D298411o46175o93771p60985q36872q48239p52984n26080j82775J20899
$$ 4298411 3652236 2958465 2197480 1360608 512369 -240615 -766695 -949470 -828571
15450h28571K04065N8902j66975l09796k84902j19909M6066O7906n2779j97263
$$ -828571 -624506 -565604 -732579 -1042375 -1327277 -1447186 -1401120 -1333214 -1385993 -1583256
15440a583256l06659l83208l94963l33860k39350j26303j648P2207M5551N716
$$ -1583256 -1889915 -2273123 -2668086 -3001946 -3241296 -3367599 -3369247 -3297040 -3251489 -3245773
15430c245773R4934L16487N31131N95794M68853K55151J22381J35515K37272L13197
$$ -3245773 -3150839 -2834352 -2303221 -1707427 -1238574 -983423 -861042 -725527 -488255 -175058
15420a75058K65561J35475N9718P3453N0306j18544l62703n21547n14673l78006
$$ -175058 90503 225978 285696 359149 409455 290911 -71792 -593339 -1108012 -1486018
15410a486018k09715j27159k24290m93354p68856q47746p11764n33647m41197
$$ -1486018 -1695733 -1822892 -2047182 -2540536 -3309392 -4157138 -4868902 -5402549 -5843746
15401e843746l32897j8020M80298R23119J147247J197992J157312J026157Q05797
$$ -5843746 -6176643 -6194663 -5714365 -4791246 -3643999 -2446007 -1288695 -262538 543259
15392E43259N60342L94042L59355L84066L73339L40168L42485L37317K33079R1136
$$ 543259 1103601 1497643 1856998 2241064 2614403 2954571 3297056 3634373 3867452 3958588
15382C958588M9855R6550J36434J33352N7132j39663m51648p75207r73218r97496
$$ 3958588 4008443 4104993 4241427 4374779 4431911 4292248 3840600 3065393 2092175 1094679
15372A094679q92003p12011m95212k84991j08809M4868J67321K03283J33131L2275
$$ 1094679 202676 -509335 -1004547 -1289538 -1398347 -1353479 -1186158 -982875 -849744 -817469
15362h17469k1709l491J17564L46395O11625Q23205R44282R72354Q80074O55055
$$ -817469 -839178 -842669 -725105 -378710 232915 1056120 2000402 2972756 3852830 4507885
15352D507885L81323J79134P2447J379q4511k03738l77024o42348r83347j278442
$$ 4507885 4889208 5068342 5140789 5142168 5057657 4853919 4476895 3834547 2851200 1572758
15342A572758j411739j388699j259535r95728n50160l32M54602O41023N67706
$$ 1572758 161019 -1227680 -2487215 -3482943 -4033103 -4033435 -3578833 -2937810 -2370104
15333b370104L56105N6012l29469p22764r62132r26171o49731l15584j19787r5520
$$ -2370104 -2013999 -1957987 -2287456 -3010220 -3972352 -4898523 -5548254 -5863838 -5983625 -6079145
15323f079145r1882L5792K21686K66019J36692R18j0580J21920L56200N93721
$$ -6079145 -6171027 -6135235 -5913549 -5647530 -5510838 -5509920 -5520500 -5398580 -5042380 -4448659
15313d448659O99123N99331L97287K58748K12706J95788J55392Q0067K2384M0472
$$ -4448659 -3749536 -3150205 -2752918 -2494170 -2281464 -2085676 -1930284 -1850217 -1827833 -1787361
15303a787361J79636M31405O48788P28761P77335Q82014R31291P78008M18523
$$ -1787361 -1607725 -1176320 -527532 201229 978564 1860578 2791869 3569877 3988400
15294C988400M646k66671l01078j57735M8029K42689L68711L69243K23010k6060
$$ 3988400 3993046 3726375 3425297 3267562 3315591 3558280 3926991 4296234 4519244 4493184
15284D493184l04664n66020p91589r40462r15730o54681k75702r689O6188P3954
$$ 4493184 4188520 3622500 2830911 1890449 974719 320038 44336 34647 100835 174789
15274A74789J02090R7739M9708Q9795L52274Q11105J246647J387348J171536Q06147
$$ 174789 276879 374618 424326 514121 866395 1677500 2924147 4311495 5483031 6289178
15264F289178M89909K23636m7650l01481n33539p98200j097046j318621j320412
$$ 6289178 6779087 7002723 6955073 6653592 6120053 5321853 4224807 2906186 1585774
15255A585774j023612m67203J30973M92973N70894N45103N06255L49109O46m19531
$$ 1585774 562162 94959 225932 718905 1289799 1834902 2341157 2690266 2690912 2271381
15245B271381o96874o60504k93599K11374N92989P12907N77998K72013j12785
$$ 2271381 1574507 914003 620404 831778 1424767 2137674 2715672 2987685 2874900
15236B874900n11277q38199r80033q83862o19399l23408q6589N8965O0123j27234
$$ 2874900 2363623 1525424 545391 -338471 -957870 -1281278 -1367867 -1308902 -1248779 -1376013
15226a376013m30932o69104o79439m51141j10020K34431N99065J016612J399303
$$ -1376013 -1806945 -2476049 -3155488 -3606629 -3716649 -3482218 -2883153 -1866541 -467238
15217d67238J637036J695934J571623J281782Q79698M19512o8117n60546j026348
$$ -467238 1169798 2865732 4437355 5719137 6598835 7018347 6950230 6389684 5363336
15208E363336j414571j628669j597683j377062j086207q08075n49344k57471O0624
$$ 5363336 3948765 2320096 722413 -654649 -1740856 -2548931 -3098275 -3355746 -3295122
15199c295122L18044M11481K18865k76229q57529j267607j431795j331809q63759
$$ -3295122 -2977078 -2565597 -2346732 -2622961 -3480490 -4748097 -6179892 -7511701 -8375460
15190h375460k5830R18052J618535J883823J760131J454020J111091O99543K08998
$$ -8375460 -8401290 -7483238 -5864703 -3980880 -2220749 -766729 344362 1043905 1252903
15181A252903k20579m50701m76519l95476l12860k87922l33636m52933o33863
$$ 1252903 1032324 581623 105104 -290372 -603232 -891154 -1224790 -1677723 -2311586
15172b311586q02979q73773q30933o89773m29533n7070L21162N84484P27736Q44032
$$ -2311586 -3114565 -3988338 -4819271 -5509044 -5938577 -5995647 -5674485 -5090001 -4362265 -3518233
15162c518233R76129J073331J115453J137910J139180J074907R51155Q37771P53463
$$ -3518233 -2542104 -1468773 -353320 784590 1923770 2998677 3949832 4787603 5541066
15153E541066O24349L69531j2679l98687n95688n22916k96048j02912k9256j4373
$$ 5541066 6165415 6534946 6522267 6123580 5527892 5004976 4708928 4606016 4576760 4562387
15143D562387L3020J24434K17246K78324K88151K33848J24245J8225j523O2872
$$ 4562387 4595407 4719841 4937087 5215411 5503562 5737410 5861655 5879880 5878357 5941229
15133E941229J05452N4920o3521j79238k14368j40338j8523M9652L9821M8540
$$ 5941229 6046681 6101601 6038080 5858842 5644474 5504136 5485613 5535265 5575086 5623626
15123E623626K03272N08766P99983R57778R94881Q68531N11870K5881l95640o65432
$$ 5623626 5826898 6335664 7135647 8093425 9088306 9956837 10468707 10494588 10098948 9433516
15113I433516p96099p81192o12349l97567l31298n43337r88751j437865j653337
$$ 9433516 8637417 7856225 7243876 6846309 6515011 5971674 4982923 3545058 1891721
15104A891721j551417j172437o36528j25761J94084K76582K29492K47173M75352
$$ 1891721 340304 -832133 -1468661 -1594422 -1400338 -1123756 -894264 -647091 -171739
15095a71739Q40589J052761R15023N43712J99649J5296n5969j16697k13367l16522
$$ -171739 668850 1721611 2636634 3180346 3379995 3395291 3339322 3222625 3009258 2692736
15085B692736l83776m39290n36638o22928n53354l12121o8009O7864J70561L27813
$$ 2692736 2308960 1869670 1333032 710104 156750 -155371 -223380 -155516 15045 342858
15075C42858M56858L99203J59089q3621j85447j19661P1555K63532L29365K51634
$$ 342858 799716 1198919 1358008 1274387 1088940 969279 1040834 1304366 1633731 1885365
15065A885365J05849K4656P4186J41414J11782N1168P9733J98836L26226L99425
$$ 1885365 1991214 2015870 2090056 2231470 2343252 2394420 2474153 2672989 2999215 3398640
15055C398640M06310L61993L02369K85733L39173M13237M16342L17276J89351
$$ 3398640 3804950 4166943 4469312 4755045 5094218 5507455 5923797 6241073 6430424
15046F430424Q1794p4437l36001o36887q32532p81975m66504m2031L11889N25105
$$ 6430424 6512218 6437781 6101780 5464893 4632361 3850386 3383882 3341851 3653740 4178845
15036D178845O19263O84795Q12114R83391J101383J104880R64524O28944J01698
$$ 4178845 4798108 5482903 6295017 7278408 8379791 9484671 10449195 11078139 11179837
15027A1179837m82802q85085q98191n70229j80512K5048k384j50977l00088l94331
$$ 11179837 10697035 9811950 8913759 8343530 8163018 8188066 8185682 8034705 7734617 7340286
15017G340286l62792j34843K07884M70435N69543N62505M48566J54991k39185
$$ 7340286 6977494 6842651 7050535 7520970 8090513 8653018 9101584 9256575 9017390
15008I017390n07167n42509m19215j97811J38857N47086Q48403Q85773P09320
$$ 9017390 8510223 7967714 7548499 7350688 7489545 8036631 8885034 9770807 10480127
14999A0480127N62656O71052J011999J344524J451747J281478R08412M64263J01109
$$ 10480127 11042783 11713835 12725834 14070358 15522105 16803583 17711995 18176258 18277367
14990A8277367p5909p5361K8006J76663L30291M50712N18496N12368M02844K12155
$$ 18277367 18201458 18126097 18154103 18330766 18661057 19111769 19630265 20142633 20545477 20757632
14980B0757632K5992p4561n6154P1769K56368M21515N33699O23155P66927J085008
$$ 20757632 20783624 20709063 20652909 20724678 20981046 21402561 21936260 22559415 23326342 24411350
14970B4411350J650172K386593L121770L712867M094883M257238M280352M343182
$$ 24411350 26061522 28448115 31569885 35282752 39377635 43634873 47915225 52258407
14962E2258407M613818N163284N981958P003457Q091489R093059R900721J0450859
$$ 52258407 56872225 62035509 68017467 75020924 83112413 92205472 102106193 112557052
14954A12557052J0660561J0358237R347179P571234N233660K797041Q49165j51428
$$ 112557052 123217613 133575850 142923029 150494263 155727923 158524964 159374129 159222701
14946A59222701q1132Q48117K263200L877544N643370P691315J0153985J3044731
$$ 159222701 159141569 159989686 162252886 166130430 171773800 179465115 189619100 202663831
14938B02663831J6216084J9391633K2217805K4189081K4546501K2442384J7363414
$$ 202663831 218879915 238271548 260489353 284678434 309224935 331667319 349030733
14931C49030733R493791j48714r885908j7979026k3337226k5853911k6153846
$$ 349030733 358524524 358375810 348489902 330510876 307173650 281319739 255165893
14924B55165893k5027125k3133476k0997643j8963853j7099288j5284040j3460442
$$ 255165893 230138768 207005292 186007649 167043796 149944508 134660468 121200026
14917A21200026j1722788j0195893q918401p876907p069274o414115n756326n081187
$$ 121200026 109477238 99281345 90362944 82486037 75416763 69002648 63246322 58165135
14909E8165135m557557m305828m214396m008786l462675k573643j603470q66062
$$ 58165135 53607578 49301750 45087354 41078568 37615893 35042250 33438780 32572718
14901C2572718m69180l64796m81746p12420r29235j048610j039705r37656q04503
$$ 32572718 32103538 31738742 31256996 30544576 29615341 28566731 27527026 26589370 25784867
14892B5784867o32915l99064j46126O1705J89457K27645K35878K93160L77789
$$ 25784867 25151952 24752888 24606762 24668467 24857924 25085569 25321447 25614607 25992396
14883B5992396M18278M00380L66186L64334L89522L69208K37146L487k32820l45555
$$ 25992396 26410674 26811054 27177240 27541574 27931096 28300304 28537450 28540937 28308117 27962562
14873B7962562k80757r3036J54917M92660R20831J282701J441672J468149J503232
$$ 27962562 27681805 27588769 27743686 28236346 29157177 30439878 31881550 33349699 34852931
14864C4852931J583615J656685J646808J497934J179483P00053R7582n82238j280668
$$ 34852931 36436546 38093231 39740039 41237973 42417456 43117509 43215091 42632853 41352185
14855D1352185j949511k550116l002780l221533l213713l069566k877316k647355
$$ 41352185 39402674 36852558 33849778 30628245 27414532 24344966 21467650 18820295
14847A8820295k310619j848035j340281q53035m16954o8476J59142K29058J32390
$$ 18820295 16509676 14661641 13321360 12468325 12051371 11982895 12142037 12371095 12503485
14838A2503485p6347l32092n86552q05728r83813j132065j247139j294191j249322
$$ 12503485 12427138 12095046 11508494 10702766 9718953 8586888 7339749 6045558 4796236
14829D796236j115737q89333n63702k05673M5259J15808Q2184Q2214J66005K84834
$$ 4796236 3680499 2791166 2227464 2021791 2067050 2182858 2265042 2347256 2513261 2798095
14819B798095L80421M14827L84040L29283L19995M14343N64806O34993N75475
$$ 2798095 3178516 3593343 3977383 4306666 4626661 5041004 5605810 6240803 6816278
14810F816278M57345L72565L70031M12070M02063K54975n5318m27524o63252o76502
$$ 6816278 7273623 7646188 8016219 8428289 8830352 9085327 9030009 8602485 7939233 7262731
14800G262731n88204n47667n51685m99628l50596j69222m1826J9024N2433Q4173
$$ 7262731 6674527 6126860 5575175 5075547 4724951 4555729 4513903 4532927 4585360 4669533
14790D669533J46261K61117L67372L84327L39582L12690L13594L18572L22920
$$ 4669533 4815794 5076911 5444283 5828610 6168192 6480882 6794476 7113048 7435968
14781G435968K73062N7157l34914p60547j080521j225683j156203q81470m91742
$$ 7435968 7709030 7766187 7431273 6670726 5590205 4364522 3208319 2326849 1835107
14772A835107j08000J49551J58670j02632m81278p78341r33034j056480j254779
$$ 1835107 1727107 1876658 2035328 1932696 1451418 673077 -259957 -1316437 -2571216
14763b571216j451289j470207j218836p19321q4903M85730Q23148Q89214P42476
$$ -2571216 -4022505 -5492712 -6711548 -7430869 -7515772 -7030042 -6206894 -5317680 -4575204
14754d575204N06254L50814L56937M22017M20380L55466K99437K72839K35700
$$ -4575204 -4068950 -3718136 -3361199 -2939182 -2518802 -2163336 -1863899 -1591060 -1355360
14745a355360J67828P8970K2950J18676L79307O18480O63710N47517M08455K68940
$$ -1355360 -1187532 -1108562 -1085612 -966936 -587629 30851 694561 1242078 1650533 1919473
14735A919473K7555l26625o21294o66147m33642p8998J96805L33608M24457N47585
$$ 1919473 1947028 1620403 999109 332962 -100680 -179678 17127 350735 775192 1322777
14725A322777O70206P18893O66141N34272L29941K9681l05410m82667l75499r7467
$$ 1322777 1992983 2711876 3378017 3912289 4242230 4271911 3966501 3483834 3108335 3010868
14715C010868J18788J21925p3955l05922l85431k77375j00635K5846O4955M0370
$$ 3010868 3129656 3251581 3177626 2871704 2486273 2208898 2108263 2134109 2199064 2239434
14705B239434r193p0747j30345j38683n0388J44791M17443O72841P67618O11990
$$ 2239434 2230241 2159494 2029149 1890466 1840078 1984869 2402312 3075153 3842771 4454761
14695D454761K63576j05636l65374m95392n13722m41423k61167R2611N66351R70237
$$ 4454761 4718337 4612701 4247327 3751935 3238213 2796790 2535623 2628234 3194585 4164822
14685D164822J165587J130115R28378O80896M85380L07421L0610l54259p15799
$$ 4164822 5330409 6460524 7388902 8069798 8555178 8862599 8893209 8538950 7823151
14676G823151r37207j015899r95508r09050p89935o92632o62669o37035m89610
$$ 7823151 6885944 5870045 4874537 3965487 3175552 2482920 1820251 1183216 693606
14667F93606j96888J46803M07527M67701K99516l3575m14031o53977n83270k44772
$$ 693606 496718 643521 1051048 1518749 1818265 1784690 1370659 716682 133412 -111360
14657a11360R5274K31662K06238J26663J9363p0048k8737K10371N21461O53058
$$ -111360 -16086 215576 421814 548477 567840 497792 469055 679426 1200887 1853945
14647A853945N05100K21440j962j35697k95765m97865n95856n59258n87155p71448
$$ 1853945 2359045 2580485 2578523 2442826 2147061 1649196 1053340 494082 -93073 -864521
14637h64521r24246q15406l74926K71306Q69984J197391J190651R57912O72759
$$ -864521 -1788767 -2604173 -2979099 -2707793 -1837809 -640418 550233 1508145 2180904
14628B180904M42579K66331R0664r8632k46522k78429j79707j4781J05044N1048
$$ 2180904 2623483 2889814 2980478 2881846 2635324 2356895 2177188 2162407 2267451 2318499
14618B318499k55020p19237j092912j185273r99773o75449l39822k6708K55354
$$ 2318499 2063479 1344242 251330 -933943 -1933716 -2609165 -2948987 -2975695 -2720341
14609b720341M64316N50643M74346K54478J7243j01767q7582k6163R794L3661
$$ -2720341 -2256025 -1705382 -1231036 -976558 -959315 -1061082 -1148664 -1174827 -1165033 -1131372
14599a131372Q2122J36044J50869J10909O3542P1368J30529K05173K97424M23564
$$ -1131372 -1049250 -913206 -762337 -651428 -587886 -516518 -385989 -180816 116608 540172
14589E40172N33924N31309L84364J60445k7421q6216p639J43312K65155K70945
$$ 540172 1074096 1605405 1989769 2150214 2122793 2036577 2028938 2172250 2437405 2708350
14579B708350J91392J31307J10720J03011J27053J47807M3795k18094m86682n95683
$$ 2708350 2899742 3031049 3141769 3244780 3371833 3519640 3563435 3345341 2858659 2262976
14569B262976n67076n27283n19195n19851n27571n33308m74339k95236l5098J90430
$$ 2262976 1695900 1168617 649422 129571 -398000 -931308 -1405647 -1700883 -1735981 -1545551
14559a545551L05824L64838M63479O28809Q28006R71714R78507Q46229O15856
$$ -1545551 -1239727 -874889 -411410 217399 1045405 2017119 2995626 3841855 4457711
14550D457711L33050K7349k15679k43313m3489K19120L81032L75300K35818Q733
$$ 4457711 4790761 4818110 4602431 4359118 4315629 4534749 4915781 5291081 5526899 5535632
14540E535632l17861p14021j077041j379651j661589j842663j748495j332136
$$ 5535632 5217771 4503750 3426709 2047058 385469 -1457194 -3205689 -4537825
14532d537825p31662j52945K41421L77022K28123j50605n80460q95165j023365
$$ -4537825 -5269487 -5422432 -5181011 -4803989 -4575866 -4726471 -5306931 -6202096 -7225461
14523g225461r44411o90261l18573J71953P43189J224381J479190J515455J412580
$$ -7225461 -8169872 -8860133 -9178706 -9006753 -8263564 -7039183 -5559993 -4044538 -2631958
14514b631958J256115J119455J009049Q70204O61254L90561J37829J500m125L4309
$$ -2631958 -1375843 -256388 752661 1622865 2284119 2674680 2812509 2814009 2809884 2844193
14504B844193L9206L0124L6536j6901k14535n02806p48246q56546q31161p72668
$$ 2844193 2883399 2913523 2950059 2933158 2718623 2215817 1467571 611025 -220136 -992804
14494i92804p61614p67407p03650n31915l31296k38560k92919l50935k17314J25236
$$ -992804 -1754418 -2521825 -3225475 -3757390 -4088686 -4327246 -4620165 -4971100 -5188414 -5063178
14484e063178N26617Q52458J070396J176688J175774J134431J090329R39721N55507
$$ -5063178 -4536561 -3684103 -2613707 -1437019 -261245 873186 1963515 2903236 3458743
14475C458743k7235o42499j103820j223348r04882k96702K67525N39754M84753
$$ 3458743 3431508 2789009 1685189 461841 -443041 -739743 -472218 67536 552289
14466E52289K03748j29069l58111m26828l10202p137L85266P47444J037150J238404
$$ 552289 756037 626968 268857 -157971 -468173 -475310 -90044 657400 1694550 2932954
14456B932954J298559J171854Q90090N57692K66478L0054j99218m54456p19985
$$ 2932954 4231513 5403367 6293457 6851149 7117627 7147681 6948463 6494007 5774022
14447E774022r15794r03392o43418k83384Q608J81235K66920L04172K82651J25054
$$ 5774022 4858228 3954836 3311418 3028034 3036642 3217877 3484797 3788969 4071620 4196674
14437D196674j83595m62336n10223l60297k23970k95771o21142j043435j308639
$$ 4196674 4013079 3550743 3040520 2680223 2456253 2160482 1539340 495905 -812734
14428h12734j252099r05306m21398P7366N50966R75029J263908J299894J045480
$$ -812734 -2064833 -2970139 -3391537 -3314171 -2763205 -1788176 -524268 775626 1821106
14419A821106O42868L20201J61156R4085N9544O3898J33106K45495L07700K55472
$$ 1821106 2463974 2784175 2945331 3039416 3098960 3162858 3295964 3541459 3849159 4104631
14409D104631J30218k493j18077j49490O660K95146M93653M66967K38303j21809
$$ 4104631 4234849 4232356 4114279 3964789 3971449 4266595 4760248 5227215 5465518 5343709
14399E343709n15303q46216j065694j159796j143939j045489q76829o68534m63251
$$ 5343709 4828406 3982190 2916496 1756700 612761 -432728 -1309557 -1978091 -2441342
14390b441342k77387j58923j58927j95684r7082K13753O18818Q84827Q62397O15019
$$ -2441342 -2718729 -2877652 -3036579 -3232263 -3329345 -3115592 -2496774 -1611947 -749550 -134531
14380a34531L31257J51303J47998L18190N25704O21863O02338N26367L68027Q9512
$$ -134531 196726 348029 496027 814217 1339921 1961784 2564122 3090489 3458516 3548028
14370C548028k40485n13417o30810m85590q2914L55969N61879M52892J61935j09008
$$ 3548028 3307543 2794126 2163316 1677726 1594812 1950781 2512660 2965552 3127487 3018479
14360C018479k51871k83267k09076J1024L53439P10881R57178J017099R24859
$$ 3018479 2766608 2483341 2274265 2285289 2638728 3349609 4306787 5323886 6248745
14351F248745P65828N67013L34781J28885R223l8644n3560q3310k07642m51181
$$ 6248745 7014573 7581586 7916367 8045252 8054475 8015831 7962271 7878961 7671319 7220138
14341G220138p05457p96366o56810m05916k42075k81090m83826p23357q72246
$$ 7220138 6514681 5718315 5061505 4655589 4413514 4132424 3648598 2925241 2052995
14332B052995q41544n95820j82823K34041M95055N84574N52951M12584J89275
$$ 2052995 1211451 615631 432808 666849 1161904 1746478 2299429 2712013 2901288
14323B901288o7608l35355n72379p01749o99463o19476n12539l82595j96673Q8590
$$ 2901288 2833680 2498325 1925946 1224197 524734 -94742 -607281 -989876 -1186549 -1097959
14313a097959M52415P71888R33661R50255Q87770P80835O59721N21261L16537
$$ -1097959 -645544 126344 1060005 2010260 2898030 3678865 4338586 4859847 5176384
14304E176384L3642k82424n68114p59574q05770o81595m36440j67030R8666L71378
$$ 5176384 5210026 4927602 4359488 3599914 2794144 2112549 1676109 1509079 1607745 1979123
14294A979123N90186O85142O73747O18217N18059L09161R443k65262m29580n17001
$$ 1979123 2569309 3254451 3928198 4546415 5064474 5373635 5383078 5117816 4688236 4171235
14284D171235o21847p65993r05716r86390r65119q37252o29651l89962j83049
$$ 4171235 3549388 2783395 1877679 891289 -73830 -911082 -1540733 -1930695 -2113744
14275b113744p0632q9131k10820l29495l00928q8102J32604J36307j23564m69057
$$ -2113744 -2184376 -2273507 -2484327 -2813822 -3114750 -3202852 -3070248 -2933941 -3057505 -3526562
14265c526562o62624n88895l09668l1996O2039K5296R3425M27642R55578J400741
$$ -3526562 -4189186 -4778081 -5087749 -5119745 -5057706 -5032410 -4938985 -4511343 -3555765 -2155024
14255b155024J484533J194579P78574M50626K55871J70098J67361J92859J89459
$$ -2155024 -670491 524088 1302662 1753288 2009159 2179257 2346618 2539477 2728936
14246B728936J53143J20232R9725M5065j17622m58545r20182j270303j302483
$$ 2728936 2882079 3002311 3102036 3147101 3029479 2570934 1650752 380449 -922034
14237i22034r76725l90217K32975O64852Q46837Q61538Q13399P30250N55730K99148
$$ -922034 -1898759 -2288976 -2056001 -1391149 -544312 317226 1130625 1860875 2416605 2715753
14227B715753J07650R0404J99983K95533K75170J96524J80389K37719K86057K57794
$$ 2715753 2823403 2913807 3113790 3409323 3684493 3881017 4061406 4299125 4585182 4842976
14217D842976J59235M6715p460O5211K67288M54620M19939J41369j96332m54067
$$ 4842976 5002211 5048926 5041466 5106677 5373965 5828585 6248524 6389893 6193561 5739494
14207E739494o72396r28475j157067j219875j060232p28982l31215K3254K09873
$$ 5739494 5067098 4138623 2981556 1761681 701449 -27533 -358748 -335494 -125621
14198a25621J37593j25720l60864l64061j07485K43549M62817M09010J16842k02211
$$ -125621 11972 -113748 -474612 -838673 -946158 -702609 -239792 169218 286060 83849
14188H3849l29275k53088q9729J31127M10037O63921Q00461Q20056P71349O35965
$$ 83849 -245426 -498514 -588243 -457116 -47079 616842 1417303 2237359 3008708 3644673
14178C644673L74217M6105k26280l47981l15107k01200n8566Q8005J79961J62154
$$ 3644673 4018890 4064995 3838715 3490734 3175627 2974427 2915861 3003866 3183827 3345981
14168C345981J4547k72856o33694q95790r37153p89409n50707l09069j32099k5449
$$ 3345981 3360528 3087672 2453978 1558188 621035 -168374 -719081 -1028150 -1160249 -1185698
14158a185698R7274L29729O80875J048487J249650J152833Q27598N14340M05188
$$ -1185698 -1088424 -758695 -77820 970667 2220317 3373150 4200748 4715088 5120276
14149E120276M80327N66452N22374L22992j275l97147p80373j049584j154724
$$ 5120276 5600603 6167055 6689429 7012421 7011146 6613999 5833626 4784042 3629318
14140C629318j144142j062111q90775o66909n15965n05224n25631l91646p2001
$$ 3629318 2485176 1423065 532290 -134619 -650584 -1155808 -1681439 -2073085 -2145086
14131b145086L13222O50926Q25042P64147N84133M71522M56043M27874L00184
$$ -2145086 -1831864 -1180938 -355896 408251 992384 1463906 1919949 2347823 2648007
14122B648007R0621j31292l18110m13610l41480r2425K54255O09920Q86114R61783
$$ 2648007 2738628 2607336 2289226 1875616 1534136 1441711 1695966 2305886 3192000 4153783
14112D153783Q04672N55312L33496P7194l13208p68732j050769r83223o51630
$$ 4153783 4958455 5513767 5847263 5924457 5611249 4842517 3791748 2808525 2156895
14103B156895l18239j80293k76464n43956q36641r85716r32687p83001p01798
$$ 2156895 1838656 1658363 1381899 837943 1302 -984414 -1917101 -2700102 -3401900
14094c401900p07561o71954n18905k78749q035K86063O12913R03848J023738Q98338
$$ -3401900 -4109461 -4781415 -5300320 -5579069 -5587104 -5301041 -4688128 -3784280 -2760542 -1862204
14084a862204N96909K66555O859j85379l89439o36463q55942r69622r28011p00148
$$ -1862204 -1265295 -998740 -991881 -1177260 -1566699 -2203162 -3059104 -4028726 -4956737 -5656885
14074e656885k91127K23118P03508J044808J238259J311474J242145R85351O21373
$$ -5656885 -5948012 -5724894 -5021386 -3976578 -2738319 -1426845 -184700 800651 1422024
14065A422024L51515K54892J98329K4653k74160n32951n63562l79398k13848k86988
$$ 1422024 1773539 2028431 2226760 2251413 1977253 1444302 880740 501342 287494 506
14055E06n85569q93878j049349j074076j017580q66748o13664k53379J74482M85689
$$ 506 -585063 -1478941 -2528290 -3602366 -4619946 -5486694 -6100358 -6353737 -6179255 -5693566
14045e693566N01491K76940N1286L5506K31221M42290N18540M67908L39526J69930
$$ -5693566 -5192075 -4915135 -4863849 -4828343 -4597122 -4154832 -3636292 -3168384 -2828858 -2658928
14035b658928K5662j8369J9207K2331p5265k16462k89983k29775n7128J50849
$$ -2658928 -2633266 -2651635 -2632428 -2610097 -2685362 -2901824 -3191807 -3421582 -3478710 -3327861
14025c327861L11289L99086M69979N70102O61472O83073O25925N47439M91832
$$ -3327861 -3016572 -2617486 -2147507 -1577405 -915933 -232860 393065 940504 1432336
14016A432336M45380L66715K11253K555j17973N552L49854O51260O21889K01480
$$ 1432336 1877716 2244431 2455684 2458239 2340266 2345818 2695672 3346932 3968821 4170301
14006D170301m00283q68996j015596q67792n93556l86884l62801m70952n20834
$$ 4170301 3770018 2901022 1885426 1017634 424078 37194 -325607 -796559 -1317393
13997a317393l16214J84920P86011J192932J259050J009868N62407J09990j82365
$$ -1317393 -1633607 -1448687 -662676 530256 1789306 2799174 3361581 3471571 3289206
13988C289206l38771m96022o64694p03664n47176l39966k85818m27048o23186
$$ 3289206 2950435 2454413 1789719 1086055 538879 198913 -86905 -513953 -1137139
13979a137139p26196p37527p47441p81221p31566m55354L8953N65347R01669R13494
$$ -1137139 -1863335 -2600862 -3348303 -4129524 -4861090 -5316444 -5277491 -4712144 -3810475 -2896981
13969b896981O21257J92879j72003l46500k99241r8057J35638L29126M96295O53312
$$ -2896981 -2275724 -2082845 -2254848 -2601348 -2900589 -2998646 -2863008 -2533882 -2037587 -1384275
13959a384275P58291P49854N73071K40543r0758k61065k72735k37746k66419l91093
$$ -1384275 -625984 123870 696941 937484 846726 585661 312926 75180 -191239 -582332
13949e82332n27029n61636n05471m32399l30903j79204o9799q3440j87858l30273
$$ -582332 -1109361 -1670997 -2176468 -2608867 -2939770 -3118974 -3188773 -3272213 -3460071 -3790344
13939c790344m79977n86545n86260m53297k15992N5666K88730M10600L58441J36332
$$ -3790344 -4270321 -4856866 -5443126 -5896423 -6112415 -6056749 -5768019 -5357419 -4998978 -4862646
13929d862646j87633n31656q03246r28252q89612p33475n78490n46791o78672
$$ -4862646 -5050279 -5581935 -6385181 -7313433 -8203045 -8936520 -9515010 -10061801 -10740473
13920a0740473q81668r67738q48042o19099m15012l01226k70796k84515k99228
$$ -10740473 -11622141 -12589879 -13437921 -14057020 -14472032 -14773258 -15044054 -15328569 -15627797
13911a5627797k42836l9479K64804N04130N70657N02828M31082M81964P07855
$$ -15627797 -15870633 -15910112 -15645308 -15141178 -14570521 -14067693 -13636611 -13154647 -12446792
13902a2446792J041940J310067J337067J087915P12168M05263K29570J40098J32882
$$ -12446792 -11404852 -10094785 -8757718 -7669803 -6957635 -6552372 -6322802 -6182704 -6049822
13893f049822K23375L72510N27650O43647O55120N27405L09697P2049j24324k22352
$$ -6049822 -5826447 -5453937 -4926287 -4282640 -3627520 -3100115 -2790418 -2718369 -2842693 -3065045
13883c065045j89538k5791K09013L76459L71991K72885K72009M29942N82016N51913
$$ -3065045 -3254583 -3280374 -3071361 -2694902 -2322911 -2050026 -1778017 -1348075 -766059 -214146
13873b14146L71017K57449L60230N57149O23632N26004L58652J23792j90006m34306
$$ -214146 156871 414320 774550 1331699 1955331 2481335 2839987 2963779 2773773 2339467
13863B339467m41304k63294p1795P6640K30521M05472N29224M68204J76245j69342
$$ 2339467 1898163 1634869 1563074 1639714 1870235 2275707 2804931 3273135 3449380 3280038
13853C280038l35941k92246j23553J35020M38646O87679Q09513P84155O17071
$$ 3280038 2944097 2651851 2528298 2663318 3101964 3789643 4599156 5383311 6000382
13844F000382L57419P6786k07737n13783q14552j027217j070416r64934q34770
$$ 6000382 6357801 6434587 6226850 5713067 4898515 3871298 2800882 1835948 1001178
13835A001178p86242q63635j065095j291283j361525j160443p62194l64713q9287
$$ 1001178 214936 -648699 -1713794 -3005077 -4366602 -5527045 -6289239 -6653952 -6743239
13826f743239R2224K72983M70311O06319O49353O25744N28168L65864J93504L6624
$$ -6743239 -6651015 -6378032 -5907721 -5301402 -4652049 -4026305 -3498137 -3132273 -2938769 -2902145
13816b902145r8307k01597l01959m08005m46660l93318l17181k35569j14292J2459
$$ -2902145 -3000452 -3202049 -3504008 -3912013 -4358673 -4751991 -5069172 -5304741 -5419033 -5406574
13806e406574Q5611J47456L05919O00539R35765J114928J000623O42366K25874
$$ -5406574 -5320963 -5173507 -4867588 -4267049 -3331284 -2216356 -1215733 -573367 -347493
13797c47493o8190k01451k72338l88685n70401p34639p71881o37255m12017k23374
$$ -347493 -415683 -617134 -889472 -1278157 -1848558 -2583197 -3355078 -3992333 -4404350 -4627724
13787d627724q5897L1867Q8159Q1074R4629J42791J75140J99076K23368K31129
$$ -4627724 -4713621 -4681754 -4593595 -4512521 -4417892 -4275101 -4099961 -3900885 -3677517 -3446388
13777c446388K51791L08988L35458K19552o7546m43791p75177r03721p35666l52221
$$ -3446388 -3194597 -2885609 -2550151 -2330599 -2398145 -2841936 -3617113 -4520834 -5256500 -5608721
13767e608721M6156K88100K84260K5487m31597j006814j545040j792553j572973
$$ -5608721 -5562565 -5274465 -4990205 -4964718 -5396315 -6403129 -7948169 -9740722 -11313695
13758a1313695r38895j53659M62211P42805P36079N98947M85917M44338L82724
$$ -11313695 -12252590 -12406249 -11944038 -11201233 -10465154 -9866207 -9380290 -8935952 -8553228
13749h553228K02149p0422k84536k64784O0290N81867J032050J143009Q63494
$$ -8553228 -8351079 -8421501 -8706037 -8970821 -8910531 -8328664 -7296614 -6153605 -5290111
13740e290111M40599K28304L30956N29779N97480N10407L33820Q6083k26767n21639
$$ -5290111 -4849512 -4621208 -4290252 -3760473 -3162993 -2652586 -2318766 -2232683 -2459450 -2981089
13730b981089o71378o43017n36017m46730l59695j93770J02223M81213Q17665
$$ -2981089 -3652467 -4295484 -4831501 -5278231 -5637926 -5831696 -5729473 -5248260 -4430595
13721d430595R96264R88124Q72302P42900O06289M67359M11606M86145O05479
$$ -4430595 -3434331 -2446207 -1573905 -831005 -224716 242643 654249 1140394 1745873
13712A745873O35657N25470L28464R9221j63437m40313o79719q39810q92569q30591
$$ 1745873 2381530 2907000 3235464 3334685 3171248 2730935 2051216 1211406 318837 -511754
13702e11754o77087m94143l33471k13880j75558k07009j72786M812K23040L31937
$$ -511754 -1188841 -1682984 -2016455 -2230335 -2405893 -2612902 -2785688 -2780876 -2557836 -2225899
13692b225899K74757J05291q5277k09894j67654N9331L42082N83519Q04120J035119
$$ -2225899 -1951142 -1845851 -1931128 -2141022 -2308676 -2249345 -1907263 -1323744 -519624 515495
13682E15495J266023J435208J476860J400026J226030R35935N18921K8205l77211
$$ 515495 1781518 3216726 4693586 6093612 7319642 8255577 8774498 8802703 8425492
13673H425492n84874o90414q21620r41927r64832r10278q41337p65915o89043
$$ 8425492 7840618 7150204 6328584 5386657 4421825 3511547 2670210 1904295 1215252
13664A215252o59776o70446n99917l62733m425L90168P50652R97260J044642Q32542
$$ 1215252 555476 -114970 -714887 -1077620 -1082045 -691877 58775 1056035 2100677 2933219
13654B933219M18168L866k34547l12006l51639m14391m90755n72634o50024o67001
$$ 2933219 3351387 3355253 3120706 2808700 2457061 2042670 1551915 979281 329257 -337744
13644c37744n63044l33690n4781J30014J41530O2074L6578J19422K27301K33613
$$ -337744 -900788 -1234478 -1289259 -1159245 -1017715 -955641 -919063 -799641 -572340 -338727
13634c38727P8689j92168m60877o02989m98452r5212M69579R45719J163436J113757
$$ -338727 -260038 -452206 -913083 -1516072 -2014524 -2109736 -1640157 -694438 468998 1582755
13624A582755Q75489N26064J41528k06890m53644n30684m11220j56850R5240K15819
$$ 1582755 2458244 2984308 3125836 2918946 2465302 1934618 1523398 1366548 1461788 1677607
13614A677607J74700K2851j66124l09223l75406l99266m17965m46440m77876m78495
$$ 1677607 1852307 1875158 1709034 1399811 1024405 625139 207174 -239266 -717142 -1195637
13604a195637l66721n9049L91088P75028R33290R28235R07192R00986Q49116P18336
$$ -1195637 -1562358 -1621407 -1230319 -455291 477999 1406234 2313426 3214412 4063528 4781864
13594D781864N29925L14893J14783l4681j92217m73510q64494j209143j362831
$$ 4781864 5311789 5626682 5741465 5706784 5514567 5041057 4176563 2967420 1604589
13585A604589j273732j001308o78426m33222l08994k39092j45978k8895M1832
$$ 1604589 330857 -670451 -1348877 -1782099 -2091093 -2330185 -2476163 -2505058 -2463226
13576b463226J8418k888J13357L31934N09986N65702N22291M44101L35274K01657
$$ -2463226 -2444808 -2447696 -2334339 -2002405 -1492419 -926717 -404426 39675 374949 576606
13566E76606J14824J04844R7539Q758j30239k00762j64294j12480r8521o2559
$$ 576606 691430 796274 893813 902571 772332 571570 407276 294796 196275 133716
13556A33716J4012N7265M1519N733m4446j07177j15491j8959J58098L72820N29494
$$ 133716 147728 204993 246512 252245 207799 100622 -14869 -33828 124270 497090 1026584
13545A026584N04984L08686P8390q9335j99468k49092j93894o4634N0768J53690
$$ 1026584 1531568 1840254 1918644 1829309 1629841 1380749 1186855 1122221 1172989 1326679
13535A326679K76280L39365K58198J01591l0930j30240j84520j70681j10753k7646
$$ 1326679 1602959 1942324 2200522 2302113 2271183 2140943 1956423 1785742 1674989 1647343
13525A647343N4037N7034j08391l98118o09929n90157l56769r078L80226P56350
$$ 1647343 1701380 1758414 1650023 1251905 641976 51819 -304950 -314028 66198 822548
13515H22548J022411J078841R19410O69069N12322N30747N99524N09992J80548
$$ 822548 1844959 2923800 3843210 4512279 5024601 5555348 6154872 6664864 6845412
13506F845412k91712p31157j007599j056476q48911m23092Q9890N06817P00923
$$ 6845412 6553700 5822543 4814944 3758468 2909557 2486465 2576355 3083172 3784095
13497C784095O72058N10562L10189J46006P5191R7813J75316K23765J11742j94185
$$ 3784095 4456153 4966715 5276904 5422910 5498101 5595914 5771230 5994995 6106737 5912552
13487E912552n17638o41371n50066m00054l39793m05863n34367o41632o92213
$$ 5912552 5394914 4753543 4203477 3803423 3463630 3057767 2523400 1881768 1189555
13478A189555o99385o79835o27779m88911k22741Q2717K81240L38080L11333K00334
$$ 1189555 490170 -189665 -817444 -1306355 -1529096 -1446379 -1165139 -827059 -515726 -315392
13468c15392l8792m07198q43452j196144j286068j045642n65394k8822M14256
$$ -315392 -354184 -761382 -1604834 -2800978 -4087046 -5132688 -5698082 -5726904 -5312648
13459e312648P54984J068028J365191J544489J468213J112885O08097J41354j22268
$$ -5312648 -4557664 -3489636 -2124445 -579956 888257 2001142 2609239 2750593 2628325
13450B628325j11587O1024J69218N7126k58717o14218q47698r27059q90358p21555
$$ 2628325 2516738 2577762 2746980 2804106 2545389 1931171 1083473 156414 -733944 -1455499
13440a455499l82822M8134L75332M93867N23573N82483N82184M10973J42413o1346
$$ -1455499 -1838321 -1790187 -1414855 -920988 -397415 185068 767252 1178225 1320638 1259292
13430A259292j91506l82671o78142r68451j105633j022411p55014l89645j0939
$$ 1259292 1067786 685115 6973 -961478 -2067111 -3089522 -3844536 -4234181 -4245120
13421d245120L40315O57777R40949J165890J242305J061792O38008J33231k66395
$$ -4245120 -3904805 -3247028 -2306079 -1140189 102116 1163908 1801916 1935147 1668752
13412A668752m44546m11899l08009k56196k24450j05017R7100K94508M50202N25923
$$ 1668752 1224206 812307 504298 248102 23652 -81365 15735 310243 760445 1286368
13402A286368M33210J77074r9490k83828m08354n77648p99163r09490p41896l60756
$$ 1286368 1719578 1896652 1797162 1513334 1104980 527332 -271831 -1181321 -1923217 -2283973
13392b283973p478J84403K89699M25867O17526Q07376Q93843Q07081N84109L42779
$$ -2283973 -2291451 -2107048 -1817349 -1391482 -773956 33420 927263 1734344 2318453 2661232
13382B661232J88465J51082K02892K87993L31752K92006K29036K43049L12992
$$ 2661232 2849697 3000779 3203671 3491664 3823416 4115422 4344458 4587507 4900499
13373D900499L48201L43083L71114M95309P14042R14565Q91968N23361p9829o30997
$$ 4900499 5248700 5591783 5962897 6458206 7172248 8086813 8978781 9502142 9422313 8791316
13363H791316r10634r48018r07657r04052r70109j036231r58961p50496o44357
$$ 8791316 7880682 6932664 6025007 5120955 4150846 3114615 2155654 1405158 760801
13354G60801p95649j092181j341181j479713j510355j399857j140663q31826o29626
$$ 760801 -34848 -1127029 -2468210 -3947923 -5458278 -6858135 -7998798 -8830624 -9460250
13345i460250n53982m33760j37618K18961L92544K95128L3785k52369m74614n74871
$$ -9460250 -10014232 -10447992 -10585610 -10366649 -9974105 -9678977 -9645192 -9897561 -10372175 -10947046
13335a0947046n23714l34227m9008K46405M50116N07833M17957K39621R5545Q3091
$$ -10947046 -11470760 -11804987 -11853995 -11607590 -11157474 -10649641 -10231684 -9992063 -9896518 -9813427
13325i813427J94427L54341N24881P18295R28462J106102J179498J119678R79418
$$ -9813427 -9619000 -9264659 -8739778 -8021483 -7093021 -5986919 -4807421 -3687743 -2708325
13316b708325Q20526O18851L37609M8549j24132j20060L4624K28701L39955L66237
$$ -2708325 -1887799 -1268948 -931339 -882790 -1006922 -1126982 -1092358 -863657 -523702 -157465
13306a57465L82390M54722O00788P40219P60380O31249M13781K12945J23651J81560
$$ -157465 224925 679647 1280435 2020654 2781034 3412283 3826064 4039009 4162660 4344220
13296D344220L21909L59785J53908k21474n55101p01960o65854n25829l80263
$$ 4344220 4666129 5025914 5179822 4958348 4403247 3701287 3035433 2509604 2129341
13287B129341k92210k61208k90939l48800l28204k02231n1425J03292K80848L85931
$$ 2129341 1837131 1575923 1284984 936184 607980 405749 354324 457616 738464 1124395
13277A124395L01840P7860j43220k53113j49715K22441P30927J093079J121247
$$ 1124395 1426235 1504095 1360875 1107762 958047 1180488 1911415 3004494 4125741
13268D125741Q69929M96144Q2879l17526o08860p21129o70365n35419m12098l54558
$$ 4125741 4995670 5491814 5574693 5257167 4648307 3927178 3256813 2721394 2309296 1954738
13258A954738l28201k37403o3274Q8802J41343J23695M6846j41867m08033o09501
$$ 1954738 1626537 1389134 1325860 1414662 1556005 1679700 1726546 1584679 1176646 567145
13248E67145o47744n21179k68458N2742L34941M52510L73121J77698m3976k44353
$$ 567145 -80599 -601778 -870236 -817494 -482553 -30043 343078 520776 476800 232447
13238B32447l77084l77436k24912N505K19299L62692L94309K87242Q3761r7054
$$ 232447 -144637 -522073 -746985 -741480 -522181 -159489 234820 522062 605823 508769
13228E08769j50455n6594J49455M29550P06588Q43136P58233M88021J09051l08991
$$ 508769 358314 301720 451175 880725 1587313 2430449 3188682 3676703 3785754 3476763
13218C476763o42631p30958n31458j97066P7847K14489K36700J83527O1687q4234
$$ 3476763 2834132 2103174 1571716 1374650 1452497 1666986 1903686 2087213 2148900 2064666
13208B064666k04351l30056m83622n88211n91531n76343o43318p69607q33722
$$ 2064666 1860315 1530259 1046637 458426 -133105 -709448 -1352766 -2122373 -2956095
13199b956095p52730n73648m20062l27034j70842J67851N80387P84802O28352
$$ -2956095 -3708825 -4282473 -4702535 -5029569 -5200411 -5032560 -4452173 -3667371 -3039019
13190c039019K00492l05367o93468q13618o38645k84039P2342L14387M36793M62711
$$ -3039019 -2838527 -3143894 -3837362 -4650980 -5289625 -5573664 -5501322 -5186935 -4750142 -4287431
13180d287431L96344L04058K82583L18845L35061K97085K14981J08954j5694j41175
$$ -4287431 -3891087 -3587029 -3304446 -2985601 -2650540 -2353455 -2138474 -2029520 -2045214 -2186389
13170b186389k01556j44450q765J52947L19555M02735L08707J37982J08325K83467
$$ -2186389 -2387945 -2532395 -2541160 -2388213 -2068658 -1665923 -1357216 -1219234 -1110909 -827442
13160h27442N32378O90049O83036N22270K75923M4863j11241j88440k27743l11380
$$ -827442 -295064 394985 1078021 1600291 1876214 1921077 1809836 1621396 1393653 1082273
13150A082273m78383o49801o94335n81854m07467k62721j53969k5528J56033L53447
$$ 1082273 603890 -45911 -740246 -1322100 -1729567 -1992288 -2146257 -2171785 -2015752 -1662305
13140a662305M80094N06007N09953N45710N68124N03280L07320J6063k56398m06735
$$ -1662305 -1182211 -676204 -166251 379459 947583 1450863 1758183 1774246 1517848 1111113
13130A111113m17293l63642k91273j55091M0688J73089R7723k20943o75122j091626
$$ 1111113 693820 330178 38905 -116186 -75498 97591 195314 -25629 -700751 -1792377
13120a792377j295057j170307p65236k82857P9648K58126K87975K21605J36245
$$ -1792377 -3087434 -4257741 -5022977 -5305834 -5226186 -4968060 -4680085 -4458480 -4322235
13111d322235J28181K18669L79427O30795R72577J279988J384798J224161Q46288
$$ -4322235 -4194054 -3975385 -3595958 -2965163 -1992586 -712598 672200 1896361 2742649
13102B742649L77233j8693k46407k92940j63413J19535M73332P29303P29644M53798
$$ 2742649 3119882 3101189 2854782 2561842 2398429 2517964 2991296 3720599 4450243 4904041
13092D904041J4554m26554p28244p77466n51284k11025j2090j16170m83833r19698
$$ 4904041 4918595 4492041 3763797 2986331 2435047 2224022 2211932 2095762 1611929 692231
13082F92231j231151j293772j022486m40766K17776O36874O85820M67819J66135
$$ 692231 -538920 -1832692 -2855178 -3295944 -3078168 -2441294 -1755474 -1287655 -1121520
13073a121520r9413k99492m07001l72312k52513k43841m55401p74169j009702
$$ -1121520 -1220933 -1520425 -1927426 -2299738 -2552251 -2796092 -3251493 -4025662 -5035364
13064e035364j060972r64604q00327n96739l60328r7810K18363O04567R80275
$$ -5035364 -6096336 -7060940 -7861267 -8458006 -8818334 -8916144 -8697781 -8093214 -7112939
13055g112939J222991J309296J321878J311710J265785J199892J108171Q92835
$$ -7112939 -5889948 -4580652 -3258774 -1947064 -681279 518613 1626784 2519619
13047B519619N19286J32084j45314l90675p28795j159990j588038j894437k002126
$$ 2519619 3038905 3170989 3025675 2635000 1906205 746215 -841823 -2736260 -4738386
13038d738386j908566j602293j051888l01431N12801J187895J534839J503067
$$ -4738386 -6646952 -8249245 -9301133 -9602564 -9089763 -7901868 -6367029 -4863962
13030d863962J214231Q45170M83664J42979j68801m33446n57248m10194j0049
$$ -4863962 -3649731 -2804561 -2320897 -2177918 -2346719 -2780165 -3337413 -3747607 -3757656
13021c757656M31237O88870P22509O51275N70862M73876L43878K01593P4046L8713
$$ -3757656 -3326419 -2637549 -1915040 -1263765 -692903 -219027 124851 326444 400490 439203
13011D39203J61239L73930N86042P90897R90877J121150J081338Q41866M47115
$$ 439203 600442 974372 1560414 2351311 3342188 4463338 5544676 6386542 6833657
13002F833657n3324n58941r01249r87415r44235j014836j257663j470671j462570
$$ 6833657 6780333 6221392 5320143 4332728 3388493 2373657 1115994 -354677 -1817247
12993a817247j213596p93109l04227J13824L38418L46019K16295M5520j45603
$$ -1817247 -3030843 -3823952 -4128179 -4014355 -3675937 -3329918 -3113623 -3068103 -3213706
12984c213706l83095n97546o33687m32893r3038K49001M94044N68254M35549J58770
$$ -3213706 -3596801 -4194347 -4828034 -5260927 -5353965 -5104964 -4610920 -4042666 -3607117 -3448347
12974c448347j27222l64611n76412p39656p59718m95618J15814R06116J575451
$$ -3448347 -3575569 -3940180 -4516592 -5256248 -6015966 -6511584 -6395770 -5489654 -3914203
12965c914203J927606J923078J588789J015101M02922n3321k73668k67149j62231
$$ -3914203 -1986597 -63519 1525270 2540371 2943293 2889972 2616304 2349155 2186924
12956B186924r6219j2860K07751N23742P93545R12089Q34543N81552K24389j75853
$$ 2186924 2090705 2077845 2285596 2809338 3602883 4514972 5349515 5931067 6155456 5979603
12946E979603n62353q36508r28571q98744q93891r88455j080596r90531o77199
$$ 5979603 5417250 4580742 3652171 2753427 1859536 871081 -209515 -1200046 -1877245
12937a877245k90422R933J73898J93177P1228r7142j33724M1003K95866M40553
$$ -1877245 -2167667 -2157734 -1983836 -1790659 -1719431 -1816573 -1950297 -1909294 -1613428 -1172875
12927a172875M32813L45651K28525J30849J32137K36378L48893L54558J45713
$$ -1172875 -740062 -394411 -165886 -35037 97100 333478 682371 1036929 1182642
12918A182642l14881r05643j401601j630870j593741j412359j156910q05896l78904
$$ 1182642 867761 -37882 -1439483 -3070353 -4664094 -6076453 -7233363 -8039259 -8418163
12909h418163K6536L56555O27121Q69346J133447J402291J533617J441220J217785
$$ -8418163 -8391627 -8035072 -7407951 -6538605 -5405158 -4002867 -2469250 -1028030 189755
12900A89755R89556P87181N99845M18979K11593m5070k73619l35540k07748N657
$$ 189755 1179311 1966492 2566337 2985316 3196909 3151839 2878220 2542680 2334932 2340589
12890B340589J74399J57670q4794l82176n04409l98796j77505O0751K58763L44054
$$ 2340589 2514988 2672658 2587864 2205688 1701279 1302483 1124978 1185729 1444492 1788546
12880A788546L02207K31838K21445K71367L19845K72519P0683k34877m98753n83500
$$ 1788546 2090753 2322591 2544036 2815403 3135248 3407767 3478450 3243573 2744820 2161320
12870B161320m72649k49238J7418L05250O01354Q52675R73625R14671P18946M98965
$$ 2161320 1688671 1439433 1456851 1762101 2363455 3216130 4189755 5104426 5823372 6322337
12860F322337L52607K67931R5440k84436p54632j061947j098857r96114r92497
$$ 6322337 6674944 6942875 7038315 6753879 5999247 4937300 3838443 2842329 1849832
12851A849832j215835j555297j768230j681335j275598o83331j22583K20636K65454
$$ 1849832 633997 -921300 -2689530 -4370865 -5646463 -6329794 -6452377 -6231741 -5966287
12842e966287O4346k11369m07931n03310n33743m99649l89708j87829J27642M99299
$$ -5966287 -5901941 -6113310 -6521241 -7024551 -7558294 -8057943 -8447651 -8635480 -8507838 -8008539
12832h008539P62924P73795O01041M91669N32449N20522K68567j67570o19336
$$ -8008539 -7245615 -6471820 -5870779 -5379110 -4846661 -4326139 -4057572 -4225142 -4844478
12823d844478r47241j036975q55227n20284j84553Q9327K76841L50303L23190
$$ -4844478 -5791719 -6828694 -7683921 -8204205 -8388758 -8299431 -8022590 -7672287 -7349097
12814g349097K64740K77392M04287N47359O04584N77640M95856L59418J35204
$$ -7349097 -7084357 -6806965 -6402678 -5855319 -5250735 -4673095 -4177239 -3817821 -3682617
12805c682617j80179m33889m33763j94228J30624M29115O55548P99705Q78388
$$ -3682617 -3862796 -4296685 -4730448 -4924676 -4794052 -4364937 -3709389 -2909684 -2031296
12796b031296R30114R64829R25948P73415N78914M49972L85609K87786J08343
$$ -2031296 -1101182 -136353 789595 1563010 2141924 2591896 2977505 3265291 3373634
12787C373634q6803k23237l24378m47063n94890p28868p86865p11963n22327l09113
$$ 3373634 3286831 3063594 2739216 2292153 1697263 968395 181530 -530433 -1052760 -1361873
12777a361873j25472M3146J62300J33358n0322k25768j84131J07889M15308M97707
$$ -1361873 -1487345 -1444199 -1281899 -1148541 -1198863 -1424631 -1608762 -1500873 -1085565 -587858
12767e87858L82374K70100L06925M51877N76215O35934O34584N53440L54626K0558
$$ -587858 -205484 64616 371541 823418 1399633 2035567 2670151 3223591 3578217 3598775
12757C598775l71033p08461r66150j144470j195196j122228j035738j017264r96341
$$ 3598775 3227742 2519281 1553131 408661 -786535 -1908763 -2944501 -3961765 -4958106
12748d958106p86909k81366L75888R25767J246393J359964J270846R24338L19444
$$ -4958106 -5745015 -6026381 -5650493 -4724726 -3478333 -2118369 -847523 76815 396259
12739C96259m22809j069405j380148j320186j068912p52625l28779J99707O40000
$$ 396259 -26550 -1095955 -2476103 -3796289 -4865201 -5617826 -5946605 -5746898 -5106898
12730e106898Q27755P79402N45937K03656o8636j34550P730K90291N82645P00092
$$ -5106898 -4279143 -3499741 -2953804 -2750148 -2818784 -2953334 -2945604 -2655313 -2072668 -1372576
12720a372576N49816K36508l0772j29670j16271j00904j01981m7372J14087L02712
$$ -1372576 -822760 -586252 -617024 -746694 -862965 -963869 -1065850 -1113222 -999135 -696423
12710f96423L53043K01855k610n5849P5214K44817K98250K22533J35769J17302
$$ -696423 -343380 -141525 -144135 -199984 -124770 120047 418297 640830 776599 893901
12700H93901J09974K2099j19326j94002j63373j11068r5794o8483M551L7219p1926
$$ 893901 1003875 1025974 906648 712646 549273 438205 342411 273928 278479 315698 243772
12689B43772k64234l07502m2879M07015P62954Q26453N73269J31672k97775n81843
$$ 243772 -20462 -327964 -370843 36172 799126 1625579 2198848 2330520 2032745 1450902
12679A450902p23582p79273p60700o53122m90163l24916j70040K0044K98788O00837
$$ 1450902 727320 -51953 -812653 -1465775 -1955938 -2280854 -2450894 -2430850 -2132062 -1531225
12669a531225P32039N82544K64771l4594k53009m45336o35330p49780p06311n20147
$$ -1531225 -799186 -216642 48129 13535 -239474 -684810 -1320140 -2069920 -2776231 -3296378
12659c296378k74047N074L60821P79570J117904J187073R23876M49934n7688m33574
$$ -3296378 -3570425 -3565351 -3204530 -2424960 -1307056 -119983 803893 1253827 1196139 762565
12649G62565n63854n27648n35422o35318o57290m98049k65509j13501q7138r6165
$$ 762565 198711 -328937 -864359 -1499677 -2156967 -2655016 -2920525 -3034026 -3121164 -3217329
12639c217329P540K07686K78979J04625j52030k86776k60170j16911J04692L48245
$$ -3217329 -3209789 -3002103 -2723124 -2618499 -2770529 -3057305 -3317475 -3434386 -3329694 -2981449
12629b981449N60079P83064J137582J633530K076361K232697K028379J577595
$$ -2981449 -2421370 -1638306 -500724 1132806 3209167 5441864 7470243 9047838
12621I047838J097089P55824N69939M38374K66865L9679k21332m84892o68410
$$ 9047838 10144927 10900751 11470690 11909064 12175929 12215608 11994276 11509384 10840974
12612A0840974o72333m83081j73671J48673M02551N82001O73230N78872K32319
$$ 10840974 10168641 9685560 9511889 9660562 10063113 10645114 11318344 11897216 12129535
12603A2129535k33996n46151n75902m36822k98892k53767l07642m10701n22419
$$ 12129535 11895539 11349388 10773486 10336664 10037772 9784005 9476363 9065662 8543243
12594H543243o80487r28049j161031j163514q40293l38482P6166K31908J61472
$$ 8543243 7862756 6934707 5773676 4610162 3769869 3431387 3507553 3739461 3900933
12585C900933J4174j34005l12774m97128n87300n59485m78002l89063l17422l56525
$$ 3900933 3915107 3781102 3468328 2971200 2383900 1824415 1346413 957350 639928 283403
12575B83403n86491q83477r98757q21627m57500r8850J63434L87453N91581O45451
$$ 283403 -303088 -1186565 -2185322 -3006949 -3464449 -3563299 -3399865 -3012412 -2420831 -1775380
12565a775380M52848J17951j23571j22464M6824J61121O4940j48309k62751k38844
$$ -1775380 -1322532 -1204581 -1328152 -1450616 -1403792 -1242671 -1177731 -1326040 -1588791 -1827635
12555a827635j85793j15175K3071J33526O7053j10960j73713k0957K56180N53137
$$ -1827635 -2013428 -2128603 -2105532 -1972006 -1904953 -2015913 -2189626 -2210583 -1954403 -1401266
12545a401266Q30017J041817J131430J074354Q60375M70807n2290n77184r45778
$$ -1401266 -571249 470568 1601998 2676352 3536727 4007534 3955244 3378060 2432282
12536B432282j048066q81664n39970j66494Q9137J35044J4076j02101p2004Q6767
$$ 2432282 1384216 502552 -37418 -203912 -114775 20269 34345 -67756 -139760 -52993
12526e2993K32800K06618k6127l28070n42763o37741o81624p47687q34694q69811
$$ -52993 179807 386425 360298 32228 -510535 -1148276 -1829900 -2577587 -3412281 -4282092
12516d282092p82603n43375j85572J69817L80490L93255K83478J57025M8663k4003
$$ -4282092 -5064695 -5608070 -5793642 -5623825 -5243335 -4850080 -4566602 -4409577 -4360914 -4384917
12506d384917n881J48070M00526O75066R48654J220486J417736J392380J064671
$$ -4384917 -4390798 -4242728 -3842202 -3167136 -2218482 -997996 419740 1812120 2876791
12497B876791N38639K4678l52611o37236r02180j109776j193027j148693r94911
$$ 2876791 3415430 3440108 3087497 2450261 1548081 438305 -754722 -1903415 -2898326
12488b898326p67872n11396k23463J26052N02284P72741Q43885Q04415Q23771
$$ -2898326 -3666198 -4177594 -4401057 -4275005 -3772721 -2999980 -2156095 -1351680 -527909
12479e27909R10171R24455Q18269O56315M52190J88297j10132l83252n30515m91668
$$ -527909 382262 1306717 2124986 2781301 3233491 3421788 3311656 2928404 2397889 1906221
12469A906221l18276j01037J02789K51629L37772M05714M75073N07424M83120
$$ 1906221 1587945 1486908 1589697 1841326 2179098 2584812 3059885 3567309 4050429
12460D050429M73947N45233O47385O75197N63439L43102J17843m8155k00386m04621
$$ 4050429 4524376 5069609 5716994 6392191 6955630 7298732 7416575 7368420 7168034 6763413
12450F763413o34103q10447q76965q01856o06806m13778l59168m22207m58714
$$ 6763413 6129310 5318863 4441898 3640042 3033236 2619458 2260290 1838083 1379369
12441A379369m24103m26353n43481p18962q80379j004768j062080j024810q88228
$$ 1379369 955266 528913 -14568 -733530 -1613909 -2618677 -3680757 -4705567 -5593795
12432e593795o78038m50818k34734j031K65740N15359O83405P14731N52947K18616
$$ -5593795 -6271833 -6722651 -6957385 -6958416 -6692676 -6177317 -5493912 -4779181 -4226234 -4007618
12422d007618j62666m36198n01531l70580j24915J88708N58382R33831J204642
$$ -4007618 -4170284 -4606482 -5108013 -5478593 -5603508 -5414800 -4856418 -3922587 -2717945
12413b717945J283316J196430J031520Q54504P10511O13089N29325M32545L35677
$$ -2717945 -1434629 -238199 793321 1647825 2358336 2971425 3500750 3933295 4268972
12404D268972K62343K03464P6684j94817n48949q07386q32666o81018n21377m26293
$$ 4268972 4531315 4734779 4811463 4616646 4067697 3260311 2427645 1746627 1225250 798957
12394G98957l64097l13706l03117l68352m90699n74559n25803l71215k40124j97910
$$ 798957 434860 121154 -181963 -550315 -1041014 -1615573 -2141376 -2512591 -2752715 -2950625
12384b950625j92270j40013J5093K73496N67538Q08603R75872J089402J110397
$$ -2950625 -3142895 -3282908 -3267815 -2994319 -2426781 -1618178 -642306 447096 1557493
12375A557493J014615Q90452P96717O26620K64272k27690o74381r21560q92308
$$ 1557493 2572108 3462560 4259277 4885897 5150169 4922479 4248098 3326538 2434230
12366B434230o22317k57546L4324J66286J71298J15682R306j38320k81444l79628
$$ 2434230 1811913 1554367 1588691 1754977 1926275 2041957 2051263 1912943 1631499 1251871
12356A251871m02370l21278j55956L3738J93467K48135J09889k51858p47073j135992
$$ 1251871 849501 528223 372267 406005 599472 847607 957496 705638 -41435 -1177427
12346a177427j173318q46350l98938j03923m0204j05046j77096j88552q2852J43994
$$ -1177427 -2350745 -3197095 -3596033 -3699956 -3740160 -3845206 -4022302 -4210854 -4293706 -4149712
12336d149712L61393M80850O15822Q38123R74117Q11135L54887j80268n23696
$$ -4149712 -3788319 -3307469 -2691647 -1853524 -879407 -68272 286615 106347 -417349
12327d17349n10800k04785J51301L55257M23269N36328P59490R20742Q57487O29765
$$ -417349 -928149 -1132934 -981633 -626376 -203107 333221 1092711 2013453 2870940 3500705
12317C500705M35465L64071L09416J57614p2723k92013m62719o20471p56207p90355
$$ 3500705 3936170 4300241 4609657 4767271 4694548 4402535 3939816 3319345 2563138 1772783
12307A772783o93646n06393k62554J131K22133L61391L94998K98045J06069k1449
$$ 1772783 1079137 572744 310190 311321 533454 894845 1289843 1587888 1693957 1672508
12297A672508O9680L28490N66815O24839M28852M3463l39704n28414m98317m37202
$$ 1672508 1742188 2070678 2637493 3262332 3691184 3734647 3394943 2866529 2368212 1931010
12287A931010n20398o98552p56783n84264l32317k08758k15179k24430j95717
$$ 1931010 1410612 712060 -44723 -628987 -961304 -1170062 -1385241 -1609671 -1805388
12278a805388j58587j15472m0615R7256K80462M22719M57865M07568L63629M08637
$$ -1805388 -1963975 -2079447 -2120062 -2022806 -1742344 -1319625 -861760 -454192 -90563 318074
12268C18074N02745N15603M00939K23100O5447K5797J59685L64104M54913L53792
$$ 318074 820819 1336422 1737361 1960461 2025908 2051705 2211390 2575494 3030407 3384199
12258C384199J16425j89228n36374q84282j128226j154933r61240o83295m80458
$$ 3384199 3500624 3311396 2775022 1890740 762514 -392419 -1353659 -2036954 -2517412
12249b517412l87485l08485j71892p7043j62233l68275n16916m95201k42821K36350
$$ -2517412 -2904897 -3213382 -3385274 -3462317 -3624550 -3992825 -4509741 -5004942 -5247763 -5011413
12239e011413Q00154J232299J387350J284001J061001Q09564N44896L45853L21347
$$ -5011413 -4211259 -2978960 -1591610 -307609 753392 1562956 2107852 2453705 2775052
12230B775052M18165M75995M15882K83697J68133R5304P479j52034l64913n79242
$$ 2775052 3193217 3669212 4085094 4368791 4536924 4632228 4639707 4487673 4122760 3543518
12220C543518p64115q58464p57696m40374n5505J99600K71737K11270N8995r7748
$$ 3543518 2779403 1920939 1163243 722869 667364 866964 1138701 1349971 1408966 1311218
12210A311218j52838r7450k118R4682K05480K93438K65155Q7576j54635l64139
$$ 1311218 1158380 1060930 1058812 1153494 1358974 1652412 1917567 2005143 1850508 1486369
12200A486369n24986o33951o08100l91328p6590J92585L62515M80968N36118M12958
$$ 1486369 961383 327432 -280668 -671996 -748586 -556001 -193486 287482 823600 1236558
12190A236558R2539k82209n14057m29802j2199N29360R21916J010806Q51619O36342
$$ 1236558 1329097 1046888 532831 103029 90830 620190 1542106 2552912 3404531 4040873
$$ [...]
##END NTUPLES=NMR SPECTRUM
##END=
