##TITLE=31P ikalashn
LR-789-O-C1
24.10.2024
##JCAMPDX= 6.0         $$ Bruker NMR JCAMP-DX V2.0
##DATA TYPE= NMR SPECTRUM
##DATA CLASS= NTUPLES
##ORIGIN= UXNMR, Bruker Analytische Messtechnik GmbH
##OWNER= root
$$ TOPSPIN		Version 1.3
$$ 2024-10-24 14:17:43.359 +0400  Irina@DPX200
$$ Compression mode = diff/dup
##.OBSERVE FREQUENCY= 81.01967998063
##.OBSERVE NUCLEUS= ^31P
##.ACQUISITION MODE= SIMULTANEOUS
##.ACQUISITION SCHEME= undefined
##.AVERAGES= 64
##.DIGITISER RES= 17
##SPECTROMETER/DATA SYSTEM= spect
##.PULSE SEQUENCE= zgpg
##.SOLVENT NAME= D2O
##.SHIFT REFERENCE= INTERNAL, D2O, 1, 298.5841
##AUDIT TRAIL= $$ (NUMBER, WHEN, WHO, WHERE, WHAT)
$$ ##TITLE= Audit trail, TOPSPIN		Version 1.3
$$ ##JCAMPDX= 5.01
$$ ##ORIGIN= Bruker BioSpin GmbH
$$ ##OWNER= Irina
$$ $$ F:/spectra/data/iren/nmr/P31dec/1/pdata/1/auditp.txt
$$ ##AUDIT TRAIL=  $$ (NUMBER, WHEN, WHO, WHERE, VERSION, WHAT)
(   1,<2024-10-24 14:15:26.812 +0400>,<Irina>,<DPX200>,<TOPSPIN 1.3>,
      <acquisition in progress>)
(   2,<2024-10-24 14:17:08.593 +0400>,<Irina>,<DPX200>,<TOPSPIN 1.3>,
      <Start of raw data processing
       efp BC_mod = 2 LB = 8 FT_mod = 6 PKNL = 1 PHC0 = 36.77877 PHC1 = 393.2469 SI = 32K 
       data hash MD5: 32K
       B6 0B A5 6D 00 34 F2 85 33 14 B4 8B B9 CB 4D E2>)
(   3,<2024-10-24 14:17:10.765 +0400>,<Irina>,<DPX200>,<TOPSPIN 1.3>,
      <apk 
       data hash MD5: 32K
       3A 68 EF 62 E9 7D D7 7D 16 43 B4 B2 1A 22 B5 10>)
(   4,<2024-10-24 14:17:12.953 +0400>,<Irina>,<DPX200>,<TOPSPIN 1.3>,
      <abs n ABSG = 5 
       data hash MD5: 32K
       69 52 57 66 D5 57 BF F8 8E 0B 6C 1C 4A 62 C0 71>)
$$ ##END=
$$ 
$$ $$ hash MD5
$$ $$ 6D 9B 9B 0B D0 78 39 58 4F 55 12 B2 43 57 08 C0
##$RELAX= 
##$RELAX= 
##$RELAX= 
##$RELAX= 
##$RELAX= 
##$RELAX= 
##$RELAX= 
##$RELAX= 
##$RELAX= 
##$RELAX= 
##$RELAX= 
$$ Bruker specific parameters
$$ --------------------------
##$DU= <F:/spectra>
##$EXPNO= 1
##$NAME= <P31dec>
##$PROCNO= 1
##$TYPE= <nmr>
##$USER= <iren>
##$AMP= (0..31)
100 100 100 100 100 100 100 100 100 100 100 100 100 100 100 100 100 100 
100 100 100 100 100 100 100 100 100 100 100 100 100 100 
##$ANAVPT= -1
##$AQSEQ= 0
##$AQ_mod= 1
##$AUNM= <au_zg>
##$AUTOPOS= <>
##$BF1= 81.014009
##$BF2= 200.13
##$BF3= 200.13
##$BF4= 200.13
##$BF5= 200.13
##$BF6= 200.13
##$BF7= 200.13
##$BF8= 200.13
##$BYTORDA= 1
##$CFDGTYP= 0
##$CFRGTYP= 5
##$CHEMSTR= <none>
##$CNST= (0..63)
1 1 145 1 1 1 1 1 1 1 1 1 1 1 1 1 1 1 1 1 1 1 1 1 1 1 1 1 1 1 1 1 1 1 
1 1 1 1 1 1 1 1 1 1 1 1 1 1 1 1 1 1 1 1 1 1 1 1 1 1 1 1 1 1 
##$CPDPRG= <waltz16>
##$CPDPRG1= <>
##$CPDPRG2= <waltz16>
##$CPDPRG3= <>
##$CPDPRG4= <mlev>
##$CPDPRG5= <mlev>
##$CPDPRG6= <mlev>
##$CPDPRG7= <mlev>
##$CPDPRG8= <mlev>
##$CPDPRGB= <>
##$CPDPRGT= <>
##$D= (0..63)
0 1 0 0 0 0 0 0 0 0.06 0 0.03 2e-005 3e-006 0 0 0.0002 0 0 0 0 0 0 0 0 
0 0 0 0 0 0 0 0 0 0 0 0 0 0 0 0 0 0 0 0 0 0 0 0 0 0 0 0 0 0 0 0 0 0 0 
0 0 0 0 
##$DATE= 1729765025
##$DBL= (0..7)
120 120 120 11 120 120 24 19 
##$DBP= (0..7)
$$ [...]
##$SW_h= 37037.037037037
##$TD= 32768
##$TD0= 1
##$TE= 300
##$TE2= 300
##$TE3= 300
##$TEG= 300
##$TL= (0..7)
0 120 53 12 22 120 120 120 
##$TP= (0..7)
150 150 150 150 150 150 150 150 
##$TP07= 0
##$TPNAME0= <>
##$TPNAME1= <>
##$TPNAME2= <>
##$TPNAME3= <>
##$TPNAME4= <>
##$TPNAME5= <>
##$TPNAME6= <>
##$TPNAME7= <>
##$TPOAL= (0..7)
0.5 0.5 0.5 0.5 0.5 0.5 0.5 0.5 
##$TPOFFS= (0..7)
0 0 0 0 0 0 0 0 
##$TUNHIN= 0
##$TUNHOUT= 0
##$TUNXOUT= 0
##$USERA1= <user>
##$USERA2= <user>
##$USERA3= <user>
##$USERA4= <user>
##$USERA5= <user>
##$V9= 5
##$VALIST= <valist>
##$VCLIST= <CCCCCCCCCCCCCCC>
##$VD= 0
##$VDLIST= <DDDDDDDDDDDDDDD>
##$VPLIST= <PPPPPPPPPPPPPPP>
##$VTLIST= <TTTTTTTTTTTTTTT>
##$WBST= 1024
##$WBSW= 4
##$XGAIN= (0..3)
0 0 0 0 
##$XL= 0
##$YL= 0
##$YMAX_a= 2455
##$YMIN_a= -5012
##$ZGOPTNS= <>
##$ZL1= 120
##$ZL2= 120
##$ZL3= 120
##$ZL4= 120
##$ABSF1= 298.5841
##$ABSF2= -158.5842
##$ABSG= 5
##$ABSL= 5
##$ALPHA= 0
##$AQORDER= 0
##$ASSFAC= 0
##$ASSFACI= 0
##$ASSFACX= 0
##$ASSWID= 0
##$AUNMP= <proc_1d>
##$AXLEFT= 0
##$AXRIGHT= 0
##$AXTYPE= 0
##$AXUNIT= <>
##$AZFE= 0.1
##$AZFW= 0.5
##$BCFW= 0
##$BC_mod= 2
##$BYTORDP= 0
##$COROFFS= 0
##$CY= 12.5935478210449
##$DATMOD= 1
##$DC= 0
##$DFILT= <>
##$DTYPP= 0
##$F1P= 47.1127640792319
##$F2P= -24.0371245302204
##$FCOR= 0.5
##$FTSIZE= 32768
##$FT_mod= 6
##$GAMMA= 0
##$GB= 0
##$INTBC= 1
##$INTSCL= 7.269226e-011
##$ISEN= 30
##$LB= 8
##$LEV0= 0
##$LPBIN= 0
##$MAXI= 12.09355
##$MC2= 0
##$MEAN= 0
##$ME_mod= 0
##$MI= 0.7550151
##$NCOEF= 0
##$NC_proc= -10
##$NLEV= 6
##$NOISF1= 298.5841
##$NOISF2= 270.0111
##$NSP= 0
##$NTH_PI= 0
##$NZP= 0
##$OFFSET= 298.5841
##$PC= 1.4
##$PHC0= 65.50082
##$PHC1= 344.6366
##$PH_mod= 1
##$PKNL= yes
##$PPARMOD= 0
##$PPDIAG= 0
##$PPIPTYP= 0
##$PPMPNUM= 100
##$PPRESOL= 1
##$PSCAL= 0
##$PSIGN= 0
##$REVERSE= no
##$SF= 81.014009
##$SI= 32768
##$SIGF1= 270.0111
##$SIGF2= -158.5842
##$SINO= 77.54984
##$SIOLD= 32768
##$SREGLST= <31P.CDCl3>
##$SSB= 0
##$STSI= 32768
##$STSR= 0
##$SW_p= 37037.037037037
##$SYMM= 0
##$S_DEV= 0
##$TDeff= 32768
##$TDoff= 0
##$TI= <>
##$TILT= no
##$TM1= 0
##$TM2= 0
##$TOPLEV= 0
##$USERP1= <user>
##$USERP2= <user>
##$USERP3= <user>
##$USERP4= <user>
##$USERP5= <user>
##$WDW= 1
##$XDIM= 32768
##$YMAX_p= 313178725
##$YMIN_p= -4602338
$$ End of Bruker specific parameters
$$ ---------------------------------
##NTUPLES= NMR SPECTRUM
##VAR_NAME=  FREQUENCY,     SPECTRUM/REAL,   SPECTRUM/IMAG
##SYMBOL=    X,             R,               I
##VAR_TYPE=  INDEPENDENT,   DEPENDENT,       DEPENDENT
##VAR_FORM=  AFFN,          ASDF,            ASDF
##VAR_DIM=   32768,         32768,           32768
##UNITS=     HZ,            ARBITRARY UNITS, ARBITRARY UNITS
##FACTOR=    1.13031516577767, 1,            1
##FIRST=     37037.037037037, -263886,       -2266606
##LAST=      0,             -1496921,        783065
##MIN=       0,             -4602338,        0
##MAX=       37037.037037037, 313178725,     0
$$ Real data points
##PAGE= N=1
##DATA TABLE= (X++(R..R)), XYDATA
$$ [...]
20245 2003897 2323878 2514027 2553389 2420740 2114120 1696078 1266330 889674 589982 364798
20235 364798 172018 -47035 -313854 -576997 -735836 -726352 -580826 -367015 -133954 73983
20225 73983 217855 319311 449885 642870 861265 1043598 1184853 1323782 1460865 1588492
20215 1588492 1745732 1966519 2206919 2346770 2272991 1962823 1480818 908143 331193 -117361
20205 -117361 -328721 -334712 -247666 -138061 -34734 63251 205223 393822 528262 482405
20195 482405 247849 -33503 -238531 -381001 -494426 -533568 -464973 -351975 -290333 -334948
20185 -334948 -524036 -845549 -1192879 -1418129 -1427718 -1255827 -1021265 -819858 -689721 -627950
20175 -627950 -595924 -531464 -368779 -81054 260103 544433 732907 825687 811118 663271
20165 663271 345924 -102870 -518893 -756394 -811394 -714627 -502137 -299096 -230946 -295185
20155 -295185 -398939 -513342 -674597 -858380 -981499 -976661 -805153 -483162 -120432 134893
20145 134893 161328 -92128 -558298 -1094020 -1549679 -1792001 -1754474 -1484100 -1079896 -608533
20135 -608533 -98556 405374 835843 1150258 1349310 1451477 1504622 1548765 1524986 1371936
20125 1371936 1121199 853780 657427 607926 724788 917867 1079452 1187959 1262547 1274880
20115 1274880 1134079 774424 246326 -306791 -732775 -945664 -948985 -793364 -531997 -196717
20105 -196717 182680 551733 792620 804925 628751 400060 250100 252488 398838 582028
20095 582028 640345 504314 232604 -117092 -506719 -882501 -1212138 -1500760 -1780720 -2107870
20085 -2107870 -2520877 -2943623 -3235154 -3331744 -3273607 -3108420 -2841462 -2508189 -2172854 -1863448
20075 -1863448 -1571468 -1290442 -1032746 -809907 -622060 -444454 -290256 -261760 -411134 -663388
20065 -663388 -907914 -1062764 -1104390 -1067831 -953115 -710513 -358716 -2009 299373 569711
20055 569711 833755 1068633 1251056 1394208 1516103 1633968 1747825 1808715 1733578 1461454
20045 1461454 1008929 471688 15713 -178166 -82758 137512 312338 375617 330597 209349
20035 209349 49790 -99820 -179811 -154931 -93948 -137058 -319212 -533630 -685948 -751930
20025 -751930 -721165 -633516 -592462 -643060 -711133 -678142 -525181 -379579 -358591 -420503 -424712
20014 -424712 -287233 -26786 314421 690397 1011520 1226938 1387159 1539707 1692817 1894146
20004 1894146 2192478 2568603 2920377 3075537 2943904 2609022 2213846 1874323 1594385
19995 1594385 1265764 790362 156849 -517168 -1065340 -1414008 -1597685 -1677865 -1712190 -1766808
19985 -1766808 -1878697 -2006014 -2033088 -1855643 -1475471 -1015060 -625082 -363620 -241502 -279210
19975 -279210 -456846 -708709 -949422 -1099561 -1158010 -1229463 -1397728 -1602636 -1730490 -1751183
19965 -1751183 -1707566 -1685668 -1756053 -1907703 -2081436 -2208461 -2217911 -2110204 -1972240 -1864447
19955 -1864447 -1740908 -1527000 -1244729 -992390 -809211 -625516 -376048 -116845 34131
19946 34131 24968 -79655 -180280 -225256 -199777 -104995 24402 112056 106223 35673 -24248
19935 -24248 -25960 45323 222513 509934 813592 1060725 1303888 1620840 1974913 2239335
19925 2239335 2358016 2378996 2353132 2309977 2276002 2250399 2145665 1852699 1401496 959542
19915 959542 682322 626591 754233 936102 1040848 1061126 1071548 1086330 1001681 703922
19905 703922 207367 -324690 -683419 -775551 -698323 -629549 -655275 -739477 -823556 -873456 -867614
19894 -867614 -766108 -516238 -83402 503772 1088690 1522808 1794822 1965967 2040237 1925584
19884 1925584 1589805 1179291 880968 778983 880015 1140069 1436845 1611423 1587477 1399376
19874 1399376 1132495 868123 610416 276107 -176467 -656110 -1025166 -1214142 -1225450 -1076762
19864 -1076762 -797167 -460544 -154309 84269 282072 480680 673935 815868 849321 754543
19854 754543 607895 517011 519653 592653 669966 631327 408114 71539 -282674 -616617 -875267
19843 -875267 -968703 -884244 -714537 -543209 -363402 -137602 144174 458902 724865 852300
19833 852300 849969 783288 653973 486365 420386 545058 754427 877321 842352 688449
19823 688449 506488 367876 275038 169749 -18711 -314058 -662254 -967186 -1160509 -1284496
19813 -1284496 -1426938 -1562659 -1619748 -1628227 -1659747 -1693631 -1620615 -1362291 -944654 -478612
19803 -478612 -104962 60347 -32884 -351714 -773231 -1140059 -1361142 -1456204 -1507635 -1590303
19793 -1590303 -1713698 -1797071 -1770712 -1637199 -1416412 -1133087 -846864 -639315 -534225 -460702
19783 -460702 -387451 -333800 -248191 -91824 53923 58651 -126757 -445908 -789607 -1062318
19773 -1062318 -1211562 -1214946 -1087307 -870359 -623913 -405030 -218286 -37759 112845 159686
19763 159686 85725 -8776 11321 178862 432533 721596 994505 1166220 1196799 1155956
19753 1155956 1114181 1061992 991092 960902 1035078 1210110 1425002 1595418 1664094 1620068 1469370
19742 1469370 1206468 798135 258113 -275278 -644277 -816674 -864409 -836945 -712843 -494242
19732 -494242 -224696 57291 315308 552863 794670 1019255 1205153 1326581 1309230 1114209
19722 1114209 781332 389484 54579 -149900 -264647 -382556 -569626 -818018 -1043413
19713 -1043413 -1151138 -1113183 -982358 -865013 -845791 -910019 -966148 -968405 -957343 -974949 -1028216
19702 -1028216 -1122542 -1239243 -1294148 -1195977 -941288 -644837 -469775 -482818 -582884 -596700
19692 -596700 -464889 -301752 -232148 -243162 -255164 -255047 -293068 -417785 -609666 -790165 -912946
19681 -912946 -970884 -935427 -780364 -558353 -403136 -434392 -664747 -972459 -1186311 -1208156
19671 -1208156 -1035010 -745461 -478537 -330802 -321597 -421550 -553947 -628417 -592445 -425160
19661 -425160 -156343 115480 324459 472424 559504 546876 406575 181183 -40980 -208006
19651 -208006 -293042 -249373 -49617 279192 675779 1097054 1525236 1904698 2170797 2302358
19641 2302358 2271207 2075373 1798658 1550052 1366058 1236265 1142540 1053522 939683 750637
19631 750637 477545 200445 1403 -85590 -42909 172554 602200 1229277 1956041 2600203
19621 2600203 2984979 3086952 3035746 2940630 2793243 2539785 2188059 1816814 1498733 1251897
19611 1251897 1060145 904726 772326 681976 665716 705000 736899 714074 633372 501733
19601 501733 347450 239076 208619 203330 171976 153990 212845 341697 521362 752910 1024249
19590 1024249 1298606 1501241 1550589 1411658 1122150 774780 471211 248912 56638 -141444
19580 -141444 -336155 -510484 -605366 -554020 -350977 -59419 210757 346517 266379 -23549
19570 -23549 -434448 -834978 -1089185 -1138373 -1000978 -761989 -580970 -568211 -653088 -679380
19560 -679380 -567112 -330455 -25362 269984 467558 494342 318515 -20887 -422417 -780113
19550 -780113 -1041958 -1188769 -1196427 -1058752 -828646 -549130 -193494 238957 673254 1008920
19540 1008920 1159494 1110661 919834 638758 280696 -139852 -554564 -888766 -1139500 -1320520
19530 -1320520 -1423269 -1465600 -1486432 -1462829 -1297016 -925189 -397081 144410 559724 790445
19520 790445 859286 860853 899771 993854 1079105 1072131 921852 631319 238870 -196816 -594221
19509 -594221 -878692 -1050552 -1179479 -1325167 -1496815 -1681556 -1825765 -1811547 -1619924 -1416554
19499 -1416554 -1370263 -1493568 -1701585 -1897283 -2000885 -1990852 -1900749 -1784042 -1710338 -1727449
19489 -1727449 -1797673 -1804600 -1651497 -1375812 -1106774 -934790 -851253 -760899 -553500 -214042
19479 -214042 129249 313679 282837 124549 -52556 -224060 -381827 -499295 -552160 -508782
19469 -508782 -348608 -103116 121935 200058 109982 -67907 -258021 -418813 -522040 -552476
19459 -552476 -523417 -470463 -425227 -389083 -305230 -130747 76445 228017 333317 457240
19449 457240 581405 620260 527505 328068 104158 -39466 -67218 -34321 13691 86538 210423
19438 210423 390384 581732 682440 601025 359848 71860 -191035 -451537 -725770 -965600
19428 -965600 -1112744 -1150840 -1087792 -876392 -464095 73960 592278 991408 1232297 1303001
19418 1303001 1223429 1039514 782574 530132 438413 615448 982529 1320111 1447665 1313743
19408 1313743 954683 464580 -1793 -320360 -486980 -578558 -653907 -700007 -660113 -519198
19398 -519198 -358501 -263752 -210528 -140574 -71105 -42073 -46252 -57400 -41861 14078 70794
19387 70794 64866 -2823 -73951 -154862 -319115 -595525 -910727 -1134592 -1186231 -1091864 -943014
19376 -943014 -792331 -631615 -488666 -430798 -468177 -536649 -582818 -620055 -687544 -820574 -1024072
19365 -1024072 -1231020 -1358593 -1396167 -1411133 -1458096 -1505120 -1449310 -1219494 -866059 -565199
19355 -565199 -507797 -731106 -1073004 -1325187 -1381955 -1233063 -926602 -541738 -175066 87718
19345 87718 224989 283686 314720 342447 418116 599706 920629 1387767 1928035 2411540
19335 2411540 2749325 2939431 3045587 3126423 3176728 3139868 2971834 2660861 2215414 1713917
19325 1713917 1277864 959876 749356 642297 625560 628024 528156 250957 -96035 -310341
19315 -310341 -327550 -222324 -72657 44101 39768 -98442 -264332 -345091 -334738 -275935 -168043
19304 -168043 -10376 128600 163341 121544 129116 234892 373230 476616 536901 576956 577413
19293 577413 494737 370459 298729 318246 435271 629092 835536 1022609 1202511 1373002
19283 1373002 1528228 1693498 1861417 1985311 2044748 2071335 2103118 2147915 2190157 2210927
19273 2210927 2206771 2155290 2053666 1944506 1842354 1743219 1667389 1610242 1486235 1219465
19263 1219465 852004 528422 378887 365344 316766 155329 -71316 -309585 -527424 -691692
19253 -691692 -788415 -840796 -843409 -756615 -603132 -467634 -386293 -308034 -217528 -188179 -258460
19242 -258460 -383767 -519142 -647360 -725767 -688044 -511613 -236823 66585 295338 350514
19232 350514 193659 -155842 -621903 -1051752 -1296148 -1348653 -1304554 -1239311 -1218664 -1285131
19222 -1285131 -1395903 -1446418 -1356725 -1115102 -781523 -432384 -79343 300955 643507 821764
19212 821764 807510 707994 659173 732951 900496 1087443 1278349 1498413 1726452 1925959
19202 1925959 2105370 2266052 2356370 2320222 2151742 1879994 1529742 1133674 729507 352310
19192 352310 75016 -30388 16847 100374 91883 -27168 -137371 -132728 -18037 131054 212693
19181 212693 167301 32664 -81107 -71183 93683 350614 615773 864936 1061356 1111212
19171 1111212 973729 705053 404358 171503 77617 139216 296875 472130 615463 709490
19161 709490 801396 937253 1072725 1116578 1022722 820015 566365 327208 161492 100233
19151 100233 182950 466311 884797 1242230 1430466 1494746 1512210 1552391 1718167 2073942
19141 2073942 2515495 2838162 2947020 2905376 2810021 2690767 2503155 2194780 1800186 1396494
19131 1396494 1024163 708569 454230 247887 93881 -8695 -78213 -106722 -69254 39204
19121 39204 196202 365331 502649 559714 516207 415928 338836 344577 428749 522478 562926
19110 562926 527247 439156 357618 304228 234020 133602 64965 75929 169214 321712 498827
19099 498827 683820 873662 1014040 1032972 934258 734250 461341 240979 208437 355132
19089 355132 529741 588968 511450 399512 372634 469025 673824 958614 1255649 1481141
19079 1481141 1578993 1545082 1416983 1239865 1076577 967916 855751 586109 60923 -629713
19069 -629713 -1271603 -1692938 -1856981 -1822411 -1642202 -1358668 -1065916 -857645 -753109 -718432
19059 -718432 -701650 -662142 -606016 -556562 -489391 -375323 -238356 -82781 115130 299239
19049 299239 377972 364760 321696 232136 55784 -154856 -298688 -315674 -183964 97894
19039 97894 501181 957310 1370717 1651862 1764481 1716026 1525623 1213301 844673 554469
19029 554469 436124 488359 629461 722110 669639 467489 144030 -229256 -505500 -597176
19019 -597176 -573376 -557175 -619702 -765860 -946685 -1126768 -1318534 -1498209 -1589371 -1571010
19009 -1571010 -1534358 -1585174 -1687299 -1721932 -1683638 -1653428 -1661365 -1671674 -1604778 -1381038 -992759
18998 -992759 -527496 -125111 134352 266305 305961 310843 351751 440776 549576 648353 709482
18987 709482 712605 665436 609639 578489 549348 437678 204782 -86364 -361237 -546806 -562875
18976 -562875 -398405 -126119 163725 404086 557143 604672 545658 407990 224750 -8668
18966 -8668 -298217 -592666 -814301 -903782 -857137 -786589 -847629 -1067489 -1311058 -1412163 -1285605
18955 -1285605 -968925 -578938 -235310 -29543 48791 111888 244471 451780 677619 837696
18945 837696 880613 810216 666952 500970 325599 156565 55708 57561 117482 174930 212420
18934 212420 191317 51569 -178955 -390828 -473873 -390067 -208753 -18563 175321 413109
18924 413109 660838 816268 840662 813536 818255 851207 872924 887503 935202 1066276 1294779
18913 1294779 1545576 1718872 1795615 1858575 1971981 2086057 2126701 2119292 2149761 2247997 2331264
18902 2331264 2274314 2042177 1705357 1338766 953445 546198 152485 -157638 -341380 -418751
18892 -418751 -447438 -452139 -381217 -173874 147755 506140 844981 1109268 1225409 1165080
18882 1165080 962050 670571 388766 208282 104276 -5971 -167115 -358100 -493186
18873 -493186 -479105 -329229 -161457 -80580 -134892 -342635 -684147 -1076163 -1391111 -1516470
18863 -1516470 -1386909 -1016776 -507118 9032 459534 838651 1109889 1209455 1144435 988448
18853 988448 788389 593086 483057 491702 556463 622146 685339 692350 568985 342744 130801
18842 130801 24083 10229 17898 -16729 -124000 -282059 -425547 -505141 -508132 -405334 -139147
18831 -139147 292716 782106 1174587 1391862 1491243 1574877 1649467 1612195 1404643 1126223
18821 1126223 902060 785396 781034 844075 902654 939582 1013578 1173798 1367293 1446375 1336591
18810 1336591 1110697 890552 737344 635345 519980 322821 51325 -223914 -425834
18801 -425834 -498288 -433298 -259681 -11462 248576 436865 511049 516451 518157 493600 369867
18790 369867 93817 -329523 -794649 -1173216 -1425939 -1591333 -1717332 -1804629 -1827588 -1784683
18780 -1784683 -1691749 -1580114 -1496794 -1463325 -1463572 -1466342 -1469682 -1501704 -1567415 -1609373 -1569707 -1440297
18768 -1440297 -1205698 -832231 -370446 33161 250264 247577 78419 -122137 -240340 -318826
18758 -318826 -444906 -615495 -761317 -780537 -599153 -293385 -34540 116768 235195 384182
18748 384182 528098 557980 379250 17744 -378803 -672542 -827583 -886310 -876226 -812605
18738 -812605 -756863 -741127 -715857 -643602 -557144 -495815 -433091 -304422 -77022 238162 616580
18727 616580 1015146 1386557 1703633 1920591 1964233 1805542 1486428 1086293 707719 439899
18717 439899 305783 256238 198304 65533 -113118 -262657 -343184 -350730 -267760 -63656 219718
18706 219718 484436 660350 705533 602588 387437 169385 102474 272708 637890 1071652
18696 1071652 1454603 1736610 1908261 1946997 1836248 1600797 1315588 1107327 1086777 1245334
18686 1245334 1453981 1581208 1606600 1587383 1533355 1425161 1294661 1200673 1149519 1054137
18676 1054137 811950 433541 72154 -143922 -246732 -327339 -405598 -452050 -472256 -480266
18666 -480266 -459304 -377523 -216870 8079 244426 429495 518075 493163 392277 264827
18656 264827 136581 28779 -79950 -270276 -594026 -993152 -1328100 -1472868 -1391305 -1142781
18646 -1142781 -853958 -615616 -392000 -146071 67492 206712 283361 311169 296718 279828
18636 279828 304102 340732 357981 406979 523974 658080 776936 884376 947487 929803 853726
18625 853726 758616 634420 430836 154853 -52945 -15680 297730 748572 1165641 1457059
18615 1457059 1625962 1679352 1591136 1382421 1124103 884530 718437 638396 657770 823559
18605 823559 1126799 1472569 1754033 1925600 1992800 1953072 1833925 1712375 1653983 1666863
18595 1666863 1694645 1671980 1607027 1531203 1414252 1232714 1027090 822418 611653 445128
18585 445128 396377 441470 451565 324801 62435 -240069 -443756 -453890 -285003 -54086
18575 -54086 128376 225321 242916 190907 81140 -90152 -300280 -462789 -489681 -400015 -334778
18564 -334778 -400979 -589602 -823750 -1046721 -1202033 -1189696 -956698 -574562 -157030 207300
18554 207300 454843 613966 745973 831447 845735 864878 961011 1040308 915691 516750
18544 516750 -11654 -440338 -661076 -718573 -686255 -620687 -593970 -616107 -618086 -584391 -587203
18533 -587203 -657100 -724478 -700379 -528840 -242695 -16034 -3357 -185603 -433287 -606230
18523 -606230 -617168 -493937 -374624 -404407 -618182 -927347 -1200760 -1363625 -1460539 -1568878
18513 -1568878 -1687144 -1782378 -1841965 -1856432 -1805316 -1660622 -1432264 -1199532 -1078991 -1118885
18503 -1118885 -1221277 -1219183 -1053302 -810336 -583063 -379827 -163154 120792 490472 858551
18493 858551 1141550 1375635 1651655 2005198 2373460 2667794 2842733 2875316 2724028 2351277
18483 2351277 1765884 1021562 263292 -308090 -584785 -608042 -468178 -221891 81014 377200
18473 377200 616708 759373 762480 610599 311255 -88479 -491273 -827745 -1058082 -1104442
18463 -1104442 -960200 -741860 -564886 -464082 -394293 -318310 -256424 -192482 -57290 175075
18453 175075 454510 708576 937891 1217860 1614009 2110835 2573507 2826688 2794645 2534751
18443 2534751 2162109 1802931 1563426 1508972 1610480 1720212 1669986 1414266 1043948 650941
18433 650941 301564 40885 -155151 -322906 -404972 -322485 -124305 56573 129881 72289
18423 72289 -131038 -471232 -847494 -1142823 -1309459 -1375468 -1460268 -1658353 -1877981 -1901306
18413 -1901306 -1605360 -1100499 -636067 -372068 -302767 -347454 -450094 -608844 -799203 -985196
18403 -985196 -1171979 -1335657 -1395967 -1308292 -1109555 -862625 -605733 -380820 -272538 -317304
18393 -317304 -450756 -629665 -888745 -1266835 -1759400 -2295008 -2766699 -3078080 -3148697 -2993244
18383 -2993244 -2740600 -2494114 -2254953 -1990266 -1654116 -1187699 -593988 27616 528469
18374 528469 814456 929466 1004727 1120051 1204209 1126270 882005 595645 353195 140062
18364 140062 -50051 -188826 -305930 -512855 -902125 -1383166 -1733334 -1835141 -1730400 -1522170
18354 -1522170 -1314873 -1165274 -1056208 -947809 -836436 -771799 -791779 -843921 -838278 -731118
18344 -731118 -517287 -217782 78678 249107 239158 80254 -181959 -501414 -801196 -1023684
18334 -1023684 -1188874 -1352789 -1484541 -1490450 -1324091 -988476 -532364 -55971 331268 557808
18324 557808 587498 460291 299259 211116 221369 288450 340870 322348 233950 102872 -44766
18313 -44766 -138022 -102416 19732 117407 148959 137364 74774 -43066 -142016 -173351 -200982
18302 -200982 -308497 -507153 -719305 -829863 -797414 -713130 -699594 -795635 -961178 -1136714
18292 -1136714 -1312150 -1482958 -1572890 -1540923 -1449354 -1351750 -1256389 -1190720 -1171590 -1146690 -1043528
18281 -1043528 -864590 -664623 -440072 -169166 111698 371674 630019 878861 1078050
18272 1078050 1260955 1478527 1689102 1818972 1845078 1756077 1533543 1209310 869499 576633
18262 576633 347696 223620 231117 302267 334616 297591 205866 52497 -153457 -338620 -408738
18251 -408738 -346441 -228612 -132072 -75033 -31010 41428 154545 287358 407433 463737 429481
18240 429481 347127 324831 459423 727532 1028140 1256666 1315055 1170451 874390 492294
18230 492294 79770 -305020 -616857 -833196 -965723 -1036385 -1058600 -1041938 -1028480 -1112105
18220 -1112105 -1323981 -1569029 -1738494 -1782778 -1723311 -1631993 -1575977 -1596533 -1669863 -1713447 -1665388
18209 -1665388 -1572849 -1575786 -1736500 -1961403 -2104220 -2065285 -1865262 -1677038 -1691608 -1916395
18199 -1916395 -2157206 -2198905 -1985805 -1636417 -1333048 -1205432 -1260004 -1426556 -1638225 -1847886
18189 -1847886 -2013641 -2132780 -2282337 -2545335 -2911566 -3269696 -3501502 -3580713 -3548006 -3432210
18179 -3432210 -3242429 -2985581 -2669606 -2338639 -2059231 -1841354 -1627370 -1412849 -1256048
18170 -1256048 -1176471 -1150141 -1174645 -1260513 -1388100 -1492394 -1491250 -1345656 -1104761 -899275
18160 -899275 -816027 -804172 -803216 -844900 -967665 -1142977 -1296770 -1395321 -1499839 -1680267 -1920993
18149 -1920993 -2182097 -2433482 -2628630 -2718965 -2667225 -2471742 -2175775 -1849855 -1574393 -1387613
18139 -1387613 -1256709 -1113642 -951040 -830970 -820045 -910475 -1022452 -1104999 -1154136 -1194412
18129 -1194412 -1259962 -1334242 -1343417 -1245310 -1101623 -994193 -927116 -875947 -801133 -632719 -328479
18118 -328479 83887 486810 765009 899359 922806 847822 692623 521345 401922 378734
18108 378734 459026 598557 750210 896516 999127 988962 841892 587351 251335 -148014
18098 -148014 -540521 -791783 -790976 -546766 -203378 86871 285524 413208 498003 568921
18088 568921 618195 613910 548764 438971 294121 138007 40463 16040 -36085 -213462 -515280
18077 -515280 -884155 -1261398 -1555025 -1676516 -1653657 -1606002 -1593447 -1564971 -1449515 -1227487
18067 -1227487 -938720 -681329 -556210 -545254 -538754 -497938 -484515 -573701 -715234 -780952 -717213
18056 -717213 -538527 -282841 -9697 215037 368771 456936 430423 220149 -145005 -500857
18046 -500857 -647601 -520258 -241590 -11179 81280 89164 55992 -17524 -141235 -319675
18036 -319675 -522622 -743488 -1015309 -1327832 -1610645 -1803394 -1906864 -1954270 -1968662 -1932640
18026 -1932640 -1792014 -1537781 -1199528 -811541 -444554 -160605 24593 104829 46579 -166536
18016 -166536 -468309 -775844 -1067509 -1335657 -1568638 -1773852 -1947415 -2065318 -2093258 -2024260
18006 -2024260 -1880034 -1655382 -1323537 -916746 -538991 -295860 -236299 -328890 -502506 -720994
17996 -720994 -959685 -1163148 -1300561 -1420311 -1567820 -1678551 -1679466 -1599854 -1535276 -1569598 -1716415
17985 -1716415 -1920467 -2094110 -2150915 -2038652 -1782823 -1523440 -1409182 -1453502 -1596237 -1819165
17975 -1819165 -2083740 -2270041 -2256117 -1998410 -1569915 -1158134 -933358 -925117 -1040378 -1150708
17965 -1150708 -1226429 -1324611 -1462069 -1581275 -1625904 -1608806 -1551879 -1430330 -1206189 -896089
17955 -896089 -595065 -383183 -258811 -166337 -50686 86018 239181 468812 842638 1318006
17945 1318006 1756285 2051953 2166239 2133684 2024194 1883673 1710772 1438633 1030071 556926
17935 556926 140653 -139662 -304047 -386876 -381157 -326895 -285555 -269273 -228438 -77647 215312
17924 215312 564978 813804 849764 699443 480800 278890 101847 -57036 -156274 -100291
17914 -100291 183068 615206 990595 1155567 1129961 1021329 888327 803742 903968 1202595
17904 1202595 1489787 1515476 1249647 886293 628898 574331 685082 840673 975657 1114216
17894 1114216 1261159 1386800 1481629 1525361 1515188 1523411 1623865 1829338 2100298 2368337
17884 2368337 2549179 2557274 2359320 2015432 1617772 1200536 808262 566574 560624 734390
17874 734390 963846 1166090 1296512 1304762 1175081 952379 717879 534246 407640 309986
17864 309986 270088 372741 601521 795829 818434 683017 493532 326622 175580 -1250
17854 -1250 -220098 -446082 -599085 -637785 -598715 -509118 -336760 -78030 175899 325175
17844 325175 362834 335514 254244 124404 43464 152629 504901 1016895 1536145 1936717
17834 1936717 2194761 2337758 2367387 2306803 2208270 2099650 1984397 1837889 1598048 1236679
17824 1236679 811334 419828 141376 6865 -21714 1124 52007 115329 143605 69150
17814 69150 -150885 -448018 -646832 -647793 -483054 -227295 30086 194070 225942 144909 -13900
17803 -13900 -179360 -273142 -308287 -378632 -540892 -749168 -868529 -776727 -468954 -46544
17793 -46544 343844 594070 693000 725778 790939 924424 1083210 1144153 1048287 917724 923810
17782 923810 1079330 1250243 1357788 1467942 1659091 1876042 1979820 1901500 1674692 1346446
17772 1346446 962131 608343 349546 149967 -85746 -384084 -644494 -773431 -795477 -780509
17762 -780509 -758152 -728546 -721105 -750575 -706809 -465668 -36762 458098 837973 971698 886932
17751 886932 697907 462470 197944 -51151 -221772 -297990 -360542 -528100 -847641 -1264917
17741 -1264917 -1626908 -1758757 -1652217 -1459217 -1298945 -1181741 -1091819 -1030396 -971661 -841917
17731 -841917 -578321 -235501 31109 112484 39989 -108802 -314212 -580942 -902710 -1251050
17721 -1251050 -1564378 -1778044 -1872154 -1838383 -1652608 -1343291 -1017416 -793032 -732262 -805339
17711 -805339 -888069 -859573 -702272 -524534 -465780 -539658 -649887 -737114 -830840 -991807 -1250746
17700 -1250746 -1589966 -1956316 -2273223 -2455981 -2463181 -2354971 -2244899 -2225237 -2332606 -2516407
17690 -2516407 -2662284 -2694255 -2647527 -2569623 -2409630 -2093328 -1635178 -1141847 -743595 -499404
17680 -499404 -362839 -287511 -313351 -477548 -747677 -1057492 -1304981 -1406021 -1392765 -1365638
17670 -1365638 -1364197 -1362811 -1371049 -1435508 -1559687 -1697407 -1804033 -1847075 -1785377 -1616355 -1428168
17659 -1428168 -1323810 -1304239 -1250254 -1037638 -660300 -213643 209378 572561 862537 1038190
17649 1038190 1076227 1045975 1025392 1025034 1011233 951260 887792 903009 977743 1006962 942924 848250
17637 848250 834945 949891 1129956 1302274 1458662 1575644 1520648 1161848 570917 -10451
17627 -10451 -364936 -461276 -441913 -446727 -495453 -504485 -362318 -70107 218240 343321 279671
17616 279671 136557 17512 -103217 -312073 -568787 -724313 -729916 -681227 -657546 -619324
17606 -619324 -463812 -166355 146617 304292 235592 12320 -230597 -440388 -680090 -1005521
17596 -1005521 -1352912 -1584887 -1630141 -1578534 -1578394 -1664211 -1776419 -1876497 -1943470 -1936784 -1827454
17585 -1827454 -1604979 -1269767 -857714 -441132 -103579 96264 127452 -36727 -372487 -770021
17575 -770021 -1098651 -1308477 -1458722 -1619859 -1766108 -1824381 -1764748 -1638047 -1545361 -1559011
17565 -1559011 -1708996 -1965156 -2231582 -2421838 -2552350 -2716692 -2934416 -3139342 -3305895
17556 -3305895 -3425925 -3447397 -3336175 -3099055 -2791621 -2524743 -2353119 -2225173 -2085434 -1962872
17546 -1962872 -1958378 -2121727 -2391103 -2654053 -2832702 -2886047 -2786077 -2554273 -2253720 -1938053
17536 -1938053 -1650576 -1449116 -1374858 -1383098 -1383014 -1321383 -1196109 -1066306 -1036175 -1194320 -1505433
17525 -1505433 -1805916 -1936996 -1823441 -1475459 -980283 -451477 18840 364530 528812
17516 528812 496220 350507 214759 144243 114688 81055 46699 34705 43519 85104 179489
17505 179489 352233 621321 923469 1124455 1138294 977657 686989 280828 -229181 -811806
17495 -811806 -1377402 -1799053 -2043347 -2199736 -2343078 -2390575 -2164017 -1625354 -984218 -487358
17485 -487358 -198699 -64121 -55979 -144730 -235980 -251201 -187826 -92493 -21381 -5564 -71845
17474 -71845 -251702 -518008 -764747 -877617 -821360 -686860 -629320 -734745 -984429 -1281538
17464 -1281538 -1529174 -1739604 -1965724 -2188942 -2327794 -2305380 -2116059 -1844566 -1603903 -1481911
17454 -1481911 -1518971 -1686803 -1929243 -2208872 -2457554 -2547446 -2386766 -2003486 -1542263 -1170977
17444 -1170977 -965777 -919634 -1027948 -1265249 -1508615 -1627747 -1606859 -1536732 -1508241 -1521860
17434 -1521860 -1529496 -1520589 -1502929 -1428162 -1245328 -967007 -634596 -293334 21669 287441
17424 287441 466760 527982 487262 394330 314792 320804 413685 557803 791590 1130475 1498672
17413 1498672 1837652 2152943 2425276 2613296 2721843 2735431 2582874 2259519 1877773 1530653
17403 1530653 1239024 986060 743794 506539 291945 123651 -462 -82663 -79716 33819
17393 33819 211202 340890 246099 -197715 -888853 -1582690 -2129132 -2500304 -2676835 -2622541
17383 -2622541 -2378633 -2085274 -1847758 -1676329 -1530717 -1355248 -1118320 -835360 -534099
17374 -534099 -248071 -16794 146566 229204 197952 57764 -127493 -318759 -540003 -797768
17364 -797768 -1013968 -1069535 -915553 -625300 -280930 88604 425452 661456 775061 780695
17354 780695 744750 716670 655860 553542 488996 501968 528555 454884 222239 -110862 -401979
17343 -401979 -533903 -499104 -363812 -197559 -62522 13427 36059 -18002 -157008 -310823
17333 -310823 -381421 -338809 -228220 -126423 -92942 -101031 -59764 74794 250281 346419 232080
17322 232080 -122760 -589518 -997301 -1245350 -1286058 -1142487 -897069 -578186 -184469 198053
17312 198053 438773 536446 584499 614002 598637 539619 491110 516752 667432 981704 1403501
17301 1403501 1766139 1908980 1808831 1596024 1412133 1289164 1175144 1044534 919024
17292 919024 807819 697395 564662 400100 225187 74862 -15123 -35515 -17326 45140
17282 45140 160720 236054 154906 -73155 -339064 -549249 -655231 -659867 -586756 -465447 -302380
17271 -302380 -53268 307601 752119 1239369 1722457 2101967 2270301 2184562 1863384 1397763
17261 1397763 904843 430385 -64765 -590255 -1057116 -1330656 -1331813 -1088883 -673966 -138620
17251 -138620 453008 969074 1279129 1382469 1355440 1215774 908769 454261 22570 -205053
17241 -205053 -183567 -13756 169907 281271 257912 84753 -166349 -399920 -539502 -568570
17231 -568570 -525148 -440728 -363387 -332598 -297299 -163910 75020 357279 616397 763564
17221 763564 738507 615358 564060 656008 814215 947156 1022326 1002088 831340 549452
17211 549452 280529 64341 -114986 -201708 -142200 31547 168037 68787 -308086 -800122
17201 -800122 -1194536 -1397151 -1447454 -1407971 -1325833 -1227440 -1113178 -961981 -763040 -549710
17191 -549710 -362298 -231797 -168783 -139788 -92430 14954 192044 425530 675328 829499
17181 829499 805870 672728 531691 428394 381233 343525 270047 202561 204397 303066 496871
17170 496871 737591 907852 906821 736074 474977 204470 -74262 -396974 -734355 -969169
17160 -969169 -940960 -607753 -144175 231904 426260 474689 459210 395487 241544 1743
17150 1743 -233338 -363538 -393494 -431552 -572169 -813033 -1082052 -1280906 -1325754 -1234896 -1142961
17139 -1142961 -1175085 -1291749 -1351459 -1293940 -1160513 -1018286 -912541 -860549 -862424 -907280 -1018126
17128 -1018126 -1221555 -1439007 -1530527 -1427626 -1182227 -902287 -676029 -524237 -408946 -269819
17118 -269819 -85768 95976 226259 268895 176277 -29018 -239963 -356962 -315025 -110285
17108 -110285 148058 324904 361745 244561 8705 -235137 -350118 -296111 -189439 -176332
17098 -176332 -270420 -352224 -347713 -330363 -375885 -460893 -511755 -450779 -208016 191103 584834
17087 584834 791803 746493 513104 200604 -94510 -333959 -539139 -712246 -813535 -813246
17077 -813246 -749931 -678476 -589354 -480082 -427988 -483329 -582141 -666358 -787252 -1031185 -1406160
17066 -1406160 -1837869 -2238006 -2506632 -2579661 -2528261 -2500711 -2560243 -2654015 -2706955 -2694555 -2594074
17055 -2594074 -2347379 -1958806 -1506217 -1053329 -600029 -138950 278927 569734 690178
17046 690178 623016 357376 -68851 -575833 -1080866 -1519429 -1826773 -1958821 -1928456 -1785503
17036 -1785503 -1569517 -1362541 -1276651 -1315028 -1400843 -1496468 -1599717 -1696347 -1751555 -1737385 -1669126
17025 -1669126 -1563744 -1410059 -1201725 -938703 -642071 -362986 -145472 -36960 -99462 -352464
17015 -352464 -776071 -1310967 -1814147 -2122948 -2185223 -2076231 -1900130 -1718127 -1534848 -1311827
17005 -1311827 -1031708 -744259 -505500 -320747 -203340 -209232 -343513 -546508 -756806 -915745
16995 -915745 -983428 -1002373 -1080597 -1246750 -1418030 -1514031 -1502285 -1365611 -1124492 -870293
16985 -870293 -702410 -651481 -670640 -711015 -772536 -867906 -952035 -951720 -863036 -751440 -683394
16974 -683394 -684370 -759830 -900498 -1068095 -1217249 -1303543 -1292769 -1183053 -1006870 -793802 -515545
16963 -515545 -178436 65836 39407 -284105 -748616 -1163293 -1439037 -1540861 -1453529 -1222598
16953 -1222598 -944218 -739082 -705612 -812531 -925393 -960245 -923106 -823363 -636612 -395558
16943 -395558 -233880 -259837 -460424 -747527 -979925 -994239 -727637 -278538 166003 468783
16933 468783 609371 627323 528525 320956 83761 -98280 -182749 -172356 -120795 -71561 -38880
16922 -38880 -70505 -177890 -298839 -410780 -572371 -863429 -1304456 -1782647 -2125972 -2240615
16912 -2240615 -2123828 -1880802 -1687847 -1628394 -1646773 -1652290 -1603830 -1512002 -1421932 -1395368 -1465296
16901 -1465296 -1582152 -1613269 -1463364 -1169434 -826987 -514401 -333658 -367156 -544314 -677633
16891 -677633 -633806 -393952 -9652 435488 827108 1057218 1083221 954326 788811 652455
16881 652455 490470 227458 -115291 -449683 -718179 -888305 -959442 -1006861 -1106312 -1228535
16871 -1228535 -1250220 -1065978 -655037 -82956 505848 961148 1199663 1208274 1033100 802673
16861 802673 691028 772484 978141 1178412 1275474 1284995 1298255 1319698 1264178 1105392 902899
16850 902899 718558 514778 204938 -188814 -555395 -831663 -1055490 -1271218 -1455051 -1524917
16840 -1524917 -1389069 -1026892 -527101 -9527 457903 886300 1332906 1811026 2269901
16831 2269901 2617336 2747920 2652293 2428926 2167801 1934516 1760347 1581831 1315901 999355
16821 999355 759860 672927 689327 674798 541862 353094 235980 231505 279610 296414 232099
16810 232099 71045 -148007 -359716 -549745 -711618 -811839 -847132 -838683 -767172 -577716
16800 -577716 -305793 -91133 -32768 -111305 -234611 -340029 -412378 -424212 -356977 -253873
16790 -253873 -162447 -51094 139971 420620 733418 1006301 1190180 1224663 1047061 685399
16780 685399 293185 -14899 -252741 -440098 -516500 -414780 -165959 74875 163174 83520
16770 83520 -122951 -411445 -719163 -983708 -1150491 -1185237 -1102251 -954726 -789785 -620276
16760 -620276 -412291 -143192 105940 217663 195886 155321 173645 240876 311472 328894 260816
16749 260816 128523 -32105 -219596 -462726 -727426 -893996 -843449 -586425 -311673 -208159
16739 -208159 -273314 -329292 -204613 76316 326571 399440 319884 227766 221299 284766 370491
16728 370491 467229 530046 482344 296979 -1708 -352248 -621492 -645016 -382093 -8570
16718 -8570 218335 140079 -206209 -653797 -1047205 -1288051 -1372544 -1395287 -1450192 -1502005 -1412048
16707 -1412048 -1104712 -681389 -329301 -138554 -64109 -2453 108930 233325 291609 269521
16697 269521 207187 120179 37121 73424 335895 807725 1350302 1785356 1989850 1948288
16687 1948288 1728007 1423681 1167620 1061931 1081416 1130677 1139226 1109198 1090642 1077216 1003596
16676 1003596 862770 721188 658764 691698 736153 712204 616113 478508 323151 138825
16666 138825 -83578 -302086 -458301 -518393 -498494 -507210 -681850 -1038962 -1445976 -1784532
16656 -1784532 -2071257 -2349931 -2557573 -2550872 -2248970 -1722579 -1144667 -674887 -357523 -126150
16646 -126150 87938 287496 433617 496195 467339 355752 225874 158784 152309 182784 255156
16635 255156 331689 392780 493752 666766 878356 1045128 1087432 994106 801230 534726
16625 534726 227545 -72713 -321212 -479191 -565485 -642512 -729785 -779566 -718115 -522218
16615 -522218 -231434 97589 427752 736038 961304 1022428 900791 627221 228552 -263247
16605 -263247 -802483 -1311835 -1675778 -1816454 -1735226 -1512776 -1290594 -1118994 -912953 -623495
16595 -623495 -360226 -264627 -347191 -541320 -775458 -974095 -1129465 -1314731 -1554180 -1796670
16585 -1796670 -1991268 -2101748 -2085907 -1927383 -1656401 -1317924 -960068 -673999 -590264 -758986
16575 -758986 -1082655 -1392454 -1585516 -1667104 -1682033 -1700672 -1800553 -1969503 -2081153 -2013096
16565 -2013096 -1750719 -1363702 -927870 -490160 -105830 135397 176351 38566 -215835 -523959
16555 -523959 -819301 -1040855 -1184654 -1265532 -1265160 -1171120 -963480 -607529 -165934 185003
16545 185003 289336 93096 -328294 -757231 -958269 -877985 -657415 -451121 -347172 -407255
16535 -407255 -632098 -937689 -1250676 -1585873 -1958236 -2284626 -2434166 -2345165 -2089348 -1811699
16525 -1811699 -1606265 -1491448 -1448900 -1401206 -1226183 -876676 -473893 -175150 -33835 -6765
16515 -6765 6635 54703 96576 66056 -80632 -357118 -690877 -971317 -1191202 -1381916 -1514687
16504 -1514687 -1533546 -1422895 -1207889 -940571 -688188 -491326 -356045 -255978 -165037 -88037
16494 -88037 -44679 -38246 -74681 -185050 -399826 -714003 -1060909 -1361656 -1611521 -1857567
16484 -1857567 -2113237 -2331971 -2433467 -2392965 -2276775 -2152281 -2067370 -2046733 -2054193 -2026097
16474 -2026097 -1946053 -1849880 -1785487 -1813744 -1983250 -2304267 -2732169 -3190845 -3613575 -3947587
16464 -3947587 -4173175 -4332243 -4449933 -4366229 -3753718 -2493976 -1001032 179055 849021
16455 849021 1134338 1253510 1350528 1477293 1604920 1673104 1673293 1649632 1612074 1469545 1137339
16444 1137339 682047 208684 -276381 -784232 -1236358 -1536681 -1678846 -1717476 -1663722 -1504596
16434 -1504596 -1271220 -1007080 -733171 -485492 -337534 -315953 -368622 -389802 -265751 29210
16424 29210 405640 711268 813553 679558 356707 -85862 -557038 -954147 -1231794 -1431333
16414 -1431333 -1604225 -1764073 -1886814 -1951788 -1940375 -1843637 -1727692 -1710463 -1826314 -1967676
16404 -1967676 -2013275 -1899917 -1655461 -1420549 -1275336 -1136745 -935106 -739732 -635033 -602958
16394 -602958 -566017 -470444 -361387 -381269 -663930 -1225557 -1928280 -2529169 -2809897 -2687840
16384 -2687840 -2181959 -1431774 -740882 -359246 -286988 -410106 -670746 -1045577 -1461305 -1838406
16374 -1838406 -2153940 -2371129 -2403360 -2228813 -1952154 -1681801 -1448929 -1257027 -1116382 -999496
16364 -999496 -847444 -646318 -430556 -224265 -28620 183506 421709 614902 638248 406525
16354 406525 -70333 -690698 -1275889 -1643645 -1746407 -1653689 -1400424 -978273 -443125 90588
16344 90588 544176 895999 1107080 1108981 899936 570046 246999 -8517 -267608 -615226
16334 -615226 -1028863 -1446968 -1840468 -2143364 -2247631 -2093016 -1709716 -1186499 -647760 -197802
16324 -197802 156922 457001 700857 854624 871954 732957 464737 113203 -262459 -657078
16314 -657078 -1131505 -1715651 -2331130 -2734601 -2544347 -1483814 96382 1432877 2206916
16305 2206916 2507563 2495582 2357632 2204235 2054822 1911408 1776812 1674335 1607188 1521691
16295 1521691 1386568 1246427 1168614 1211441 1405503 1705975 1985151 2118871 2067977 1852165
16285 1852165 1529134 1234704 1072627 1042302 1139810 1334971 1537128 1665557 1707498 1699546
16275 1699546 1669199 1649790 1716141 1913013 2209720 2515244 2749108 2939414 3144467 3322855
16265 3322855 3376509 3275724 3092555 2937917 2859527 2796199 2678192 2550334 2505865 2539203
16255 2539203 2571622 2520139 2355521 2126124 1914051 1785275 1760538 1836729 2004316 2218193
16245 2218193 2339503 2218495 1828281 1277903 738004 340812 120430 54498 114053 266467
16235 266467 464849 596127 537268 311897 98766 32759 78384 146345 194695 233567 260868
16224 260868 254134 221067 154824 18138 -181166 -376037 -497150 -516469 -463591 -398071 -352311
16213 -352311 -303883 -223064 -100561 70201 279461 514918 807307 1156943 1420611 1398343
16203 1398343 1046663 553161 219011 210195 442536 676965 670304 339320 -198830 -735662
16193 -735662 -1111515 -1313321 -1424155 -1524684 -1691642 -1968608 -2314036 -2618988 -2789243 -2779916
16183 -2779916 -2566153 -2202672 -1823207 -1481506 -1167019 -938935 -832006 -755840 -613454 -425987
16173 -425987 -293825 -288179 -393051 -508834 -532790 -471292 -455016 -598745 -890433 -1221437
16163 -1221437 -1476168 -1644012 -1812118 -2023415 -2201018 -2226372 -2062092 -1765840 -1399958 -1003313
16153 -1003313 -645232 -400415 -304780 -338566 -426247 -495348 -515754 -466613 -307869 -46495
16143 -46495 240732 495568 709127 903443 1098437 1282278 1451412 1596967 1665325 1613496
16133 1613496 1462898 1265389 1060326 903388 852441 899356 965549 978941 937429 879395
16123 879395 813163 717461 606136 535731 559573 690070 856096 918543 772644 408369
16113 408369 -93341 -582454 -932175 -1111658 -1124844 -1009824 -852049 -679905 -439234 -94179
16103 -94179 331823 797632 1263236 1666588 1971125 2206916 2396763 2542064 2675419 2827612
16093 2827612 2978825 3116028 3243044 3316830 3284370 3154911 2976535 2804445 2672096 2539695
16083 2539695 2359379 2175910 2052559 1980968 1934677 1926236 1935623 1887513 1722291 1403883 970887
16072 970887 550598 237661 51615 -61256 -199273 -417149 -711442 -1024673 -1256323 -1326770
16062 -1326770 -1254392 -1163341 -1145541 -1156265 -1152002 -1149325 -1101221 -923983 -642486 -374187 -178998
16051 -178998 -9514 233804 601053 1076557 1606911 2070685 2359714 2439456 2324528 2072287
16041 2072287 1769565 1515422 1385149 1393465 1500864 1632862 1717216 1708601 1605291 1460313
16031 1460313 1298454 1077763 786060 506776 324572 227018 169172 128303 91534 85447
16021 85447 154549 292248 428238 469879 383740 243349 166020 202930 287376 295261 179416
16010 179416 -2960 -180977 -293692 -285754 -173765 -46205 51783 133200 196181 225475 236457
15999 236457 263887 346221 535134 831533 1141208 1367339 1509293 1616171 1693514 1700539
15989 1700539 1622455 1492581 1384467 1401179 1577161 1793011 1864542 1684798 1270768 710908
15979 710908 133458 -312427 -552396 -628527 -628138 -622340 -655311 -718687 -773949 -789694 -752104
15968 -752104 -680734 -583459 -467639 -399316 -470446 -666366 -869050 -972771 -946346 -854873 -789403
15957 -789403 -782835 -808286 -793323 -692151 -529430 -363067 -240692 -152288 -62929 32637 103511
15946 103511 123292 110195 84677 62203 91833 206416 380637 544303 615929 557660 402435
15935 402435 204064 -29180 -277460 -481016 -622967 -754558 -882157 -936984 -911965 -871280
15925 -871280 -823763 -688438 -410884 -78416 148249 190625 84230 -74277 -210574 -328154
15915 -328154 -460405 -619221 -771438 -851716 -822404 -700008 -544205 -412500 -308508 -224929
15905 -224929 -171450 -133401 -73625 74047 372890 793525 1213804 1519369 1690170 1798983
15895 1798983 1918857 2046218 2125399 2121030 2031535 1883583 1741119 1681443 1702633 1738336 1761061
15884 1761061 1756307 1666550 1426183 1012316 484521 -33205 -454922 -766911 -970704 -1065027
15874 -1065027 -1044221 -884319 -589054 -224863 146366 526046 935152 1312894 1556191 1632603
15864 1632603 1610337 1597301 1635015 1670363 1650031 1571959 1448306 1283978 1099310 942220
15854 942220 836025 743524 601503 391439 170257 -15531 -173153 -323232 -480164 -627044
15844 -627044 -736371 -830807 -966443 -1149206 -1306568 -1366898 -1335351 -1266902 -1178098 -1041184
15834 -1041184 -839453 -565613 -226000 98066 284902 227819 -106029 -572448 -892458 -880704
15824 -880704 -610515 -326690 -199449 -195754 -180980 -79519 78834 226805 356637 506442
15814 506442 660093 766816 854836 1027588 1304013 1521288 1487116 1181222 771543 440372
15804 440372 227361 90730 23584 47875 173096 361229 517428 570683 532152 463255
15794 463255 414970 396684 403710 467641 640895 865305 938762 774700 486506 183002 -102814
15783 -102814 -331810 -460180 -496580 -477222 -418326 -343818 -279539 -230735 -210487 -225927 -248025
15772 -248025 -211850 -68483 121044 204363 101003 -128737 -381724 -593293 -713079 -711734
15762 -711734 -611699 -480424 -389368 -365413 -390956 -437586 -493076 -539508 -552753 -494835 -291235
15751 -291235 106675 628540 1154866 1648288 2138755 2607775 2987684 3222101 3278310 3158179
15741 3158179 2925314 2710415 2630643 2646451 2583703 2299078 1766212 1076229 405630 -65129
15731 -65129 -256440 -226121 -107206 16257 156119 326855 481646 571116 611845 684642
15721 684642 848801 1094461 1344620 1501442 1573685 1658866 1804473 1991848 2179630 2313639
15711 2313639 2377013 2407051 2423775 2410586 2343005 2212603 2071170 2007338 2045486 2131319 2200409
15700 2200409 2210567 2154986 2068339 1996790 1960673 1945276 1906460 1832694 1784707 1831490 1968000
15689 1968000 2118598 2218838 2233246 2133703 1915728 1595110 1194691 748745 317719 9787
15679 9787 -56797 138929 498279 870925 1080684 1024464 755620 452144 319674 424795
15669 424795 641750 807272 858962 840140 847166 950162 1093031 1134145 1037465 955932 1073770
15658 1073770 1397565 1768816 2012970 2100821 2121936 2095701 1963340 1680994 1245368 743155
15648 743155 327726 92381 20212 66078 198441 389670 598019 735423 735273 636025 521210
15637 521210 422692 332327 262178 264367 351814 453709 498671 460646 344342 180365 19253
15626 19253 -91263 -130657 -70465 141193 497429 906478 1248460 1475226 1639759 1784077
15616 1784077 1884294 1901470 1849618 1769141 1693937 1674033 1770528 2015779 2349915 2613758
15606 2613758 2660254 2480185 2184576 1895003 1663060 1497077 1402961 1344908 1238429 1022926
15596 1022926 743302 489898 286122 147911 201321 586210 1253295 1967858 2450544 2523781
15586 2523781 2243472 1846323 1548732 1438662 1510524 1746825 2109242 2491827 2767013 2855137
15576 2855137 2774532 2598365 2353421 2037945 1697798 1358009 1002806 701722 587052 690680
15566 690680 887523 1031053 1106161 1162668 1229260 1302996 1359051 1372317 1301250 1123184 872999
15555 872999 595097 318212 74884 -134935 -359286 -619752 -852380 -976387 -953282 -761054
15545 -761054 -421827 -52259 200476 282849 280392 315682 438174 639693 888875 1141281
15535 1141281 1336976 1428891 1423285 1367838 1305673 1237488 1161092 1110460 1114028 1126012 1101082
15524 1101082 1107491 1237794 1476662 1728342 1947829 2159339 2328275 2347269 2178300 1898825
15514 1898825 1571353 1221290 951273 878847 978460 1103966 1144002 1111208 1064127 1041915
15504 1041915 1095372 1249268 1477080 1743253 2019007 2259041 2393184 2405081 2378610 2384010
15494 2384010 2375856 2296907 2194122 2109481 2010532 1867471 1709184 1576595 1442615 1233908
15484 1233908 908722 489405 55356 -295371 -472736 -444180 -268611 -64083 91221 237613
15474 237613 437587 681254 921780 1079044 1033371 738098 286712 -140436 -388467 -436053
15464 -436053 -367884 -231336 -10241 272371 518268 661878 725647 732191 647871 481611
15454 481611 354984 362318 462717 549180 548596 481779 427679 387717 277354 70300 -155756
15443 -155756 -273739 -191994 75646 407944 702549 982290 1301615 1641440 1927200 2067464
15433 2067464 1988688 1705761 1333987 1009623 802331 696226 672548 737680 852038 975456
15423 975456 1107666 1201196 1157573 958690 725038 584345 560382 589481 552951 360215
15413 360215 38587 -296297 -534852 -656437 -736528 -847746 -956658 -962663 -823451 -594374
15403 -594374 -370474 -231320 -207602 -235867 -224093 -200704 -284520 -529620 -892099 -1289748
15393 -1289748 -1589805 -1665722 -1480070 -1056993 -494050 49370 459224 707369 817926 899628
15383 899628 1072007 1326077 1572120 1766904 1925495 2059445 2185407 2340125 2527707 2688465
15373 2688465 2732035 2601357 2322690 1953472 1528042 1100232 757674 586799 617556 794671
15363 794671 1037451 1302364 1577309 1828397 2010648 2114318 2144660 2089959 1939423 1746572
15353 1746572 1644234 1749953 2084221 2558335 3011835 3347244 3617114 3880434 4102215
15344 4102215 4255705 4358842 4445769 4558482 4691336 4819145 4976145 5259547 5807116 6764840
15334 6764840 8220461 10154451 12511451 15223450 18109616 20780024 22693593 23397067
15326 23397067 22743021 20954416 18530275 16002783 13734699 11856683 10368918 9227234
15318 9227234 8361627 7754304 7454869 7453554 7639896 7915973 8202283 8388549 8457788 8539180
15308 8539180 8762855 9185603 9856302 10840440 12155481 13784283 15715967 17955617 20592384
15299 20592384 23791037 27550413 31418324 34544651 36208211 36229977 34779532 32245311
15291 32245311 29264854 26419190 24037471 22291523 21269921 20963641 21238098 21909880
15283 21909880 22815392 23733398 24350479 24485855 24301099 24150905 24389983 25313191 26994693
15274 26994693 29161372 31320524 33083412 34421004 35471674 36115513 36018495 35147132 33946034
15265 33946034 32961455 32488785 32443293 32354600 31568584 29765727 27250828 24577848 22097806
15256 22097806 19858030 17782298 15857806 14150741 12737242 11652537 10897040 10434675
15248 10434675 10195899 10111956 10074797 9956235 9710914 9410858 9185894 9131491 9259630 9540464
15238 9540464 9925834 10360622 10852776 11479966 12289687 13190510 14054382 14818085 15404443
15229 15404443 15721966 15727653 15466030 15057869 14639844 14292243 14025022 13859145 13860069 14045632
15219 14045632 14324638 14586648 14826834 15123874 15498837 15892524 16275448 16721244 17324679
15210 17324679 18104729 19004215 19984811 21098671 22409510 23911866 25590029 27494595
15202 27494595 29684188 32146077 34810361 37580207 40347721 43010112 45500882 47837500
15194 47837500 50198144 52948544 56503298 61175897 67199762 74797010 84163081 95488539
15186 95488539 108995316 124833496 142873308 162482553 182273615 199869804 212297726
15179 212297726 217911439 218327784 217536355 219352822 226011775 237881234 253420953 269563396
15171 269563396 283148668 293111543 300928145 308065803 313178725 312179746 301699845 282671919
15163 282671919 259791532 238107979 220948898 209844108 205197773 206891234 214464861
15156 214464861 226808946 241451091 253954648 258817987 252713369 237128593 216789533
15149 216789533 196069767 177264599 160832246 146302250 133110106 121014898 110076006
15142 110076006 100458427 92317018 85730126 80629829 76777543 73809257 71251983 68594474
15134 68594474 65510264 61995290 58280497 54722200 51683114 49408917 48026292 47569803
15126 47569803 47985009 49192662 51146898 53765260 56809132 59853853 62303147 63481692
15118 63481692 62927792 60617123 56923939 52419969 47679661 43135872 39002884 35356910
15110 35356910 32244741 29678198 27599737 25908170 24460732 23090455 21655259 20081104
15102 20081104 18423363 16841367 15502824 14469180 13683129 13100969 12730606 12543529 12475149
15093 12475149 12508666 12653141 12870615 13104948 13304494 13431189 13519741 13677540 13977545 14399987
15083 14399987 14881691 15362419 15823601 16268786 16690829 17042513 17197587 17009752 16441015
15074 16441015 15594217 14648822 13756321 12975768 12295676 11665348 11076696 10578348 10253685
15065 10253685 10160646 10271899 10558177 11006216 11544331 12056926 12476514 12808612 13045455
15056 13045455 13117112 12912652 12346012 11425804 10286162 9133248 8115002 7275491 6627437
15047 6627437 6210399 6056067 6110678 6276439 6494074 6690447 6745567 6606161 6340109 6043755
15037 6043755 5780971 5556241 5332824 5102609 4928609 4882802 4948183 5016734 4987895 4855204
15027 4855204 4676009 4514649 4411201 4384187 4468198 4695674 4992540 5185920 5170885 4990998
15017 4990998 4779650 4685706 4773431 4982162 5158916 5129166 4789985 4185794 3480356 2804503
15007 2804503 2218779 1757476 1419986 1145129 876185 645183 507436 478235 544360 669085
14997 669085 815117 1018676 1332715 1698718 2005234 2236130 2447820 2628754 2719923 2711268
14987 2711268 2629570 2546091 2548128 2614485 2614616 2460945 2196655 1904941 1598017 1266990 981391
14976 981391 820608 759541 725108 663536 558667 449574 383948 407041 552339 770002
14966 770002 911637 847796 632658 472590 485667 639998 878154 1135801 1340696 1457344
14956 1457344 1520548 1623109 1791003 1933063 1972294 1944089 1914533 1877604 1794338 1678549
14946 1678549 1605824 1605309 1619626 1627260 1681393 1792222 1904586 2003657 2116429 2233116 2275017
14935 2275017 2168391 1914819 1540327 1110722 754909 553823 499905 565702 725785 950043
14925 950043 1215748 1479732 1681311 1810398 1899079 1949815 1910596 1718507 1394295 1037611
14915 1037611 690298 311351 -144066 -657279 -1103437 -1387321 -1538933 -1569415 -1460503 -1214472
14905 -1214472 -818946 -327484 93843 306323 309630 206776 113626 96576 187481 415345
14895 415345 777466 1200492 1591822 1894119 2063881 2107227 2103654 2148108 2313673 2606400
14885 2606400 2920862 3079617 2978567 2673606 2330697 2111974 2056359 2070298 2048882 1968236
14875 1968236 1846733 1680583 1471700 1285316 1201259 1212829 1245089 1255339 1235392 1191151
14865 1191151 1150491 1144863 1195753 1307705 1472402 1638816 1722378 1719258 1740560 1884099 2073747
14854 2073747 2136075 2067843 2049087 2249194 2650487 2987911 2940709 2515339 2072381 1882683
14844 1882683 1915550 2016365 2083375 2053133 1864039 1544688 1256015 1146450 1229320 1404719
14834 1404719 1567519 1711654 1916417 2223155 2564644 2835720 2985129 2998415 2881471 2688023
14824 2688023 2517829 2467105 2535780 2623042 2664805 2747014 2983278 3322792 3584613 3647381
14814 3647381 3546593 3399358 3222213 2955572 2633719 2348345 2108275 1863217 1612139
14805 1612139 1378481 1134685 854948 569173 343531 233745 249765 333343 373767 305721
14795 305721 139241 -96204 -382863 -672883 -895899 -1050954 -1181464 -1254549 -1171605 -921239
14785 -921239 -632137 -440936 -369615 -347059 -310666 -225431 -32235 309967 770432 1280215
14775 1280215 1754059 2106649 2285242 2285138 2175044 2076258 2084036 2189643 2301132 2350257 2339694
14764 2339694 2295701 2229766 2160820 2122644 2161383 2304330 2531149 2807290 3095555 3360682
14754 3360682 3578838 3748196 3879659 3940759 3832952 3467478 2879397 2260277 1823762 1607428
14744 1607428 1486522 1345693 1157708 974608 869795 845955 812495 700907 546825 433810
14734 433810 418920 473614 522280 528623 493337 434087 379156 358258 421316 569931 693444
14723 693444 712287 678189 658848 660505 637885 562374 464269 423516 530957 803082 1154604
14712 1154604 1446707 1591605 1575202 1413700 1146503 843364 585704 446433 490883 739237
14702 739237 1090778 1341943 1354271 1167168 906542 647573 437301 339222 413654 637600
14692 637600 876980 1013182 1038266 1003669 938028 836048 699997 582793 572145 698899
14682 698899 870335 928288 798935 556470 308834 127182 55656 82286 139135 161045
14672 161045 169349 227708 299944 304315 287092 329630 381284 335018 199976 106343 94299 33347
14660 33347 -203282 -616034 -1097765 -1507847 -1744198 -1782829 -1691499 -1624811 -1717745 -1957711
14650 -1957711 -2183430 -2226979 -2064805 -1764887 -1363429 -869417 -324291 178838 509652 607282
14640 607282 575124 552754 591102 660980 681736 600974 423494 219593 124033 214671 423285
14629 423285 620797 738066 790296 846339 974958 1170552 1340657 1393285 1365998 1413501
14619 1413501 1664574 2109528 2642197 3136558 3470698 3577181 3478149 3241635 2931556 2649449
14609 2649449 2510355 2513172 2524929 2440425 2321394 2304831 2427965 2626429 2792013 2834563
14599 2834563 2756781 2612802 2431885 2226959 2022389 1813193 1560526 1307325 1158078 1151292
14589 1151292 1267907 1446000 1573821 1542977 1344116 1066475 804883 593357 403816 209610
14579 209610 4338 -239606 -542276 -842108 -1042202 -1134374 -1169214 -1164442 -1145565 -1159320 -1178807
14568 -1178807 -1103565 -912097 -717213 -621096 -628880 -697589 -775963 -823409 -802539 -704961 -597760
14557 -597760 -588297 -715514 -924000 -1149414 -1346462 -1487554 -1559031 -1570342 -1570861 -1584879 -1589097
14546 -1589097 -1546426 -1402764 -1092915 -581064 65768 709629 1237352 1562813 1640673 1495577
14536 1495577 1213892 891138 595451 358985 160132 -27435 -197310 -344054 -420625 -336553
14526 -336553 -88760 212945 446689 537212 493367 410359 392509 479444 629343 795421
14516 795421 983411 1204745 1430756 1573563 1570692 1482210 1371132 1187093 881792 511130
14506 511130 171695 -57898 -133215 -102306 -73440 -106984 -245452 -579127 -1124850 -1709503
14496 -1709503 -2104728 -2232078 -2183950 -2054002 -1829966 -1514184 -1200906 -981998 -869152 -816534
14486 -816534 -749991 -571890 -217849 262107 706809 972742 1022619 890969 633458 307139
14476 307139 -1687 -165481 -74108 245715 615883 843679 811098 518386 103214 -245112
14466 -245112 -433166 -500912 -533344 -580780 -652320 -732342 -795335 -822824 -827132 -834673 -837778 -795390
14454 -795390 -693433 -562211 -456670 -432652 -498912 -595140 -626846 -525980 -267490 71009
14444 71009 311419 342200 222146 116547 158849 349787 557894 602770 363666 -130029
14434 -130029 -716026 -1187892 -1406714 -1380734 -1222306 -1032089 -851439 -726046 -728427 -866949
14424 -866949 -1061331 -1246073 -1410982 -1517868 -1501840 -1395506 -1326258 -1345141 -1380863 -1360829
14414 -1360829 -1291009 -1254621 -1303250 -1362646 -1313280 -1128194 -917219 -831699 -912475 -1093958 -1304298
14403 -1304298 -1481810 -1598413 -1678512 -1761173 -1883851 -2043945 -2163666 -2169512 -2042262 -1792231
14393 -1792231 -1478194 -1189815 -1009190 -955641 -985030 -1076063 -1224042 -1363768 -1410765 -1352372
14383 -1352372 -1246672 -1161734 -1140995 -1193443 -1263021 -1293530 -1305139 -1320036 -1272299 -1036860 -570020
14372 -570020 31115 598572 984490 1142985 1164846 1181699 1253694 1391504 1572063 1705989
14362 1705989 1731331 1696382 1683171 1751598 1910868 2073016 2111225 1958690 1675339 1395494
14352 1395494 1191385 1064032 947890 728249 391439 55761 -187036 -269882 -116677 231912
14342 231912 613988 897968 1037835 1022594 862645 618140 385739 248927 231688 283219
14332 283219 331819 355006 352475 296826 168307 -18469 -263777 -611306 -1067517 -1524059
14322 -1524059 -1797725 -1773805 -1510643 -1176181 -934475 -868474 -924261 -965039 -933755 -874627
14312 -874627 -803317 -672043 -471400 -310935 -308042 -468206 -742245 -1070673 -1359999 -1535357
14302 -1535357 -1624387 -1682111 -1696271 -1651895 -1600307 -1589741 -1602619 -1626542 -1653473 -1611650 -1420345
14291 -1420345 -1104155 -791249 -558786 -358947 -157200 7799 97726 98968 12504 -110406
14281 -110406 -180842 -151028 -34963 142928 392848 708917 1001310 1165474 1185952 1097222
14271 1097222 938969 754112 566910 371568 131545 -147757 -393413 -555649 -621107 -623320
14261 -623320 -599133 -517133 -349507 -119475 156425 468490 769672 1003835 1169053 1301575
14251 1301575 1437487 1589332 1713502 1738004 1634353 1450031 1249320 1038774 770533 415273
14241 415273 21525 -284193 -401260 -352920 -224450 -72154 93176 265527 403649 439291
14231 439291 366601 232036 48410 -191887 -480163 -795167 -1057025 -1125347 -929519 -534019
14221 -534019 -103503 210520 358722 381829 377815 414235 449315 425269 385735 421715 569260
14210 569260 808519 1042981 1118932 998108 808398 658445 518988 307876 -10304 -408599
14200 -408599 -813634 -1143220 -1344234 -1398294 -1317723 -1109009 -776564 -395171 -69978 152591
14190 152591 302587 458662 658466 835605 896198 837808 770544 807539 943245 1052357
14180 1052357 1039461 958599 911771 922797 991015 1122916 1283507 1392717 1399069 1324775 1213554
14169 1213554 1073278 918539 826800 855126 941095 977729 954238 923242 884323 783835 568070
14158 568070 210424 -225148 -575809 -707644 -620758 -437127 -312447 -345720 -482118 -558629
14148 -558629 -475954 -262009 -42800 11898 -176481 -511335 -792802 -822653 -511960 31055
14138 31055 566265 913320 1046663 1066369 1110409 1235101 1400140 1546038 1608600 1531089
14128 1531089 1333180 1123581 1012985 1009448 1038229 1056752 1086992 1193065 1438698 1825733
14118 1825733 2263956 2614535 2775432 2752492 2645215 2540244 2448188 2334857 2158091 1921162
14108 1921162 1718082 1642735 1658525 1631704 1476519 1218485 923159 638669 399708 221984
14098 221984 91421 -36450 -191863 -323679 -368696 -371308 -464478 -727246 -1078681 -1346685
14088 -1346685 -1443726 -1437565 -1442498 -1499644 -1540360 -1501928 -1410157 -1269325 -1055644 -800334 -574794
14077 -574794 -424505 -359986 -373805 -420385 -461726 -485655 -482461 -465926 -464254 -483851 -516099 -540736
14065 -540736 -517962 -445009 -367265 -313917 -295690 -312276 -329887 -308409 -230370 -125319 -60837
14054 -60837 -59907 -74062 -98083 -203341 -429858 -746483 -1056545 -1245826 -1269897 -1147148 -912930
14043 -912930 -611712 -310895 -81504 69847 187330 279349 315522 319229 362707 480427
14033 480427 652477 826639 935563 947071 914729 933069 1035330 1166150 1246453 1244378 1186292
14022 1186292 1100842 1022053 983302 972724 947062 865612 707524 503372 352550 341288 425805
14011 425805 467167 382058 188492 -75027 -380600 -666904 -861679 -924928 -852958 -682120
14001 -682120 -502474 -399957 -355287 -300717 -231258 -193369 -235213 -369980 -526717 -620404 -672637
13990 -672637 -725095 -722919 -584700 -310326 13099 274980 400174 366559 221916 70557
13980 70557 -5557 20897 116285 189988 133455 -96666 -412762 -668205 -762266 -706307 -591807
13969 -591807 -487950 -431010 -430154 -439811 -420512 -380571 -315544 -174761 77167 387836 667110
13958 667110 854602 923180 866044 708995 488523 240473 59543 51739 213927 451287
13948 451287 682519 873746 1020938 1122493 1164500 1126405 1009207 829137 627599 471605
13938 471605 396257 398680 453520 469169 334115 80922 -124318 -161963 13018 366781 739049
13927 739049 932720 854384 585313 291461 101718 55844 95489 176679 343749 618608
13917 618608 896362 1004993 886519 639355 413533 319506 402759 664499 1039610 1399439
13907 1399439 1604193 1568324 1316642 961919 623923 364331 207480 168834 249126 417985
13897 417985 588496 665980 621921 485547 305844 166191 119535 138752 172728 178152 117080
13886 117080 -16954 -160017 -207606 -110590 53046 154584 166614 153298 150425 144568 112157
13875 112157 35757 -59911 -138580 -197311 -219048 -176197 -79893 51946 232653 460283 661943
13864 661943 763201 788084 847821 1050659 1393604 1738569 1904263 1793762 1434922 970360
13854 970360 590615 385129 324870 382918 542802 709679 747289 583371 235383 -201430
13844 -201430 -594542 -826734 -849717 -711847 -498313 -243227 59362 376687 659648 899306
13834 899306 1045641 1018974 852487 635151 379304 47711 -334834 -650327 -779826 -684352
13824 -684352 -426882 -138317 65911 137306 104774 27279 -97836 -297621 -517020 -663665
13814 -663665 -665263 -484263 -189978 67724 210546 303744 438472 595380 688487 654452
13804 654452 494297 281007 85844 -92458 -281019 -459752 -553697 -508942 -385535 -300372
13794 -300372 -276610 -228503 -94462 90147 255946 361768 398312 382725 343412 276729 116815
13783 116815 -205720 -659090 -1096782 -1368616 -1401594 -1205101 -874739 -569573 -420538 -435253
13773 -435253 -510626 -562905 -554979 -472742 -377066 -367917 -458522 -572371 -646627 -694320 -762772 -876908
13761 -876908 -1032989 -1203324 -1351958 -1437919 -1431700 -1343039 -1242095 -1240784 -1442342 -1815335 -2139826
13750 -2139826 -2204128 -1993803 -1655117 -1337444 -1092026 -864630 -607572 -405276 -422392 -743774
13740 -743774 -1235013 -1607689 -1661966 -1430549 -1040188 -577113 -111248 325541 757183 1172660
13730 1172660 1492903 1645565 1591144 1348349 1012312 692677 449735 289911 190016 113294
13720 113294 27635 -68048 -132653 -106502 38088 279946 572185 867021 1144864 1363865
13710 1363865 1414331 1215091 798169 285419 -176477 -456595 -501431 -362718 -115601 198284
13700 198284 570611 1003000 1465841 1889062 2204019 2350912 2331789 2259277 2224260 2230478
13690 2230478 2219224 2078590 1747494 1306777 897430 632442 525352 483370 411401 298452
13680 298452 194921 136621 73314 -81976 -312491 -510698 -593059 -544558 -392502 -187937
13670 -187937 23729 221289 364493 425569 469173 593539 821480 1125348 1467511 1785764
13660 1785764 1992730 2014622 1820109 1446602 1069264 892139 940543 1043476 998772 763928
13650 763928 474140 281126 220978 253523 327547 348411 219735 -39724 -297630 -450515
13640 -450515 -488790 -437375 -349792 -299243 -275915 -196839 -58602 25566 -36451 -218018 -434610
13629 -434610 -634202 -785238 -883409 -982146 -1150604 -1414665 -1732324 -2029244 -2230604 -2250695
13619 -2250695 -2047368 -1703464 -1371899 -1157600 -1075464 -1094433 -1204662 -1388350 -1563335 -1632043
13609 -1632043 -1541203 -1307037 -991589 -655089 -367482 -220468 -246857 -382975 -544493 -698904
13599 -698904 -872134 -1075350 -1282106 -1452262 -1547678 -1540741 -1401386 -1133987 -824122 -588958
13589 -588958 -520034 -645650 -870656 -1032184 -1056584 -1018299 -1041066 -1151625 -1253134 -1237727
13579 -1237727 -1096796 -929949 -819349 -722664 -581315 -394146 -168747 92804 359398 559150
13569 559150 658513 680294 596554 342839 -41508 -444853 -802065 -1076384 -1203969 -1153839
13559 -1153839 -973994 -752617 -596828 -574915 -610930 -544487 -332682 -92175 76384 188432
13549 188432 323234 532569 770366 940001 982875 920452 867443 938254 1111846 1262697
13539 1262697 1326732 1383109 1510600 1657260 1710654 1619268 1436874 1262453 1156169 1108792
13529 1108792 1066791 948268 690484 330705 -12206 -206962 -172613 43619 273324 362382
13519 362382 289761 150356 41374 5381 31545 106909 291935 636592 1071983 1486017
13509 1486017 1814416 2021933 2115055 2133160 2101471 2059655 2047196 2019725 1864463 1536683
13499 1536683 1130423 761509 453705 200727 79449 168816 422079 693726 834295 766331
13489 766331 490264 95350 -233493 -351911 -287644 -180040 -132369 -167858 -259826 -318984
13479 -318984 -226182 53826 451873 828701 1043459 1038807 857621 644135 592389 825478
13469 825478 1288873 1764491 2030231 2031536 1828169 1476483 1073951 796901 774627 956743
13459 956743 1172472 1343162 1512563 1693610 1857166 1978996 2014017 1921049 1725728 1508189
13449 1508189 1297995 1064008 832936 702035 715522 799291 852141 855390 853610 878006 940471
13438 940471 1073528 1328395 1692928 2054039 2251023 2190590 1928358 1627719 1434234 1333221
13428 1333221 1177851 854556 382622 -127271 -568132 -866657 -970116 -886677 -719124 -588557
13418 -588557 -510566 -410414 -254411 -88046 77557 298719 617352 1001116 1362268 1589558
13408 1589558 1579932 1300395 836966 383468 132643 139863 308359 495775 620017 669776
13398 669776 637961 542568 452498 418836 422263 386784 254001 52871 -121878 -200125 -182981
13387 -182981 -105757 25172 197361 376356 598772 887437 1126169 1203090 1150421 1105199
13377 1105199 1179499 1378604 1629658 1826351 1857361 1674213 1366424 1083960 883756 677111
13367 677111 393337 140049 83121 256705 534638 733540 753869 620392 431982 337155
13357 337155 451280 738460 1041434 1222704 1197573 963508 675134 544263 652724 936291
13347 936291 1268767 1516544 1588981 1448245 1123877 726510 373970 78266 -241689 -636597
13337 -636597 -1107363 -1630614 -2141164 -2545325 -2750160 -2703019 -2382529 -1799643 -1013489 -170333
13327 -170333 518588 890521 908537 666609 337858 80314 -43138 -48223 26567 111061
13317 111061 143360 136568 130809 171889 312895 535872 752890 901132 972839 1014963 1084485
13306 1084485 1159625 1168801 1077396 877307 556901 108982 -424105 -940078 -1322546 -1466149
13296 -1466149 -1341976 -1075813 -861823 -765889 -686642 -508444 -216017 129759 473179 802814
13286 802814 1117811 1418777 1715897 1987679 2173876 2230306 2136336 1859928 1394651 847528
13276 847528 390650 109851 -22187 -65619 -60747 -27490 15472 71457 145645 221827 257648
13265 257648 210798 84113 -98632 -321404 -553726 -715674 -716867 -543117 -259510 36435
13255 36435 280107 508041 808180 1182675 1535390 1760970 1796768 1685373 1563461 1495327
13245 1495327 1413956 1229952 941142 633827 392576 233682 118016 -6532 -176724 -394630
13235 -394630 -619205 -777089 -818910 -772053 -715529 -734483 -858368 -1030215 -1169450 -1242123
13225 -1242123 -1239275 -1133201 -935297 -710297 -512925 -373134 -285437 -218908 -199484 -280984
13215 -280984 -428762 -561389 -656856 -753639 -886883 -1035170 -1108611 -1031809 -817500 -536629
13205 -536629 -290066 -164734 -120614 -38467 81020 113617 -9243 -246036 -522486 -758136
13195 -758136 -913750 -1026813 -1136496 -1234890 -1304402 -1321466 -1246205 -1036610 -682648 -262348
13185 -262348 57570 130643 -47491 -337685 -587544 -748369 -848543 -901764 -882871 -764668
13175 -764668 -537892 -244206 12262 167113 257719 371728 520808 657820 742553 746180
13165 746180 704613 699880 754246 809610 803871 716423 567262 406271 297417 255402 207590
13154 207590 79857 -114012 -330975 -588999 -903487 -1197545 -1366974 -1375597 -1231943 -992123
13144 -992123 -733720 -472837 -174774 157971 427892 538220 524153 507230 537894 575605
13134 575605 568967 485468 346805 233756 201173 206334 156802 12278 -174838 -329194 -436944
13123 -436944 -514239 -540069 -487149 -376288 -260178 -187795 -185361 -232951 -272136 -258725 -208013
13112 -208013 -131903 -8628 150270 315815 454121 494645 395184 193246 -38614 -229321
13102 -229321 -309630 -244928 -83089 80502 185932 247334 306240 358488 352708 251789 70492
13091 70492 -126776 -251348 -243864 -135271 797 138001 281359 418211 533961 645240
13081 645240 797991 1004276 1183179 1241101 1185493 1090206 995386 886204 743648 585885
13071 585885 425527 248623 66623 -69158 -122681 -91437 25448 232502 526861 889524
13061 889524 1276017 1615249 1856268 2019988 2153100 2247971 2264831 2198041 2039068 1738352
13051 1738352 1294193 808415 394097 74264 -185008 -397705 -565718 -727022 -913378
13042 -913378 -1120015 -1352141 -1634242 -1913023 -2063329 -2032513 -1888949 -1733344 -1639403 -1683995
13032 -1683995 -1896371 -2160484 -2283541 -2178349 -1866326 -1384421 -808394 -252839 196472
13023 196472 530864 799590 1008800 1094606 1020828 852574 696930 615969 621607 664404 658217
13012 658217 552832 341731 71500 -143274 -191309 -52082 226138 577192 909101 1147486
13002 1147486 1267894 1251920 1057118 650586 54194 -665435 -1391858 -1954691 -2222985 -2197547
12992 -2197547 -1954676 -1584610 -1189177 -851766 -612491 -472808 -407929 -357546 -237239 2826
12982 2826 358842 791155 1247018 1658455 1941685 2036891 1927581 1643804 1275416 933613
12972 933613 683687 557104 544365 559727 477683 225606 -99185 -272057 -156555 184756
12962 184756 603539 991830 1300254 1519875 1669885 1795370 1925838 2018935 2021863 1943357
12952 1943357 1833417 1746359 1703119 1668179 1567817 1330201 931588 434981 -16923 -233089
12942 -233089 -93399 353548 962134 1567301 2015323 2200176 2095533 1802359 1473769 1212589
12932 1212589 1052009 959495 884117 798699 697178 592973 510042 449668 372756 239609
12922 239609 56783 -144918 -342501 -515969 -652003 -767243 -900434 -1066245 -1238881 -1383478
12912 -1383478 -1471308 -1475583 -1419860 -1376348 -1378651 -1387783 -1354101 -1254666 -1103952 -943643 -823028
12901 -823028 -804954 -872716 -889286 -756870 -538480 -372977 -341269 -413632 -502398 -576045 -691481
12890 -691481 -923261 -1268465 -1596101 -1759189 -1708475 -1474425 -1144181 -821533 -596827 -540374
12880 -540374 -667849 -922412 -1200596 -1412883 -1568483 -1746032 -1997693 -2299725 -2567763 -2733076
12870 -2733076 -2757376 -2572185 -2130743 -1551680 -1051783 -758747 -657362 -632678 -562494 -415892
12860 -415892 -226291 -27748 154347 292188 342681 315173 302430 407972 645802 908428
12850 908428 1098742 1224484 1312885 1298228 1100837 749472 355773 27408 -197834 -329212
12840 -329212 -394692 -417695 -367445 -213246 -22270 101488 139467 166573 241672 332969 361557
12829 361557 271665 87682 -91593 -164232 -88788 126401 457905 857298 1199668 1316749
12819 1316749 1141598 767313 328317 -122819 -566384 -976894 -1358073 -1707709 -1989207
12810 -1989207 -2149678 -2147294 -1980072 -1712302 -1454282 -1277485 -1200529 -1230896 -1371212 -1587056
12800 -1587056 -1825614 -2025238 -2129483 -2152545 -2147414 -2133435 -2080959 -1966880 -1821748 -1685424
12790 -1685424 -1595667 -1570437 -1540109 -1390282 -1100008 -775819 -518168 -329335 -189018 -101054
12780 -101054 -29025 80723 223801 345291 385832 345378 293295 266440 232448 163320 116129
12769 116129 175935 325570 482707 573278 519683 247149 -224526 -749598 -1178114 -1446297
12759 -1446297 -1567797 -1596671 -1590455 -1575673 -1510674 -1322992 -1022887 -712961 -494206 -441230
12749 -441230 -591138 -848894 -1031263 -1047106 -931974 -760744 -584681 -434250 -347909 -332262
12739 -332262 -357528 -433523 -581279 -783190 -990969 -1162149 -1278274 -1306388 -1243117 -1158874
12729 -1158874 -1100958 -1020298 -865166 -680980 -550962 -519376 -558569 -592375 -606671 -673531 -830281
12718 -830281 -1018566 -1198232 -1377096 -1509254 -1501251 -1366277 -1259623 -1316156 -1535303 -1815869
12708 -1815869 -2026652 -2081052 -1981748 -1819900 -1741788 -1825485 -1985221 -2068171 -2002201 -1819180
12698 -1819180 -1587198 -1333658 -1048763 -767532 -545175 -373631 -209172 -30759 119567
12689 119567 172113 138881 82076 7074 -115117 -259407 -360140 -332125 -130037 142248
12679 142248 313131 304242 119174 -238547 -718979 -1165205 -1374140 -1269153 -961834 -636400
12669 -636400 -400877 -248951 -135496 -38239 18020 -8270 -128358 -360617 -707563 -1100758
12659 -1100758 -1435213 -1634763 -1679650 -1617940 -1537356 -1503008 -1527805 -1558736 -1538836 -1479682 -1424757
12648 -1424757 -1379401 -1343696 -1359433 -1461974 -1604993 -1677026 -1617322 -1445946 -1203776 -934982
12638 -934982 -710683 -584720 -544559 -538913 -511966 -404661 -197612 40476 215338 265319
12628 265319 184455 51406 -12483 61867 225637 333365 293764 134027 -87196 -360470
12618 -360470 -677828 -978438 -1237591 -1469616 -1607340 -1557651 -1344666 -1072908 -803684 -489093
12608 -489093 -28340 579330 1186006 1600832 1695274 1463003 1005662 427390 -222047 -906869
12598 -906869 -1546726 -2067532 -2455820 -2737274 -2965571 -3166875 -3311202 -3330469 -3149267 -2766105
12588 -2766105 -2289868 -1855838 -1525999 -1292074 -1150962 -1132062 -1225609 -1336018 -1373414 -1343465
12578 -1343465 -1282078 -1173963 -1007945 -856135 -802758 -836531 -894366 -953339 -1027632 -1099860 -1130446
12567 -1130446 -1107232 -1029932 -906908 -774320 -679082 -644181 -627109 -557085 -426068 -269580
12557 -269580 -103844 81456 287967 490853 633154 651472 559582 428283 278933 85144
12547 85144 -120098 -238389 -200558 -36106 194443 472080 728346 873804 915755 902747
12537 902747 878877 840992 732793 568247 438358 392994 434351 541303 647389 673380
12527 673380 602100 499324 447475 459903 465090 403180 285717 169283 101918 86870 39522
12516 39522 -148747 -441737 -676954 -743232 -634415 -384832 -59319 224955 382347 428371
12506 428371 434502 444746 447963 430206 388639 338524 339669 442609 589696 647640 550112 348305
12494 348305 134803 -57153 -237387 -382778 -459304 -475832 -465572 -429813 -305480 -11100
12484 -11100 452187 986212 1483473 1877219 2110481 2140433 1985882 1694185 1334285 1040890
12474 1040890 909304 883669 854879 781411 709124 663057 598137 513890 466575 475540 540760
12463 540760 686170 936487 1270994 1586257 1730835 1611865 1268697 803043 290722 -229865
12453 -229865 -717348 -1057040 -1141649 -1028612 -859107 -681335 -467920 -201838 96803 365768
12443 365768 560267 688472 742259 710611 659640 646346 636472 604637 618458 737503 926226
12432 926226 1071156 1093242 1017751 910575 869947 994517 1276248 1580839 1731815 1631174
12422 1631174 1355618 1118723 1056236 1131750 1212025 1191668 1098569 1040912 1076680 1139798 1079901
12411 1079901 813723 387173 -109574 -575492 -914350 -1077191 -1084744 -1045137 -1066765 -1137615
12401 -1137615 -1168953 -1138257 -1088294 -1035361 -938656 -770980 -596439 -483628 -444031 -482160 -564058
12390 -564058 -570425 -403612 -118239 142859 260179 173289 -91559 -429591 -710810 -831797
12380 -831797 -742140 -473667 -137566 131154 255938 280364 323263 433610 587897 813550
12370 813550 1165142 1634190 2175006 2743106 3281962 3716610 3976984 4019305 3824936 3421548
12360 3421548 2900729 2414048 2091991 1964508 1971537 1997682 1916605 1649107 1213110 721525
12350 721525 312133 59089 -24745 53973 291848 707452 1252758 1762388 2112935 2297859
12340 2297859 2357105 2323761 2196074 1952237 1622654 1313306 1144553 1174556 1379564 1657420
12330 1657420 1867846 1927199 1857130 1702309 1441053 1040647 520948 -35200 -520715 -840616
12320 -840616 -940883 -824829 -533189 -144895 254782 637320 1001677 1285133 1384332 1263995
12310 1263995 1008838 766306 624879 589138 636839 698302 654065 456160 208808 28748
12300 28748 -54349 -31429 77203 186432 222112 183959 134728 149157 247133 410768 611458
12289 611458 754762 722706 487641 89852 -404444 -885239 -1194175 -1186490 -886391 -498355
12279 -498355 -211915 -98954 -153170 -296332 -404121 -390190 -249088 -43126 167126 380058
12269 380058 600239 825698 1105225 1470816 1820711 2001286 1985863 1864485 1703361 1530020
12259 1530020 1397116 1375425 1484408 1661429 1845819 2020865 2159772 2204894 2101005 1797205
12249 1797205 1255981 547457 -176054 -796833 -1278366 -1644013 -1905738 -2024762 -1959762 -1748096
12239 -1748096 -1507019 -1335139 -1235052 -1151619 -999389 -690690 -220430 309578 761335 1031266
12229 1031266 1093340 1011881 893235 775443 591383 274443 -127944 -476942 -639944 -560469
12219 -560469 -292510 33499 233129 116558 -323298 -854631 -1225233 -1335276 -1235278 -1042046
12209 -1042046 -817579 -578606 -407095 -411717 -605712 -911383 -1205880 -1377601 -1416937 -1426887
12199 -1426887 -1532126 -1772031 -2061875 -2282986 -2391168 -2389200 -2257865 -2013276 -1776602 -1660616
12189 -1660616 -1618585 -1516477 -1261539 -813183 -213674 367880 740839 860309 841778 824006
12179 824006 850367 844581 695261 396727 62718 -184690 -319600 -406696 -485610 -567843 -698497
12168 -698497 -871322 -970804 -905896 -719253 -500175 -296038 -154636 -121267 -185354 -324883
12158 -324883 -530218 -782587 -1073381 -1372791 -1571427 -1602516 -1522857 -1408657 -1270787 -1039422
12148 -1039422 -636896 -123291 318497 555597 571744 415000 155966 -126096 -378267 -613715
12138 -613715 -840320 -1000890 -1061338 -1058133 -1049318 -1093554 -1208731 -1311975 -1294621 -1157151 -1023118
12127 -1023118 -977710 -985561 -966034 -877436 -754751 -684299 -732764 -894695 -1094973 -1259305 -1355428
12116 -1355428 -1364707 -1287562 -1213428 -1264625 -1450410 -1681769 -1856388 -1950085 -2007673 -2039187 -2020185
12105 -2020185 -1941638 -1769608 -1467962 -1081653 -678522 -293949 49968 337352 577568 810588
12095 810588 1041652 1212320 1277290 1276353 1287309 1315552 1289668 1144861 836401 351144 -208441
12084 -208441 -646539 -823471 -753763 -581367 -439022 -372136 -385323 -465527 -591815 -754087
12074 -754087 -887168 -878227 -732260 -603459 -620702 -785090 -1005216 -1165438 -1217509 -1210667 -1239458
12063 -1239458 -1365111 -1589804 -1898595 -2233596 -2510064 -2666684 -2657369 -2469376 -2177362 -1914531
12053 -1914531 -1748774 -1632799 -1485966 -1322185 -1216442 -1188524 -1219686 -1294968 -1395662 -1494337
12043 -1494337 -1555166 -1544154 -1454167 -1284585 -1005667 -616018 -176884 227312 521761 660360
12033 660360 655481 571216 480998 410876 318822 162780 -60731 -336973 -598290 -698181 -565557
12022 -565557 -321675 -123452 26838 211357 400770 453388 287092 -32424 -401740 -773099
12012 -773099 -1085532 -1246378 -1207792 -984233 -649069 -356491 -275006 -432656 -697402 -913518
12002 -913518 -978468 -818792 -401724 210565 863560 1363175 1547613 1398630 1083801 809608
11992 809608 693455 734429 830264 880256 889004 927201 1026465 1116893 1081698 865977 498100
11981 498100 81783 -282779 -584977 -842312 -1052051 -1260049 -1510574 -1718077 -1751093 -1615846
11971 -1615846 -1435092 -1309009 -1252092 -1203280 -1118468 -1030784 -965396 -888130 -781722 -697486 -691879
11960 -691879 -752786 -829880 -865450 -797167 -626544 -451963 -401447 -523669 -772611 -1052262
11950 -1052262 -1232646 -1221773 -1033142 -742124 -458214 -289085 -246488 -266361 -297779 -294884
11940 -294884 -228852 -149215 -131311 -206967 -389348 -654877 -929141 -1114846 -1123040 -951041 -652292
11929 -652292 -271744 117498 403448 489559 350575 46818 -283828 -496729 -546310 -440737
11919 -440737 -167539 247956 703334 1092423 1387730 1606227 1744842 1808338 1834355 1842581
11909 1842581 1778456 1565951 1253193 994043 882523 911944 997230 992311 772012 343670
11899 343670 -151952 -592649 -928026 -1111207 -1093641 -884408 -534367 -118728 257927 524844
11889 524844 694449 830520 974090 1127860 1255622 1319006 1336319 1373713 1434465 1433383 1304291
11878 1304291 1062904 765497 445768 98802 -276768 -651419 -1025166 -1415557 -1780545
11869 -1780545 -2082835 -2334247 -2502688 -2535060 -2431769 -2228586 -1953705 -1606679 -1159064 -618995
11859 -618995 -104474 248627 402526 402673 310038 153458 -52863 -265718 -411576 -434533
11849 -434533 -356600 -288917 -353429 -608756 -1016455 -1455711 -1796101 -1952413 -1931169 -1810435
11839 -1810435 -1654048 -1511077 -1440496 -1420755 -1335220 -1134510 -896687 -714546 -611502 -552693
11829 -552693 -470643 -280931 55030 467350 807582 943628 865706 712824 625300 565906
11819 565906 366855 -30117 -500392 -913399 -1221032 -1361414 -1257807 -941255 -541305 -177151
11809 -177151 80827 201269 175300 27658 -178176 -363110 -476581 -547071 -629403 -719028
11799 -719028 -707248 -497900 -151294 199844 477269 655340 724595 659963 437627 156844
11789 156844 -5967 14789 151081 304570 402997 413464 331421 138473 -177848 -566142
11779 -566142 -940935 -1244133 -1461609 -1616559 -1737798 -1827598 -1873654 -1854650 -1760758 -1625223
11769 -1625223 -1487121 -1317313 -1036229 -610699 -133925 244027 482260 627131 708421 765909
11759 765909 840832 904694 906688 865648 867201 962982 1105617 1224919 1313669 1381477 1421939
11748 1421939 1468119 1597827 1835339 2103032 2236922 2122481 1817877 1459842 1158527 987300
11738 987300 966631 1032371 1049198 910269 604763 219272 -97494 -233487 -199661 -93127
11728 -93127 43229 234328 509796 847693 1156959 1338935 1379299 1358805 1321571 1211794
11718 1211794 995104 735695 500746 308104 157839 33724 -60825 -73855 9459 129611
11708 129611 253094 405283 562628 626131 509636 200728 -214118 -581344 -778956 -788282
11698 -788282 -639971 -374992 -76134 149544 267922 300115 253812 153028 27642 -132455
11688 -132455 -363960 -657695 -936237 -1097420 -1096358 -952566 -707241 -413818 -151115 -3468
11678 -3468 -16953 -159194 -329933 -444823 -506689 -577308 -687781 -811629 -866329 -763444 -500024
11667 -500024 -135256 271122 686639 1128127 1618900 2117205 2523408 2769095 2871976 2870341
11657 2870341 2741620 2468749 2097595 1709667 1395645 1203368 1102553 1021646 896433 698843
11647 698843 445485 186308 -26793 -164862 -207295 -158294 -90599 -86344 -122675 -115789 -57961
11636 -57961 26633 158588 364954 651724 936572 1120344 1241282 1365811 1458201 1445386
11626 1445386 1323436 1152140 953998 726519 520973 394465 326011 233652 62722 -194224
11616 -194224 -493710 -763273 -952456 -1030302 -961692 -720526 -346140 27093 271226 379075
11606 379075 400174 407162 507055 749405 1090433 1428877 1670322 1801551 1866516 1899222 1913943
11595 1913943 1916916 1894652 1829797 1748749 1697194 1672280 1622251 1486876 1229990 848991 406048
11584 406048 21093 -254609 -457168 -607170 -679567 -614039 -392949 -90092 206077 414012
11574 414012 448359 291467 27330 -228643 -387670 -429509 -419941 -439311 -490547 -542510 -606312
11563 -606312 -700756 -821850 -947979 -1040214 -1061798 -996493 -837660 -643142 -535765 -608663
11553 -608663 -856647 -1151519 -1316988 -1310345 -1261534 -1276670 -1328844 -1346821 -1284097 -1127023 -898083
11542 -898083 -656034 -457831 -315503 -188783 -1982 292489 666831 1062956 1423512 1668718
11532 1668718 1759924 1792402 1897358 2064440 2163159 2090880 1842842 1477686 1026724 503083
11522 503083 -55119 -610776 -1108723 -1449277 -1531952 -1332177 -950077 -553872 -252132 -49132
11512 -49132 97372 197940 211370 118002 -50661 -285325 -585843 -905681 -1165950 -1303242
11502 -1303242 -1327141 -1313740 -1312813 -1291507 -1209051 -1086141 -1000875 -1057873 -1268615 -1491543 -1562709
11491 -1562709 -1407940 -1071589 -679786 -288407 142825 605569 1017045 1286957 1361143 1270486
11481 1270486 1133444 1041655 982100 898896 727727 420590 -4635 -482955 -935058 -1280204
11471 -1280204 -1482062 -1543515 -1466700 -1249837 -916540 -559166 -324682 -309017 -461772 -613347
11461 -613347 -666285 -698079 -796628 -919774 -955441 -836570 -584081 -251680 133718 513139
11451 513139 804380 1005111 1135501 1174133 1112642 968880 766557 542741 328783 117641
11441 117641 -86682 -224458 -227240 -105290 40065 114080 125242 132616 114314 -7932 -261941
11430 -261941 -576924 -843913 -1042712 -1208532 -1342922 -1440140 -1501301 -1521679 -1502338 -1448684
11420 -1448684 -1365214 -1275797 -1189765 -1095803 -999760 -920158 -886016 -897324 -884765 -752723 -514027
11409 -514027 -339288 -388361 -653120 -977940 -1208039 -1275553 -1202352 -1076147 -954828 -847959
11399 -847959 -777999 -751433 -749086 -787987 -912887 -1107945 -1299170 -1432095 -1501358 -1552531 -1629185
11388 -1629185 -1713222 -1746159 -1689312 -1548557 -1379104 -1282008 -1323818 -1435018 -1500727 -1512291 -1531484
11377 -1531484 -1588598 -1662974 -1713649 -1741763 -1766829 -1756386 -1700925 -1658096 -1651583 -1632632 -1529220
11366 -1529220 -1305793 -1011917 -749503 -579435 -477419 -387300 -297922 -236329 -199704 -114780
11356 -114780 85750 397412 773002 1093487 1163949 869084 330850 -151727 -369270 -343961
11346 -343961 -198178 -4931 177704 275552 288454 271415 266891 294518 312792 246766 86865
11335 86865 -109860 -281601 -344826 -208510 118883 511136 833992 1024076 1068221 1002336
11325 1002336 893732 761437 580562 383606 270310 298981 446021 637733 796389 879645
11315 879645 854070 697789 418850 13032 -474291 -869348 -1014257 -939967 -797247 -698243
11305 -698243 -694180 -803938 -1017003 -1302566 -1561055 -1633029 -1495883 -1315779 -1230380 -1226691 -1222448
11294 -1222448 -1146518 -952191 -596618 -67096 548492 1075839 1394323 1518558 1515153 1439410
11284 1439410 1351978 1269802 1133860 890748 571487 275578 76455 33509 228008 659259
11274 659259 1174289 1579467 1747340 1656929 1407413 1114617 831093 553388 231487 -152930
11264 -152930 -517538 -750855 -801573 -713246 -596165 -509884 -426386 -328327 -245436 -186771 -102805
11253 -102805 43509 249793 473144 605235 533085 253091 -131279 -467535 -658352 -770100
11243 -770100 -915823 -1058577 -1064839 -920691 -782233 -796579 -946445 -1095166 -1136498 -1085887
11233 -1085887 -991296 -832598 -587155 -293367 -8147 233589 422485 581893 741155 883973
11223 883973 995420 1084872 1158452 1227490 1294526 1342487 1337936 1268518 1190961 1171600 1191067
11212 1191067 1187213 1132566 991926 774976 590375 507532 475778 415358 288453 96271
11202 96271 -122855 -326076 -519101 -696817 -818370 -889767 -937150 -937589 -852438 -673638 -465733
11191 -465733 -359060 -441641 -672920 -927667 -1073957 -1043643 -915076 -856777 -970934 -1216726
11181 -1216726 -1458397 -1573981 -1494847 -1251458 -990778 -819056 -698038 -549513 -372324 -258935
11171 -258935 -264881 -309050 -299703 -238056 -190019 -213454 -290643 -367677 -404606 -366302 -234321 -65573
11159 -65573 52706 127381 193764 222650 190657 131639 75666 42769 109176 337600 672401
11148 672401 1001907 1250197 1406793 1493204 1505100 1475684 1474753 1499205 1524643 1535171 1478964
11137 1478964 1306747 1032645 697974 307406 -113551 -480071 -716510 -807504 -797363 -743481
11127 -743481 -680335 -654377 -744545 -977980 -1283774 -1554950 -1683112 -1608976 -1365827 -1029360
11117 -1029360 -647220 -244791 97455 274579 311019 356752 494531 636902 623035 395823
11107 395823 38675 -312626 -541847 -617815 -593689 -510097 -368974 -188981 -40477 -23547
11097 -23547 -208925 -560102 -963412 -1300242 -1478589 -1452396 -1232431 -903003 -576975 -324439
11087 -324439 -153676 -34297 26801 -28778 -223531 -508296 -820255 -1116810 -1335520 -1431768
11077 -1431768 -1453034 -1455327 -1405234 -1211478 -844663 -398423 -15475 214138 273324 197573
11067 197573 59798 -70404 -130505 -105771 -55164 -46105 -72974 -96033 -87011 -21354 96004
11056 96004 264170 480572 704226 900483 1083375 1296651 1548197 1759197 1814159 1661112
11046 1661112 1330704 939823 630540 413309 162068 -211166 -633131 -945872 -1071863
11037 -1071863 -1083753 -1099849 -1137297 -1159160 -1136723 -1027557 -797598 -451019 -53603 300807
11027 300807 560798 743020 874545 959260 983571 916073 777060 632661 501143 394090
11017 394090 363952 414980 461581 421378 298144 172122 117320 136033 206528 279936 258491
11006 258491 116416 -54985 -152989 -129276 -2789 163081 314701 408344 372861 165619
10996 165619 -137936 -393559 -505869 -488878 -417007 -386609 -524206 -873014 -1290231 -1560381
10986 -1560381 -1590520 -1463678 -1338466 -1327794 -1446487 -1649636 -1896543 -2158395 -2384516 -2474124
10976 -2474124 -2360841 -2071164 -1653954 -1147012 -610712 -120679 245691 410156 326347 22556
10966 22556 -381330 -724413 -901535 -923432 -896567 -905585 -932349 -926831 -856751 -673248 -374552
10955 -374552 -66803 104998 55913 -234177 -717458 -1268828 -1725830 -1983588 -2051800 -1980064
10945 -1980064 -1818690 -1637314 -1503249 -1458797 -1515691 -1649001 -1792236 -1845059 -1751798 -1536157
10935 -1536157 -1268151 -1014516 -776303 -529446 -281135 829 378031 819944 1173415
10926 1173415 1316216 1319466 1326756 1333561 1229438 983611 694176 489259 373347 224834
10916 224834 -12957 -295950 -573948 -816591 -1000822 -1107502 -1099383 -959667 -717056 -438409
10906 -438409 -211646 -81974 -61097 -136506 -250757 -335651 -362793 -342590 -306041 -302017 -356296
10895 -356296 -445844 -530780 -583266 -586881 -526969 -426152 -353915 -407826 -657617 -1032150 -1353220
10884 -1353220 -1517265 -1527008 -1383527 -1123837 -831383 -534811 -225515 119337 534373 1023043
10874 1023043 1549816 2049602 2421884 2554116 2435706 2199866 1982573 1815182 1650700
10865 1650700 1426022 1091491 635817 154174 -183556 -310249 -322610 -350660 -460074 -648209
10855 -648209 -904721 -1230757 -1537860 -1661857 -1547729 -1266193 -903078 -508241 -72452 424434
10845 424434 884582 1143740 1155515 991526 728337 425706 178791 52747 14101 -6735
10835 -6735 -55352 -110180 -113398 -94679 -166784 -363181 -601423 -840216 -1120735 -1418080 -1558337
10824 -1558337 -1390442 -959152 -414639 95580 416230 450714 222289 -166443 -596313 -986189
10814 -986189 -1268033 -1361267 -1252831 -1060721 -936927 -898930 -866538 -804569 -744105 -694030 -593717
10803 -593717 -386443 -74627 246736 443711 483698 425451 336481 279322 296655 401023
10793 401023 587745 804890 986190 1130163 1270800 1401611 1476388 1483624 1469521 1459727 1443567
10782 1443567 1428650 1439790 1517933 1701786 1952703 2163719 2257260 2192975 1962178 1643805
10772 1643805 1325436 1008560 668219 292992 -66293 -302632 -386552 -405164 -470656 -612316
10762 -612316 -780228 -934317 -1104991 -1324199 -1541160 -1650709 -1591923 -1384988 -1104673 -858318
10752 -858318 -737205 -799949 -1064543 -1440223 -1737521 -1814024 -1662812 -1380944 -1133174 -1082727
10742 -1082727 -1253193 -1517619 -1720476 -1750432 -1563510 -1235317 -928680 -743829 -655867 -621754
10732 -621754 -646822 -726216 -809960 -850727 -840152 -796154 -770481 -817892 -950475 -1099590 -1122153
10721 -1122153 -933929 -635456 -416060 -349354 -378285 -444624 -552707 -716298 -908631 -1106528
10711 -1106528 -1290211 -1364774 -1225055 -902189 -540485 -270536 -146550 -186002 -389463 -681867
10701 -681867 -929691 -1056136 -1099641 -1158995 -1311079 -1512814 -1635284 -1585576 -1369322 -1117253
10691 -1117253 -996771 -1066144 -1274057 -1511926 -1631300 -1544998 -1300800 -979428 -634387 -360882
10681 -360882 -257731 -327588 -501283 -709867 -887223 -972302 -944125 -833831 -673551 -472293
10671 -472293 -253069 -65708 42297 27239 -139571 -405407 -643760 -762791 -759738 -653388
10661 -653388 -447887 -232482 -215728 -535424 -1066451 -1540098 -1806962 -1857315 -1740295 -1522073
10651 -1522073 -1249066 -956565 -683890 -461939 -284217 -124177 32555 193549 370917
10642 370917 568506 750558 837329 780915 624797 449068 307835 226830 193734 179678
10632 179678 245326 482318 838719 1220612 1626650 2029866 2301156 2337861 2149825 1821744
10622 1821744 1445366 1084382 781866 515060 233011 -54691 -343542 -650155 -923146
10613 -923146 -1076907 -1081518 -1010460 -964383 -957019 -950875 -944167 -966847 -1022272 -1065012 -1057230 -1008128
10601 -1008128 -917672 -734633 -494487 -336774 -313800 -358391 -393468 -420446 -513566 -760745
10591 -760745 -1201489 -1780588 -2338399 -2680050 -2697444 -2414009 -1934119 -1385830 -851276 -340685
10581 -340685 122894 464509 649738 722936 758259 818462 904216 942898 871831 698332 489673
10570 489673 323798 208565 124802 141067 393432 898231 1497370 1998646 2289102 2379153
10560 2379153 2332180 2211419 2103856 2082156 2156844 2297341 2428653 2417511 2163942 1689391
10550 1689391 1107541 577689 220290 22622 -111932 -287151 -596863 -1069636 -1619442
10541 -1619442 -2101080 -2435111 -2636662 -2697458 -2592385 -2373325 -2140604 -1943205 -1724654 -1393063
10531 -1393063 -983931 -625425 -363415 -184906 -93754 -56201 6013 135651 346203 606663
10521 606663 835423 975058 1021856 1001925 942309 870306 854213 996870 1309934 1665221
10511 1665221 1922539 2026621 1990262 1835494 1601272 1382155 1267829 1247222 1243663 1208610
10501 1208610 1144836 1065950 953974 813286 740062 815074 984888 1118257 1114262 978903
10491 978903 828194 782678 857566 998069 1152228 1277517 1323908 1228195 967523 593837
10481 593837 164536 -277690 -668627 -946157 -1095884 -1174045 -1273958 -1438118 -1592356 -1617824
10471 -1617824 -1481547 -1259707 -1059944 -940874 -914863 -979215 -1097956 -1204251 -1236793 -1164001
10461 -1164001 -1013207 -854057 -742533 -694265 -674807 -661888 -726227 -936697 -1249602 -1539347
10451 -1539347 -1707154 -1726147 -1609140 -1381029 -1057133 -692715 -430116 -380340 -489486 -647377
10441 -647377 -795139 -918708 -1056860 -1251015 -1472853 -1665911 -1826914 -1959919 -2032735 -2016778
10431 -2016778 -1889891 -1659401 -1383500 -1132476 -937954 -800927 -732156 -728385 -729325 -666994 -523123
10420 -523123 -311067 -40668 247849 415370 344102 106577 -102262 -159435 -94488 -8822
10410 -8822 5279 -117953 -399892 -815566 -1308494 -1794360 -2188769 -2448495 -2566697 -2581328
10400 -2581328 -2560608 -2547852 -2517601 -2394523 -2127857 -1729703 -1285317 -914187 -681463 -550498
10390 -550498 -436044 -274946 -82961 36392 -6274 -163976 -340874 -520226 -728521 -934134
10380 -934134 -1062346 -1101137 -1090983 -1082363 -1113581 -1176044 -1214606 -1161082 -976084 -715146 -486351
10369 -486351 -345076 -257603 -147042 28317 273180 584027 934622 1288488 1580619 1678982
10359 1678982 1491211 1103311 696189 386667 187140 50626 -88048 -273868 -485683
10350 -485683 -672028 -818202 -975793 -1230026 -1595423 -1869374 -1708547 -1061475 -307249 227689
10340 227689 541973 752205 933977 1114348 1248604 1248342 1087314 837649 591722 399836
10330 399836 281863 221437 121870 -141483 -615172 -1243318 -1889439 -2375660 -2587379 -2536493
10320 -2536493 -2321601 -2058272 -1837388 -1666683 -1490019 -1277458 -1024324 -734972 -456120
10311 -456120 -248984 -128437 -81626 -120666 -289221 -593963 -962981 -1321929 -1648411 -1900833
10301 -1900833 -2022581 -2004385 -1858415 -1597190 -1289843 -1038405 -847358 -659761 -467806 -277628
10291 -277628 -86484 97135 269861 455100 688835 975397 1219282 1283369 1146917 890797
10281 890797 594125 286669 -25752 -279630 -369861 -280185 -72253 188401 429220 607792
10271 607792 722947 799640 867972 940745 997102 1000381 967035 954903 950296 863669 681963
10260 681963 510697 445679 494807 602307 681153 653208 502148 276969 22536 -247735
10250 -247735 -497886 -630869 -579569 -392920 -193993 -86057 -54383 36562 301312 715885
10240 715885 1118858 1307796 1237107 1049946 873174 706259 514743 275483 -28299 -327541
10230 -327541 -479632 -392569 -105090 262000 602664 839908 940391 988219 1111884 1326400
10220 1326400 1561605 1751041 1860150 1877022 1831453 1777142 1750471 1773346 1854464 1972761
10210 1972761 2096325 2180481 2165486 2034571 1816067 1518727 1150586 775910 446572 178900
10200 178900 16533 -18041 31838 87265 91763 96889 191154 343003 433721 347181 40819
10189 40819 -355408 -685971 -934840 -1141015 -1324648 -1472522 -1516685 -1385795 -1119830 -844313
10179 -844313 -631726 -479212 -377322 -291464 -158504 20639 160301 197951 197519 305382
10169 305382 569267 910620 1221894 1408146 1384141 1110455 678189 260132 -4147 -17159
10159 -17159 218995 532681 708122 637575 311582 -208090 -786654 -1287226 -1616074 -1674164
10149 -1674164 -1424545 -1007902 -675283 -626115 -883198 -1312495 -1732345 -2034019 -2190806 -2200173
10139 -2200173 -2129876 -2075907 -2036550 -1948581 -1795588 -1620202 -1496617 -1482458 -1570924 -1703804
10129 -1703804 -1801681 -1792076 -1637108 -1334727 -906648 -388248 144351 572695 785345 742682
10119 742682 504926 198724 -72196 -268950 -351008 -301595 -158918 33453 235952 381865
10109 381865 416141 355264 229746 9775 -295243 -542669 -578312 -390379 -83595 231994
10099 231994 516751 804038 1120209 1445342 1764900 2066380 2271130 2288376 2106863 1797802
10089 1797802 1455785 1117573 763942 411397 109645 -105175 -197381 -142412 50499 346500
10079 346500 695187 1050390 1382390 1662836 1908046 2173167 2425933 2538187 2431328 2122937
10069 2122937 1712374 1352641 1123759 991002 924625 939109 1006988 1046156 982733 796750
10059 796750 544741 356208 350234 522130 746043 887998 914122 861892 772444 695527 701218
$$ [...]
##END NTUPLES=NMR SPECTRUM
##END=
