##TITLE=31P ikalashn
LR-788-O-C1
22.10.2024
##JCAMPDX= 6.0         $$ Bruker NMR JCAMP-DX V2.0
##DATA TYPE= NMR SPECTRUM
##DATA CLASS= NTUPLES
##ORIGIN= UXNMR, Bruker Analytische Messtechnik GmbH
##OWNER= root
$$ TOPSPIN		Version 1.3
$$ 2024-10-22 09:30:00.187 +0400  Irina@DPX200
$$ Compression mode = diff/dup
##.OBSERVE FREQUENCY= 81.01967998063
##.OBSERVE NUCLEUS= ^31P
##.ACQUISITION MODE= SIMULTANEOUS
##.ACQUISITION SCHEME= undefined
##.AVERAGES= 32
##.DIGITISER RES= 17
##SPECTROMETER/DATA SYSTEM= spect
##.PULSE SEQUENCE= zgpg
##.SOLVENT NAME= D2O
##.SHIFT REFERENCE= INTERNAL, D2O, 1, 298.5841
##AUDIT TRAIL= $$ (NUMBER, WHEN, WHO, WHERE, WHAT)
$$ ##TITLE= Audit trail, TOPSPIN		Version 1.3
$$ ##JCAMPDX= 5.01
$$ ##ORIGIN= Bruker BioSpin GmbH
$$ ##OWNER= Irina
$$ $$ F:/spectra/data/iren/nmr/P31dec/1/pdata/1/auditp.txt
$$ ##AUDIT TRAIL=  $$ (NUMBER, WHEN, WHO, WHERE, VERSION, WHAT)
(   1,<2024-10-22 09:28:48.406 +0400>,<Irina>,<DPX200>,<TOPSPIN 1.3>,
      <acquisition in progress>)
(   2,<2024-10-22 09:29:43.125 +0400>,<Irina>,<DPX200>,<TOPSPIN 1.3>,
      <Start of raw data processing
       efp BC_mod = 2 LB = 10 FT_mod = 6 PKNL = 1 PHC0 = -4.025293 PHC1 = 394.7854 SI = 32K 
       data hash MD5: 32K
       86 5D 14 D0 49 9D 09 C6 3B 3D A8 DA DF FD 12 80>)
(   3,<2024-10-22 09:29:45.156 +0400>,<Irina>,<DPX200>,<TOPSPIN 1.3>,
      <apk 
       data hash MD5: 32K
       D5 06 0A C7 DC C0 96 10 EE B3 A4 49 E1 2D 01 C0>)
$$ ##END=
$$ 
$$ $$ hash MD5
$$ $$ 7E A9 C6 D4 53 EF 60 7E 05 39 B8 78 60 64 77 11
##$RELAX= 
##$RELAX= 
##$RELAX= 
##$RELAX= 
##$RELAX= 
##$RELAX= 
##$RELAX= 
##$RELAX= 
##$RELAX= 
##$RELAX= 
##$RELAX= 
$$ Bruker specific parameters
$$ --------------------------
##$DU= <F:/spectra>
##$EXPNO= 1
##$NAME= <P31dec>
##$PROCNO= 1
##$TYPE= <nmr>
##$USER= <iren>
##$AMP= (0..31)
100 100 100 100 100 100 100 100 100 100 100 100 100 100 100 100 100 100 
100 100 100 100 100 100 100 100 100 100 100 100 100 100 
##$ANAVPT= -1
##$AQSEQ= 0
##$AQ_mod= 1
##$AUNM= <au_zg>
##$AUTOPOS= <>
##$BF1= 81.014009
##$BF2= 200.13
##$BF3= 200.13
##$BF4= 200.13
##$BF5= 200.13
##$BF6= 200.13
##$BF7= 200.13
##$BF8= 200.13
##$BYTORDA= 1
##$CFDGTYP= 0
##$CFRGTYP= 5
##$CHEMSTR= <none>
##$CNST= (0..63)
1 1 145 1 1 1 1 1 1 1 1 1 1 1 1 1 1 1 1 1 1 1 1 1 1 1 1 1 1 1 1 1 1 1 
1 1 1 1 1 1 1 1 1 1 1 1 1 1 1 1 1 1 1 1 1 1 1 1 1 1 1 1 1 1 
##$CPDPRG= <waltz16>
##$CPDPRG1= <>
##$CPDPRG2= <waltz16>
##$CPDPRG3= <>
##$CPDPRG4= <mlev>
##$CPDPRG5= <mlev>
##$CPDPRG6= <mlev>
##$CPDPRG7= <mlev>
##$CPDPRG8= <mlev>
##$CPDPRGB= <>
##$CPDPRGT= <>
##$D= (0..63)
0 1 0 0 0 0 0 0 0 0.06 0 0.03 2e-005 3e-006 0 0 0.0002 0 0 0 0 0 0 0 0 
0 0 0 0 0 0 0 0 0 0 0 0 0 0 0 0 0 0 0 0 0 0 0 0 0 0 0 0 0 0 0 0 0 0 0 
0 0 0 0 
##$DATE= 1729574979
##$DBL= (0..7)
120 120 120 11 120 120 24 19 
##$DBP= (0..7)
150 150 150 150 150 150 150 150 
##$DBP07= 0
##$DBPNAM0= <>
##$DBPNAM1= <>
##$DBPNAM2= <>
##$DBPNAM3= <>
##$DBPNAM4= <>
##$DBPNAM5= <>
##$DBPNAM6= <>
##$DBPNAM7= <>
##$DBPOAL= (0..7)
$$ [...]
0 1 3 0 0 0 0 0 0 0 0 0 0 0 0 0 
##$SW_h= 37037.037037037
##$TD= 32768
##$TD0= 1
##$TE= 300
##$TE2= 300
##$TE3= 300
##$TEG= 300
##$TL= (0..7)
0 120 53 12 22 120 120 120 
##$TP= (0..7)
150 150 150 150 150 150 150 150 
##$TP07= 0
##$TPNAME0= <>
##$TPNAME1= <>
##$TPNAME2= <>
##$TPNAME3= <>
##$TPNAME4= <>
##$TPNAME5= <>
##$TPNAME6= <>
##$TPNAME7= <>
##$TPOAL= (0..7)
0.5 0.5 0.5 0.5 0.5 0.5 0.5 0.5 
##$TPOFFS= (0..7)
0 0 0 0 0 0 0 0 
##$TUNHIN= 0
##$TUNHOUT= 0
##$TUNXOUT= 0
##$USERA1= <user>
##$USERA2= <user>
##$USERA3= <user>
##$USERA4= <user>
##$USERA5= <user>
##$V9= 5
##$VALIST= <valist>
##$VCLIST= <CCCCCCCCCCCCCCC>
##$VD= 0
##$VDLIST= <DDDDDDDDDDDDDDD>
##$VPLIST= <PPPPPPPPPPPPPPP>
##$VTLIST= <TTTTTTTTTTTTTTT>
##$WBST= 1024
##$WBSW= 4
##$XGAIN= (0..3)
0 0 0 0 
##$XL= 0
##$YL= 0
##$YMAX_a= 1537
##$YMIN_a= -1322
##$ZGOPTNS= <>
##$ZL1= 120
##$ZL2= 120
##$ZL3= 120
##$ZL4= 120
##$ABSF1= 0
##$ABSF2= 0
##$ABSG= 0
##$ABSL= 0
##$ALPHA= 0
##$AQORDER= 0
##$ASSFAC= 0
##$ASSFACI= 0
##$ASSFACX= 0
##$ASSWID= 0
##$AUNMP= <proc_1d>
##$AXLEFT= 0
##$AXRIGHT= 0
##$AXTYPE= 0
##$AXUNIT= <>
##$AZFE= 0.1
##$AZFW= 0.5
##$BCFW= 0
##$BC_mod= 2
##$BYTORDP= 0
##$COROFFS= 0
##$CY= 12.5935478210449
##$DATMOD= 1
##$DC= 0
##$DFILT= <>
##$DTYPP= 0
##$F1P= 47.1127640792319
##$F2P= -24.0371245302204
##$FCOR= 0.5
##$FTSIZE= 32768
##$FT_mod= 6
##$GAMMA= 0
##$GB= 0
##$INTBC= 1
##$INTSCL= 7.269226e-011
##$ISEN= 30
##$LB= 10
##$LEV0= 0
##$LPBIN= 0
##$MAXI= 12.09355
##$MC2= 0
##$MEAN= 0
##$ME_mod= 0
##$MI= 0.7550151
##$NCOEF= 0
##$NC_proc= -11
##$NLEV= 6
##$NOISF1= 298.5841
##$NOISF2= 270.0111
##$NSP= 0
##$NTH_PI= 0
##$NZP= 0
##$OFFSET= 298.5841
##$PC= 1.4
##$PHC0= 36.77877
##$PHC1= 393.2469
##$PH_mod= 1
##$PKNL= yes
##$PPARMOD= 0
##$PPDIAG= 0
##$PPIPTYP= 0
##$PPMPNUM= 100
##$PPRESOL= 1
##$PSCAL= 0
##$PSIGN= 0
##$REVERSE= no
##$SF= 81.014009
##$SI= 32768
##$SIGF1= 270.0111
##$SIGF2= -158.5842
##$SINO= 77.54984
##$SIOLD= 32768
##$SREGLST= <31P.CDCl3>
##$SSB= 0
##$STSI= 32768
##$STSR= 0
##$SW_p= 37037.037037037
##$SYMM= 0
##$S_DEV= 0
##$TDeff= 32768
##$TDoff= 0
##$TI= <>
##$TILT= no
##$TM1= 0
##$TM2= 0
##$TOPLEV= 0
##$USERP1= <user>
##$USERP2= <user>
##$USERP3= <user>
##$USERP4= <user>
##$USERP5= <user>
##$WDW= 1
##$XDIM= 32768
##$YMAX_p= 302367682
##$YMIN_p= -5076866
$$ End of Bruker specific parameters
$$ ---------------------------------
##NTUPLES= NMR SPECTRUM
##VAR_NAME=  FREQUENCY,     SPECTRUM/REAL,   SPECTRUM/IMAG
##SYMBOL=    X,             R,               I
##VAR_TYPE=  INDEPENDENT,   DEPENDENT,       DEPENDENT
##VAR_FORM=  AFFN,          ASDF,            ASDF
##VAR_DIM=   32768,         32768,           32768
##UNITS=     HZ,            ARBITRARY UNITS, ARBITRARY UNITS
##FACTOR=    1.13031516577767, 1,            1
##FIRST=     37037.037037037, -1559813,      1168248
##LAST=      0,             1337579,         1270328
##MIN=       0,             -5076866,        0
##MAX=       37037.037037037, 302367682,     0
$$ Real data points
##PAGE= N=1
##DATA TABLE= (X++(R..R)), XYDATA
$$ [...]
$$ plain form
18031 2031977 2297948 2429304 2412070 2280710 2092847 1883633 1658055 1415972 1158850 894745
18021 894745 647283 458268 381982 456122 679121 1016234 1412767 1808684 2162765 2452987
18011 2452987 2639768 2662806 2491439 2156596 1725197 1259032 797666 363035 -30616 -373377
18001 -373377 -659015 -885833 -1061037 -1186186 -1248041 -1252212 -1232163 -1202363 -1135343 -992040 -760327
17990 -760327 -453314 -87695 301871 639051 832147 835427 678331 432355 162842 -88169
17980 -88169 -293760 -442428 -560329 -702378 -896819 -1119498 -1325466 -1480469 -1572113 -1621847
17970 -1621847 -1672105 -1734504 -1754104 -1645692 -1364930 -935460 -423642 96896 562937 927901
17960 927901 1162063 1246163 1175107 981323 739228 518001 355157 285437 350854 569212
$$ packed form
18031B031977K65971J31356j7234j31360j87863k09214k25578k42083k57122k64105
18021H94745k47462j89015p6286P4140K22999L37113L96533L95917L54081K90222
18011B452987J86781K3038j71367l34843m31399m66165m61366m34631l93651l42761
18001c73377k85638k26818j75204j25149o1855m171K0049K9800O7020J43303K31713
17990g60327L07013L65619L89566L37180J93096L280j57096k45976k69513k51011
17980h8169k05591j48668j17901j42049j94441k22679k05968j55003r1644m9734
17970a621847n0258o2399j9600J08412K80762M29470N11818N20538M66041L64964
17960I27901K34162Q4100p1056j93784k42095k21227j62844o9720O5417K18358
$$ plain form
17950 569212 905301 1287328 1646707 1938144 2150133 2308501 2458904 2641836 2872657 3125555
17940 3125555 3329615 3400587 3305217 3098247 2882382 2727124 2617747 2478769 2244058 1895831
17930 1895831 1470079 1049491 719936 509517 384098 302831 258488 266276 331253 435652
17920 435652 557866 687654 816402 928519 1007133 1043037 1055932 1090985 1162939 1231718 1244457
17909 1244457 1180437 1061210 939919 879644 916442 1021152 1107826 1087802 910598 578049
17899 578049 156366 -228113 -436798 -405045 -195513 62273 276303 432379 566525 710901
17889 710901 874036 1048738 1201119 1275351 1229503 1052962 765959 415433 47674 -322013
17879 -322013 -691067 -1033377 -1304208 -1463749 -1480854 -1342538 -1086309 -791396 -531255 -347838
$$ packed form
17950E69212L36089L82027L59379K91437K11989J58368J50403J82932K30821K52898
17940C125555K04060P0972r5370k06970k15865j55258j09377j38978k34711l48227
17930A895831m25752m20588l29555k10419j25419q1267m4343P788O4977J04399
17920D35652J22214J29788J28748J12117P8614L5904J2895L5053P1954O8779J2739
17909A244457o4020j19227j21291o0275L6798J04710Q6674k0024j77204l32549
17899E78049m21683l84479k08685L1753K09532K57786K14030J56076J34146J44376
17889G10901J63135J74702J52381P4232m5848j76541k87003l50526l67759l69687
17879c22013l69054l42310k70831j59541j7105J38316K56229K94913K60141J83417
$$ plain form
17869 -347838 -242856 -184738 -145037 -123135 -115806 -109305 -131489 -245522 -465449 -715987 -892346
17858 -892346 -935070 -843991 -678445 -551007 -547333 -646222 -749473 -776303 -724821 -653162 -623502
17847 -623502 -670501 -783003 -908481 -991886 -1003222 -940755 -831981 -713014 -605220 -529328
17837 -529328 -508955 -546302 -614453 -667564 -642348 -466529 -102044 414232 965090 1398731
17827 1398731 1619600 1627639 1465377 1169502 790710 420457 161570 80745 187953 439066
17817 439066 749773 1030946 1229810 1336311 1369335 1373427 1408276 1509086 1634540 1681526
17807 1681526 1596968 1439125 1312907 1287826 1366329 1498210 1616898 1669440 1640309 1543150
17797 1543150 1375731 1116749 773071 387786 42 -381616 -766401 -1156029 -1527521
$$ packed form
17869c47838J04982N8118L9701K1902P329O501k2184j14033k19927k50538j76359
17858h92346m2724R1079J65546J27438L674r8889j03251k6830N1482P1659K9660
17847f23502m6999j12502j25478q3405j1336O2467J08774J18967J07794P5892
17837e29328K0373l7347o8151n3111K5216J75819L64485N16276N50858M33641
17827A398731K20869Q039j62262k95875l78792l70253k58887q0825J07208K51113
17817D39066L10707K81173J98864J06501L3024M092L4849J00810J25454M6986
17807A681526q4558j57843j26218k5081P8503J31881J18688N2542k9131r7159
17797A543150j67419k58982l43678l85285l87744l81658l84785l89628l71492
$$ plain form
17788 -1527521 -1834654 -2036177 -2112223 -2060352 -1901293 -1677475 -1433278 -1210408 -1049998 -971340
17778 -971340 -956373 -967344 -967906 -936405 -877015 -814026 -769787 -741460 -712207 -687219 -688890 -723951
17766 -723951 -766558 -767853 -690088 -541878 -384057 -298766 -338946 -496869 -721308 -959599 -1190916
17755 -1190916 -1425463 -1671159 -1912080 -2121222 -2275742 -2371208 -2419620 -2422908 -2382336 -2332111
17745 -2332111 -2320798 -2359655 -2429850 -2528322 -2658153 -2780634 -2814752 -2704576 -2473055 -2195826
17735 -2195826 -1939469 -1726964 -1535836 -1315643 -1024028 -664372 -297106 -5433 162767
17726 162767 234517 297737 429120 631622 847341 1024266 1162075 1301933 1485792 1724611
17716 1724611 1985729 2202273 2314291 2309162 2201292 1989036 1672552 1294163 924699 616870
$$ packed form
17788a527521l07133k01523p6046N1871J59059K23818K44197K22870J60410P8658
17778i71340J4967j0971n62L1501N9390O2989M4239K8327K9253K4988j671l5061
17766g23951m2607j295P7765J48210J57821Q5291m0180j57923k24439k38291k31317
17755a190916k34547k45696k40921k09142j54520r5466m8412l288M0572N0225
17745b332111J1313l8857p0195r8472j29831j22481l4118J10176K31521K77229
17735b195826K56357K12505J91128K20193K91615L59656L67266K91673J68200
17726A62767P1750O3220J31383K02502K15719J76925J37809J39858J83859K38819
17716A724611K61118K16544J12018n129j07870k12256l16484l78389l69464l07829
$$ plain form
17706 616870 386467 223991 112860 38024 -15561 -55956 -79902 -89211 -90648 -73062 -14480
17695 -14480 88624 213579 328306 400563 394484 289444 105569 -107674 -302656 -453160
17685 -453160 -547469 -572035 -521464 -408476 -252463 -63857 156384 391895 609846 784717
17675 784717 906247 968910 956048 837883 593119 243842 -141753 -493779 -786425 -1049354
17665 -1049354 -1336689 -1670157 -2007290 -2263637 -2360831 -2260745 -1977048 -1559288 -1063462 -543401
17655 -543401 -66091 284392 439425 395182 236937 97389 74410 182792 364726 531450
17645 531450 616515 597660 473370 250424 -44671 -371187 -685068 -932667 -1052274 -997793
17635 -997793 -766810 -410646 -3569 399953 765880 1061398 1275318 1458103 1696074 2036582
$$ packed form
17706F16870k30403j62476j11131p4836n3585m0395k3946r309j437J7586N8582
17695a4480J03104J24955J14727P2257o079j05040j83875k13243j94982j50504
17685d53160r4309k4566N0571J12988J56013J88606K20241K35511K17951J74871
17675G84717J21530O2663j2862j18165k44764l49277l85595l52026k92646k62929
17665a049354k87335l33468l37133k56347r7194J00086K83697M17760M95826N20061
17655e43401M77310L50483J55033m4243j58245j39548k2979J08382J81934J66724
17645E31450Q5065j8855j24290k22946k95095l26516l13881k47599j19607N4481
17635i97793K30983L56164M07077M03522L65927K95518K13920J82785K37971L40508
$$ plain form
17625 2036582 2462146 2928551 3397620 3822035 4132262 4270727 4218966 3991036 3626341 3195378
17615 3195378 2792060 2503507 2379459 2408613 2517674 2612919 2644481 2626887 2598094 2579299
17605 2579299 2580866 2607308 2649795 2708391 2806308 2963566 3162904 3336537 3392894 3279108 3017878
17594 3017878 2681942 2349736 2069801 1832047 1578085 1246387 812183 304151 -202387
17585 -202387 -617356 -888054 -1026544 -1074826 -1050742 -943563 -755742 -525231 -300955 -107221
17575 -107221 50408 152564 161122 37818 -228952 -593571 -954168 -1205756 -1302911 -1283532
17565 -1283532 -1248562 -1301153 -1473130 -1709804 -1915345 -2001778 -1944257 -1800663 -1641007 -1470300
17555 -1470300 -1244064 -945795 -623939 -347814 -145278 4492 134394 263239 388714
$$ packed form
17625B036582M25564M66405M69069M24415L10227J38465n1761k27930l64695m30963
17615C195378m03318k88553j24048K9154J09061R5245L1562j7594k8793j8795
17605B579299J567K6442M2487N8596R7917J57258J99338J73633N6357j13786k61230
17594C017878l35936l32206k79935k37754k53962l31698m34204n08032n06538
17585b02387m14969k70698j38490m8282K4084J07179J87821K30511K24276J93734
17575a07221J57629J02156Q558j23304k66770l64619l60597k51588r7155J9379
17565a283532L4970n2591j71977k36674k05541q6433N7521J43594J59656J70707
17555a470300K26236K98269L21856K76125K02536J49770J29902J28845J25475
$$ plain form
17546 388714 489672 553582 608745 709148 885845 1122207 1371342 1583589 1712862 1727565
17536 1727565 1639971 1495423 1326610 1133872 889820 558382 133039 -327596 -716218 -956578
17526 -956578 -1061508 -1107633 -1172115 -1295487 -1489571 -1751704 -2061148 -2371869 -2619687 -2750476
17516 -2750476 -2741966 -2609763 -2406634 -2200649 -2038019 -1918461 -1800309 -1621347 -1327727 -915354
17506 -915354 -440864 14881 381414 614285 703986 672751 562647 419517 279074 175428
17496 175428 145582 205214 344017 551792 817321 1100723 1331791 1447155 1443394 1390534
17486 1390534 1379441 1443914 1527973 1536830 1428070 1244752 1051687 870091 692934 524309
17476 524309 382328 284731 251795 300966 412894 523037 564156 525169 474031 507595 661680
$$ packed form
17546C88714J00958O3910N5163J00403J76697K36362K49135K12247J29273J4703
17536A727565q7594j44548j68813j92738k44052l31438m25343m60635l88622k40360
17526i56578j04930m6125o4482j23372j94084k62133l09444l10721k47818j30789
17516b750476Q510J32203K03129K05985J62630J19558J18152J78962K93620M12373
17506i15354M74490M55745L66533K32871Q9701l1235j10104j43130j40443j03646
17496A75428k9846N9632J38803K07775K65529K83402K31068J15364l761n2860
17486A390534j1093O4473Q4059Q857j08760j83318j93065j81596j77157j68625
17476E24309j41981r7597l2936M9171J11928J10143M1119l8987n1138L3564J54085
$$ plain form
17465 661680 877485 1054965 1118292 1044134 852305 576890 258984 -59738 -358624 -632635
17455 -632635 -871358 -1065550 -1209210 -1281267 -1262547 -1182922 -1112946 -1095006 -1108949 -1120480 -1149757
17444 -1149757 -1248059 -1413571 -1583148 -1691703 -1714185 -1675215 -1616356 -1543542 -1422538 -1233521
17434 -1233521 -1006559 -784564 -583522 -403160 -238547 -66076 157375 454222 780991
17425 780991 1055631 1230805 1320473 1368486 1385925 1321448 1124553 814964 449261 52270
17415 52270 -385078 -865278 -1346138 -1737503 -1964640 -2035686 -2019810 -1984825 -1970437 -1981630 -2001620
17404 -2001620 -2021847 -2051034 -2096472 -2169402 -2297714 -2485983 -2664493 -2708065 -2531261 -2163770
17394 -2163770 -1731007 -1370780 -1165054 -1120331 -1182754 -1287233 -1413281 -1595445 -1869461 -2198079
$$ packed form
17465F61680K15805J77480O3327p4158j91829k75415l17906l18722k98886k74011
17455f32635k38723j94192j43660p2057J8720P9625O9976J7940j3943j1531k9277
17444a149757r8302j65512j69577j08555k2482L8970N8859P2814J21004J89017
17434a233521K26962K21995K01042J80362J64613J72471K23451K96847L26769
17425G80991K74640J75174Q9668M8013J7439o4477j96895l09589l65703l96991
17415E2270m37348m80200m80860l91365k27137p1046J5876L4985J4388j1193j9990
17404b001620k0227k9187m5438p2930j28312j88269j78510m3572J76804L67491
17394b163770M32763L60227K05726M4723o2423j04479j26048j82164k74016l28618
$$ plain form
17384 -2198079 -2475768 -2625705 -2648847 -2572324 -2403581 -2136612 -1779023 -1370780 -969166 -611083
17374 -611083 -306268 -71561 48560 2777 -217876 -556105 -933365 -1304129 -1653446 -1962207
17364 -1962207 -2188256 -2284614 -2244549 -2123315 -1988553 -1851715 -1664744 -1378376 -996550 -577047
17354 -577047 -189620 114938 301272 338855 217957 -24548 -316822 -589957 -795466 -900475
17344 -900475 -890985 -785832 -638874 -495023 -342222 -154599 35758 160031 188775 150083
17334 150083 94271 67132 97778 176469 250330 270429 233978 180661 156154 173221 206491
17323 206491 219477 188654 110901 4096 -109531 -231283 -381528 -561683 -735853 -861439
17313 -861439 -921529 -914216 -846038 -743205 -633120 -524299 -429561 -384220 -401546 -426922 -364038
$$ packed form
17384b198079k77689j49937k3142P6523J68743K66969L57589M08243M01614L58083
17374f11083L04815K34707J20121m5783k20653l38229l77260l70764l49317l08761
17364a962207k26049r6358M0065J21234J34762J36838J86971K86368L81826M19503
17354e77047L87427L04558J86334L7583j20898k42505k92274k73135k05509j05009
17344i00475R490J05153J46958J43851J52801J87623J90357J24273K8744l8692
17334A50083n5812k7139L0646P8691P3861K0099l6451n3317k4507J7067L3270
17323B06491J2986l0823p7753j06805j13627j21752j50245j80155j74170j25586
17313h61439o0090P313O8178J02833J10085J08821R4738M5341j7326k5376O2884
$$ plain form
17302 -364038 -147770 211532 646522 1073871 1414677 1606105 1629272 1521571 1336002 1104298
17292 1104298 858363 647135 504008 430186 411448 433704 493913 594126 710515 787816
17282 787816 796951 770357 747671 733832 734838 775810 867313 998109 1160354 1342523 1514848
17271 1514848 1650991 1748446 1822714 1899764 2009738 2162671 2331491 2475609 2570867 2595846
17261 2595846 2504555 2247550 1821065 1269963 646405 -16833 -696713 -1359330 -1948748 -2404859
17251 -2404859 -2696838 -2819517 -2764750 -2537566 -2203163 -1868547 -1608736 -1445936 -1374672 -1350357
17241 -1350357 -1294049 -1166018 -987729 -785931 -565278 -314228 -31008 254843 516697 771311
17231 771311 1040466 1282197 1400562 1332173 1099113 774603 424416 95211 -169041 -329202
$$ packed form
17302c64038K16268L59302M34990M27349L40806J91428K3167j07701j85569k31704
17292A104298k45935k11228j43127p3822j8738K2256O0209J00213J16389P7301
17282G87816R135k6594k2686j3839J006M0972R1503J30796J62245J82169J72325
17271A514848J36143R7455P4268P7050J09974J52933J68820J44118R5258K4979
17261B595846r1291k57005m26485n51102o23558o63238o79880o62617n89418m56111
17251b404859k91979j22679N4767K27184L34403L34616K59811J62800P1264K4315
17241a350357N6308J28031J78289K01798K20653K51050K83220K85851K61854K54614
17231G71311K69155K41731J18365o8389k33060l24510l50187l29205k64252j60161
$$ plain form
17221 -329202 -363220 -281600 -117804 100163 349603 589102 744771 741536 565005 286093
17211 286093 27863 -106917 -107762 -52988 -33019 -85245 -187855 -294125 -361286 -364036 -309831
17200 -309831 -234300 -157355 -48621 147905 459421 858969 1272967 1608398 1797501 1832710
17190 1832710 1754919 1595852 1347344 1001837 599139 219529 -54485 -175406 -161994 -91621
17180 -91621 -58431 -147060 -411109 -834386 -1329913 -1805325 -2213181 -2546507 -2817765 -3035527
17170 -3035527 -3172185 -3163798 -2980066 -2670777 -2323223 -1995761 -1700665 -1442490 -1232234 -1060541
17160 -1060541 -909476 -793598 -750266 -783770 -830521 -788533 -592809 -253569 163358 556940
17150 556940 812086 853242 686774 374831 -22782 -474356 -960796 -1444591 -1870618 -2204059
$$ packed form
17221c29202l4018Q1620J63796K17967K49440K39499J55669l235j76531k78912
17211B86093k58230j34780q45N4774J9969n2226j02610j06270o7161k750N4205
17200c09831P5531P6945J08734J96526L11516L99548M13998L35431J89103L5209
17190A832710p7791j59067k48508l45507m02698l79610k74014j20921J3412P0373
17180i1621L3190q8629k64049m23277m95527m75412m07856l33326k71258k17762
17170c035527j36658Q387J83732L09289L47554L27462K95096K58175K10256J71693
17160a060541J51065J15878M3332l3504m6751M1988J95724L39240M16927L93582
17150E56940K55146M1156j66468l11943l97613m51574m86440m83795m26027l33441
$$ plain form
17140 -2204059 -2447878 -2623594 -2740729 -2777110 -2696331 -2496094 -2218529 -1898932 -1528331 -1059334
17130 -1059334 -433032 366468 1261577 2103107 2753060 3137206 3250594 3137960 2852417
17121 2852417 2433754 1931972 1422976 971735 606770 351671 224239 191741 187825 174928
17111 174928 151844 121170 87854 67074 71268 103516 167960 271838 414542 581605 743508
17100 743508 865216 925592 928129 890954 829890 758361 697745 673776 685072 682009 601464 432413
17088 432413 224668 20994 -185837 -418132 -648608 -790724 -765268 -568556 -284335 -39596
17078 -39596 64761 -664 -204242 -482200 -744684 -895142 -886279 -756415 -594653 -470697
17068 -470697 -399754 -350872 -277360 -147363 43805 276760 522027 760645 999006 1251531
$$ packed form
17140b204059k43819j75716j17135l6381Q0779K00237K77565L19597L70601M68997
17130a059334O26302P99500Q95109Q41530O49953L84146J13388j12634k85543
17121B852417m18663n01782n08996m51241l64965k55099j27432l2498l916j2897
17111A74928k3084l0674l3316k0780M194L2248O4444J03878J42704J67063J61903
17100G43508J21708O0376K537l7175o1064p1529o0616k3969J1296l063q0545j69051
17088D32413k07745k03674k06831k32295k30476j42116K5456J96712K84221K44739
17078c9596J04357o5425k03578k77958k62484j50458Q863J29864J61762J23956
17068d70697P0943M8882P3512J29997J91168K32955K45267K38618K38361K52525
$$ plain form
17058 1251531 1511002 1751058 1956722 2150543 2380006 2673252 3016568 3364649 3658658
17049 3658658 3843237 3886813 3795620 3604684 3363136 3139309 3002687 2966081 2972873 2950100
17039 2950100 2852220 2671024 2422768 2105571 1673429 1105328 494583 -775 -303668 -472202
17029 -472202 -615676 -801473 -1025453 -1226081 -1343157 -1375748 -1355355 -1286147 -1147656 -924686
17019 -924686 -617958 -244247 166138 580273 992296 1429769 1890062 2291947 2531215 2564938
17009 2564938 2423416 2171780 1886300 1641519 1484674 1412886 1379955 1325957 1205321 1007547
16999 1007547 757723 501914 295575 179241 135625 94350 9431 -97790 -184528 -234936
16989 -234936 -259585 -271160 -262555 -211441 -92429 118284 413110 740712 1058877 1381771
$$ packed form
17058A251531K59471K40056K05664J93821K29463K93246L43316L48081K94009
17049C658658J84579M3576r1193j90936k41548k23827j36622l6606O792k2773
17039B950100r7880j81196k48256l17197m32142n68101o10745m95358l02893j68534
17029d72202j43474j85797k23980k00628j17076l2591K0393O9208J38491K22970
17019i24686L06728L73711M10385M14135M12023M37473M60293M01885K39268L3723
17009B564938j41522k51636k85480k44781j56845p1788l2931n3998j20636j97774
16999A007547k49824k55809k06339j16334m3616m1275q4919j07221q6738n0408
16989b34936k4649j1575Q605N1114J19012K10713K94826L27602L18165L22894
$$ plain form
16979 1381771 1739216 2091204 2325218 2345160 2136663 1750339 1251136 690896 120316 -399342
16969 -399342 -815940 -1097926 -1223872 -1185580 -1003655 -727452 -416458 -130960 74081 180949
16959 180949 238867 337234 537555 846250 1230031 1616813 1898376 1993997 1919316 1773599
16949 1773599 1669283 1672641 1786366 1962312 2137365 2285043 2441534 2670208 2997384 3379745
16939 3379745 3729460 3972252 4088343 4111503 4095518 4079580 4081178 4107825 4153726 4187007 4156105
16928 4156105 4006387 3713810 3313473 2882537 2495742 2193782 1972897 1788563 1588491
16919 1588491 1359526 1138960 966760 836271 720197 620867 556672 523895 506608 503823
16909 503823 530374 583744 620152 614165 620090 706856 860711 996755 1039937 980415 869708
$$ packed form
16979A381771L57445L51988K34014J9942k08497l86324m99203n60240n70580n19658
16969c99342m16598k81986j25946L8292J81925K76203L10994K85498K05041J06868
16959A80949N7918R8367K00321L08695L83781L86782K81563R5621p4681j45717
16949A773599j04316L358J13725J75946J75053J47678J56491K28674L27176L82361
16939C379745L49715K42792J16091K3160j5985j5938J598K6647M5901L3281l0902
16928D156105j49718k92577m00337m30936l86795l01960k20885j84334k00072
16919A588491k28965k20566j72200j30489j16074r9330o4195l2777j7287k785
16909E03823K6551N3370L6408n987N925Q6766J53855J36044M3182n9522j10707
$$ plain form
16898 869708 763644 686036 656831 704943 835722 1008240 1152654 1223855 1236032 1230454 1225957
16887 1225957 1217218 1215687 1267754 1408205 1622353 1870100 2118460 2339355 2498351 2570148
16877 2570148 2569236 2556563 2603816 2752044 2985629 3224943 3382868 3455527 3519822 3640593 3822698
16866 3822698 4025093 4194798 4310138 4382349 4406397 4332277 4099793 3702990 3221959 2779504
16856 2779504 2459961 2284761 2262640 2408253 2692440 3026735 3312554 3487776 3532990 3456231
16846 3456231 3285636 3063329 2835140 2634863 2463734 2290751 2089964 1862088 1613003
16837 1613003 1350599 1104100 902103 724538 526658 304861 85225 -121220 -298330
16828 -298330 -409539 -440193 -414500 -358538 -273647 -155546 -23440 77279 104783 71001 56703
$$ packed form
16898H69708j06064p7608k9205M8112J30779J72518J44414P1201J2177n578m497
16887A225957q739j531N2067J40451K14148K47747K48360K20895J58996P1797
16877B570148r12j2673M7253J48228K33585K39314J57925P2659O4295J20771J82105
16866C822698K02395J69705J15340P2211K4048p4120k32484l96803m81031m42455
16856B779504l19543j75200k2121J45613K84187L34295K85819J75222M5214p6759
16846C456231j70595k22307k28189k00277j71129j72983k00787k27876k49085
16837A613003k62404k46499k01997j77565j97880k21797k19636k06445j77110
16828b98330j11209l0654K5693N5962Q4891J18101J32106J00719K7504l3782j4298
$$ plain form
16817 56703 143365 331699 552985 755991 956376 1189554 1436905 1637590 1759470 1819167
16807 1819167 1842842 1831935 1769538 1649522 1488537 1316420 1160193 1025678 897755 749825
16797 749825 556124 317077 64265 -167589 -358923 -486093 -496309 -315055 107404 730813
16787 730813 1416648 2017137 2462360 2756942 2929266 2999882 2991889 2956888 2968872 3084032
16777 3084032 3304977 3576941 3830001 4042722 4244309 4450340 4630511 4734318 4725983 4600859
16767 4600859 4371890 4051422 3653200 3200445 2722486 2251537 1814628 1420779 1076822
16758 1076822 806604 627263 525587 490198 539422 683884 902231 1173025 1498696 1885333
16748 1885333 2301447 2675894 2958112 3158680 3304168 3392096 3413219 3368865 3250304 3029321
$$ packed form
16817E6703Q6662J88334K21286K03006K00385K33178K47351K00685J21880N9697
16807A819167K3675j0907o2397j20016j60985j72117j56227j34515j27923j47930
16797G49825j93701k39047k52812k31854j91334j27170j0216J81254M22459O23409
16787G30813O85835O00489M45223K94582J72324P0616p993l5001J1984J15160
16777C084032K20945K71964K53060K12721K01587K06031J80171J03807q335j25124
16767D600859k28969l20468l98222m52755m77959m70949m36909l93849l43957
16758A076822k70218j79341j01676l5389M9224J44462K18347K70794L25671L86637
16748A885333M16114L74447K82218K00568J45488Q7928K1123m4354j18561k20983
$$ plain form
16738 3029321 2692933 2288205 1913075 1650038 1513930 1468923 1476195 1510869 1554758 1588997
16728 1588997 1584292 1501525 1320864 1072808 829287 654337 560627 517510 481132 416040 327109
16717 327109 261921 254043 290470 341498 393903 451556 518067 583379 629054 645889 634460 588866
16705 588866 510851 443287 451390 550528 681242 772168 791414 740785 633478 467945 235667
16694 235667 -29865 -242261 -315971 -226738 -17971 242221 498767 721814 909997 1087533
16684 1087533 1291717 1563960 1937323 2398722 2860802 3199030 3333543 3274741 3094467 2864722
16674 2864722 2616375 2341310 2036790 1730115 1453482 1223046 1024425 800422 485155
16665 485155 64768 -402748 -812956 -1058473 -1079185 -884985 -539881 -139507 219370 483693
$$ packed form
16738C029321l36388m04728l75130k63037j36108m5007P272L4674M3889L4239
16728A588997m705q2767j80661k48056k43521j74950r3710m3117l6378o5092q8931
16717C27109o5188p878L6427N1028N2405N7653O6511O5312M5675J6835j1429m5594
16705E88866p8015o7564Q103R9138J30714R0926J9246n0629j07307j65533k32278
16694B35667k65532k12396p3710Q9233K08767K60192K56546K23047J88183J77536
16684A087533K04184K72243L73363M61399M62080L38228J34513n8802j80274k29745
16674B864722k48347k75065l04520l06675k76633k30436j98621k24003l15267
16665D85155m20387m67516m10208k45517k0712J94200L45104M00374L58877K64323
$$ plain form
16655 483693 667652 813570 937983 1041811 1148977 1285960 1429093 1515304 1502203 1386770
16645 1386770 1183379 908847 573803 188114 -223963 -632544 -1018774 -1368673 -1648452
16636 -1648452 -1806457 -1816796 -1696882 -1472970 -1164918 -811660 -483278 -257980 -181914 -242921
16626 -242921 -368861 -456035 -430449 -287718 -79319 118969 247416 304344 343944 418447
16616 418447 543504 716451 921996 1124216 1289710 1415212 1516743 1613932 1730152 1879091
16606 1879091 2042225 2168553 2197879 2103218 1927874 1759296 1651101 1588785 1524433 1424322
16596 1424322 1300294 1205711 1201032 1330262 1606054 1993660 2419801 2812783 3129083 3345528
16586 3345528 3457231 3481022 3434281 3318076 3139766 2927253 2703118 2472626 2248114 2048730
$$ packed form
16655D83693J83959J45918J24413J03828J07166J36983J43133Q6211j3101j15433
16645A386770k03391k74532l35044l85689m12077m08581l86230l49899k79779
16636a648452j58005j0339J19914K23912L08052L53258L28382K25298P6066o1007
16626b42921j25940q7174K5586J42731K08399J98288J28447N6928L9600P4503
16616D18447J25057J72947K05545K02220J65494J25502J01531R7189J16220J48939
16606A879091J63134J26328K9326r4661j75344j68578j08195o2316o4352j00111
16596A424322j24028r4583m679J29230K75792L87606M26141L92982L16300K16445
16586C345528J11703K3791m6741j16205j78310k12513k24135k30492k24512j99384
$$ plain form
16576 2048730 1880350 1750598 1682058 1694112 1787035 1943746 2133799 2323550 2490622 2617172
16566 2617172 2674111 2624278 2453584 2202046 1949642 1771782 1700342 1701497 1703623 1657092 1564878
16555 1564878 1465517 1391390 1342206 1308456 1298315 1312387 1317446 1275899 1190322 1103707 1063681
16544 1063681 1086892 1150048 1212529 1246742 1264943 1307376 1381924 1450554 1491561 1532013 1611470
16533 1611470 1740868 1885291 1973339 1936435 1754930 1474454 1165700 866797 590751 373292
16523 373292 271829 329440 543986 841972 1090938 1181273 1109114 959797 812270 674407
16513 674407 511268 309540 98595 -63377 -118011 -51895 88442 238515 357477 434054
16503 434054 470511 465224 417599 352624 314544 314211 303061 220982 64158 -105273 -214325
$$ packed form
16576B048730j68380j29752o8540J2054R2923J56711J90053J89751J67072J26550
16566B617172N6939m9833j70694k51538k52404j77860p1440J155K126m6531r2214
16555A564878r9361p4127m9184l3750j0141J4072N059m1547q5577q6615m0026
16544A063681K3211O3156O2481L4213J8201M2433P4548O8630M1007M0452P9457
16533A611470J29398J44423Q8048l6904j81505k80476l08754k98903k76046k17459
16523C73292j01463N7611K14546K97986K48966R0335p2159j49317j47527j37863
16513F74407j63139k01728k10945j61972n4634O6116J40337J50073J18962P6577
16503D34054L6457n287m7625o4975l8080l33j1150q2079j56824j69431j09052
$$ plain form
16492 -214325 -233825 -185162 -122072 -100052 -144406 -245526 -378138 -521397 -653811 -740564 -746832
16481 -746832 -663507 -505885 -292351 -35272 265626 616422 985207 1279562 1401789 1329259
16471 1329259 1134195 928955 784833 694539 597605 434034 182864 -160948 -636118 -1305858
16461 -1305858 -2176945 -3107805 -3808691 -4006496 -3651744 -2920924 -2047398 -1200471 -468634
16452 -468634 110639 533610 830012 1057768 1275049 1496904 1685742 1786671 1741778 1495898
16442 1495898 1047806 487407 -59085 -515343 -868660 -1138934 -1361923 -1564828 -1739925
16433 -1739925 -1854235 -1880432 -1815625 -1672892 -1458606 -1175150 -840292 -487736 -157037 119657
16423 119657 340434 534195 738337 983893 1279715 1590829 1844276 1979598 1980303 1854864
$$ packed form
16492b14325j9500M8663O3090K2020m4354j01120j32612j43259j32414q6753o268
16481g46832Q3325J57622K13534K57079L00898L50796L68785K94355J22227p2530
16471A329259j95064k05240j44122r0294r6934j63571k51170l43812m75170o69740
16461a305858q71087r30860p00886j97805L54752P30820Q73526Q46927P31837
16452d68634N79273M22971K96402K27756K17281K21855J88838J00929m4893k45880
16442A495898m48092n60399n46492m56258l53317k70274k22989k02905j75097
16433a739925j14310k6197O4807J42733K14286K83456L34858L52556L30699K76694
16423A19657K20777J93761K04142K45556K95822L11114K53447J35322P05j25439
$$ plain form
16413 1854864 1620588 1310527 967084 612269 254158 -75211 -333072 -515601 -670213
16404 -670213 -858869 -1106850 -1388978 -1661866 -1878322 -1988444 -1974351 -1872209 -1739814 -1596753
16394 -1596753 -1400211 -1088490 -647137 -146113 271225 450664 315566 -78797 -573931
16385 -573931 -1009429 -1303554 -1455188 -1528901 -1636151 -1861296 -2190989 -2537393 -2823026 -3019665
16375 -3019665 -3105346 -3032977 -2764970 -2320230 -1790095 -1314792 -1020614 -961099 -1122667 -1452440
16365 -1452440 -1852890 -2201784 -2421497 -2505300 -2474070 -2332794 -2062237 -1657007 -1166171 -669485
16355 -669485 -216427 193742 562272 853140 1032511 1118720 1163583 1206834 1264557 1328101
16345 1328101 1347531 1240877 966474 575198 170658 -154577 -353894 -444196 -468942 -433143
$$ packed form
16413A854864k34276l10061l43443l54815l58111l29369k57861j82529j54612
16404f70213j88656k47981k82128k72888k16456j10122J4093J02142J32395J43061
16394a596753J96542L11721M41353N01024M17338J79439j35098l94363m95134
16385e73931m35498k94125j51634p3713j07250k25145l29693l46404k85633j96639
16375c019665q5681P2369K68007M44740N30135M75303K94178N9515j61568l29773
16365a452440m00450l48894k19713q3803L1230J41276K70557M05230M90836M96686
16355f69485M53058M10169L68530K90868J79371Q6209M4863M3251N7723O3544
16345A328101J9430j06654k74403l91276m04540l25235j99317r0302k4746L5799
$$ plain form
16335 -433143 -307143 -76653 230561 542764 763030 817113 706153 499074 265779 49935
16325 49935 -115447 -216445 -273312 -326743 -408262 -515929 -619661 -699161 -779411 -932760 -1250086
16314 -1250086 -1802362 -2603736 -3567738 -4466234 -4967680 -4828841 -4142920 -3287969 -2570906
16305 -2570906 -2063730 -1725279 -1513378 -1390066 -1308911 -1237755 -1180491 -1155652 -1154009 -1132824 -1059267
16294 -1059267 -945046 -822018 -693862 -533200 -322437 -70231 205111 478422 723639
16285 723639 926937 1077329 1168276 1223676 1285147 1360359 1419030 1432052 1384171 1272782 1121927
16274 1121927 974432 847881 710195 525930 324636 196509 210297 341528 493469 585874
16264 585874 613630 638318 752473 1026183 1441872 1890302 2239369 2393595 2327162 2098581
$$ packed form
16335d33143J26000K30490L07214L12203K20266N4083j10960k07079k33295k15844
16325D9935j65382j00998n6867n3431q1519j07667j03732p9500q0250j53349l17326
16314a250086n52276q01374r64002q98496n01446J38839O85921Q54951P17063
16305b570906N07176L38451K11901J23312Q1155P1156N7264K4839J643K1185P3557
16294a059267J14221J23028J28156J60662K10763K52206K75342K73311K45217
16285G23639K03298J50392R0947N5400O1471P5212N8671J3022m7881j11389j50855
16274A121927j47495j26551j37686j84265k01294j28127J3788J31231J51941R2405
16264E85874K7756K4688J14155K73710M15689M48430L49067J54226o6433k28581
$$ plain form
16254 2098581 1818557 1596599 1509810 1584160 1789944 2079738 2425688 2814005 3228420 3650623
16244 3650623 4053730 4379593 4533767 4426933 4041497 3466337 2859857 2360126 2008353
16235 2008353 1747319 1507220 1283835 1122246 1050429 1041818 1029718 955440 813989 662922
16225 662922 588988 663081 909697 1294859 1730887 2111591 2355257 2420714 2318360 2117399
16215 2117399 1912069 1764401 1692529 1696923 1764782 1869721 1995106 2141406 2296958 2427794
16205 2427794 2509545 2535638 2491343 2353327 2131085 1889562 1709546 1622152 1577285 1485344
16195 1485344 1293192 1008902 681412 380698 166808 55399 16348 6750 16546 91281
16185 91281 299161 663277 1117154 1537115 1822099 1939668 1930606 1876313 1841618 1855772 1939227
$$ packed form
16254B098581k80024k21958q6789P4350K05784K89794L45950L88317M14415M22203
16244C650623M03107L25863J54174j06834l85436n75160o06480m99731l51773
16235B008353k61034k40099k23385j61589p1817q611j2100p4278j41451j51067
16225F62922p3934P4093K46616L85162M36028L80704K43666O5457j02354k00961
16215B117399k05330j47668p1872M394O7859J04939J25385J46300J55552J30836
16205B427794Q1751K6093m4295j38016k22242k41523j80016q7394m4867r1941
16195A485344j92152k84290l27490l00714k13890j11409l9051r598R796P4735
16185I1281K07880L64116M53877M19961K84984J17569r062n4293l4695J4154Q3455
$$ plain form
16174 1939227 2116166 2397932 2760871 3130510 3406918 3532427 3531620 3475101 3404681 3303172
16164 3303172 3145085 2942362 2720419 2490109 2261529 2061583 1918332 1815550 1693179
16155 1693179 1520615 1343837 1252407 1309154 1500755 1740383 1925594 2010613 2014088 1946848
16145 1946848 1748625 1342811 757350 137499 -361817 -669238 -808492 -850954 -870286 -926400
16135 -926400 -1045057 -1209178 -1387834 -1560964 -1723336 -1885656 -2063493 -2260120 -2455008 -2601012
16125 -2601012 -2633612 -2498368 -2195030 -1796015 -1407676 -1102117 -882520 -710520 -564758 -468358
16115 -468358 -448694 -485321 -525812 -536798 -509683 -434823 -287564 -39154 299429 660308 972984
16104 972984 1206538 1361459 1459291 1533457 1607904 1684121 1756021 1834712 1936833 2049829 2135563
$$ packed form
16174A939227J76939K81766L62939L69639K76408J25509q07n6519p0420j01509
16164C303172j58087k02723k21943k30310k28580j99946j43251j02782j22371
16155A693179j72564j76778r1430N6747J91601K39628J85211Q5019L475o7240
16145A946848j98223m05814n85461o19851m99316l07421j39254m2462j9332n6114
16135i26400j18657j64121j78656j73130j62372j62320j77837j96627j94888j46004
16125b601012l2600J35244L03338L99015L88339L05559K19597J72000J45762R6400
16115d68358J9664l6627m0491j0986K7115P4860J47259K48410L38583L60879L12676
16104I72984K33554J54921R7832P4166P4447P6217P1900P8691J02121J12996Q5734
$$ plain form
16093 2135563 2163982 2131653 2049476 1929364 1797520 1704993 1694114 1757188 1841883 1890944 1867928
16082 1867928 1757746 1571029 1335157 1072172 801521 544021 313379 129783 15767
16073 15767 -37913 -54116 -29176 42831 120380 130496 38585 -127769 -323386 -525621 -722498
16062 -722498 -882403 -962160 -948748 -870101 -749848 -567785 -285823 97617 530558 933520
16052 933520 1237189 1402450 1421073 1317050 1135645 913104 656153 347411 -31849 -488215
16042 -488215 -1004052 -1528747 -1998092 -2357301 -2568963 -2621199 -2533268 -2353421 -2146779 -1972306
16032 -1972306 -1860177 -1792791 -1702197 -1507690 -1184347 -802568 -486071 -312356 -253260 -212091
16022 -212091 -103330 98963 361317 616138 783788 798334 640651 344479 -21056 -360068
$$ packed form
16093B135563K8419l2329q2177j20112j31844r2527j0879O3074Q4695M9061k3016
16082A867928j10182j86717k35872k62985k70651k57500k30642j83596j14016
16073A5767n3680j6203K4940P2007P7549J0116r1911j66354j95617k02235j96877
16062g22498j59905p9757J3412P8647J20253J82063K81962L83440M32941M02962
16052I33520L03669J65261J8623j04023j81405k22541k56951l08742l79260m56366
16042d88215n15837n24695m69345l59209k11662n2236Q7931J79847K06642J74473
16032a972306J12129O7386R0594J94507L23343L81779L16497J73715N9096M1169
16022b12091J08761K02293K62354K54821J67650J4546j57683k96172l65535l39012
$$ plain form
16012 -360068 -569967 -582795 -397796 -73925 319122 734280 1133638 1470538 1709336 1844579
16002 1844579 1882496 1823120 1655820 1360918 942250 466894 63395 -133169 -48630 300655
15992 300655 808009 1321337 1724032 1972155 2074011 2055313 1935357 1736777 1503245 1283019
15982 1283019 1113106 1013795 969114 928908 860200 793736 808399 963603 1240257 1539198
15972 1539198 1738277 1770759 1648097 1424609 1177053 987904 902508 905696 943215 958068
15962 958068 927748 880203 869672 932323 1049039 1150090 1169765 1097213 972291 841705 731582
15951 731582 643730 554768 428799 261454 107897 46603 122951 325453 609767 931683
15941 931683 1249323 1515435 1694531 1777532 1766776 1671351 1521210 1361542 1225041 1114434
$$ packed form
16012c60068k09899j2828J84999L23871L93047M15158L99358L36900K38798J35243
16002A844579L7917n9376j67300k94902m18668m75356m03499j96564Q4539L49285
15992C00655N07354N13328M02695K48123J01856j8698j19956j98580k33532k20226
15982A283019j69913r9311m4681m0206o8708o6464J4663J55204K76654K98941
15972A539198J99079L2482j22662k23488k47556j89149q5396L188L7519J4853
15962I58068l0320m7545j0531O2651J16716J01051J9675p2552j24922j30586j10123
15951G31582q7852q8962j25969j67345j53557o1294P6348K02502K84314L21916
15941I31683L17640K66112J79096Q3001j0756r5425j50141j59668j36501j10607
$$ plain form
15931 1114434 1011940 904571 800113 721637 680330 645023 556726 388290 187639 53447
15921 53447 62922 227283 513539 870231 1207932 1403269 1364114 1084233 644125 168551
15911 168551 -223388 -430954 -376928 -52335 461429 1051475 1636414 2189315 2721601 3216688
15901 3216688 3592749 3755172 3669293 3369181 2933066 2478569 2129546 1951884 1933537 2024117
15891 2024117 2183177 2402525 2687438 3008790 3282381 3414325 3374100 3204985 2984165 2788016
15881 2788016 2660048 2587489 2505936 2353835 2131833 1889706 1654771 1406135 1135796 893879
15871 893879 763452 814911 1057527 1398995 1686942 1803547 1698566 1386551 955525 539816
15861 539816 254736 140289 148663 195419 233806 276854 352072 455750 564906 676805 809303
$$ packed form
15931A114434j02494j07369j04458p8476m1307l5307q8297j68436k00651j34192
15921E3447R475J64361K86256L56692L37701J95337l9155k79881m40108m75574
15911A68551l91939k07566N4026L24593N13764N90046N84939N52901N32286M95087
15901C216688L76061J62423q5879l00112m36115m54497l49023j77662j8347R0580
15891B024117J59060K19348K84913L21352K73591J31944m0225j69115k20820j96149
15881B788016j27968p2559q1553j52101k22002k42127k34935k48636k70339k41917
15871H93879j30427N1459K42616L41468K87947J16605j04981l12015m31026m15709
15861E39816k85080j14447Q374M6756L8387M3048P5218J03678J09156J11899J32498
$$ plain form
15850 809303 965802 1127238 1277806 1413408 1524191 1596030 1630075 1641132 1640670 1633838 1639260
15839 1639260 1700409 1843371 2020695 2127325 2072176 1833358 1460183 1018751 557458 134013
15829 134013 -175463 -327882 -347922 -294436 -208473 -94621 52397 204910 304922 310336
15819 310336 224516 107046 63217 191314 523451 1017572 1592189 2152903 2615119 2938589
15809 2938589 3148736 3307005 3435085 3497816 3466245 3342332 3147650 2927194 2725017 2544085
15799 2544085 2354639 2124453 1826084 1434941 946870 405986 -105301 -515953 -797524
15790 -797524 -935450 -910508 -726483 -408846 11259 475729 888245 1160986 1271292 1273354
15780 1273354 1260003 1300937 1400701 1504072 1529176 1408243 1132387 764539 407566 162080
$$ packed form
15850H09303J56499J61436J50568J35602J10783P1839L4045J1057m62o832N422
15839A639260O1149J42962J77324J06630n5149k38818l73175m41432m61293m23445
15829A34013l09476j52419k0040N3486Q5963J13852J47018J52513J00012N414
15819C10336q5820j17470m3829J28097L32137M94121N74617N60714M62216L23470
15809B938589K10147J58269J28080O2731l1571j23913j94682k20456k02177j80932
15799B544085j89446k30186k98369l91143m88071n40884n11287m10652k81571
15790g97524j37926K4942J84025L17637M20105M64470M12516K72741J10306K062
15780A273354j3351M0934R9764J03371K5104j20933k75856l67848l56973k45486
$$ plain form
15770 162080 97861 235763 544396 973151 1496051 2110107 2800478 3525202 4213023 4764695
15760 4764695 5093265 5178987 5064227 4802329 4443097 4041068 3636726 3253486 2911559 2621901
15750 2621901 2382785 2188531 2038056 1944815 1925417 1963572 2015384 2050304 2064793 2080587 2148720
15739 2148720 2319795 2588451 2884935 3132700 3288069 3320259 3216181 3020834 2819425 2659410
15729 2659410 2515458 2336244 2099871 1822138 1539620 1291021 1100578 977627 917865 892153
15719 892153 850794 765168 654542 547291 446591 358734 320030 362833 484384 669794
15709 669794 916854 1228928 1595907 1973493 2291262 2509111 2637828 2699736 2700708 2640352
15699 2640352 2541466 2447520 2374072 2289402 2168618 2036964 1929903 1843865 1752904 1651695
$$ packed form
15770A62080o4219J37902L08633M28755N22900O14056O90371P24724O87821N51672
15760D764695L28570Q5722j14760k61898l59232m02029m04342l83240l41927k89658
15750B621901k39116j94254j50475r3241j9398L8155N1812L4920J4489J5794O8133
15739B148720J71075K68656K96484K47765J55369L2190j04078j95347k01409j60015
15729B659410j43952j79214k36373k77733k82518k48599j90443j22951n9762k5712
15719H92153m1359q5626j10626j07251j00700q7857l8704M2803J21551J85410
15709F69794K47060L12074L66979L77586L17769K17849J28717O1908R72o0356
15699B640352r8886r3946p3448q4670j20784j31654j07061q6038r0961j01209
$$ plain form
15689 1651695 1574185 1571961 1666889 1827594 1990080 2099177 2127818 2061698 1899015 1682459
15679 1682459 1497465 1417048 1462566 1600590 1759036 1863614 1882023 1846428 1823541 1849714
15669 1849714 1908427 1962546 1991296 2007342 2028812 2029268 1949768 1771372 1551722 1381204 1314821
15658 1314821 1343052 1420165 1523967 1672771 1886569 2159215 2481976 2867449 3322294 3805126
15648 3805126 4237562 4566460 4801073 4991385 5180368 5361613 5485605 5516495 5463347 5345707
15638 5345707 5161445 4915171 4655918 4452252 4323291 4215442 4058017 3827584 3552422
15629 3552422 3286760 3101989 3065554 3200532 3486321 3892058 4380115 4890713 5344048 5644518
15619 5644518 5700631 5493030 5133000 4811930 4664832 4681608 4751898 4788463 4790586 4804221 4864601
$$ packed form
15689A651695p7510k224R4928J60705J62486J09097K8641o6120j62683k16556
15679A682459j84994q0417M5518J38024J58446J04578J8409l5595k2887K6173
15669A849714N8713N4119K8750J6046K1470M56p9500j78396k19650j70518o6383
15658A314821K8231P7113J03802J48804K13798K72646L22761L85473M54845M82832
15648C805126M32436L28898K34613J90312J88983J81245J23992L0890n3148j17640
15638E345707j84262k46274k59253k03666j28961j07849j57425k30433k75162
15629C552422k65662j84771l6435J34978K85789M05737M88057N10598M53335L00470
15619E644518N6113k07601l60030l21070j47098J6776P0290L6565K123J3635O0380
$$ plain form
15608 4864601 4971627 5086965 5162981 5184357 5166858 5127199 5072072 5000067 4905055 4790328 4679419
15597 4679419 4590480 4501298 4356757 4106428 3735469 3277736 2812526 2426973 2154925 1964831
15587 1964831 1810956 1674397 1554121 1440454 1312082 1158948 996866 857893 762998 699756
15577 699756 643515 607721 647074 803636 1074910 1430183 1824570 2194714 2468311 2599651
15567 2599651 2590519 2462357 2217329 1835974 1327311 782650 342129 92936 28465 102971
15557 102971 274475 486657 661913 740991 718101 640231 588930 638527 811111 1079583
15547 1079583 1396050 1698921 1922342 2029400 2029929 1969284 1897384 1834261 1762365 1656562 1527608
15536 1527608 1425672 1386108 1384814 1362865 1278066 1146691 1055257 1104206 1323503 1669477 2098982
$$ packed form
15608D864601J07026J15338P6016K1376j7499l9659n5127p2005r5012j14727j10909
15597D679419q8939q9182j44541k50329l70959m57733m65210l85553k72048j90094
15587A964831j53875j36559j20276j13667j28372j53134j62082j38973r4895o3242
15577F99756n6241l5794L9353J56562K71274L55273L94387L70144K73597J31340
15567B599651r132j28162k45028l81355n08663n44661m40521k49193o4471P4506
15557A02971J71504K12182J75256P9078k2890p7870n1301M9597J72584K68472
15547A079583L16467L02871K23421J07058N29o0645p1900o3123p1896j05803j28954
15536A527608j01936l9564j294k1949q4799j31375r1434M8949K19297L45974M29505
$$ plain form
15525 2098982 2596015 3122447 3607907 4005180 4316050 4560513 4740392 4835309 4815853 4656673
15515 4656673 4365897 4010017 3687108 3478791 3418223 3468470 3542314 3569780 3548116 3527843
15505 3527843 3558662 3659940 3836623 4089476 4388809 4661627 4835040 4887368 4844303 4767510
15495 4767510 4742789 4816552 4961053 5120396 5255587 5341763 5346866 5235547 4996462 4662200
15485 4662200 4303322 3995417 3793598 3717459 3729113 3744503 3690515 3547514 3338187 3082122
15475 3082122 2773951 2407748 2007569 1630483 1346580 1214530 1252578 1414638 1612443 1774691
15465 1774691 1878776 1941361 1984366 1993480 1928487 1804042 1744284 1907295 2346853 2976743
15455 2976743 3640689 4185968 4518163 4638222 4630210 4592932 4577507 4592077 4644436 4760024
$$ packed form
15525B098982M97033N26432M85460L97273L10870K44463J79879R4917j9456j59180
15515D656673k90776l55880l22909k08317o0568N0247P3844K7466k1664k0273
15505C527843L0819J01278J76683K52853K99333K72818J73413N2328m3065p6793
15495D767510k4721P3763J44501J59343J35191Q6176N103j11319k39085l34262
15485D662200l58878l07905k01819p6139J1654J5390n3988j43001k09327k56065
15475C082122l08171l66203m00179l77086k83903j32050L8048J62060J97805J62248
15465A774691J04085O2585M3005R114o4993j24445n9758J63011M39558O29890
15455B976743O63946N45279L32195J20059q012l7278j5425J4570N2359J15588
$$ plain form
15445 4760024 4949272 5168982 5347961 5440614 5451523 5439142 5493813 5676262 5961931 6258191
15435 6258191 6481932 6618278 6706002 6783711 6861150 6928075 6962867 6934406 6816581 6594512
15425 6594512 6281155 5945555 5678359 5510678 5372168 5134722 4705307 4084396 3360144
15416 3360144 2667426 2141547 1865888 1841916 2005851 2253793 2476247 2610010 2653701 2634083
15406 2634083 2563926 2431411 2238977 2040035 1911287 1899743 2010499 2229670 2529726 2862119
15396 2862119 3167733 3387987 3484539 3474033 3429989 3429495 3503504 3641692 3815829 3988983 4132374
15385 4132374 4241460 4316694 4347138 4341911 4351686 4442827 4650220 4941803 5243677 5516899 5788562
15374 5788562 6100503 6458612 6828628 7151296 7378841 7523426 7653091 7815224 7983221
$$ packed form
15445D760024J89248K19710J78979R2653J0909j2381N4671J82449K85669K96260
15435F258191K23741J36346Q7724P7709P7439O6925L4792k8461j17825k22069
15425F594512l13357l35600k67196j67681j38510k37446m29415o20911p24252
15416C360144o92718n25879k75659k3972J63935K47942K22454J33763M3691j9618
15406B634083p0157j32515j92434j98942j28748j1544J10756K19171L00056L32393
15396B862119L05614K20254R6552j0506m4044m94P4009J38188J74137J73154J43391
15385D132374J09086P5234L0444n227R775R1141K07393K91583L01874K73222K71663
15374E788562L11941L58109L70016L22668K27545J44585J29665J62133J67997
$$ plain form
15365 7983221 8105115 8186177 8287344 8451573 8670766 8914799 9164620 9414236 9655056 9880187
15355 9880187 10093209 10306381 10549766 10885809 11397702 12148705 13144005 14336983 15685426
15346 15685426 17180834 18807497 20489995 22074640 23363117 24195198 24511252 24334246
15338 24334246 23727889 22799342 21688156 20519576 19384523 18333058 17356591 16406795 15465050
15329 15465050 14586608 13859155 13335776 13027988 12938964 13070231 13399875 13879972 14461418
15320 14461418 15118638 15860791 16729810 17779404 19039778 20501159 22140477 23957758
15312 23957758 25971912 28186816 30571988 33064749 35565489 37914507 39870400 41152207
15304 41152207 41578464 41179108 40168071 38855241 37562201 36539473 35937369 35838399 36269294
$$ packed form
15365G983221J21894Q1062J01167J64229K19193K44033K49821K49616K40820K25131
15355I880187K13022K13172K43385L36043N11893P51003R95300J192978J348443
15346A5685426J495408J626663J682498J584645J288477Q32081L16054j77006
15338B4334246o06357r28547j111186j168580j135053j051465r76467r49796r41745
15329A5465050q78442p27453n23379l07788q9024J31267L29644M80097N81446
15320A4461418O57220P42153Q69019J049594J260374J461381J639318J817281
15312B3957758K014154K214904K385172K492761K500740K349018J955893J281807
15304D1152207M26257l99356j011037j312830j293040j022728o02104r8970M30895
$$ plain form
15295 36269294 37174409 38396445 39677503 40699685 41199723 41111914 40613842 40016734 39610487
15286 39610487 39599395 40107254 41165318 42699531 44543384 46435144 48006337 48845067 48653026
15277 48653026 47379127 45219793 42506633 39580970 36718007 34086482 31749115 29715885
15269 29715885 27983243 26532681 25331573 24335543 23496125 22772192 22098995 21354811 20433505
15260 20433505 19354740 18260332 17305453 16555077 15983424 15554762 15268745 15127695 15096106
15251 15096106 15113982 15149340 15243493 15500706 16009845 16769006 17688258 18648918 19552992 20339848
15241 20339848 20972774 21412683 21619925 21583221 21327732 20901812 20377954 19851659 19410702
15232 19410702 19091188 18868972 18710362 18623777 18649059 18809966 19083492 19415135 19754660 20066616
$$ packed form
15295C6269294R05115J222036J281058J022182N00038q7809m98072n97108m06247
15286C9610487j1092N07859J058064J534213J843853J891760J571193Q38730j92041
15277D8653026j273899k159334k713160k925663k862963k631525k337367k033230
15269B9715885j732642j450562j201108r96030q39418p23933o73197p44184r21306
15260B0433505j078765j094408r54879p50376n71653m28662k86017j41050l1589
15251A5096106J7876L5358R4153K57213N09139P59161R19252R60660R04074P86856
15241B0339848O32926M39909K07242l6704k55489m25920n23858n26295m40957
15232A9410702l19514k22216j58610q6585K5282J60907K73526L31643L39525L11956
$$ plain form
15222 20066616 20331891 20551890 20751869 20998059 21369912 21864329 22379265 22817405 23165652
15213 23165652 23480520 23830735 24261764 24798185 25448704 26212206 27101204 28140099 29320808
15204 29320808 30581887 31873726 33247945 34836305 36746884 39001062 41527307 44209535
15196 44209535 46973898 49819689 52778571 55882944 59170198 62679004 66409652 70292611
15188 70292611 74222830 78132982 82041693 86069466 90414825 95288866 100883207 107398834
15180 107398834 115047658 124000206 134354567 146122671 159178228 173214146 187766627
15173 187766627 202263900 216070169 228515303 238925946 246705472 251450991 253054543
15166 253054543 251753918 248109257 242910867 237049626 231380314 226616615 223290664 221778829
$$ packed form
15222B0066616K65275K19999J99979K46190L71853M94417N14936M38140L48247
15213B3165652L14868L50215M31029N36421O50519P63502Q88998J038895J180709
15204B9320808J261079J291839J374219J588360J910579K254178K526245K682228
15196D4209535K764363K845791K958882L104373L287254L508806L730648L882959
15188G0292611L930219L910152L908711M027773M345359M874041N594341O515627
15180A07398834P648824Q952548J0354361J1768104J3055557J4035918J4552481
15173A87766627J4497273J3806269J2445134J0410643P779526M745519J603552
15166B53054543j300625l644661n198390n861241n669312m763699l325951j511835
$$ plain form
15158 221778829 222348330 225173834 230323808 237734652 247167945 258155706 269947478 281504733
15150 281504733 291586582 298910745 302367682 301262215 295488711 285533857 272301144 256868313
15142 256868313 240276964 223398847 206890297 191189930 176546353 163084083 150861268
15135 150861268 139895706 130170952 121626617 114154096 107608399 101833846 96690281 92066755
15127 92066755 87916751 84291298 81298308 79029377 77525597 76764046 76648837 77036818
15119 77036818 77784140 78779912 79966655 81330719 82855264 84484371 86131830 87721731
15111 87721731 89211663 90578059 91789838 92772719 93387311 93461152 92836927 91408347 89153704
15102 89153704 86145766 82526991 78467824 74126775 69634212 65087591 60549062 56075235
$$ packed form
15158B21778829N69501K825504N149974P410844R433293J0987761J1791772J1557255
15150B81504733J0081849P324163L456937j105467n773504r954854j3232713j5432831
15142B56868313j6591349j6878117j6508550j5700367j4643577j3462270j2222815
15135A50861268j0965562r724754q544335p472521o545697n774553n143565m623526
15127I2066755m150004l625453k992990k268931j503780p61551j15209L87981
15119G7036818P47322R95772J186743J364064J524545J629107J647459J589901
15111H7721731J489932J366396J211779R82881O14592P3841o24225j428580k254643
15102H9153704l007938l618775m059167m341049m492563m546621m538529m473827
$$ plain form
15094 56075235 51750577 47669494 43881265 40378710 37153576 34246006 31738389 29692269
15086 29692269 28088409 26842426 25865411 25085891 24436654 23855664 23291161 22707995 22115496
15077 22115496 21567998 21094034 20643417 20122036 19464683 18676221 17819121 16971216 16193794
15068 16193794 15538804 15063541 14799514 14698345 14635443 14487820 14197303 13769330 13235117
15059 13235117 12630075 11997321 11375881 10778951 10196328 9622276 9082584 8630870 8316924
15050 8316924 8148653 8081299 8055391 8036551 8014837 7974650 7877374 7684220 7393977 7045099
15040 7045099 6681303 6333241 6025558 5787223 5651692 5615925 5600799 5490354 5215017 4796427
15030 4796427 4326333 3905791 3585779 3340633 3101048 2831949 2561319 2331197 2169886
$$ packed form
15094E6075235m324658m081083l788229l502555l225134k907570k507617k046120
15086B9692269j603860j245983r77015p79520o49237n80990n64503n83166n92499
15077B2115496n47498m73964m50617n21381o57353p88462q57100q47905p77422
15068A6193794o54990m75263k64027j01169o2902j47623k90517m27973n34213
15059A3235117o05042o32754o21440n96930n82623n74052n39692m51714l13946
15050H316924j68271o7354k5908j8840k1714m0187r7276j93154k90243l48878
15040G045099l63796l48062l07683k38335j35531l5767j5126j10445k75337m18590
15030D796427m70094m20542l20012k45146k39585k69099k70630k30122j61311
$$ plain form
15021 2169886 2100980 2120757 2190240 2281702 2405758 2587251 2819473 3039603 3159499 3136035
15011 3136035 3007741 2857685 2763873 2785834 2943659 3175774 3362516 3418067 3342509 3210894
15001 3210894 3138899 3220262 3456142 3763945 4043530 4206544 4195884 4017319 3729467 3399258
14991 3399258 3074263 2783033 2553245 2430120 2457619 2627717 2881790 3165603 3453792 3731687
14981 3731687 3971173 4125042 4156597 4074647 3928876 3771279 3617735 3448324 3232496 2963507
14971 2963507 2671643 2382150 2088400 1769234 1405610 995470 583164 265905 133432
14962 133432 206317 444507 786364 1157440 1474595 1687232 1802713 1851885 1853772 1819854
14952 1819854 1766878 1721602 1719832 1797723 1964667 2174730 2355799 2478977 2564891 2620628 2619895
$$ packed form
15021B169886o8906J9777O9483R1462J24056J81493K32222K20130J19896k3464
15011C136035j28294j50056r3812K1961J57825K32115J86742N5551p5558j31615
15001C210894p1995Q1363K35880L07803K79585J63014j0660j78565k87852l30209
14991C399258l24995k91230k29788j23125K7499J70098K54073K83813K88189K77895
14981C731687K39486J53869L1555q1950j45771j57597j53544j69411k15828k68989
14971B963507k91864k89493k93750l19166l63624m10140m12306l17259j32473
14962A33432P2885K38190L41857L71076L17155K12637J15481M9172J887l3918
14952A819854n2976m5276j770P7891J66944K10063J81069J23178Q5914N5737p33
$$ plain form
14941 2619895 2556311 2470835 2402266 2340579 2266097 2206275 2208363 2285021 2404849 2502839 2504550
14930 2504550 2370918 2126637 1844662 1594332 1401641 1261369 1174003 1163419 1252636 1433868
14920 1433868 1680061 1974575 2308383 2651316 2953980 3188259 3360359 3470575 3483374 3346806
14910 3346806 3050344 2661430 2273403 1940538 1689916 1553173 1555162 1696631 1965208 2321199
14900 2321199 2666145 2875185 2876940 2691108 2412242 2160035 1997587 1893132 1788521 1688252
14890 1688252 1649376 1718414 1915914 2235067 2615011 2951034 3159764 3228632 3196373 3093173
14880 3093173 2922882 2695954 2443744 2203833 2022553 1959744 2057425 2304769 2628091 2918298
14870 2918298 3094445 3150971 3145274 3151508 3221010 3358543 3516267 3609371 3559808 3358071 3082147
$$ packed form
14941B619895o3584q5476o8569o1687p4482n9822K088P6658J19828R7990J711
14930B504550j33632k44281k81975k50330j92691j40272q7366j0584Q9217J81232
14920A433868K46193K94514L33808L42933L02664K34279J72100J10216J2799j36568
14910C346806k96462l88914l88027l32865k50622j36743J989J41469K68577L55991
14900B321199L44946K09040J755j85832k78866k52207j62448j04455j04611j00269
14890A688252l8876O9038J97500L19153L79944L36023K08730O8868l2259j03200
14880C093173j70291k26928k52210k39911j81280o2809R7681K47344L23322K90207
14870B918298J76147N6526n697O234O9502J37533J57724R3104m9563k01737k75924
$$ plain form
14859 3082147 2835104 2675218 2602262 2572111 2522416 2411576 2243885 2069638 1961110 1971071
14849 1971071 2102537 2302361 2492855 2622093 2677550 2659681 2561377 2380990 2140429 1867348
14839 1867348 1576053 1286357 1028396 810303 594730 336638 51788 -184626 -298929
14830 -298929 -257659 -74841 192021 458808 642509 692887 617469 485856 400367 425977
14820 425977 541292 673929 766345 790257 736891 630105 542758 583822 832148 1270218
14810 1270218 1802906 2327931 2774545 3110887 3345748 3511737 3630303 3703304 3732118 3732303
14800 3732303 3732748 3762939 3833825 3917158 3962658 3955728 3935892 3943514 3976620 4004236 3993047 3912139
14788 3912139 3735096 3470638 3176318 2915357 2708181 2543751 2421037 2345006 2290862 2214227
$$ packed form
14859C082147k47043j59886p2956l0151m9695j10840j67691j74247j08528R961
14849A971071J31466J99824J90494J29238N5457j7869r8304j80387k40561k73081
14839A867348k91295k89696k57961k18093k15573k58092k84850k36414j14303
14830b98929M1270J82818K66862K66787J83701N0378p5418j31613q5489K5610
14820D25977J15315J32637R2416K3912n3366j06786q7347M1064K48326M38070
14810A270218N32688N25025M46614L36342K34861J65989J18566P3001K8814J85
14800C732303M45L0191P0886Q3333M5500o930j9836P622L3106K7616j1189q0908
14788C912139j77043k64458k94320k60961k07176j64430j22714p6031n4144p6635
$$ plain form
14778 2214227 2101803 1981892 1887713 1833568 1825161 1862720 1911249 1900027 1790105 1613479 1423956
14767 1423956 1245349 1086276 970014 916549 903150 868217 768663 623295 494566 438330
14757 438330 475139 608624 842155 1154069 1482883 1757999 1936976 2022674 2062488 2113061
14747 2113061 2192950 2271210 2291891 2218146 2062755 1860831 1620631 1325327 961086 524016
14737 524016 29213 -466245 -872677 -1113178 -1155257 -1020120 -782802 -547063 -388682 -311125
14727 -311125 -250198 -121294 134339 519738 980186 1434294 1793011 1975450 1942100 1717491
14717 1717491 1393800 1091939 882750 754732 645458 490449 263786 -22751 -350412
14708 -350412 -698674 -1032184 -1316595 -1548139 -1741182 -1895989 -2007429 -2084994 -2136211 -2149546
$$ packed form
14778B214227j12424j19911r4179n4145q407L7559M8529j1222j09922j76626j89523
14767A423956j78607j59073j16262n3465j3399l4933r9554j45368j28729n6236
14757D38330L6809J33485K33531L11914L28814K75116J78977Q5698L9814N0573
14747B113061P9889P8260K0681p3745j55391k01924k40200k95304l64241m37070
14737E24016m94803m95458m06432k40501m2079J35137K37318K35739J58381P7557
14727c11125O0927J28904K55633L85399M60448M54108L58717J82439l3350k24609
14717A717491l23691l01861k09189j28018j09274j55009k26663k86537l27661
14708c50412l48262l33510k84411k31544j93043j54807j11440p7565n1217j3335
$$ plain form
14698 -2149546 -2101157 -1964001 -1721112 -1368584 -908164 -361841 220587 791116 1332529 1842863
14688 1842863 2294016 2638367 2844572 2888320 2741128 2416976 1998821 1591390 1275193 1094735
14678 1094735 1048216 1088631 1160964 1241691 1329179 1416303 1495002 1559262 1591748 1574928 1522457
14667 1522457 1472869 1440812 1395335 1295937 1138693 977718 903587 982699 1217701 1560477
14657 1560477 1925101 2201478 2305215 2226792 2044240 1879753 1825504 1907334 2098688 2346432
14647 2346432 2580118 2720658 2718286 2591005 2405437 2219346 2070733 2002810 2042539 2150300
14637 2150300 2241840 2276416 2292409 2362126 2531371 2808219 3190131 3665320 4196262 4729503
14627 4729503 5205381 5557304 5749299 5826406 5883618 5975597 6081315 6147561 6152986 6130355 6140186
$$ packed form
14698b149546M8389J37156K42889L52528M60420N46323N82428N70529N41413N10334
14688A842863M51153L44351K06205M3748j47192l24152m18155m07431l16197j80458
14678A094735m6519M0415P2333Q0727Q7488Q7124P8699O4260L2486j6820n2471
14667A522457m9588l2057m5477r9398j57244j60975p4131P9112K35002L42776
14657A560477L64624K76377J03737p8423j82552j64487n4249Q1830J91354K47744
14647B346432K33686J40540k372j27281j85568j86091j48613o7923L9729J07761
14637B150300R1540L4576J5993O9717J69245K76848L81912M75189N30942N33241
14627D729503M75878L51923J91995P7107N7212R1979J05718O6246N425k2631R831
$$ plain form
14616 6140186 6218811 6337417 6414628 6361045 6120222 5699234 5156632 4560815 3982250 3492526
14606 3492526 3130112 2879979 2706165 2595752 2569763 2666639 2892116 3170229 3373989 3414914
14596 3414914 3285270 3021462 2660917 2238919 1802284 1396907 1037009 706739 392350
14587 392350 111892 -73207 -98552 43913 298717 573919 774187 861677 900142 998617
14577 998617 1219108 1553395 1946153 2313551 2563479 2638938 2567051 2446432 2368125 2354908
14567 2354908 2371748 2387906 2418569 2493965 2596316 2653545 2596740 2404877 2109109 1782204
14557 1782204 1507531 1332929 1247142 1183035 1044549 768773 402219 104767 33151 215871
14547 215871 542951 849915 1024789 1068978 1059237 1056935 1070585 1082101 1062894 984241 861699
$$ packed form
14616F140186P8625J18606P7211n3583k40823m20988n42602n95817n78565m89724
14606C492526l62414k50133j73814j10413k5989R6876K25477K78113K03760M0925
14596C414914j29644k63808l60545m21998m36635m05377l59898l30270l14389
14587C92350k80458j85099k5345J42465K54804K75202K00268Q7490L8465R8475
14577I98617K20491L34287L92758L67398K49928P5459p1887j20619p8307j3217
14567B354908J6840J6158L0663P5396J02351N7229n6805j91863k95768l26905
14557A782204k74673j74602q5787o4107j38486k75776l66554k97452p1616J82720
14547B15871L27080L06964J74874M4189r741k302J3650J1516j9207p8653j22542
$$ plain form
14536 861699 773800 789017 884394 976919 1003655 944265 800333 574990 273228 -67494 -362522
14525 -362522 -526344 -538225 -462098 -403037 -451884 -661959 -1026395 -1456301 -1816799 -1999872
14515 -1999872 -1972602 -1776687 -1486491 -1164806 -840041 -502895 -140677 224216 547303 791486
14505 791486 931445 950097 843643 644012 430247 294206 293667 430898 662897 927832
14495 927832 1160510 1303152 1329762 1272044 1211180 1220555 1310435 1430261 1521112 1550460 1500659
14484 1500659 1381781 1253784 1179276 1161458 1151487 1100380 997072 861149 709482 553214
14474 553214 409496 276772 121382 -79612 -316551 -569015 -809475 -995921 -1107878 -1182474
14464 -1182474 -1276354 -1408962 -1576069 -1771779 -1968190 -2135864 -2281745 -2430955 -2587328 -2713844
$$ packed form
14536H61699q7899J5217R5377R2525K6736n9390j43932k25343l01762l40722k95028
14525c62522j63822j1881P6127N9061m8847k10075l64436m29906l60498j83073
14515a999872K7270J95915K90196L21685L24765L37146L62218L64893L23087K44183
14505G91486J39959J8652j06454j99631k13765j36041n39J37231K31999K64935
14495I27832K32678J42642K6610n7718o0864R375Q9880J19826R0851K9348m9801
14484A500659j18878j27997p4508j7818r971n1107j03308j35923j51667j56268
14474E53214j43718j32724j55390k00994k36939k52464k40460j86446j11957p4596
14464a182474r3880j32608j67107j95710j96411j67674j45881j49210j56373j26516
$$ plain form
14454 -2713844 -2747812 -2634242 -2350987 -1914675 -1366289 -757058 -153199 364182 721793 875801
14444 875801 826869 626249 353641 84950 -119041 -215914 -207015 -140662 -71126 -30042 -19868
14433 -19868 -12407 37653 168111 393607 701370 1053952 1397865 1670066 1808165 1781847
14423 1781847 1607119 1321942 977193 651347 438359 398272 526033 769175 1077340 1429298
14413 1429298 1810379 2201732 2581472 2893255 3053494 3026867 2863625 2656362 2472284 2302688
14403 2302688 2066555 1678957 1126261 486063 -117810 -586363 -887864 -1055422 -1153607 -1230592
14393 -1230592 -1294656 -1337346 -1366214 -1394281 -1409891 -1391292 -1349061 -1327769 -1368302 -1469123 -1579554
14382 -1579554 -1636949 -1609218 -1497842 -1320533 -1109241 -908177 -756004 -672641 -656435 -691516
$$ packed form
14454b713844l3968J13570K83255M36312N48386O09231O03859N17381L57611J54008
14444H75801m8932k00620k72608k68691k03991r6873Q899O6353O9536M1084J0174
14433a9868P461N0060J30458K25496L07763L52582L43913K72201J38099k6318
14423A781847j74728k85177l44749l25846k12988m0087J27761K43142L08165L51958
14413A429298L81081L91353L79740L11783J60239k6627j63242k07263j84078j69596
14403B302688k36133l87598n52696o40198o03873m68553l01501j67558r8185p6985
14393a230592o4064m2690k8868k8067j5610J8599M2231K1292m0533j00821j10431
14382a579554n7395K7731J11376J77309K11292K01064J52173Q3363J6206l5081
$$ plain form
14372 -691516 -767093 -868568 -931958 -842821 -520329 10291 636974 1234953 1742508 2182831
14362 2182831 2591609 2952650 3223617 3374643 3396234 3308620 3165945 3029785 2924497 2819053
14352 2819053 2655675 2393917 2048651 1695089 1424135 1298503 1333952 1486934 1664644 1771825
14342 1771825 1765636 1677282 1582384 1539063 1537130 1511474 1401046 1179313 861673 512610 215521
14331 215521 26548 -32045 34852 197173 417477 663952 906091 1112068 1248064 1300532
14321 1300532 1299316 1297117 1352392 1526529 1840038 2231624 2596102 2858160 2994948 3009934
14311 3009934 2916271 2736322 2490349 2187298 1837843 1472913 1139879 885591 748407 755243
14301 755243 901278 1131204 1373256 1597498 1827234 2109642 2481478 2932569 3382647 3697614
$$ packed form
14372f91516p5577j01475o3390Q9137L22492N30620O26683N97979N07555M40323
14362B182831M08778L61041K70967J51026K1591q7614j42675j36160j05288j05444
14352B819053j63378k61758l45266l53562k70954j25632L5449J52982J77710J07181
14342A771825o189q8354r4898m3321j933k5656j10428k21733l17640l49063k97089
14331B15521j88973n8593O6897J62321K20304K46475K42139K05977J35996N2468
14321A300532j216k199N5275J74137L13509L91586L64478K62058J36788J4986
14311C009934r3663j79949k45973l03051l49455l64930l33034k54288j37184O836
14301G55243J46035K29926K42052K24242K29736K82408L71836M51091M50078L14967
$$ plain form
14291 3697614 3764813 3577394 3237076 2889037 2646119 2544045 2565284 2675580 2819406 2914046
14281 2914046 2879153 2687107 2382629 2052308 1780427 1617218 1557918 1547994 1534118 1513458
14271 1513458 1521138 1580615 1676749 1759452 1769124 1666667 1433264 1068204 610647 143192 -231570
14260 -231570 -431727 -448715 -361541 -286515 -294697 -368390 -436042 -427592 -310969 -110154 136202
14249 136202 425278 771851 1171950 1599326 2013475 2370046 2650281 2882875 3124668 3420387
14239 3420387 3775533 4150987 4481042 4708703 4794390 4706118 4443122 4070172 3707936 3457972
14229 3457972 3339533 3314646 3346037 3413979 3484682 3493213 3391289 3192614 2955389 2744414
14219 2744414 2594968 2483648 2364636 2239840 2150264 2105461 2056117 1935755 1717253 1436582
$$ packed form
14291C697614O7199j87419l40318l48039k42918j02074K1239J10296J43826R4640
14281B914046l4893j92046l04478l30321k71881j63209n9300r924j3876k0660
14271A513458P680N9477R6134Q2703R672j02457k33403l65060m57557m67455l74762
14260b31570k00157j6988Q7174P5026q182p3693o7652Q450J16623K00815K46356
14249A36202K89076L46573M00099M27376M14149L56571K80235K32594K41793K95719
14239C420387L55146L75454L30055K27661Q5687q8272k62996l72950l62236k49964
14229C457972j18439k4887L1391O7942P0703Q531j01924j98675k37225k10975
14219B744414j49446j11320j19012j24796q9576m4803m9344j20362k18502k80671
$$ plain form
14209 1436582 1171298 1000033 965325 1068069 1290607 1592397 1905688 2182722 2429416 2669015
14199 2669015 2888702 3025087 3001884 2805246 2521464 2284637 2189308 2245797 2413133 2658386
14189 2658386 2961873 3287875 3577871 3759893 3766464 3571355 3224669 2835712 2499536 2248997
14179 2248997 2067517 1908939 1726109 1528298 1382051 1334117 1372894 1463755 1580515 1698799
14169 1698799 1787904 1819898 1778410 1671730 1537286 1404478 1263666 1091392 884901 658062
14159 658062 428902 231950 131262 180465 360754 591949 805505 986663 1141444 1252897
14149 1252897 1294719 1267407 1206191 1146807 1089859 1012894 894146 723248 515263 308921
14139 308921 135774 -4095 -120291 -189572 -168470 -58481 67426 121575 64424 -90586
$$ packed form
14209A436582k65284j71265l4708J02744K22538L01790L13291K77034K46694K39599
14199B669015K19687J36385k3203j96638k83782k36827r5329N6489J67336K45253
14189B658386L03487L26002K89996J82022O571j95109l46686l88957l36176k50539
14179B248997j81480j58578j82830j97811j46247m7934L8777R0861J16760J18284
14169A698799Q9105L1994m1488j06680j34444j32808j40812j72274k06491k26839
14159F58062k29160j96952j00688M9203J80289K31195K13556J81158J54781J11453
14149A252897M1822k7312o1216n9384n6948p6965j18748j70898k07985k06342
14139C08921j73147j39869j16196o9281K1102J09989J25907N4149n7151j55010
$$ plain form
14129 -90586 -288864 -442936 -467520 -325611 -30066 387434 874554 1347126 1720746 1956303
14119 1956303 2072032 2123453 2176669 2275158 2403838 2491275 2471671 2333013 2090136 1754505
14109 1754505 1360571 976504 662248 440864 306930 240704 213447 201657 195450 178852
14099 178852 134140 79409 76823 182390 399640 683531 954020 1121277 1140254 1033496
14089 1033496 855707 652700 450968 261864 96324 -11413 -8704 145146 447414 837456
14079 837456 1224952 1533050 1707985 1714595 1557136 1275234 900196 453522 -25470 -478426
14069 -478426 -852796 -1130569 -1335346 -1510798 -1689807 -1883789 -2100847 -2365907 -2697359 -3054101
14059 -3054101 -3331816 -3441337 -3386376 -3241817 -3076662 -2934715 -2854431 -2862106 -2954146 -3097208
$$ packed form
14129i0586j98278j54072k4584J41909K95545M17500M87120M72572L73620K35557
14119A956303J15729N1421N3216R8489J28680Q7437j9604j38658k42877l35631
14109A754505l93934l84067l14256k21384j33934o6226k7257j1790o207j6598
14099A78852m4712n4731k586J05567K17250K83891K70489J67257J8977j06758
14089A033496j77789k03007k01732j89104j65540j07737K709J53850L02268L90042
14079H37456L87496L08098J74935O610j57459k81902l75038m46674m78992m52956
14069d78426l74370k77773k04777j75452j79009j93982k17058k65060l31452l56742
14059c054101k77715j09521N4961J44559J65155J41947Q0284p675r2040j43062
$$ plain form
14049 -3097208 -3240858 -3328146 -3317572 -3227287 -3135569 -3108204 -3141887 -3182189 -3169574 -3063577 -2855890
14038 -2855890 -2577958 -2292846 -2075110 -1972549 -1970575 -1998552 -1974401 -1853022 -1647445 -1392980
14028 -1392980 -1080552 -657662 -92867 578523 1258774 1837685 2242155 2441960 2440451 2278376
14018 2278376 2025377 1742068 1451821 1168210 929513 763982 635329 481133 309810
14009 309810 209057 249313 410232 600606 729460 762704 720835 648867 587447 542567 497691
13998 497691 441499 369720 280160 180423 100107 65010 61433 66456 103302 227457 469865
13987 469865 804784 1154501 1431117 1581547 1606257 1563276 1544425 1624985 1821890 2071755
13977 2071755 2251352 2258716 2089806 1827812 1565963 1356332 1192196 1000820 687971 235403
$$ packed form
14049c097208j43650q7288J0574R0285R1718K7365l3683m0302J2615J05997K07687
14038b855890K77932K85112K17736J02561J974k7977K4151J21379K05577K54465
14028a392980L12428M22890N64795O71390O80251N78911M04470J99805j509j62075
14018B278376k52999k83309k90247k83611k38697j65531j28653j54196j71323
14009C09810j00753M0256J60919J90374J28854L3244m1869p1968o1420m4880m4876
13998D97691n6192p1779q9560r9737q0316l5097l577N023L6846J24155K42408
13987D69865L34919L49717K76616J50430K4710m2981j8851Q0560J96905K49865
13977B071755J79597P364j68910k61994k61849k09631j64136j91376l12849m52568
$$ plain form
13967 235403 -248367 -595718 -700695 -581543 -351722 -150924 -76625 -130629 -226663 -263764
13957 -263764 -199245 -63974 78198 181079 248846 332460 476456 668052 836451 900768
13947 900768 833987 667128 441949 182816 -96492 -382767 -670383 -954539 -1207327 -1386996
13937 -1386996 -1472777 -1479782 -1451793 -1427962 -1404620 -1334072 -1160778 -871094 -509723 -139364 204311
13926 204311 512399 779944 996481 1152944 1245700 1272527 1220460 1055318 756376 365776
13916 365776 -21175 -298018 -386122 -273084 -19565 290677 610610 932543 1263255 1607776
13906 1607776 1943358 2219483 2404281 2511237 2571616 2609034 2649278 2721041 2818543 2878713
13896 2878713 2834338 2679207 2453794 2190746 1907514 1636888 1424100 1286881 1203910 1139551
$$ packed form
13967B35403m83770l47351j04977J19152K29821K00798P4299n4004r6034l7101
13957b63764O4519J35271J42172J02881O7767Q3614J43996J91596J68399O4317
13947I00768o6781j66859k25179k59133k79308k86275k87616k84156k52788j79669
13937a386996q5781p005K7989K3831K3342P0548J73294K89684L61371L70359L43675
13926B04311L08088K67545K16537J56463R2756K6827n2067j65142k98942l90600
13916C65776l86951k76843q8104J13038K53519L10242L19933L21933L30712L44521
13906A607776L35582K76125J84798J06956O0379L7418M0244P1763R7502O0170
13896B878713m4375j55131k25413k63048k83232k70626k12788j37219q2971o4359
$$ plain form
13886 1139551 1068191 990950 929541 893682 865118 825709 782894 759822 773471 819895 881939
13875 881939 962567 1084709 1238231 1371842 1451351 1504222 1593783 1735237 1840662 1772798
13865 1772798 1459404 941241 334809 -221552 -618098 -823536 -883849 -861696 -801122 -724378
13855 -724378 -615440 -439579 -191016 108367 443085 799625 1127415 1345413 1393307 1270966
13845 1270966 1028875 717140 352794 -56241 -462797 -765024 -850543 -666631 -265741 203867
13835 203867 589488 834344 972110 1041697 1039603 945963 776264 604704 524411 587997 786390
13824 786390 1062405 1345216 1587144 1767925 1880962 1936700 1962848 1979585 1977888 1934360 1844218
13813 1844218 1735903 1650091 1610238 1617247 1649032 1658009 1601848 1491655 1395314 1381007 1450024
$$ packed form
13886A139551p1360p7241o1409l5859k8564l9409m2815k3072J3649M6424O2044
13875H81939Q0628J22142J53522J33611P9509N2871Q9561J41454J05425o7864
13865A772798l13394n18163o06432n56361l96546k05438o0313K2153O0574P6744
13855g24378J08938J75861K48563K99383L34718L56540L27790K17998M7894j22341
13845A270966k42091l11735l64346m09035m06556l02227q5519J83912M00890M69608
13835B03867L85621K44856J37766O9587k094r3640j69699j71560q0293O3586J98393
13824G86390K76015K82811K41928J80781J13037N5738K6148J6737j697m3528r0142
13813A844218j08315q5812l9853P009L1785Q977n6161j10193r6341j4307O9017
$$ plain form
13802 1450024 1538838 1588856 1596787 1604722 1656595 1759766 1874958 1939176 1909532 1790870 1617184
13791 1617184 1422062 1225559 1034697 858353 712184 593015 462194 271342 -2119
13782 -2119 -336866 -669746 -924110 -1042912 -997839 -788768 -449553 -60897 273729 510052
13772 510052 686744 839808 943188 952547 854750 673655 478223 376387 462687 760923
13762 760923 1208987 1694841 2115842 2418883 2603622 2700170 2751834 2801704 2873878 2968676
13752 2968676 3068510 3140382 3153759 3102635 2999292 2849686 2648640 2408497 2167048 1940401
13742 1940401 1703962 1448822 1212783 1045208 979992 1036152 1217723 1489653 1761442 1945845
13732 1945845 2037754 2110841 2246065 2474844 2776517 3099767 3387988 3608562 3762365 3863664
$$ packed form
13802A450024Q8814N0018P931P935N1873J03171J15192O4218k9644j18662j73686
13791A617184j95122j96503j90862j76344j46169j19169j30821j90852k73461
13782b119l34747l32880k54364j18802M5073K09071L39215L88656L34626K36323
13772E10052J76692J53064J03380R359r7797j81095j95432j01836Q6300K98236
13762G60923M48064M85854M21001L03041J84739R6548N1664M9870P2174R4798
13752B968676R9834P1872J3377n1124j03343j49606k01046k40143k41449k26647
13742A940401k36439k55140k36039j67575o5216N6160J81571K71930K71789J84403
13732A945845R1909P3087J35224K28779L01673L23250K88221K20574J53803J01299
$$ plain form
13722 3863664 3914182 3880578 3689172 3278468 2672496 1981573 1331927 811124 463341 292491
13712 292491 252691 266703 290069 348269 499618 762928 1071132 1295788 1339482 1217758
13702 1217758 1033565 888733 843082 922935 1122858 1399526 1683161 1900796 2006133 2004065
13692 2004065 1939077 1843365 1713038 1541177 1335612 1097346 815226 495010 170233 -127511
13682 -127511 -382883 -578523 -701166 -772259 -850669 -996307 -1227651 -1510923 -1784547 -1991053
13672 -1991053 -2096801 -2101804 -2039835 -1954156 -1851373 -1687789 -1412758 -1010447 -502645 63470
13662 63470 628108 1133354 1536624 1816992 1958125 1924529 1669094 1184346 536739 -161129
13652 -161129 -793029 -1270074 -1552254 -1632096 -1501674 -1167684 -674388 -89492 518227 1088388
$$ packed form
13722C863664N0518l3604j91406m10704o05972o90923o49646n20803l47783j70850
13712B92491l9800J4012K3366N8200J51349K63310L08204K24656M3694j21724
13702A217758j84193j44832m5651P9853J99923K76668K83635K17635J05337k068
13692B004065o4988r5712j30327j71861k05565k38266k82120l20216l24777k97744
13682a27511k55372j95640j22643p1093p8410j45638k31344k83272k73624k06506
13672a991053j05748n003O1969Q5679J02783J63584K75031M02311N07802N66115
13662F3470N64638N05246M03270K80368J41133l3596k55435m84748o47607o97868
13652a61129o31900m77045k82180p9842J30422L33990M93296N84896O07719N70161
$$ plain form
13642 1088388 1570730 1949531 2260895 2547099 2807772 3011131 3134364 3185805 3197416 3196908
13632 3196908 3190548 3170916 3130357 3074173 3030669 3038907 3118626 3248512 3375782 3458590 3488312
13621 3488312 3473366 3422648 3344844 3254284 3166194 3085024 3009027 2941326 2883800 2815181 2697773
13610 2697773 2522168 2318598 2125288 1970487 1876848 1857930 1899096 1953030 1970633 1933157
13600 1933157 1845341 1716997 1556139 1381683 1238878 1164389 1137916 1101558 1020605 900996
13590 900996 763159 622281 491560 381880 286856 199356 139666 136434 192732 292592 429898
13579 429898 615358 860704 1160162 1476152 1743092 1888686 1863500 1669782 1346139 923058
13569 923058 431733 -58674 -455623 -698172 -797387 -820331 -814152 -756437 -608797 -388613
$$ packed form
13642A088388M82342L78801L11364K86204K60673K03359J23233N1441J1611n08
13632C196908o360j9632m0559n6184m3504Q238P9719J29886J27270Q2808K9722
13621C488312j4946n0718p7804r0560q8090q1170p5997o7701n7526o8619j17408
13610B697773j75605k03570j93310j54801r3639j8918M1166N3934J7603l7476
13600A933157q7816j28344j60858j74456j42805p4489k6473l6358q0953j19609
13590I00996j37837j40878j30721j09680r5024q7500n9690l232N6298R9860J37306
13579D29898J85460K45346K99458L15990K66940J45594k5186j93718l23643m23081
13569I23058m91325m90407l96949k42549r9215k2944O179N7715J47640K20184
$$ plain form
13559 -388613 -149099 90322 371597 752235 1230318 1734089 2176915 2499258 2688683 2789676
13549 2789676 2871971 2981011 3133739 3342902 3617842 3956083 4347848 4779628 5224638 5628794
13539 5628794 5919967 6033454 5930157 5620850 5182298 4717899 4293821 3935001 3670836
13530 3670836 3548826 3592864 3757922 3938530 4029485 3983650 3832654 3667884 3578647 3593954
13520 3593954 3684761 3805402 3923065 4021875 4096828 4157117 4230779 4336118 4457753 4565038
13510 4565038 4634866 4645222 4559584 4343508 4013261 3651024 3341702 3103137 2892263 2658630
13500 2658630 2388429 2118293 1907690 1800189 1802909 1870947 1922089 1894614 1792182 1676840
13490 1676840 1615089 1638864 1753726 1935391 2111103 2189148 2126843 1964293 1798522 1732319
$$ packed form
13559c88613K39514K39421K81275L80638M78083N03771M42826L22343J89425J00993
13549B789676Q2295J09040J52728K09163K74940L38241L91765M31780M45010M04156
13539E628794K91173J13487j03297l09307m38552m64399m24078l58820k64165
13530C670836j22010M4038J65058J80608R0955m5835j50996j64770q9237J5307
13520C593954R0807J20641J17663R8810P4953O0289P3662J05339J21635J07285
13510D565038O9828J0356q5638k16076l30247l62237l09322k38565k10874k33633
13500B658630k70201k70136k10603j07501K720O8038N1142k7475j02432j15342
13490A676840o1751K3775J14862J81665J75712P8045o2305j62550j65771o6203
$$ plain form
13480 1732319 1808358 1960618 2050431 1973601 1735895 1429475 1157716 965836 824240 685475
13470 685475 544484 428734 360449 356844 428927 557982 695255 799368 865419 910832 945121
13459 945121 952197 914064 853927 824178 866081 995212 1194185 1402750 1535609 1536717 1409557
13448 1409557 1192676 925483 642758 396058 257758 286236 488076 824287 1234640 1643997
13438 1643997 1987622 2240822 2408323 2499083 2504411 2404830 2211976 1984704 1804089 1738644
13428 1738644 1802235 1938963 2069956 2147695 2156656 2098212 1989011 1854989 1734823 1679784
13418 1679784 1723411 1854270 2046145 2311690 2682326 3144410 3639921 4107059 4492583 4747522
13408 4747522 4820490 4665350 4281124 3738570 3134201 2518808 1902602 1309029 793659 427800
$$ packed form
13480A732319P6039J52260Q9813p6830k37706l06420k71759j91880j41596j38765
13470F85475j40991j15750o8285l605P2083J29055J37273J04113O6051M5413L4289
13459I45121P076l8133o0137k9749M1903J29131J98973K08565J32859J108j27160
13448A409557k16881k67193k82725k46700j38300K8478K01840L36211M10353M09357
13438A643997L43625K53200J67501R0760N328r9581j92854k27272j80615o5445
13428A738644O3591J36728J30993P7739Q961n8444j09201j34022j20166n5039
13418A679784M3627J30859J91875K65545L70636M62084M95511M67138L85524K54939
13408D747522P2968j55140l84226n42554o04369o15393o16206n93573n15370l65859
$$ plain form
13398 427800 256496 245213 291672 310127 281906 226819 158291 82643 28472 52508 203000
13387 203000 486306 864141 1261591 1580008 1722296 1645463 1396258 1075621 780666 582218
13377 582218 518986 582374 714070 839726 914826 946565 976221 1029948 1084959 1086046 986393
13366 986393 790207 568456 416274 389069 466430 560835 584096 508738 368576 232808
13356 232808 166161 188658 279581 411565 556108 663735 676755 578028 404317 214354
13346 214354 72211 41581 173293 488903 945098 1426401 1811869 2048680 2155441 2165926
13336 2165926 2093472 1946063 1745395 1531165 1358167 1262560 1219647 1158060 1016370 784788
13326 784788 501560 208987 -68001 -304543 -462482 -500084 -414938 -274381 -165598 -109374
$$ packed form
13398D27800j71304j1283M6459J8455k8221n5087o8528p5648n4171K4036J50492
13387B03000K83306L77835L97450L18417J42288p6833k49205l20637k94955j98448
13377E82218o3232O3388J31696J25656P5100L1739K9656N3727N5011J087r9653
13366I86393j96186k21751j52182k7205P7361R4405K3261p5358j40162j35768
13356B32808o6647K2497R0923J31984J44543J07627J3020r8727j73711j89963
13346B14354j42143l0630J31712L15610M56195M81303L85468K36811J06761J0485
13336B165926p2454j47409k00668k14230j72998r5607m2913o1587j41690k31582
13326G84788k83228k92573k76988k36542j57939l7602Q5146J40557J08783N6224
$$ plain form
13316 -109374 -44746 105690 371039 720334 1091170 1433884 1735834 2001468 2218070 2357800
13306 2357800 2418917 2447710 2501739 2600576 2726505 2859741 2984632 3072880 3093196 3024160 2847420
13295 2847420 2566474 2241127 1972950 1853042 1906569 2061519 2199550 2256963 2265873 2293209
13285 2293209 2353773 2414145 2450109 2448439 2390690 2274276 2132943 2029486 2030864 2179855 2472576
13274 2472576 2846254 3208327 3497708 3710424 3861602 3948765 3966782 3943700 3944550 4029351 4200533
13263 4200533 4401962 4582080 4736735 4881146 5011068 5107427 5152470 5123337 4997750 4787245
13253 4787245 4533645 4258971 3955324 3631948 3339618 3135724 3031198 2978353 2916383 2822136
13243 2822136 2713750 2621936 2568646 2568741 2627996 2712544 2732991 2592458 2258567 1788379 1283578
$$ packed form
13316a09374O4628J50436K65349L49295L70836L42714L01950K65634K16602J39730
13306B357800O1117K8793N4029R8837J25929J33236J24891Q8248K0316o9036j76740
13295B847420k80946l25347k68177j19908N3527J54950J38031N7413Q910K7336
13285B293209O0564O0372L5964j670n7749j16414j41333j03457J378J48991K92721
13274B472576L73678L62073K89381K12716J51178Q7163J8017k3082Q50Q4801J71182
13263D200533K01429J80118J54655J44411J29922R6359M5043k9133j25587k10505
13253D787245k53600k74674l03647l23376k92330k03894j04526n2845o1970r4247
13243B822136j08386r1814n3290R5N9255Q4548K0447j40533l33891m70188n04801
$$ plain form
13232 1283578 830009 481289 270209 201810 240137 332008 458808 646888 897666 1145278
13222 1145278 1321912 1420524 1472287 1498986 1505573 1497500 1487985 1491276 1523399 1603997 1735540 1888810
13210 1888810 2010908 2049863 1991849 1863200 1684971 1445931 1136976 795162 498342 322724
13200 322724 294634 376335 514989 684634 870084 1044358 1165631 1191540 1107725 942316
13190 942316 739499 530120 330936 149425 339 -75775 -35602 133961 415907 758157
13180 758157 1066793 1250105 1280332 1195337 1057251 933172 874997 877785 879755 822708 694288
13169 694288 506520 262883 -38677 -381083 -717057 -977310 -1095161 -1045360 -867049 -649268
13159 -649268 -467350 -317937 -142011 105097 412448 711753 901198 886604 657210 332867
$$ packed form
13232A283578m53569l48720k11080o8399L8327R1871J26800J88080K50778K47612
13222A145278J76634R8612N1763K6699O587q073r515L291L2123Q0598J31543J53270
13210A888810J22098L8955n8014j28649j78229k39040l08955l41814k96820j75618
13200C22724k8090Q1701J38654J69645J85450J74274J21273K5909q3815j65409
13190I42316k02817k09379j99184j81511j49086p6114M0173J69563K81946L42250
13180G58157L08636J83312L0227q4995j38086j24079n8175K788J970n7047j28420
13169F94288j87768k43637l01560l42406l35974k60253j17851M9801J78311K17781
13159f49268J81918J49413J75926K47108L07351K99305J89445j4594k29394l24343
$$ plain form
13149 332867 87821 15368 86977 212205 294486 261791 93461 -173296 -477310 -779703
13139 -779703 -1079114 -1382511 -1658656 -1846029 -1905531 -1841465 -1689668 -1502275 -1337981 -1239105
13129 -1239105 -1181014 -1083441 -892995 -609184 -250647 149167 526875 818745 1009725 1135558
13119 1135558 1248028 1382985 1539622 1702265 1877148 2061307 2203852 2238520 2139746 1943001
13109 1943001 1724253 1561424 1496964 1523312 1595676 1649869 1635270 1548721 1402978 1173647
13099 1173647 829808 410686 27719 -224610 -341595 -386557 -409191 -391776 -276310 -38491
13089 -38491 286625 637382 949150 1160961 1238819 1203989 1124149 1056888 985976 829176 520943
13078 520943 80258 -395419 -794550 -1050993 -1160680 -1176116 -1165467 -1142759 -1069211 -929973
$$ packed form
13149C32867k45046p2453P1609J25228Q2281l2695j68330k66757l04014l02393
13139g79703k99411l03397k76145j87373n9502O4066J51797J87393J64294R8876
13129a239105N8091R7573J90446K83811L58537L99814L77708K91870J90980J25833
13119A135558J12470J34957J56637J62643J74883J84159J42545L4668r8774j96745
13109A943001k18748j62829o4460K6348P2364N4193j4599q6549j45743k29331
13099A173647l43839m19122l82967k52329j16985m4962k2634J7415J15466K37819
13089c8491L25116L50757L11768K11811P7858l4830p9840o7261p0912j56800l08233
13078E20943m40685m75677l99131k56443j09687j5436J0649K2708P3548J39238
$$ plain form
13068 -929973 -770737 -649654 -582492 -544109 -498772 -438580 -395176 -402653 -463921 -551730 -630581
13057 -630581 -677374 -684089 -645354 -560218 -461507 -425853 -527237 -775570 -1101341 -1401297 -1603935
13046 -1603935 -1685102 -1643790 -1492632 -1261006 -998722 -772007 -628812 -554084 -485088 -372794
13036 -372794 -213423 -50277 45875 14610 -174023 -521638 -1007714 -1566932 -2072444 -2395790
13026 -2395790 -2490361 -2396395 -2166799 -1813494 -1337308 -765665 -136274 521213 1158560 1687749
13016 1687749 2019981 2115983 1998529 1741042 1428034 1115580 845721 669500 624573 692293
13006 692293 797028 864140 861760 789885 660320 484222 277157 74215 -95361 -238424
12996 -238424 -369253 -467281 -490190 -414501 -243299 -170 280644 570388 848855 1107915
$$ packed form
13068i29973J59236J21083O7162L8383M5337O0192M3404p477o1268q7809p8851
13057f30581m6793o715L8735Q5136R8711L5654j01384k48333l25771k99956k02638
13046a603935q1167M1312J51158K31626K62284K26715J43195P4728O8996J12294
13036c72794J59371J63146R6152l1265j88633l47615m86076n59218n05512l23346
13026b395790r4571R3966K29596L53305M76186N71643O29391O57487O37347N29189
13016A687749L32232R6002j17454k57487l13008l12454k69859j76221m4927O7720
13006F92293J04735O7112k380p1875j29565j76098k07065k02942j69576j43063
12996b38424j30829r8028k2909P5689J71202K43129K80814K89744K78467K59060
$$ plain form
12986 1107915 1354412 1590809 1790945 1912194 1948469 1959539 2023137 2166661 2350891 2498176
12976 2498176 2547276 2491158 2352686 2147437 1884775 1587208 1290936 1033371 849220 763590
12966 763590 758027 750772 642593 388865 40293 -284915 -493558 -578615 -578827 -510367 -369736
12955 -369736 -176729 29677 235027 455405 701211 962853 1218870 1443052 1621266 1756577
12945 1756577 1851661 1898885 1879751 1774556 1586295 1350760 1129154 987980 946669 939956
12935 939956 865465 670996 390195 120867 -16850 71412 412181 944358 1525402 1979949
12925 1979949 2184387 2111560 1803464 1338687 825722 380986 92848 -1140 70651 237545
12915 237545 447400 669493 854454 957088 981584 962972 923467 865313 789751 705988 624197
$$ packed form
12986A107915K46497K36397K00136J21249L6275J1070O3598J43524J84230J47285
12976B498176M9100n6118j38472k05249k62662k97567k96272k57565j84151q5630
12966G63590n563p255j08179k53728l48572l25208k08643q5057k12O8460J40631
12955c69736J93007K06406K05350K20378K45806K61642K56017K24182J78214J35311
12945A756577R5084M7224j9134j05195j88261k35535k21606j41174m1311o713
12935I39956p4491j94469k80801k69328j37717Q8262L40769N32177N81044M54547
12925A979949K04438p2827l08096m64777n12965m44736k88138r3988P1791J66894
12915B37545K09855K22093J84961J02634K4496j8612l9505n8154p5562q3763q1791
$$ plain form
12904 624197 546572 465766 370881 262722 170701 147175 226647 379335 530727 651612 800915
12893 800915 1052570 1403528 1772316 2065737 2238641 2310826 2337459 2357456 2375426 2385668
12883 2385668 2393555 2412036 2436269 2428137 2355490 2249277 2174875 2156998 2182120 2243463 2341993
12872 2341993 2462840 2575335 2651252 2672695 2640787 2579925 2508913 2421549 2302461 2131713
12862 2131713 1880619 1518312 1023775 424697 -165895 -597565 -784303 -741393 -531902 -200207
12852 -200207 239471 758182 1277378 1691986 1921640 1936542 1758132 1455586 1121589 825021
12842 825021 587183 396413 244408 156524 178576 328869 567656 824197 1060697 1296591
12832 1296591 1561622 1855602 2167578 2497852 2838079 3150303 3386922 3524775 3581402 3611557
$$ packed form
12904F24197p7625q0806r4885j08159r2021k3526P9472J52688J51392J20885J49303
12893H00915K51655L50958L68788K93421J72904P2185K6633J9997J7970J0242
12883B385668P887J8481K4233q132p2647j06213p4402j7877K5122O1343R8530
12872B341993J20847J12495P5917K1443l1908o0862p1012q7364j19088j70748
12862B131713k51094l62307m94537n99078n90592m31670j86738M2910K09491L31695
12852b00207M39678N18711N19196M14608K29654J4902j78410l02546l33997k96568
12842H25021k37838j90770j52005q7884K2052J50293K38787K56541K36500K35894
12832A296591K65031K93980L11976L30274L40227L12224K36619J37853N6627L0155
$$ plain form
12822 3611557 3680372 3826083 4035499 4250190 4404331 4460529 4414835 4294572 4156801 4049920
12812 4049920 3980661 3941284 3945929 4014662 4137719 4268497 4352346 4366248 4321759 4231073 4081041
12801 4081041 3854805 3580259 3334226 3187212 3159014 3222968 3322129 3368286 3258800 2929626
12791 2929626 2398963 1771357 1206697 860673 812546 1019113 1337914 1625140 1826680 1965538
12781 1965538 2063546 2111075 2096375 2026735 1919985 1794660 1668162 1563132 1508664 1531650
12771 1531650 1658700 1903837 2228539 2533442 2703535 2664297 2418487 2044050 1648708 1320294
12761 1320294 1106418 1018792 1041759 1140185 1276202 1413839 1518561 1572302 1590823 1628150
12751 1628150 1756920 2019418 2378928 2728382 2967016 3075286 3091250 3026055 2863108 2628813
$$ packed form
12822C611557O8815J45711K09416K14691J54141N6198m5694j20263j37771j06881
12812D049920o9259l9377M645O8733J23057J30778Q3849J3902m4489r0686j50032
12801D081041k26236k74546k46033j47014k8198O3954R9161M6157j09486l29174
12791B929626n30663o27606n64660l46024m8127K06567L18801K87226K01540J38858
12781A965538R8008M7529j4700o9640j06750j25325j26498j05030n4468K2986
12771A531650J27050K45137L24702L04903J70093l9238k45810l74437l95342l28414
12761A320294k13876q7626K2967R8426J36017J37637J04722N3741J8521L7327
12751A628150J28770K62498L59510L49454K38634J08270J5964o5195j62947k34295
$$ plain form
12741 2628813 2396664 2217926 2087755 1978296 1871496 1760362 1633166 1478776 1314365
12732 1314365 1178566 1094396 1051737 1018019 951598 822328 642520 463153 321768 208807
12722 208807 98495 -2802 -50092 5378 189838 500685 891578 1273991 1551352 1653910
12712 1653910 1567291 1346837 1087014 867720 731132 673825 631730 520455 313938 55577
12702 55577 -189055 -359966 -405116 -284050 17442 479685 1045129 1612708 2082857 2416697
12692 2416697 2617683 2696787 2682122 2613092 2508452 2354995 2126032 1800331 1371181 874157
12682 874157 394828 9723 -276811 -511747 -723747 -894170 -979768 -960695 -864097 -736051
12672 -736051 -602984 -462401 -289653 -56059 235267 538042 804674 1021258 1187340 1290471
$$ packed form
12741B628813k32149j78738j30171j09459j06800j11134j27196j54390j64411
12732A314365j35799q4170m2659l3718o6421j29270j79808j79367j41385j12961
12722B08807j10312j01297m7290N5470J84460L10847L90893L82413K77361J02558
12712A653910q6619k20454k59823k19294j36588n7307m2095j11275k06517k58361
12702E5577k44632j70911m5150J21066L01492M62243N65444N67579M70149L33840
12692B416697K00986P9104j4665o9030j04640j53457k28963l25701m29150m97024
12682H74157m79329l85105k86534k34936k12000j70423q5598J9073R6598J28046
12672g36051J33067J40583J72748K33594K91326L02775K66632K16584J66082J03131
$$ plain form
12662 1290471 1322225 1305604 1298536 1351148 1450421 1528509 1528352 1447161 1324794 1217688 1176250
12651 1176250 1213967 1297468 1379050 1433378 1462010 1472547 1464896 1443494 1402901 1297750 1085202
12640 1085202 800584 557651 477445 620268 961296 1411259 1863879 2245849 2532747 2733112
12630 2733112 2877755 2999247 3095187 3138183 3123589 3076130 3009011 2894215 2694609 2428422
12620 2428422 2180329 2044403 2070820 2249474 2507019 2734727 2847732 2805911 2598237 2258605
12610 2258605 1881252 1564606 1332464 1142359 958273 772398 583093 386201 168471
12601 168471 -81234 -351454 -623344 -897915 -1183351 -1459868 -1671669 -1759648 -1706288 -1545317
12591 -1545317 -1323486 -1064694 -771314 -448303 -123740 160985 376655 509925 542561 437065
$$ packed form
12662A290471L1754j6621p068N2612R9273P8088j57q1191j22367j07106m1438
12651A176250L7717Q3501Q1582N4328K8632J0537p651k1402m0593j05151k12548
12640A085202k84618k42933q0206J42823L41028M49963M52620L81970K86898K00365
12630B733112J44643J21492R5940M2996j4594m7459o7119j14796j99606k66187
12620B428422k48093j35926K6417J78654K57545K27708J13005m1821k07674l39632
12610B258605l77353l16646k32142j90105j84086j85875j89305j96892k17730
12601A68471k49705k70220k71890k74571k85436k76517k11801q7979N3360J60971
12591a545317K21831K58792K93380L23011L24563K84725K15670J33270L2636j05496
$$ plain form
12581 437065 159472 -266243 -733045 -1102107 -1296073 -1321791 -1214365 -1021882 -821160 -680826
12571 -680826 -609952 -554863 -443320 -240359 20986 251373 364759 344340 251956 176389
12561 176389 179588 292932 526702 857497 1218615 1522952 1713385 1800467 1836292 1837839 1768540
12550 1768540 1606971 1391491 1186944 1042691 984496 1027943 1181963 1436927 1759961 2104148
12540 2104148 2438677 2771118 3122530 3484475 3803709 4020072 4121589 4140932 4120037 4093753
12530 4093753 4073681 4042304 3975977 3881279 3809144 3816619 3906900 4016892 4065325 4012976 3867032
12519 3867032 3633994 3320296 2980276 2698358 2515531 2409871 2337209 2254151 2115829 1892089
12509 1892089 1575399 1172150 710030 240764 -175889 -488875 -677463 -772501 -825761 -848466
$$ packed form
12581D37065k77593m25715m66802l69062j93966k5718J07426J92483K00722J40334
12571f80826P0874N5089J11543K02961K61345K30387J13386k0419r2384p5567
12561A76389L199J13344K33770L30795L61118L04337J90433Q7082L5825J547o9299
12550A768540j61569k15480k04547j44253n8195M3447J54020K54964L23034L44187
12540B104148L34529L32441L51412L61945L19234K16363J01517J9343k0895k6284
12530D093753k0072l1377o6327r4698p2135P475R0281J09992M8433n2349j45944
12519C867032k33038l13698l40020k81918j82827j05660p2662q3058j38322k23740
12509A892089l16690m03249m62120m69266m16653l12986j88588r5038n3260k2705
$$ plain form
12499 -848466 -810692 -685422 -462596 -150701 213090 577609 909330 1202226 1474892 1751923
12489 1751923 2030550 2271390 2421857 2449614 2369140 2240920 2130861 2077462 2077485 2070632 1968935
12478 1968935 1719096 1327797 846473 344496 -117971 -505923 -807398 -1026546 -1162127
12469 -1162127 -1181645 -1052784 -799688 -496937 -208195 59660 339533 650089 960055 1209084
12459 1209084 1355206 1394525 1352195 1262282 1144073 1004073 846790 657742 405362 88391
12449 88391 -232007 -477048 -622044 -688343 -683057 -595320 -434479 -242869 -65883 97545
12439 97545 291486 541050 830007 1135876 1443061 1722406 1925886 2009566 1955011 1778809
12429 1778809 1532780 1281764 1073362 942575 943237 1131010 1492323 1920624 2291805 2549865
$$ packed form
12499h48466L7774J25270K22826L11895L63791L64519L31721K92896K72666K77031
12489A751923K78627K40840J50467K7757q0474j28220j10059n3399K3o853j01697
12478A968935k49839l91299m81324n01977m62467l87952l01475k19148j35581
12469a162127j9518J28861K53096L02751K88742K67855K79873L10556L09966K49029
12459A209084J46122L9319m2330q9913j18209j40000j57283j89048k52380l16971
12449H8391l20398k45041j44996o6299N286Q7737J60841J91610J76986J63428
12439I7545J93941K49564K88957L05869L07185K79345K03480Q3680n4555j76202
12429A778809k46029k51016k08402j30787O62J87773L61313M28301L71181K58060
$$ plain form
12419 2549865 2706116 2780415 2777143 2716653 2650766 2621670 2612902 2554882 2389696 2135267 1884234
12408 1884234 1745678 1786220 1986604 2233893 2401598 2444300 2375755 2183326 1817635 1256719
12398 1256719 553519 -189996 -886573 -1481920 -1912664 -2094822 -1993928 -1684691 -1303074
12389 -1303074 -949852 -656408 -404515 -144176 183070 608264 1108983 1611500 2034794
12380 2034794 2337751 2526305 2634091 2703538 2767477 2832059 2872657 2850743 2739691 2544127
12370 2544127 2295179 2028500 1781432 1593483 1486825 1466648 1541551 1707627 1930015 2172177
12360 2172177 2414761 2632048 2783545 2835252 2775769 2623065 2434600 2304014 2310974 2463623
12350 2463623 2695085 2904337 3014857 3000193 2872047 2664934 2413434 2131240 1812706 1462496
$$ packed form
12419B549865J56251P4299l272o0490o5887k9096q768n8020j65186k54429k51033
12408A884234j38556M0542K00384K47289J67705M2702o8545j92429l65691n60916
12398A256719p03200p43515o96577n95347m30744j82158J00894L09237L81617
12389a303074L53222K93444K51893K60339L27246M25194N00719N02517M23294
12380B034794L02957J88554J07786O9447O3939O4582M0598k1914j11052j95564
12370B544127k48948k66679k47068j87949j06658k0177P4903J66076K22388K42162
12360B172177K42584K17287J51497N1707n9483j52704j88465j30586O960J52649
12350B463623K31462K09252J10520j4664j28146k07113k51500k82194l18534l50210
$$ plain form
12340 1462496 1114947 822120 628378 544388 552248 636036 787036 978057 1164227 1307828
12330 1307828 1386586 1404537 1401494 1421893 1471819 1533920 1614043 1742053 1924354 2112276 2220193
12319 2220193 2187468 2036205 1853782 1717334 1628967 1521162 1333194 1068354 782499 539415
12309 539415 369520 260726 185001 117015 35554 -58237 -126063 -131540 -84415 -20646 33133
12298 33133 66914 87453 123739 218550 393886 626955 873019 1104691 1322467 1531729
12288 1531729 1720858 1861936 1914870 1849046 1685505 1500279 1380848 1379274 1481802 1613358
12278 1613358 1681055 1629130 1477834 1308527 1187497 1114842 1056395 996467 953569 967278 1061981
12267 1061981 1224496 1417714 1593235 1705731 1751461 1785550 1878747 2052311 2256542 2407700
$$ packed form
12340A462496l47549k92827j93742q3990P860Q3788J51000J91021J86170J43601
12330A307828P8758J7951l043K0399M9926O2101Q0123J28010J82301J87922J07917
12319B220193l2725j51263j82423j36448q8367j07805j87968k64840k85855k43084
12309E39415j69895j08794p5725o7986q1461r3791o7826n477M7125O3769N3779
12298C3133L3781K0539L6286R4811J75336K33069K46064K31672K17776K09262
12288A531729J89129J41078N2934o5824j63541j85226j19431j574J02528J31556
12278A613358O7697n1925j51296j69307j21030p2655n8447n9928m2898J3709R4703
12267A061981J62515J93218J75521J12496M5730L4089R3197J73564K04231J51158
$$ plain form
12257 2407700 2443300 2371881 2271509 2222509 2257571 2365814 2521373 2700535 2883386 3063881
12247 3063881 3257330 3477164 3695680 3854273 3911022 3858673 3717100 3515864 3272257 2985764
12237 2985764 2662482 2333767 2043055 1820659 1665101 1553126 1468715 1400567 1325438 1233565
$$ packed form
12257B407700L5600p1419j00372m9000L5062J08243J55559J79162J82851J80495
12247C063881J93449K19834K18516J58593N6749n2349j41573k01236k43607k86493
12237B985764l23282l28715k90712k22396j55558j11975q4411o8148p5129r1873
$$ [...]
##END NTUPLES=NMR SPECTRUM
##END=
