##TITLE=31P ikalashn
LR-787-OM-C1M
17.10.2024
##JCAMPDX= 6.0         $$ Bruker NMR JCAMP-DX V2.0
##DATA TYPE= NMR SPECTRUM
##DATA CLASS= NTUPLES
##ORIGIN= UXNMR, Bruker Analytische Messtechnik GmbH
##OWNER= root
$$ TOPSPIN		Version 1.3
$$ 2024-10-17 09:41:22.156 +0400  Irina@DPX200
$$ Compression mode = diff/dup
##.OBSERVE FREQUENCY= 81.01967998063
##.OBSERVE NUCLEUS= ^31P
##.ACQUISITION MODE= SIMULTANEOUS
##.ACQUISITION SCHEME= undefined
##.AVERAGES= 64
##.DIGITISER RES= 17
##SPECTROMETER/DATA SYSTEM= spect
##.PULSE SEQUENCE= zgpg
##.SOLVENT NAME= CDCl3
##.SHIFT REFERENCE= INTERNAL, CDCl3, 1, 298.5841
##AUDIT TRAIL= $$ (NUMBER, WHEN, WHO, WHERE, WHAT)
$$ ##TITLE= Audit trail, TOPSPIN		Version 1.3
$$ ##JCAMPDX= 5.01
$$ ##ORIGIN= Bruker BioSpin GmbH
$$ ##OWNER= Irina
$$ $$ F:/spectra/data/iren/nmr/P31dec/1/pdata/1/auditp.txt
$$ ##AUDIT TRAIL=  $$ (NUMBER, WHEN, WHO, WHERE, VERSION, WHAT)
(   1,<2024-10-17 09:39:23.390 +0400>,<Irina>,<DPX200>,<TOPSPIN 1.3>,
      <acquisition in progress>)
(   2,<2024-10-17 09:41:05.343 +0400>,<Irina>,<DPX200>,<TOPSPIN 1.3>,
      <Start of raw data processing
       efp BC_mod = 2 LB = 8 FT_mod = 6 PKNL = 1 PHC0 = 105.0548 PHC1 = 206.7423 SI = 32K 
       data hash MD5: 32K
       CD D4 4A 0B DD C1 7E 38 4C DF 88 9B 8B 8C 44 DA>)
(   3,<2024-10-17 09:41:07.578 +0400>,<Irina>,<DPX200>,<TOPSPIN 1.3>,
      <apk 
       data hash MD5: 32K
       BE 43 C2 0D 23 4A A1 DC 4C 1C 06 0A 16 C9 F8 BA>)
(   4,<2024-10-17 09:41:10.984 +0400>,<Irina>,<DPX200>,<TOPSPIN 1.3>,
      <abs n ABSG = 5 
       data hash MD5: 32K
       1D D8 D7 C4 BF 47 66 A0 9A 13 3E 2A D6 B1 40 E1>)
$$ ##END=
$$ 
$$ $$ hash MD5
$$ $$ 91 1D A5 8C 28 04 F1 C4 FF 0F 9C DA A6 61 9D EB
##$RELAX= 
##$RELAX= 
##$RELAX= 
##$RELAX= 
##$RELAX= 
##$RELAX= 
##$RELAX= 
##$RELAX= 
##$RELAX= 
##$RELAX= 
##$RELAX= 
$$ Bruker specific parameters
$$ --------------------------
##$DU= <F:/spectra>
##$EXPNO= 1
##$NAME= <P31dec>
##$PROCNO= 1
##$TYPE= <nmr>
##$USER= <iren>
##$AMP= (0..31)
100 100 100 100 100 100 100 100 100 100 100 100 100 100 100 100 100 100 
100 100 100 100 100 100 100 100 100 100 100 100 100 100 
##$ANAVPT= -1
##$AQSEQ= 0
##$AQ_mod= 1
##$AUNM= <au_zg>
##$AUTOPOS= <>
##$BF1= 81.014009
##$BF2= 200.13
##$BF3= 200.13
##$BF4= 200.13
##$BF5= 200.13
##$BF6= 200.13
##$BF7= 200.13
##$BF8= 200.13
##$BYTORDA= 1
##$CFDGTYP= 0
##$CFRGTYP= 5
##$CHEMSTR= <none>
##$CNST= (0..63)
1 1 145 1 1 1 1 1 1 1 1 1 1 1 1 1 1 1 1 1 1 1 1 1 1 1 1 1 1 1 1 1 1 1 
1 1 1 1 1 1 1 1 1 1 1 1 1 1 1 1 1 1 1 1 1 1 1 1 1 1 1 1 1 1 
##$CPDPRG= <waltz16>
##$CPDPRG1= <>
##$CPDPRG2= <waltz16>
##$CPDPRG3= <>
##$CPDPRG4= <mlev>
##$CPDPRG5= <mlev>
##$CPDPRG6= <mlev>
##$CPDPRG7= <mlev>
##$CPDPRG8= <mlev>
##$CPDPRGB= <>
##$CPDPRGT= <>
##$D= (0..63)
0 1 0 0 0 0 0 0 0 0.06 0 0.03 2e-005 3e-006 0 0 0.0002 0 0 0 0 0 0 0 0 
0 0 0 0 0 0 0 0 0 0 0 0 0 0 0 0 0 0 0 0 0 0 0 0 0 0 0 0 0 0 0 0 0 0 0 
0 0 0 0 
##$DATE= 1729143662
##$DBL= (0..7)
120 120 120 11 120 120 24 19 
##$DBP= (0..7)
$$ [...]
##$SW_h= 37037.037037037
##$TD= 32768
##$TD0= 1
##$TE= 300
##$TE2= 300
##$TE3= 300
##$TEG= 300
##$TL= (0..7)
0 120 53 12 22 120 120 120 
##$TP= (0..7)
150 150 150 150 150 150 150 150 
##$TP07= 0
##$TPNAME0= <>
##$TPNAME1= <>
##$TPNAME2= <>
##$TPNAME3= <>
##$TPNAME4= <>
##$TPNAME5= <>
##$TPNAME6= <>
##$TPNAME7= <>
##$TPOAL= (0..7)
0.5 0.5 0.5 0.5 0.5 0.5 0.5 0.5 
##$TPOFFS= (0..7)
0 0 0 0 0 0 0 0 
##$TUNHIN= 0
##$TUNHOUT= 0
##$TUNXOUT= 0
##$USERA1= <user>
##$USERA2= <user>
##$USERA3= <user>
##$USERA4= <user>
##$USERA5= <user>
##$V9= 5
##$VALIST= <valist>
##$VCLIST= <CCCCCCCCCCCCCCC>
##$VD= 0
##$VDLIST= <DDDDDDDDDDDDDDD>
##$VPLIST= <PPPPPPPPPPPPPPP>
##$VTLIST= <TTTTTTTTTTTTTTT>
##$WBST= 1024
##$WBSW= 4
##$XGAIN= (0..3)
0 0 0 0 
##$XL= 0
##$YL= 0
##$YMAX_a= 4718
##$YMIN_a= -2521
##$ZGOPTNS= <>
##$ZL1= 120
##$ZL2= 120
##$ZL3= 120
##$ZL4= 120
##$ABSF1= 298.5841
##$ABSF2= -158.5842
##$ABSG= 5
##$ABSL= 5
##$ALPHA= 0
##$AQORDER= 0
##$ASSFAC= 0
##$ASSFACI= 0
##$ASSFACX= 0
##$ASSWID= 0
##$AUNMP= <proc_1d>
##$AXLEFT= 0
##$AXRIGHT= 0
##$AXTYPE= 0
##$AXUNIT= <>
##$AZFE= 0.1
##$AZFW= 0.5
##$BCFW= 0
##$BC_mod= 2
##$BYTORDP= 0
##$COROFFS= 0
##$CY= 12.5935478210449
##$DATMOD= 1
##$DC= 0
##$DFILT= <>
##$DTYPP= 0
##$F1P= 47.1127640792319
##$F2P= -24.0371245302204
##$FCOR= 0.5
##$FTSIZE= 32768
##$FT_mod= 6
##$GAMMA= 0
##$GB= 0
##$INTBC= 1
##$INTSCL= 7.269226e-011
##$ISEN= 30
##$LB= 8
##$LEV0= 0
##$LPBIN= 0
##$MAXI= 12.09355
##$MC2= 0
##$MEAN= 0
##$ME_mod= 0
##$MI= 0.7550151
##$NCOEF= 0
##$NC_proc= -11
##$NLEV= 6
##$NOISF1= 298.5841
##$NOISF2= 270.0111
##$NSP= 0
##$NTH_PI= 0
##$NZP= 0
##$OFFSET= 298.5841
##$PC= 1.4
##$PHC0= 139.8032
##$PHC1= 213.1219
##$PH_mod= 1
##$PKNL= yes
##$PPARMOD= 0
##$PPDIAG= 0
##$PPIPTYP= 0
##$PPMPNUM= 100
##$PPRESOL= 1
##$PSCAL= 0
##$PSIGN= 0
##$REVERSE= no
##$SF= 81.014009
##$SI= 32768
##$SIGF1= 270.0111
##$SIGF2= -158.5842
##$SINO= 77.54984
##$SIOLD= 32768
##$SREGLST= <31P.CDCl3>
##$SSB= 0
##$STSI= 32768
##$STSR= 0
##$SW_p= 37037.037037037
##$SYMM= 0
##$S_DEV= 0
##$TDeff= 32768
##$TDoff= 0
##$TI= <>
##$TILT= no
##$TM1= 0
##$TM2= 0
##$TOPLEV= 0
##$USERP1= <user>
##$USERP2= <user>
##$USERP3= <user>
##$USERP4= <user>
##$USERP5= <user>
##$WDW= 1
##$XDIM= 32768
##$YMAX_p= 400729618
##$YMIN_p= -9676418
$$ End of Bruker specific parameters
$$ ---------------------------------
##NTUPLES= NMR SPECTRUM
##VAR_NAME=  FREQUENCY,     SPECTRUM/REAL,   SPECTRUM/IMAG
##SYMBOL=    X,             R,               I
##VAR_TYPE=  INDEPENDENT,   DEPENDENT,       DEPENDENT
##VAR_FORM=  AFFN,          ASDF,            ASDF
##VAR_DIM=   32768,         32768,           32768
##UNITS=     HZ,            ARBITRARY UNITS, ARBITRARY UNITS
##FACTOR=    1.13031516577767, 1,            1
##FIRST=     37037.037037037, -713048,       1238865
##LAST=      0,             -2384615,        1635955
##MIN=       0,             -9676418,        0
##MAX=       37037.037037037, 400729618,     0
$$ Real data points
##PAGE= N=1
##DATA TABLE= (X++(R..R)), XYDATA
$$ [...]
19990 3519365 3222753 2612529 1837803 1092631 469929 -35522 -389381 -545145 -577471 -580221
19980 -580221 -545536 -490981 -564567 -928124 -1560641 -2253904 -2827363 -3153215 -3144786 -2941756
19970 -2941756 -2809704 -2821521 -2841212 -2744043 -2569944 -2471580 -2528311 -2583997 -2320614 -1596425
19960 -1596425 -677140 -64844 -64810 -598053 -1375791 -2124491 -2678852 -2981993 -3015652 -2784725
19950 -2784725 -2413824 -2059131 -1741071 -1416588 -1115922 -952710 -946043 -906424 -708189 -486391
19940 -486391 -431476 -577132 -764656 -748830 -387487 213493 760293 1012809 982428 803823
19930 803823 529199 223794 27240 -42169 -69642 -46834 48923 133924 135134 59262 -93692
19919 -93692 -301095 -420508 -338443 -49075 425818 968813 1403366 1619163 1608151 1457457
19909 1457457 1267476 1100994 988889 937901 923951 978079 1228105 1666912 2065096 2270118
19899 2270118 2293642 2118754 1737691 1255455 767577 253392 -321358 -900812 -1424663 -1894023
19889 -1894023 -2298250 -2572605 -2656264 -2591638 -2392983 -2005138 -1463098 -892657 -407358 -114126
19879 -114126 -109180 -322186 -525791 -552576 -441993 -351793 -365060 -441565 -445780 -207012 300691
19868 300691 877695 1348598 1748721 2215072 2735703 3097195 3200033 3173853 3098899 2873822
19858 2873822 2370839 1603021 753244 56499 -371799 -563939 -631023 -767867 -1120289 -1559776
19848 -1559776 -1797614 -1724557 -1480683 -1204488 -951858 -829215 -978707 -1431010 -2066691 -2717992
19838 -2717992 -3312231 -3840657 -4251077 -4517925 -4710759 -4905785 -5057002 -5009107 -4725152 -4258192
19828 -4258192 -3673544 -3125909 -2696790 -2383773 -2275551 -2453521 -2795296 -3011394 -2876159
19819 -2876159 -2385400 -1724326 -1107260 -659493 -438989 -458139 -694575 -1100162 -1544683 -1840377
19809 -1840377 -1893072 -1754418 -1517090 -1250556 -1028733 -886950 -804309 -767781 -751171 -742975
19799 -742975 -762311 -816506 -903582 -953199 -860622 -614504 -349438 -225313 -283823 -460066 -669132
19788 -669132 -887656 -1161441 -1497693 -1811186 -2027896 -2111016 -2053262 -1966287 -1972212 -2059765 -2184980
19777 -2184980 -2325368 -2413178 -2321200 -1999157 -1539018 -1053826 -664503 -505011 -631907 -985066
19767 -985066 -1401848 -1706255 -1857825 -1909058 -1909694 -1921979 -1973536 -2007682 -1985712 -1992892 -2127270
19756 -2127270 -2370664 -2568381 -2574386 -2540090 -2797041 -3408148 -4065483 -4512101 -4768826 -4911917
19746 -4911917 -5012315 -5134121 -5214457 -5114552 -4752832 -4102274 -3233450 -2363695 -1686686 -1291596
19736 -1291596 -1242476 -1536947 -2097872 -2832695 -3593690 -4142200 -4300427 -4138629 -3839171 -3453980
19726 -3453980 -2981505 -2502242 -2098592 -1785160 -1552175 -1426824 -1473540 -1684948 -1897743 -1866167
19716 -1866167 -1428268 -644249 167926 686052 843751 747001 539437 280487 -51748 -417934
19706 -417934 -724019 -895930 -894837 -722241 -519700 -494325 -671910 -898871 -1043525 -1103872
19696 -1103872 -1178831 -1395241 -1839955 -2522494 -3353196 -4088155 -4410355 -4216236 -3639612 -2862267
19686 -2862267 -2016201 -1174151 -469566 -94419 -84133 -255670 -394310 -371508 -119443 384625
19676 384625 1100715 1912192 2662142 3251186 3586397 3561718 3233726 2801779 2390636 1953106
19666 1953106 1416763 807624 203182 -268943 -443668 -200617 485869 1549551 2807049
19657 2807049 4038181 5067584 5723953 5942510 5814718 5462983 4960211 4349045 3679291
19648 3679291 3013193 2354751 1638573 852739 159724 -180799 -49649 379268 820986
19639 820986 1065212 919223 403424 -84451 -144462 262953 927484 1582129 2036287 2236361
19629 2236361 2174860 1902273 1533164 1143466 719828 202017 -387840 -915998 -1237175 -1302870
19619 -1302870 -1176347 -1039291 -1164160 -1702720 -2469685 -3061379 -3252396 -3242270 -3388089 -3752311
19609 -3752311 -4090571 -4159971 -3784147 -2800722 -1263214 427449 1778668 2617247 3086650
19600 3086650 3294514 3197335 2755054 2072376 1407374 955137 682661 356252 -261266 -1129570
19590 -1129570 -1917559 -2309518 -2287342 -2166349 -2271747 -2569316 -2803455 -2820879 -2613990 -2253586
19580 -2253586 -1813846 -1257141 -504562 375283 1218003 1889691 2303146 2451289 2389325 2180044
19570 2180044 1885796 1473826 849260 73289 -609920 -983202 -1046349 -1006490 -1045064 -1130116
19560 -1130116 -1151636 -1152427 -1261561 -1491349 -1725814 -1767627 -1506338 -1119366 -861938 -691992
19550 -691992 -340065 312800 1090205 1663452 1789830 1458867 826870 149301 -325273 -507815
19540 -507815 -535380 -623866 -822232 -1008644 -1120254 -1186324 -1191328 -1115462 -1063906 -1126798 -1199422
19529 -1199422 -1130760 -960570 -820513 -726645 -671759 -681144 -731749 -737553 -644280 -510682 -451265
19518 -451265 -503384 -638541 -860091 -1177552 -1536853 -1893003 -2248198 -2543018 -2646015 -2345092
19508 -2345092 -1505624 -406526 437874 807904 851170 759473 589176 277950 -188187 -687444
19498 -687444 -987862 -900933 -429802 251177 887954 1328146 1571214 1685627 1838056 2186852
19488 2186852 2673283 3114983 3454489 3765565 4038534 4109419 3846610 3309157 2625429 1868017
19478 1868017 1168310 720990 573982 512244 225225 -418961 -1207043 -1727791 -1750161 -1394639
19468 -1394639 -967709 -597342 -232419 86115 256646 279901 320936 553274 939625 1226580
19458 1226580 1146477 660501 -2393 -589272 -989192 -1110842 -872370 -356655 245939 835122
19448 835122 1388442 1839197 2011837 1751798 1104255 334838 -266011 -562445 -545720 -303957
19438 -303957 -8123 155506 142526 38427 -121266 -303124 -368029 -208372 77474 245049
19428 245049 106900 -375294 -1097897 -1896780 -2637697 -3266806 -3785563 -4167541 -4337563 -4162181
19418 -4162181 -3561339 -2705955 -1939166 -1389788 -921653 -482935 -157808 -936 -3497 -86150
19408 -86150 -169636 -239074 -269793 -195732 33609 434880 967948 1492897 1854954 2011662
19398 2011662 2020530 1911158 1626466 1103332 469586 29789 -93395 -44408 104637 394379
19388 394379 731385 962221 1089411 1244920 1516909 1783499 1822662 1541369 1038571 533132
19378 533132 203568 54268 -46265 -195043 -439141 -785814 -1192025 -1543276 -1633018 -1316324
19368 -1316324 -713674 -135089 176089 160338 -62193 -269754 -274762 -46973 348363 811629
19358 811629 1225382 1510051 1579158 1337535 844841 299986 -155560 -446613 -549883 -536826
19348 -536826 -549683 -710328 -999030 -1312714 -1596308 -1780969 -1754623 -1588282 -1529362 -1698605
19338 -1698605 -2008298 -2288925 -2462714 -2590428 -2676486 -2591159 -2218619 -1571536 -882493 -507681
19328 -507681 -607962 -973360 -1213876 -1124393 -853694 -691998 -745467 -865207 -778482 -338997
19318 -338997 312664 899348 1189906 1114070 826175 548955 321547 50971 -242333 -370014
19308 -370014 -209056 158135 582406 976019 1307140 1535899 1552429 1219522 497292 -479146
19298 -479146 -1384043 -1953042 -2157450 -2037762 -1672534 -1212348 -825196 -664720 -840110 -1289973
19288 -1289973 -1799102 -2232610 -2570068 -2698388 -2489969 -2020775 -1564047 -1395831 -1567522
19279 -1567522 -1912347 -2251984 -2554472 -2874476 -3171350 -3306572 -3221945 -2971013 -2630790 -2315346
19269 -2315346 -2082754 -1876587 -1660421 -1401916 -1039036 -514843 234640 1144445 1922297
19260 1922297 2269111 2136230 1677068 1056693 355689 -439242 -1327124 -2261612 -3161496
19251 -3161496 -3900614 -4384097 -4573852 -4504941 -4277684 -3997100 -3781146 -3715966 -3771323 -3813418
19241 -3813418 -3750414 -3584734 -3352041 -3102294 -2845129 -2564760 -2383768 -2482930 -2817313 -3121897
19231 -3121897 -3196958 -3057516 -2789818 -2420018 -1971226 -1530339 -1272686 -1451704 -2161634 -3097899
19221 -3097899 -3804644 -4029371 -3758200 -3130084 -2373886 -1719759 -1303991 -1157505 -1245530 -1445512
19211 -1445512 -1622131 -1776698 -1993616 -2270960 -2556274 -2829755 -3128635 -3473122 -3797427
19202 -3797427 -3985483 -3897712 -3543614 -3154042 -2929804 -2884054 -2917330 -2893393 -2698979 -2325094
19192 -2325094 -1890660 -1539711 -1313419 -1130575 -845302 -384709 112503 466884 575934
19183 575934 360122 -133491 -682830 -1099548 -1443785 -1849316 -2268134 -2609033 -2867712 -3052869
19173 -3052869 -3085681 -2834985 -2318153 -1777824 -1493897 -1573584 -1948899 -2453783 -2925080 -3326207
19163 -3326207 -3654255 -3785321 -3586565 -3130907 -2696714 -2548050 -2678136 -2881656 -3105221
19154 -3105221 -3377421 -3595584 -3592733 -3229450 -2499413 -1633431 -975682 -748897 -944778 -1392166
19144 -1392166 -1922543 -2452392 -2968610 -3535598 -4182732 -4768229 -5141687 -5332560 -5412287 -5311171
19134 -5311171 -4962320 -4451017 -3921171 -3419638 -2881731 -2275075 -1714296 -1334466 -1129429
19125 -1129429 -989847 -800088 -504338 -97878 322730 592321 642026 558978 519778 637820
19115 637820 951629 1497792 2205849 2817445 3131239 3245024 3449449 3861720 4256211 4454141
19105 4454141 4544074 4505002 4121565 3295281 2195023 1147100 477408 380105 756307 1302066
19095 1302066 1758037 1991112 1954053 1679502 1268240 801878 371200 94384 9003 91971
19085 91971 346355 765410 1261957 1753771 2184384 2463533 2542393 2446872 2230749 1944327
19075 1944327 1770324 2017946 2717780 3449535 3742039 3436833 2645474 1627211 704351
19066 704351 153445 -20200 -58889 -97611 -50327 186541 558897 865370 949563 771087
19056 771087 309613 -419301 -1314211 -2168040 -2709324 -2750493 -2282689 -1480499 -613738 118595
19046 118595 655654 980079 1077691 969435 752171 551875 406977 289096 332530 735702
19036 735702 1505197 2530191 3630432 4565429 5138271 5294385 5063161 4501611 3728874
19027 3728874 2842180 1917651 1028961 200316 -447042 -695489 -543714 -284979 -202275 -342980
19017 -342980 -564954 -740393 -880755 -1019064 -1081509 -1018359 -933298 -951498 -1069048 -1157019
19007 -1157019 -1105864 -926448 -721704 -665300 -881148 -1299107 -1748535 -2088321 -2226362 -2114749
18997 -2114749 -1724884 -1196713 -790681 -585823 -540052 -670473 -990549 -1432985 -1841336 -2126393
18987 -2126393 -2284138 -2257223 -1954386 -1308639 -389752 558274 1267525 1578666 1432448 883060
18977 883060 105168 -629235 -1059185 -1127891 -957365 -660727 -312946 -34364 104801 119842
18967 119842 413 -232178 -388824 -217808 334354 1078182 1784460 2268666 2405834 2228870
18957 2228870 1863356 1442429 1139114 1072004 1145471 1181588 1199134 1300130 1450494 1536654
18947 1536654 1452342 1118730 571112 -47342 -688634 -1396930 -2072992 -2499161 -2578175 -2395475
18937 -2395475 -2049471 -1551280 -929183 -291658 278598 720947 937829 1005741 1213794 1684772
18927 1684772 2291973 2891116 3333270 3364121 2870097 2025617 1099967 317897 -180571 -384176
18917 -384176 -386439 -265417 -62976 215358 594651 1078329 1610989 2029628 2173636 2119539
18907 2119539 2087187 2208602 2515070 2986606 3514991 3823645 3692502 3229145 2680101 2175603
18897 2175603 1707299 1224383 711973 212283 -182951 -375202 -290279 169489 1050649 2200870
18887 2200870 3345316 4206165 4560112 4428626 4117686 3872835 3654654 3309876 2774152
18878 2774152 2196966 1839287 1767447 1748316 1469347 854212 131902 -437166 -797618 -1041281
18868 -1041281 -1264245 -1422199 -1394339 -1193903 -904790 -532221 -56389 405107 704289 891181
18858 891181 1088465 1357294 1691815 1991877 2143253 2121878 1936052 1537218 946102 402861
18848 402861 153902 185505 266630 232644 114724 -78959 -441243 -882789 -1067642 -806165
18838 -806165 -243102 425535 1105335 1630455 1778485 1471003 839295 103819 -560782 -1084525
18828 -1084525 -1461006 -1699020 -1781152 -1641959 -1242296 -638428 21332 540500 699900 395487
18818 395487 -188844 -801575 -1353670 -1826869 -2162580 -2313285 -2300109 -2222608 -2174610 -2127648
18808 -2127648 -2038274 -1976197 -2043036 -2218032 -2355813 -2405005 -2461948 -2519299 -2434049 -2079677 -1477037
18797 -1477037 -785179 -183293 189439 239377 -46754 -563272 -1149410 -1697231 -2223954 -2791474
18787 -2791474 -3332706 -3610584 -3410669 -2798144 -2165179 -1848795 -1789051 -1744998 -1603433 -1427081
18777 -1427081 -1407187 -1737392 -2389044 -3057273 -3458652 -3551842 -3421773 -3088553 -2519389 -1817853
18767 -1817853 -1209176 -767213 -377334 102714 682393 1181702 1448534 1533005 1577632 1709743
18757 1709743 1995387 2372700 2601653 2356695 1543128 466988 -373178 -681961 -546471
18748 -546471 -219272 187875 710183 1307730 1858355 2318189 2697094 2926450 2890574 2568999
18738 2568999 2072274 1464933 723873 -94960 -864470 -1530026 -2097347 -2553415 -2793822
18729 -2793822 -2609488 -1903907 -931888 -151548 169688 116073 -49910 -106882 31664 336035
18719 336035 717714 1104447 1482033 1875744 2294861 2675139 2918808 2969995 2852155 2627971
18709 2627971 2280034 1802924 1353381 1072361 902778 593991 -65246 -1018418 -2021694
18700 -2021694 -2843604 -3337600 -3449203 -3317762 -3213157 -3225907 -3194258 -2934265 -2374762 -1649029
18690 -1649029 -1110256 -1065724 -1484592 -2081312 -2638552 -3138441 -3595175 -3890988 -3943793 -3828891
18680 -3828891 -3678786 -3557213 -3390331 -3083527 -2670962 -2177963 -1562340 -869901 -234576
18671 -234576 188276 317818 215624 -35814 -324716 -441093 -271531 79441 471101 869940
18661 869940 1240528 1444355 1361461 1021365 577579 177145 -52647 -33185 129853 248930
18651 248930 208398 -15024 -328665 -645243 -1037671 -1647363 -2419580 -3041504 -3253090 -3102220
18641 -3102220 -2838250 -2673102 -2694430 -2923554 -3301768 -3662251 -3780035 -3513676 -2886467 -2096922
18631 -2096922 -1457400 -1135937 -1025906 -900901 -621061 -219519 244697 749819 1248953
18622 1248953 1734766 2289026 3009451 3870007 4675432 5170187 5289582 5265661 5315746 5330672
18612 5330672 5075598 4527028 3823758 3101143 2522588 2241609 2165976 2002841 1556078 877189
18602 877189 111780 -658000 -1363815 -1903609 -2231813 -2433666 -2638841 -2940180 -3320635 -3669243
18592 -3669243 -3906849 -3966009 -3766620 -3337564 -2785591 -2166239 -1552737 -1108578 -935081 -925000
18582 -925000 -821917 -441903 174077 845956 1371015 1625779 1646835 1581413 1565238 1562232
18572 1562232 1390994 990789 504070 55653 -346436 -630907 -693938 -541153 -244129 53257
18562 53257 232914 358546 555552 852687 1190542 1410950 1371002 1136415 850087 570711
18552 570711 309888 98274 -18795 -33085 -18282 -78422 -232859 -374521 -344185 -128940
18542 -128940 115536 272613 345989 317027 142748 -96513 -273095 -335332 -339895 -504034
18532 -504034 -985343 -1635380 -2157192 -2418028 -2497959 -2550762 -2688332 -2922651 -3168679 -3307842
18522 -3307842 -3269939 -3053903 -2762180 -2555486 -2505841 -2503653 -2357785 -1998133 -1553656 -1261413
18512 -1261413 -1205758 -1258678 -1390594 -1704374 -2148277 -2472288 -2398878 -1832636 -939384 1062
18502 1062 719615 1042992 1028348 777739 232313 -590692 -1515318 -2432706 -3261734 -3852281
18492 -3852281 -4138609 -4144776 -3888026 -3446070 -2970210 -2569877 -2316853 -2268788 -2380733 -2464745
18482 -2464745 -2343698 -1966886 -1301850 -338084 708751 1507569 1923129 2012969 1890599
18473 1890599 1708908 1671380 1943454 2531225 3253614 3843502 4086563 3911724 3423566 2797481
18463 2797481 2047823 1119535 136768 -599252 -872135 -777119 -656964 -863626 -1509572 -2374486
18453 -2374486 -3035357 -3112220 -2490553 -1441874 -431991 313691 814749 1059511 1041495
18444 1041495 903491 811674 849283 1062678 1467328 2022907 2612472 3043250 3157134 2906025
18434 2906025 2267618 1267261 177419 -570270 -742003 -380429 340885 1175474 1888897
18425 1888897 2397328 2725787 2848305 2761818 2570104 2358159 2127010 1841549 1556806 1382013
18415 1382013 1332219 1333311 1375450 1501610 1675565 1793084 1859763 2054824 2541237 3284692
18405 3284692 4100220 4827069 5363865 5678452 5858319 5955744 5933697 5817594 5695574 5555477
18395 5555477 5341797 5117593 4994238 5039127 5238548 5503249 5707141 5704753 5388343 4757396
18385 4757396 3916798 3018155 2202893 1585566 1187908 924718 778107 839320 1123622 1459160
18375 1459160 1656812 1678992 1613052 1523911 1307976 851433 293223 -75669 -73096 258325
18365 258325 708434 1035993 1023466 506686 -523614 -1823641 -2965841 -3575826 -3531412
18356 -3531412 -2989769 -2290976 -1673441 -1148886 -751521 -621334 -797040 -1112499 -1406545
18347 -1406545 -1665144 -1908593 -2189583 -2647221 -3316842 -4035311 -4627481 -4949347 -4893443 -4477934
18337 -4477934 -3798573 -3001356 -2277626 -1786153 -1581998 -1589207 -1653960 -1661722 -1591011 -1455282
18327 -1455282 -1277616 -1165177 -1236234 -1407916 -1493953 -1424049 -1272608 -1142129 -1020229 -891500
18317 -891500 -763732 -583363 -387561 -372158 -629719 -1035736 -1451939 -1846142 -2196046 -2359661
18307 -2359661 -2192657 -1744473 -1232337 -754431 -262091 200354 551940 834460 1073694
18298 1073694 1240056 1332816 1264998 920130 334396 -273695 -663786 -836473 -939455 -1044987
18288 -1044987 -1166039 -1265758 -1250932 -1091980 -888398 -734446 -582377 -389580 -228114 -129269
18278 -129269 -63755 47053 280571 592412 866735 969315 811995 526037 324563 185271
18268 185271 -111169 -711182 -1474761 -2054044 -2220372 -2048149 -1753117 -1419906 -993803 -428906
18258 -428906 278007 1024795 1572896 1736483 1513329 1097645 772905 681127 780056 908883
18248 908883 927825 777745 501507 231257 -12079 -357205 -869465 -1460963 -1988262 -2335091
18238 -2335091 -2418298 -2206798 -1766707 -1195577 -552489 119306 770956 1365425 1884314 2241088
18228 2241088 2264206 1880155 1170796 285067 -554104 -1114553 -1288415 -1071298 -478310 422669
18218 422669 1408488 2100946 2248394 1947403 1442743 885067 397906 62895 -246950 -743859
18208 -743859 -1465532 -2207901 -2748266 -3075906 -3293858 -3403021 -3348788 -3148326 -2908895 -2708606
18198 -2708606 -2497739 -2166749 -1669905 -1130774 -744543 -530850 -389336 -324875 -415166 -634856
18188 -634856 -848956 -976774 -1024085 -989429 -950892 -1094168 -1486624 -1965941 -2345750 -2622789
18178 -2622789 -2815321 -2795678 -2469363 -1931592 -1322309 -675167 3996 699395 1394964 1943679
18168 1943679 2114195 1838893 1200070 293064 -735438 -1675548 -2311903 -2439168 -2009793
18159 -2009793 -1282846 -638714 -221418 144735 678356 1379127 2101108 2786327 3367398
18150 3367398 3606160 3402457 2991366 2607492 2276147 1986565 1748849 1529022 1302890
18141 1302890 1097318 927130 769851 563912 241299 -196594 -661540 -1016646 -1151741
18132 -1151741 -1029344 -686990 -267716 58211 256987 461450 744290 1003028 1116006
18123 1116006 1091892 1052699 1048590 1025673 926270 745527 543794 379318 176504 -162054
18113 -162054 -501629 -652731 -704355 -804855 -828026 -598453 -223236 16665 1061 -195205
18103 -195205 -452213 -679326 -866919 -1022829 -1106336 -1120868 -1218879 -1516338 -1805197 -1727492
18093 -1727492 -1252783 -656713 -151929 141802 183689 72067 -70987 -149947 -18458 382542
18083 382542 849704 1076879 919131 489886 111776 17668 130848 270211 317961 220136
18073 220136 3313 -239879 -393324 -406073 -354266 -411138 -658616 -1013904 -1307196 -1310086
18063 -1310086 -887226 -123026 744203 1447583 1780938 1689206 1311238 877732 614324 600449
18053 600449 713267 803267 782213 685469 628761 637432 657766 671537 696888 788812 1006207
18042 1006207 1284929 1503757 1688885 1879508 1917007 1684115 1220858 597388 -16076 -359406
18032 -359406 -289674 95300 572737 940044 1041105 796716 238747 -548331 -1404701 -2110342
18022 -2110342 -2656608 -3272636 -4052479 -4864330 -5536129 -5980303 -6226658 -6404579 -6615175
18013 -6615175 -6795098 -6749778 -6280689 -5347030 -4062727 -2614886 -1177127 196518 1465968
18004 1465968 2452147 2939435 2848718 2308046 1678324 1344923 1413047 1719504 2041220 2208060
17994 2208060 2181742 2053090 1925186 1879136 1922717 1981388 2040602 2132285 2220558 2274974 2340712
17983 2340712 2431652 2479054 2470242 2448319 2366806 2187664 1983885 1788942 1570408 1376544
17973 1376544 1283548 1238952 1213257 1321340 1646055 2142935 2713420 3273841 3779643 4194396
17963 4194396 4475117 4609671 4581752 4287654 3650532 2810482 2049088 1584900 1471700 1616564
17953 1616564 1870407 2130236 2280628 2178768 1873591 1624484 1600278 1772410 2028670 2273862
17943 2273862 2463846 2565744 2507221 2194076 1637388 965906 246056 -541005 -1379573 -2143245
17933 -2143245 -2688815 -3017056 -3218375 -3334674 -3346603 -3288678 -3306585 -3467818 -3625584 -3607149
17923 -3607149 -3436015 -3214621 -2918742 -2537557 -2211212 -2075951 -2116868 -2218222 -2365617 -2675639
17913 -2675639 -3215658 -3894245 -4482737 -4716652 -4425063 -3623300 -2564869 -1673262 -1276885
17904 -1276885 -1326877 -1486432 -1503584 -1378067 -1298761 -1434858 -1723466 -1980555 -2225586 -2587632
17894 -2587632 -2962258 -3108394 -2956401 -2628933 -2213057 -1730554 -1217564 -656908 -11013
17885 -11013 664139 1246988 1669773 1928273 2070548 2194149 2316871 2309397 2059420 1618906
17875 1618906 1221850 1115630 1299261 1503045 1557684 1579715 1728019 2055269 2528528 3042161
17865 3042161 3422786 3513000 3308017 2954869 2603248 2271723 1929810 1659032 1636851 1975371
17855 1975371 2647193 3504527 4260379 4560370 4161040 3044238 1487418 -80472 -1412828
17846 -1412828 -2452516 -3102273 -3243449 -2924180 -2366030 -1771621 -1225296 -762903 -442297
17837 -442297 -319398 -395425 -621550 -868745 -929239 -699967 -305611 62461 300032 341485
17827 341485 144938 -198867 -470786 -513397 -420630 -400454 -470724 -519046 -589798 -870075 -1400678
17816 -1400678 -1938215 -2156985 -1917894 -1329340 -602942 109419 708600 1085941 1170732 953274
17806 953274 521505 67086 -226072 -282546 -154628 14088 88725 21271 -193870 -605136
17796 -605136 -1198756 -1754373 -2042807 -2048183 -1931109 -1838648 -1756212 -1566174 -1236006 -862288
17786 -862288 -559293 -383406 -363255 -519968 -765142 -911082 -833656 -558896 -192416 148842
17776 148842 420999 725404 1155279 1638377 1955508 1897924 1421596 667733 -105072 -626962
17766 -626962 -785299 -711736 -558658 -352392 -98282 145683 236420 55868 -267618 -500552
17756 -500552 -544004 -397934 -160763 48569 280682 689641 1276717 1853645 2223392 2286483
17746 2286483 2079925 1795992 1564949 1328262 1030174 707290 393699 124412 967
17737 967 182570 742175 1526785 2278488 2779336 2851161 2390337 1471527 331032 -725790
17727 -725790 -1383799 -1462133 -1048051 -435181 78560 315021 189204 -299830 -912891 -1211390
17717 -1211390 -900791 -43032 1055430 2049664 2691438 2889827 2711591 2268744 1665615
17708 1665615 1054312 577155 265214 83118 -23428 -65904 37264 290062 616453 983348
17698 983348 1384159 1813530 2223672 2503147 2586063 2537485 2485990 2492760 2516612 2411961 2001622
17687 2001622 1273851 413709 -369329 -915147 -1113240 -1027013 -848696 -722672 -763564 -1063960
17677 -1063960 -1622150 -2340229 -3008765 -3356979 -3204622 -2603567 -1820033 -1125503 -703322
17668 -703322 -597170 -637963 -626175 -530461 -454858 -553241 -907218 -1478506 -2177104 -2861730
17658 -2861730 -3329985 -3462577 -3355321 -3182805 -3051207 -2905587 -2585961 -2113381 -1686627
17649 -1686627 -1430186 -1340482 -1317176 -1295684 -1403620 -1812087 -2480137 -3205688 -3742693 -3796761
17639 -3796761 -3230981 -2208222 -1079245 -236429 105515 23791 -240630 -444606 -482387
17630 -482387 -414720 -337509 -289246 -298186 -408555 -657052 -1045105 -1454116 -1679332 -1644082 -1483668
17619 -1483668 -1343563 -1260287 -1220613 -1224837 -1304878 -1447217 -1595763 -1737918 -1910171 -2129620
17609 -2129620 -2243643 -2026899 -1527344 -1055276 -873456 -1013575 -1272233 -1429568 -1443086 -1350816
17599 -1350816 -1122919 -664785 49671 954320 1902355 2636202 2908296 2691177 2185558
17590 2185558 1605302 1023422 409396 -238374 -832571 -1213834 -1293941 -1167479 -968954 -815582
17580 -815582 -880037 -1278730 -1932902 -2616754 -3152890 -3555989 -3924644 -4276084 -4506655 -4488548
17570 -4488548 -4192414 -3702372 -3157269 -2733155 -2573097 -2667562 -2813005 -2798457 -2591737 -2264903
17560 -2264903 -1870133 -1447584 -1072106 -894071 -1080376 -1662585 -2457107 -3189379 -3825581
17551 -3825581 -4477406 -5008579 -5135346 -4771957 -4076105 -3233661 -2351875 -1568694 -1026047
17542 -1026047 -800481 -838415 -979086 -1154902 -1425399 -1781863 -2078190 -2150825 -1916304 -1366347
17532 -1366347 -562146 360766 1296490 2155373 2748978 2884547 2574226 2085113 1828710
17523 1828710 2093030 2738271 3312725 3486234 3299370 3055907 2967039 2893392 2576760 2021302
17513 2021302 1398461 854807 513396 437971 577712 734264 730406 599613 413560 149258
17503 149258 -251942 -797913 -1434410 -2079858 -2569536 -2727304 -2544588 -2185855 -1757366 -1166976
17493 -1166976 -364630 430637 970157 1325612 1717558 2149709 2563380 3014184 3462992
17484 3462992 3814704 4098054 4364927 4540309 4518707 4298484 3953944 3557222 3050021 2348992
17474 2348992 1580609 907402 310642 -254621 -659995 -742357 -538428 -238449 73195 448360
17464 448360 846591 1051189 884479 406316 -108969 -371412 -267598 77683 385127 450689
17454 450689 331950 222967 205760 272828 505524 1061090 1891406 2644507 2997793 2989086
17444 2989086 2877117 2793892 2708658 2503427 2046634 1315181 436643 -374321 -968147 -1304416
17434 -1304416 -1459644 -1552568 -1574335 -1402384 -925108 -145642 741688 1426809 1652071 1397408
17424 1397408 879209 316318 -233041 -776697 -1264507 -1617115 -1761580 -1684021 -1469352 -1204166
17414 -1204166 -916439 -675233 -570169 -629137 -935153 -1515231 -2148179 -2547457 -2639814 -2561090
17404 -2561090 -2421797 -2243699 -2056086 -1828836 -1405310 -692058 202307 1023641 1487467
17395 1487467 1457566 1062886 529055 -90644 -883373 -1889975 -3010016 -3957213 -4348206
17386 -4348206 -4086283 -3467864 -2768713 -2099198 -1573226 -1320224 -1321431 -1371995 -1309257 -1162927
17376 -1162927 -1009157 -914709 -977329 -1273072 -1820603 -2540607 -3260070 -3887285 -4410915 -4777874
17366 -4777874 -4966195 -4947738 -4693909 -4323200 -4081698 -4145931 -4498508 -4929809 -5158574 -5008235
17356 -5008235 -4486142 -3724255 -2947920 -2439457 -2293266 -2342131 -2346974 -2187832 -1941008 -1743055
17346 -1743055 -1660410 -1718800 -1946224 -2297839 -2680001 -3067461 -3408979 -3650396 -3887022 -4277286
17336 -4277286 -4832057 -5323495 -5399159 -4800158 -3631893 -2365381 -1415058 -843828 -501073
17327 -501073 -215124 157815 618902 969152 1028079 817122 487658 193694 6655 -97723
17317 -97723 -206760 -442008 -916722 -1645216 -2509026 -3287517 -3778467 -3959564 -3994642 -4042872
17307 -4042872 -4107639 -4145564 -4159177 -4119174 -3955899 -3686914 -3438495 -3294502 -3292887 -3494337
17297 -3494337 -3864862 -4208250 -4300206 -4073234 -3640272 -3115352 -2567434 -2054032 -1608127 -1279759
17287 -1279759 -1099830 -1034162 -1003887 -955270 -920102 -961815 -1091413 -1240147 -1298882 -1228811 -1115496
17276 -1115496 -1057002 -1110277 -1332962 -1649115 -1851461 -1866026 -1763518 -1545612 -1154566 -653918
17266 -653918 -265467 -203855 -430805 -702711 -914529 -1148416 -1407118 -1603225 -1727219 -1799148
17256 -1799148 -1813744 -1781343 -1719541 -1618270 -1522479 -1536992 -1696653 -1990999 -2359593 -2653151
17246 -2653151 -2739599 -2581655 -2211238 -1612400 -725189 410028 1516777 2203485 2310434
17237 2310434 1944529 1328486 702482 221048 -130939 -480213 -898594 -1326819 -1624980
17228 -1624980 -1781814 -1941933 -2167498 -2297008 -2139135 -1744010 -1390818 -1268327 -1362067 -1638754
17218 -1638754 -2048653 -2466384 -2795288 -2996341 -3066645 -2985141 -2689436 -2205263 -1639661 -1057521
17208 -1057521 -437287 256173 959749 1486838 1607096 1222112 447227 -483648 -1319228
17199 -1319228 -1894848 -2172318 -2134492 -1737170 -940819 157493 1209818 1854302 1993820
17190 1993820 1806763 1612067 1542661 1491544 1448068 1538735 1817878 2177500 2461932 2695356
17180 2695356 3047114 3563986 4030717 4048717 3408131 2286815 1038980 -35303 -785208
17171 -785208 -1191428 -1288644 -1129938 -849495 -652951 -654445 -744128 -709619 -535074 -406460
17161 -406460 -527635 -1034831 -1860921 -2756055 -3522078 -4102314 -4474664 -4541844 -4166799 -3289441
17151 -3289441 -2067453 -814281 241444 1021372 1550050 1876661 1941257 1682525 1167131
17142 1167131 519860 -19596 -123670 352579 1260192 2300023 3179370 3721834 3857641
17133 3857641 3581021 2989856 2304663 1795901 1608096 1732507 2092353 2601343 3174605
17124 3174605 3732134 4207077 4512898 4578335 4359152 3832115 3032660 2041264 962390
17115 962390 -84596 -973126 -1654944 -2260322 -2974226 -3793928 -4520975 -4963272 -5043718 -4834657
17105 -4834657 -4453063 -3863719 -2986624 -1956691 -1076483 -538857 -330382 -339794 -487277 -692473
17095 -692473 -797547 -613123 -163976 267092 482316 435764 95279 -504657 -1205325 -1877565
17085 -1877565 -2480029 -2860365 -2813291 -2378143 -1809718 -1347048 -1083749 -970408 -924856 -938919
17075 -938919 -1088402 -1375262 -1718140 -2012903 -2107673 -1933797 -1579762 -1186507 -854121 -622973
17065 -622973 -483639 -444354 -570894 -929527 -1453029 -1979691 -2352983 -2471367 -2443159 -2539576
17055 -2539576 -2866688 -3250149 -3462297 -3417735 -3169819 -2779439 -2273395 -1760411 -1446540 -1409160
17045 -1409160 -1561050 -1819947 -2062468 -2065812 -1742673 -1228981 -761243 -537638 -574612 -783177
17035 -783177 -1091062 -1467484 -1979003 -2691973 -3460190 -3991539 -4119609 -3890231 -3459310 -2919472
17025 -2919472 -2238649 -1440933 -733406 -347872 -301869 -380467 -441770 -565152 -850521 -1265747
17015 -1265747 -1692674 -1970613 -1966977 -1776207 -1733830 -2062430 -2632641 -3208005 -3667720 -3927918
17005 -3927918 -3818667 -3204704 -2215808 -1184917 -336066 304687 718709 905507 963422
16996 963422 964418 885897 661645 335101 112692 112970 270915 574570 1062217 1611204 1978939
16985 1978939 1952743 1455889 610714 -364412 -1312772 -2128403 -2678961 -2875849 -2719054 -2303158
16975 -2303158 -1749276 -1071404 -241978 583202 1174281 1501324 1700088 1862352 1901506 1670393
16965 1670393 1165108 563613 50546 -343786 -735822 -1255572 -1926441 -2702711 -3490741
16956 -3490741 -4130862 -4497750 -4657769 -4856267 -5199211 -5479697 -5422917 -4988264 -4377986 -3882416
16946 -3882416 -3662585 -3592915 -3446788 -3137577 -2723741 -2298519 -1900602 -1469780 -894186 -162361
16936 -162361 585233 1183160 1572579 1805493 1959717 2052968 2053138 1932982 1702210 1421428
16926 1421428 1183390 1131393 1377918 1881360 2479841 3020852 3416941 3607205 3549209 3290804
16916 3290804 2934690 2475224 1887844 1309027 890095 669674 624741 715782 923756 1263769
16906 1263769 1738544 2284415 2725690 2925805 2882179 2624746 2243903 1906309 1708405 1645350
16896 1645350 1757990 2030114 2208220 2023750 1524249 964047 452580 -83683 -591875
16887 -591875 -903317 -1009346 -971294 -802390 -558174 -376410 -377184 -558381 -778312 -870859
16877 -870859 -766338 -525323 -274130 -113822 -130687 -366183 -728317 -1025287 -1095221 -910663
16867 -910663 -539075 -37453 545220 1161636 1783792 2373529 2827321 2985182 2815248 2461936
16857 2461936 2070716 1728994 1460691 1285526 1334517 1692361 2154477 2424417 2440661 2336929
16847 2336929 2217111 2088255 1955178 1856257 1831987 1854808 1882261 1947938 2069378 2188436
16837 2188436 2240813 2225250 2172821 2137708 2155854 2218053 2294709 2400227 2615425 2950332 3348643
16826 3348643 3710804 3785017 3314288 2385767 1456132 932688 795520 734949 489990 41480
16816 41480 -349178 -385699 3751 660905 1355747 1934037 2382722 2799190 3234348 3540909
16806 3540909 3509124 3090218 2351621 1470800 749724 433346 586519 1089615 1731110 2334153
16796 2334153 2783089 3019044 3050267 2940054 2672796 2218167 1744838 1476968 1419863 1420163
16786 1420163 1312484 986017 496451 35698 -207115 -247314 -309732 -524745 -797765 -1000414
16776 -1000414 -1117136 -1191678 -1240285 -1256695 -1213392 -1091250 -949441 -898512 -1013275 -1234833
16766 -1234833 -1475795 -1768294 -2130917 -2528101 -2949815 -3336274 -3535254 -3369451 -2790135
16757 -2790135 -1940687 -1058641 -303456 357310 1036511 1668173 1971497 1791747 1226225
16748 1226225 484509 -206130 -680530 -838898 -655362 -171316 482939 1106243 1576767
16739 1576767 1909128 2071372 1965273 1699096 1582045 1792179 2220193 2653532 2977530
16730 2977530 3130131 3100149 2940867 2661221 2270102 1844355 1413302 890644 253513 -391481
16720 -391481 -927989 -1315791 -1528182 -1485166 -1165798 -737276 -433840 -250466 33855 410176
16710 410176 576966 351284 -154074 -710554 -1172897 -1477746 -1599123 -1565672 -1446935 -1239883
16700 -1239883 -877729 -393886 90409 450293 574019 465615 255336 72143 -39376
16691 -39376 -125918 -224737 -291544 -292494 -188998 73618 386770 589803 695757 831242 1102592
16680 1102592 1541219 2004233 2299978 2432669 2467218 2368331 2118796 1722033 1159761 531153
16670 531153 61687 -137652 -216705 -372250 -616307 -818782 -843134 -707523 -520283 -324112
16660 -324112 -125760 36391 151386 263044 436599 760970 1177275 1390380 1166896 582213
16650 582213 -88079 -592539 -821595 -841201 -810006 -736080 -573327 -473041 -610453 -949641
16640 -949641 -1346845 -1754495 -2220196 -2687524 -2981320 -2973853 -2615330 -1955527 -1201136 -591500
16630 -591500 -184436 95529 300168 466476 620105 719595 654585 249067 -615446 -1787969
16620 -1787969 -2922692 -3783995 -4238892 -4179087 -3674244 -3002438 -2418098 -1971772 -1672650
16611 -1672650 -1633209 -1962472 -2624367 -3442223 -4163199 -4505261 -4239782 -3421243 -2426769 -1598083
16601 -1598083 -1093538 -984290 -1237479 -1616294 -1745305 -1458878 -978303 -606976 -395568
16592 -395568 -192617 101693 472973 862411 1181624 1386454 1540891 1707466 1863247 1999558
16582 1999558 2211736 2620284 3123039 3447342 3431360 3053859 2456447 1847499 1260183 657442
16572 657442 87802 -350296 -588884 -606867 -455110 -298376 -301226 -486824 -678524 -721861
16562 -721861 -690408 -717656 -849433 -990216 -981167 -838943 -732384 -737986 -776719 -776753 -757142 -681988
16550 -681988 -370076 222482 836135 1233660 1377634 1287855 1030659 764706 630839 693715
16540 693715 925912 1206601 1400700 1364388 969640 293388 -330701 -637915 -785777 -1134265
16530 -1134265 -1800885 -2637697 -3517716 -4366749 -4977984 -5092784 -4616810 -3675191 -2655874
16521 -2655874 -2034755 -2008836 -2424016 -2863153 -2856770 -2271603 -1436942 -740319 -323359 -180285
16511 -180285 -384665 -1045263 -2065456 -3224400 -4341237 -5248357 -5804223 -5933512 -5615252
16502 -5615252 -4948938 -4161247 -3515061 -3221941 -3289933 -3474096 -3487640 -3271480 -2949680 -2549533
16492 -2549533 -2093435 -1758765 -1660567 -1723008 -1800898 -1820409 -1773974 -1676361 -1610550 -1698918 -2011659
16481 -2011659 -2510860 -3006008 -3237795 -3118472 -2823523 -2667125 -2948788 -3845088 -5270474
16472 -5270474 -6831387 -8169469 -9158433 -9676418 -9593632 -8896686 -7677874 -6175646 -4767858
16463 -4767858 -3737039 -3025803 -2346727 -1492781 -592345 -126830 -335883 -807193 -1041655
16454 -1041655 -925053 -658587 -548040 -765805 -1299531 -2070267 -2953453 -3735980 -4135479
16445 -4135479 -4008317 -3587628 -3314970 -3384300 -3573120 -3502787 -3026616 -2275281 -1432520 -622228
16435 -622228 63220 547482 798707 810635 643484 457290 391184 440108 521815 583871
16425 583871 565452 403830 73129 -388086 -838843 -1145964 -1321101 -1540909 -1890449 -2198402
16415 -2198402 -2306062 -2248162 -2090911 -1753193 -1183565 -590102 -261621 -286121 -531212 -863831
16405 -863831 -1270108 -1755176 -2194192 -2412113 -2347882 -2108281 -1858031 -1618998 -1297976 -868219
16395 -868219 -481479 -384628 -670312 -1227985 -1913855 -2643104 -3422413 -4300186 -5244450 -6042038
16385 -6042038 -6379754 -6165182 -5625973 -5030573 -4457762 -3784708 -2810637 -1509118 -150541
16376 -150541 899652 1500252 1774254 1864203 1831517 1733582 1654902 1587199 1345071 834680
16366 834680 259310 -69883 -43289 154916 345745 554929 739169 708191 438063 58914
16356 58914 -305472 -515839 -464795 -162019 265075 614589 713104 485809 -7795 -488025
16346 -488025 -622359 -323348 234520 793264 1187829 1455807 1715812 1949235 2061408 2008874
16336 2008874 1831536 1672414 1608294 1526107 1301458 993163 806461 776801 660183 215645
16326 215645 -523498 -1304413 -1928946 -2329481 -2450047 -2159379 -1357873 -208378 893236
16317 893236 1690352 2216477 2646848 3236235 4245749 5705826 7272767 8208989 7803700
16308 7803700 6215402 4312222 2729228 1606324 860309 341922 -129850 -702100 -1439976
16299 -1439976 -2338570 -3316331 -4232186 -4896095 -5086630 -4690846 -3853106 -2890137 -2075417
16290 -2075417 -1546302 -1262769 -1083143 -1007699 -1139801 -1434080 -1756441 -2092339 -2522244 -3047705
16280 -3047705 -3565820 -3988678 -4320466 -4601343 -4786841 -4742543 -4422392 -3972976 -3573779 -3258569
16270 -3258569 -2936999 -2527705 -2045708 -1563631 -1145379 -853238 -702857 -603714 -435160 -128981
16260 -128981 204975 340194 327038 451912 731590 931950 952987 838614 642580 425660
16250 425660 210513 -16842 -262264 -495218 -623336 -544455 -219175 274932 792763 1230675
16240 1230675 1630457 2089474 2593756 3087740 3540011 3861251 3967969 3915333 3810690 3677454
16230 3677454 3521044 3328705 3016971 2552481 1998142 1461172 1052294 783765 518913
16221 518913 82654 -548601 -1174451 -1558850 -1610349 -1319300 -680170 200066 1029808 1552958
16211 1552958 1797522 2021956 2409125 2820437 3007164 3032655 3145018 3386688 3632657 3880320
16201 3880320 4194183 4542902 4849793 4995772 4830255 4284867 3474939 2649039 2009599
16192 2009599 1638082 1511009 1486321 1394853 1206724 1017925 841701 576520 216216 -58872
16182 -58872 -91341 20493 77784 25417 -72164 -230761 -606092 -1356647 -2475691 -3680657
16172 -3680657 -4517194 -4700320 -4336110 -3778054 -3305700 -2941822 -2640418 -2482321 -2529281 -2682119
16162 -2682119 -2790291 -2800527 -2665799 -2296362 -1752072 -1234626 -924606 -884728 -999631 -1047959
16152 -1047959 -895562 -616563 -344125 -70069 232871 444911 406088 21892 -710814 -1641347
16142 -1641347 -2487041 -3039021 -3340892 -3572282 -3806521 -3923746 -3784645 -3379840 -2771160
16133 -2771160 -2055363 -1398889 -910067 -456642 116526 665130 883605 633624 74328
16124 74328 -437663 -595671 -397021 -60155 276458 648336 1115205 1590627 1867769 1810739
16114 1810739 1458208 971807 499512 45992 -416007 -763597 -844845 -687922 -422923 -160884
16104 -160884 12427 72152 68520 109817 284580 624229 1192609 1999654 2904368 3740486
16094 3740486 4335214 4492011 4144798 3374436 2296309 1093276 -2373 -823842 -1309284
16085 -1309284 -1462522 -1405298 -1425741 -1786559 -2480193 -3235570 -3874458 -4481937 -5082931 -5501919
16075 -5501919 -5651078 -5626890 -5491085 -5226387 -4865931 -4482588 -4111957 -3746811 -3302980 -2677735
16065 -2677735 -1968825 -1451384 -1252562 -1247782 -1267858 -1262124 -1245111 -1203350 -1182318 -1291107 -1574061
16054 -1574061 -1998171 -2538173 -3211987 -3947286 -4562604 -4921934 -5011671 -4861151 -4522320 -4104128
16044 -4104128 -3678839 -3223277 -2719797 -2268158 -2012233 -1899332 -1642202 -1084031 -355226
16035 -355226 378572 1070610 1718797 2265264 2663982 2938439 3093432 3051314 2729360 2298473
16025 2298473 2150576 2479093 3127896 3765699 4073385 3826943 2954448 1651028 361299
16016 361299 -504477 -786874 -599960 -297179 -228740 -426056 -708854 -966692 -1148643 -1204741
16006 -1204741 -1169885 -1196932 -1434824 -1903396 -2531335 -3211191 -3796628 -4136367 -4155453 -3904999
15996 -3904999 -3581541 -3375116 -3284793 -3194970 -3022127 -2772615 -2537618 -2373443 -2281766 -2278209
15986 -2278209 -2306884 -2205880 -1892303 -1416490 -726324 278592 1379545 2094715 2144479
15977 2144479 1694779 1070478 380800 -427762 -1299254 -2033950 -2490887 -2628916 -2480449
15968 -2480449 -2106018 -1544485 -899730 -288847 258982 703933 871278 580876 -82448
15959 -82448 -790698 -1253562 -1427217 -1541870 -1920750 -2692030 -3663078 -4478977 -4873323 -4815245
15949 -4815245 -4475115 -4016309 -3520796 -3119174 -3039624 -3416290 -4141767 -4952684 -5601736 -5974825
15939 -5974825 -6107261 -6101467 -5989721 -5723685 -5305527 -4780640 -4177455 -3585362 -3190197 -3048167
15929 -3048167 -2887821 -2378369 -1549174 -737155 -246205 -93437 -48533 73274 242581 356943
15919 356943 390825 332814 105425 -371931 -1069837 -1823682 -2437029 -2808462 -2954493 -2841447
15909 -2841447 -2374948 -1621931 -778225 -40772 374413 299558 -176688 -623134 -622731 -159500
15899 -159500 478713 1075894 1597339 2039916 2391108 2594643 2533859 2070114 1181193 142440
15889 142440 -619046 -895600 -856440 -848589 -1039125 -1332827 -1534433 -1511365 -1214930 -689060
15879 -689060 -164866 42365 -174904 -628712 -1029436 -1131664 -825704 -193955 570570 1275265
15869 1275265 1825571 2254379 2597200 2820862 2893362 2775699 2440081 2025137 1738871 1633538
15859 1633538 1581113 1444530 1284178 1266978 1417302 1539591 1397460 932765 240230 -533089
15849 -533089 -1241812 -1793586 -2161871 -2404302 -2620681 -2784176 -2695548 -2249888 -1630614 -1114291
15839 -1114291 -854215 -856963 -1065902 -1436832 -1889434 -2271739 -2460954 -2428299 -2179084 -1702031
15829 -1702031 -1009674 -245943 342329 643204 829884 1127146 1553629 1991556 2394446
15820 2394446 2843602 3430129 4094629 4625389 4832820 4686774 4317280 3898947 3537320
15811 3537320 3231303 2942431 2651117 2333162 2035960 1911438 2119259 2678955 3408629
15802 3408629 4109136 4656386 4963082 4989405 4726549 4243537 3727260 3311320 2989438 2833093
15792 2833093 3027610 3615761 4502179 5576419 6658887 7449461 7673162 7319160 6536618
15783 6536618 5485221 4418594 3585870 2977165 2387587 1767537 1308840 1152615 1282217
15774 1282217 1692935 2386293 3235981 4045656 4650851 4982734 5089077 5012617 4727720 4287289
15764 4287289 3881839 3653317 3584317 3558515 3418178 3065522 2632483 2418124 2591373 3088381
15754 3088381 3699253 4110685 4091708 3685783 3057170 2267007 1354368 449056 -278928 -706177
15744 -706177 -864746 -946800 -1196010 -1721043 -2301111 -2550024 -2345627 -1898282 -1481329 -1221611
15734 -1221611 -1101504 -1091066 -1070614 -887986 -562512 -252505 -58961 84241 305934 653580
15724 653580 1038299 1459452 2069776 2848048 3468710 3617548 3337840 2982939 2827870 2818732
15714 2818732 2769287 2624668 2427304 2235611 2097397 1994311 1858457 1604826 1145220 533100
15704 533100 -275 -307170 -419272 -484492 -682408 -1067973 -1598944 -2182852 -2667955 -2888834
15694 -2888834 -2755027 -2342020 -1836212 -1413130 -1158678 -1086188 -1225454 -1534992 -1752491 -1575180
15684 -1575180 -993708 -316448 64146 -46534 -468013 -773680 -660380 -191603 348641
15675 348641 745235 985119 1143369 1267687 1375384 1496826 1771777 2345987 3156475 3962306
15665 3962306 4561087 4854298 4837070 4608529 4330335 4143710 4022201 3913307 3922351 4110322
15655 4110322 4413140 4729835 5019557 5286065 5419027 5270654 4913341 4595919 4450839
15646 4450839 4440680 4496225 4469252 4141164 3453198 2555147 1592878 630577 -248697 -957088
15636 -957088 -1395120 -1467401 -1201825 -712880 -118712 529116 1242722 2046387 2940943 3832392
15626 3832392 4557168 5041221 5380070 5728933 6114220 6415570 6493177 6267533 5798196 5288890
15616 5288890 4898644 4655346 4602673 4820089 5293546 5813374 6097131 6037445 5703225 5105131
15606 5105131 4170139 2991356 1845242 927355 205477 -423711 -890477 -1003196 -724211
15597 -724211 -209352 413545 1090403 1741738 2268859 2610215 2733361 2607896 2278976 1951878
15587 1951878 1789060 1703010 1466466 1003182 481968 66593 -274346 -644746 -1087454 -1545389
15577 -1545389 -1892564 -2013819 -1862442 -1512382 -1165042 -1008497 -1072057 -1207715 -1246102 -1132501
15567 -1132501 -838525 -387542 12637 208551 316773 460540 647044 886766 1208069
15558 1208069 1618351 2033620 2340728 2514675 2597553 2694760 2915870 3293157 3773506 4332869
15548 4332869 5020699 5740574 6264696 6457570 6318557 5925222 5436899 5090137 5033131 5162606
15538 5162606 5237140 5150119 5055505 5167438 5490717 5764190 5617725 4857106 3642717 2386735
15528 2386735 1479602 1110415 1255978 1707508 2193887 2561451 2876382 3271763 3725909
15519 3725909 4094093 4204260 3962833 3384443 2530933 1490901 406396 -509352 -1047723
15510 -1047723 -1152303 -976746 -720685 -485114 -250683 36006 312635 477661 509135 344955
15500 344955 -141068 -860557 -1399605 -1363437 -769377 36521 698647 1049947 1170821 1248978
15490 1248978 1395068 1620850 1819862 1792888 1476719 1029004 736749 784171 1058366 1322467
15480 1322467 1503800 1735993 2180226 2912859 3871059 4807651 5487513 5859092 6018779
15471 6018779 6095805 6039000 5684037 5053388 4354600 3713474 3131210 2638506 2335417 2315034
15461 2315034 2527919 2800370 3020198 3144348 3104850 2888378 2602419 2365824 2247068 2276619
15451 2276619 2409378 2483520 2426117 2446503 2735133 3196685 3662587 4122651 4607000 5102157
15441 5102157 5627437 6197718 6827726 7535735 8264650 8880484 9230603 9298969 9321983 9541043
15431 9541043 9928542 10382945 10889862 11387238 11780400 12065563 12327812 12629272 12937439
15422 12937439 13166591 13293805 13317943 13184418 12931762 12674864 12427644 12141174 11752748
15413 11752748 11204963 10529627 9846536 9315563 9095616 9220421 9478244 9544291 9221161
15404 9221161 8504188 7609506 6922063 6775439 7269869 8330176 9842542 11725170 13955633
15395 13955633 16591508 19648511 23064828 26798336 30832801 35202590 40016489 45263239
15387 45263239 50469317 54495630 55859129 53781126 49036652 43335367 38057745 33783196
15379 33783196 30535494 28106330 26224236 24636849 23267718 22272813 21793552 21767498 21973634
15370 21973634 22229681 22466544 22622650 22705479 22893204 23411522 24398039 25931702 28030212
15361 28030212 30623608 33717876 37598116 42813428 49876987 59027062 70309588 83692172
15353 83692172 98831474 114456510 127748625 135027315 134335170 127146728 116920882 106681089
15345 106681089 98120817 91944369 88402665 87635054 89599101 93745500 98652191 101918844
15337 101918844 101028388 95135946 85749280 75324887 65673205 57554788 51071342 46004813
15329 46004813 42019252 38795692 36004679 33390758 30845790 28374190 26100558 24139046
15321 24139046 22523911 21191218 19971640 18840080 17997805 17555697 17378738 17297703 17239620
15312 17239620 17098908 16719855 16103050 15488306 15241358 15630116 16699014 18312291 20152739
15303 20152739 21675625 22307503 21888855 20787562 19462099 18059132 16559473 15078015
15295 15078015 13803458 12837621 12194239 11853683 11800689 12024059 12559224 13481338 14848790
15286 14848790 16648638 18686540 20635101 22141162 22874075 22714488 21846698 20623634
15278 20623634 19338937 18095889 16942038 16023509 15473150 15313799 15512166 16031949 16853878
15269 16853878 17864050 18790934 19350476 19424506 19120993 18714650 18465024 18476852 18734654
15260 18734654 19155468 19636835 20134171 20672657 21202003 21516671 21472645 21081939 20502027
15251 20502027 20020415 19786868 19652197 19459109 19297245 19409382 19982507 20994214 22211436
15242 22211436 23315150 24074118 24542159 24978991 25625624 26572499 27717805 28881344 30016248
15233 30016248 31241759 32671641 34349592 36345715 38741398 41510903 44596176 48130973
15225 48130973 52389471 57620456 64064145 71916980 81244013 92147965 104938463 119981620
15217 119981620 137351697 156601785 176829438 196619355 213870040 226110909 231405934
15210 231405934 229321176 221326628 210141817 198449161 188046303 179920318 174711443
15203 174711443 172929405 174985403 181208772 191823974 206918587 226377028 249636394
15196 249636394 275341211 301102107 323388580 338019069 341677025 333564591 315745972
15189 315745972 291884983 265518531 239206481 214545294 192423488 173289831 157209527
15182 157209527 143817473 132527960 122835451 114415006 107129039 101005354 96097382 92334200
15174 92334200 89464716 87170587 85234878 83617312 82440168 81824630 81735436 81972434 82323361
15165 82323361 82742875 83323062 84175979 85468315 87374771 90006753 93583654 98520187
15157 98520187 105250850 114027969 124875902 137661961 152129339 167830187 183954884
15150 183954884 199107148 211444539 219405483 222665425 222485672 221027246 220427794 222364137
15142 222364137 227994204 238103414 253245516 273626838 298766240 327152454 355937408
15135 355937408 380853147 397028579 400729618 391050168 370288483 342746604 312951567
15128 312951567 284350038 258843656 237078010 219123462 204973580 194682060 188246622
15121 188246622 185481702 186159519 190217898 197691257 208453136 222078114 237979451 255318540
15113 255318540 272482849 286758596 294835718 294246587 284717451 268241441 247999117
15106 247999117 227012037 207313476 189887997 175079065 162857145 152874221 144623011
15099 144623011 137575700 131241205 125206960 119237214 113283524 107384287 101624423 96163908
15091 96163908 91113791 86398807 81904998 77651723 73789316 70520715 67965209 66118679
15083 66118679 64930072 64286423 64059371 64212266 64667481 65205694 65588716 65677903 65584539
15074 65584539 65573190 65792933 66266441 66951689 67692982 68327554 68891942 69541901 70329362
15065 70329362 71240925 72297284 73536337 74993758 76710533 78638322 80620032 82506989
15057 82506989 84195189 85597752 86701540 87609598 88344619 88767411 88720636 88134072 87025083
15048 87025083 85423677 83464782 81569716 80247472 79660126 79596203 79734212 79685948 78903794
15039 78903794 76879042 73561463 69373381 64933250 60773416 57157869 54072656 51267718
15031 51267718 48460744 45559672 42667622 40032940 37918153 36370050 35188319 34118494
15023 34118494 33083333 32201698 31582102 31269245 31305195 31728628 32505710 33576388 35011012
15014 35011012 36888560 39266143 42225555 45538198 48463731 49985485 49454210 47145342
15006 47145342 43946284 40674692 37880344 35877643 34636961 33900186 33414251 32907266
14998 32907266 32110595 30957964 29575116 28157446 26827805 25476215 23933349 22233370
14990 22233370 20572056 19164643 18116706 17399519 16924232 16616201 16439765 16375769 16363364
14981 16363364 16286007 16074402 15763085 15477883 15305837 15172332 14957981 14620574 14157083
14972 14157083 13620593 13059047 12489494 11995810 11709676 11632411 11584735 11368372 10827838 9922137
14962 9922137 8808578 7748413 6924796 6401707 6145075 6064293 6118799 6226326 6204047 5960362
14952 5960362 5586729 5242714 5042594 4946130 4824723 4675019 4616844 4725739 4964617 5290416
14942 5290416 5734203 6337633 7067356 7846324 8619131 9322686 9868421 10206199 10363682
14933 10363682 10388930 10330334 10261469 10206889 10131834 9991473 9730540 9282292 8717310 8268041
14923 8268041 8081927 8135160 8353792 8687163 9074866 9398197 9510037 9481578 9582368 9969600
14913 9969600 10615622 11383441 12146832 12954433 13967984 15292932 17027422 19289224 22148383
14904 22148383 25625870 29665253 34058651 38551910 42944139 47004261 50545769 53373634
14896 53373634 54900065 54547054 52452227 49301391 45730965 42031776 38328722 34787971
14888 34787971 31631805 29073783 27189385 25850380 24824830 23932920 23162496 22607341
14880 22607341 22306384 22205287 22285716 22686643 23596947 25076739 27104399 29722028 32996760
14871 32996760 36876846 41225950 45973645 51098270 56523014 62069325 67314900 71548917
14863 71548917 73979629 74035627 71663633 67331316 61734679 55596482 49590106 44233404
14855 44233404 39721577 35894528 32511385 29519414 26867617 24376567 22051719 20152261
14847 20152261 18772404 17723525 16806274 15893314 14924423 13927121 12995161 12165533 11323218
14838 11323218 10424723 9649613 9171386 9015804 9109168 9263913 9295774 9205449 9180443 9351967
14828 9351967 9657829 10017323 10429710 10803811 10973974 10929957 10747253 10410076 9867687 9159191
14818 9159191 8374173 7604189 6970616 6528518 6172382 5825757 5606708 5652840 5923725 6301492
14808 6301492 6684907 6985950 7113106 6946077 6461214 5890819 5581763 5675362 6115137 6772559
14798 6772559 7425574 7861594 8015769 7925275 7649328 7337095 7185931 7268093 7547175 7968523
14788 7968523 8457233 8893999 9120899 9080798 8887245 8711805 8582409 8373806 8093234 7966121
14778 7966121 8123325 8467517 8829323 8990502 8785374 8267829 7573047 6783837 5954646
14769 5954646 5083634 4158382 3159088 2051955 903862 -113929 -804681 -1059284 -974021
14760 -974021 -731036 -425832 -82164 256696 529279 778417 1111973 1473058 1648417 1572571
14750 1572571 1418546 1407160 1642926 2107782 2689171 3239900 3694587 4060511 4297933 4438497
14740 4438497 4721788 5295193 5974909 6467676 6660322 6564991 6226111 5744170 5202929 4551822
14730 4551822 3753950 2994042 2505581 2316919 2258801 2158701 2046414 2080636 2336091 2768557
14720 2768557 3283693 3744456 3988559 3940773 3614323 3109151 2638587 2353418 2149425 1781456
14710 1781456 1184115 590830 271783 269674 461855 702169 878529 947712 874539 591739
14700 591739 129599 -369188 -829416 -1229168 -1487379 -1540276 -1415462 -1193037 -981188 -861726
14690 -861726 -794192 -656525 -423354 -223719 -224110 -441174 -713036 -863152 -820223 -612271
14680 -612271 -209147 467936 1315264 2103741 2744474 3311337 3854143 4316033 4689779 5055922
14670 5055922 5427375 5675058 5660033 5361695 4864383 4348080 3999949 3909182 4126730 4668564
14660 4668564 5332302 5696683 5435688 4650225 3774757 3101062 2541807 1873217 1097669
14651 1097669 425937 -50187 -455949 -921477 -1423800 -1813704 -1927081 -1674202 -1063804
14642 -1063804 -237111 492241 850711 881703 835588 874999 986566 1074375 1046399 848545
14632 848545 530075 210802 354 -105327 -270863 -627983 -1090245 -1431315 -1510124 -1328802
14622 -1328802 -996568 -731749 -716711 -911281 -1099343 -1054790 -676147 -42175 668423 1287518
14612 1287518 1724636 2032132 2364135 2795332 3268630 3660380 3865888 3930777 4007069 4103162
14602 4103162 4019843 3650686 3118138 2560931 2042253 1593329 1205064 853234 531894 280140
14592 280140 151946 153754 243368 420663 772471 1250454 1598746 1674834 1534996 1243894
14582 1243894 947893 894335 1081066 1286434 1490785 1873720 2451469 3021889 3428940 3653627
14572 3653627 3755797 3750812 3504660 2915941 2141670 1450561 985933 744268 682717 755363
14562 755363 853374 925580 1098136 1493887 2096462 2745900 3187332 3259884 2995344 2516104
14552 2516104 2003630 1690101 1688386 1935569 2215061 2245175 1941218 1504199 1202451 1172563
14542 1172563 1386646 1727303 2043486 2176383 2006733 1573828 1081001 631042 158887
14533 158887 -332100 -625910 -444608 227760 1137302 1993466 2557004 2727936 2642523 2511625
14523 2511625 2427392 2350281 2178898 1904151 1561736 1060072 310595 -523174 -1128854 -1360996
14513 -1360996 -1299743 -1104254 -895853 -750195 -705792 -668888 -432108 91169 798172 1489076
14503 1489076 1903133 1847672 1390078 851726 554130 611304 931394 1314239 1587997 1744013
14493 1744013 1888784 2093239 2282775 2325920 2260866 2257565 2445535 2869242 3478119 4153913
14483 4153913 4764016 5148849 5162698 4750214 3893115 2678654 1475476 711002 518239
14474 518239 750242 1229176 1865558 2562734 3157625 3476998 3403849 2957549 2344329 1840116
14464 1840116 1563425 1408567 1267981 1184505 1218984 1288827 1193955 870667 550856 589186
14454 589186 1085942 1738907 2204308 2463650 2619920 2629182 2440017 2096867 1659437 1152904
14444 1152904 676081 482736 719207 1221088 1730509 2164416 2648729 3282779 3938393
14435 3938393 4397084 4569978 4511507 4278072 3948699 3644119 3373595 3116140 2934239 2803791
14425 2803791 2585457 2220803 1783533 1380689 985796 476598 -107551 -564168 -733106
14416 -733106 -714358 -744265 -797449 -718393 -496946 -173274 239438 688207 1050326 1288037
14406 1288037 1535537 1869294 2185017 2359309 2351817 2214143 2004915 1673794 1153590 504241
14396 504241 -114938 -576410 -836512 -898751 -723879 -241576 472256 1195556 1712434 1949517
14386 1949517 2006615 2001634 1946843 1895369 1984434 2278439 2748013 3329404 3879207 4220184
14376 4220184 4312133 4222460 4000617 3747400 3678669 3920967 4371723 4825844 5077590 4974111
14366 4974111 4510435 3823139 3061315 2317031 1559648 672992 -358576 -1413540 -2367283
14357 -2367283 -3119991 -3562097 -3716851 -3823494 -4014709 -4146479 -4087260 -3839268 -3422186 -2907176
14347 -2907176 -2453291 -2093875 -1730320 -1310971 -824491 -328434 70632 340645 569028
14338 569028 888883 1316064 1772657 2169274 2459923 2708644 3103893 3774700 4586818 5247083
14328 5247083 5554803 5487350 5133980 4602059 3936824 3164135 2389052 1755457 1377395 1298735
14318 1298735 1416274 1509844 1375878 960476 370804 -245306 -820999 -1413172 -2094961 -2738947
14308 -2738947 -3066013 -2963776 -2585169 -2133823 -1678897 -1254104 -872785 -456981 59087
14299 59087 636779 1154039 1427836 1322704 928425 570195 470450 509827 441465 167080
14289 167080 -214631 -537386 -683395 -583240 -220843 319359 847933 1162665 1159270 910314
14279 910314 602202 364347 209269 111277 60333 -28593 -262775 -551455 -689688 -635345
14269 -635345 -478098 -303589 -136385 80921 385692 661340 664058 294675 -267168 -743369
14259 -743369 -975605 -947654 -701720 -238498 508056 1394353 1957715 1872294 1293894 624849
14249 624849 126302 -89388 54106 491203 964161 1210121 1207291 1099228 956438 791149
14239 791149 610951 384472 87692 -226800 -467593 -494415 -137374 618451 1560606 2368763
14229 2368763 2798502 2837287 2667888 2465049 2292430 2194309 2263752 2520677 2872928 3186542
14219 3186542 3327285 3216747 2838868 2205849 1423435 703188 186758 -160330 -383765
14210 -383765 -506166 -604260 -690220 -638191 -304701 375685 1343298 2408998 3303228 3714282
14200 3714282 3464975 2740561 1969970 1499661 1469599 1791689 2246560 2693524 3072829 3310425
14190 3310425 3415909 3526305 3771259 4110447 4322293 4179771 3603743 2677545 1612209
14181 1612209 698592 199306 241905 728951 1367906 1899576 2218074 2356996 2412563 2420983
14171 2420983 2354965 2237398 2135172 2065552 2057724 2202331 2516430 2785823 2701748 2168478
14161 2168478 1386433 602343 -74202 -532071 -621183 -348048 130978 692923 1293186 1862368
14151 1862368 2200183 2068213 1484110 774287 267168 48411 119524 537955 1248289 1972253
14141 1972253 2389814 2336542 1814090 1048635 388396 -52854 -428392 -883297 -1399486 -1914038
14131 -1914038 -2329919 -2468157 -2283677 -1932828 -1544413 -1146203 -749142 -387333 -130788
14122 -130788 -13796 16575 41210 182885 587994 1242337 1948570 2454072 2625172 2574463
14112 2574463 2415076 2078300 1542113 960338 443954 -13628 -474511 -1073916 -1853731
14103 -1853731 -2633124 -3125112 -3095749 -2524957 -1653103 -794718 -133670 327749 583310 524956
14093 524956 148708 -309948 -606514 -652793 -384746 171198 769883 1232215 1545384 1675385
14083 1675385 1561290 1172673 525106 -275423 -1029706 -1525390 -1651982 -1457220 -1055885
14074 -1055885 -575431 -179980 -2202 1455 76409 513333 1364612 2325029 3021720 3430520
14064 3430520 3777609 4106122 4243132 4063962 3606732 3012998 2477619 2146453 1983821
14055 1983821 1904716 1904901 1933535 1875104 1663604 1385736 1276110 1451831 1800315 2098686
14045 2098686 2170903 2067483 1927076 1743669 1384846 676763 -324684 -1243373 -1723571
14036 -1723571 -1726842 -1510973 -1291671 -1039731 -677230 -229859 249232 752139 1280796 1773165
14026 1773165 2139066 2340041 2396952 2315313 2101605 1829205 1592023 1479106 1604660 2017252
14016 2017252 2627611 3300701 3931933 4336058 4327203 3961410 3498937 3175850 3031669 3024992
14006 3024992 3176672 3483644 3826217 4019245 3889554 3403053 2787297 2368571 2339587 2731967
13996 2731967 3394846 4031911 4410717 4496623 4366113 4110462 3834025 3637945 3487598 3184574
13986 3184574 2626196 1983541 1422863 875092 216292 -580602 -1407728 -2049794 -2397463
13977 -2397463 -2579120 -2715504 -2799544 -2751393 -2420013 -1730916 -758592 437637 1746889
13968 1746889 2905072 3660126 4002483 4159386 4295767 4383107 4311674 4013345 3513418 2996586
13958 2996586 2719959 2821189 3244903 3771664 4148194 4149548 3658490 2836452 2062637 1576217
13948 1576217 1296624 1034361 625422 -46606 -892459 -1615896 -1953452 -1852746 -1381547
13939 -1381547 -686711 -38068 309380 262788 -147259 -742553 -1161309 -1139057 -787860 -372346
13929 -372346 -52954 106610 115757 55113 15554 17050 21888 -4615 -71797 -181617 -393238
13918 -393238 -763453 -1172370 -1440535 -1505231 -1365665 -1008216 -406847 440401 1372693 2052969
13908 2052969 2307734 2338877 2411423 2468584 2262147 1745961 1061751 426901 140149 336893
13898 336893 885530 1577789 2214450 2670156 2940374 3040605 2878805 2362501 1574576 753719
13888 753719 94968 -325114 -479503 -370588 -10335 532515 1075308 1412721 1474512 1307530
13878 1307530 964579 551978 244848 164241 281669 446453 584515 776463 971061 955383
13868 955383 753058 622879 654527 739942 806953 754287 419208 -227976 -1112697 -2150015
13858 -2150015 -3126057 -3756874 -3930260 -3804848 -3679160 -3692064 -3758297 -3827824 -3954239 -4122133
13848 -4122133 -4190480 -4083947 -3861326 -3535549 -3105136 -2628997 -2155632 -1665666 -1114826 -491639
13838 -491639 123795 554830 652602 410241 -129721 -847017 -1414073 -1579859 -1388554 -970979
13828 -970979 -446404 19339 244154 54791 -564741 -1368906 -2134761 -2808579 -3343543 -3665592
13818 -3665592 -3684482 -3336432 -2718960 -2049321 -1468402 -1009845 -623131 -255873 48448 256532
13808 256532 364265 293995 3482 -379617 -651279 -738895 -726188 -719272 -806306 -975197 -1054183
13797 -1054183 -908028 -613910 -454992 -640748 -1032088 -1367925 -1552224 -1581154 -1487590 -1354484
13787 -1354484 -1243207 -1108470 -895746 -611632 -338468 -268692 -483026 -801325 -993364 -1037052
13777 -1037052 -1095683 -1261505 -1447325 -1511478 -1402497 -1154050 -774041 -320558 25217 159668
13767 159668 184505 215043 250509 334040 564126 962124 1406853 1670103 1633543 1376932
13757 1376932 1061193 883769 966467 1240199 1553133 1723980 1659174 1544982 1626393 1815145
13747 1815145 1782743 1386846 819942 356268 94169 -33956 -112408 -247987 -564953 -961861
13737 -961861 -1173781 -1160379 -1136098 -1200074 -1214422 -1098167 -934121 -815681 -778936 -780037 -755627
13726 -755627 -717727 -707302 -616562 -256897 390223 1174788 1893836 2465708 2956537 3411146
13716 3411146 3805340 4082850 4194203 4160574 4086855 4004572 3724373 3019760 1892122 577204
13706 577204 -602959 -1413666 -1784269 -1755711 -1520150 -1290937 -1120377 -999771 -855788 -560081
13696 -560081 -62160 616359 1336763 1841449 1985981 1785350 1315816 707070 101410 -449361
13686 -449361 -1001699 -1609307 -2286210 -3080116 -3999127 -4939785 -5734416 -6206804 -6242824 -5867040
13676 -5867040 -5247168 -4554591 -3899506 -3370541 -2992153 -2695813 -2436519 -2215653 -1920455
13667 -1920455 -1444273 -891567 -403436 39589 490275 833913 933292 848349 761976 757260
13657 757260 824913 971562 1136173 1222260 1273181 1404829 1585092 1627940 1426213 1122161
13647 1122161 990570 1133206 1390557 1562050 1671330 1887490 2231504 2491200 2419599 2104704
13637 2104704 1899971 1960632 2150419 2261931 2161212 1818053 1257486 513746 -306711 -983208
13627 -983208 -1305900 -1272181 -1010042 -648919 -323588 -178141 -387685 -1031392 -1892790 -2640137
13617 -2640137 -3105323 -3284167 -3243831 -3091942 -2921483 -2694945 -2255040 -1483302 -430552
13608 -430552 735931 1859235 2762566 3262811 3377187 3303178 3190769 3085508 2987777 2822419
13598 2822419 2522221 2217884 2165265 2474421 2930424 3187662 3194460 3153938 3150003 3118132 3023565
13587 3023565 2913615 2868593 2926189 3039163 3115848 3095380 2990924 2923039 3004007 3166870
13577 3166870 3216687 3144277 3141431 3331413 3715647 4214520 4660035 4865720 4787659 4581115
13567 4581115 4531348 4863110 5528656 6301381 7090118 7937013 8806416 9620876 10409253 11258224
13557 11258224 12114895 12779684 13139495 13226142 13130855 12931537 12572948 11949114 11118701 10304710
13547 10304710 9586967 8846305 7950185 6884059 5877719 5234623 4987633 4865083 4594112
13538 4594112 4105977 3518128 3009171 2712329 2705456 2989833 3457723 3976911 4477639 4876479
13528 4876479 5019634 4839874 4538293 4362931 4253780 3989597 3517197 2948464 2421918
13519 2421918 2057006 1973902 2264125 2871836 3563664 4079148 4329427 4356391 4232797 4008201
13509 4008201 3646941 3119779 2515918 2036889 1834779 1891803 2105528 2319946 2325239 2059210
13499 2059210 1679187 1410885 1420966 1742781 2201791 2543963 2642305 2544331 2363783 2103175
13489 2103175 1760300 1463091 1351425 1464337 1759215 2164599 2613368 3079609 3557065
13480 3557065 3947061 4119681 4102895 4069374 4116404 4130195 3946927 3541380 2994913 2460397
13470 2460397 2082806 1921769 1925357 1887727 1621003 1145120 605952 156443 -129744 -382713
13460 -382713 -742944 -1117852 -1277985 -1195021 -1148853 -1350812 -1752514 -2192151 -2395637 -2038367
13450 -2038367 -1082021 156648 1266255 1945502 2138617 2033217 1886048 1830068 1770269
13441 1770269 1554305 1290768 1188960 1235952 1325281 1453496 1681796 2027560 2400916 2667382
13431 2667382 2820355 2963033 3172585 3488841 3950539 4540944 5017084 5019808 4466542 3541707
13421 3541707 2365543 1023488 -214251 -959677 -1011725 -582587 -65768 333929 582539
13412 582539 652277 544314 361285 310787 625233 1347552 2277301 3109048 3621259 3731524
13402 3731524 3444815 2927190 2407262 1976168 1648722 1501235 1583801 1862334 2212310 2479457
13392 2479457 2625281 2657199 2564781 2390596 2215233 2094724 2057765 2143828 2328092 2487370
13382 2487370 2570031 2665129 2904413 3349527 3883019 4273633 4397181 4315331 4150361 3969482
13372 3969482 3806342 3734941 3830157 4037761 4254119 4460492 4589998 4477719 4024908 3280110
13362 3280110 2467259 1861111 1558074 1473297 1485485 1533139 1635653 1810784 1950166 1826645
13352 1826645 1289416 411459 -580278 -1493933 -2251600 -2755827 -2865117 -2605915 -2238338
13343 -2238338 -2000532 -1891356 -1854497 -1917741 -2005629 -1964895 -1826728 -1810296 -2105607 -2623667
13333 -2623667 -3080458 -3375094 -3691709 -4232739 -4915300 -5449593 -5596791 -5332157 -4847152
13324 -4847152 -4277891 -3554352 -2573316 -1416410 -362085 278835 417385 278122 170337
13315 170337 248555 509530 848094 1142971 1339751 1430372 1441165 1394463 1294700 1207706 1273997
13304 1273997 1582437 2001820 2286408 2361604 2350618 2391373 2491801 2565658 2595655 2706248
13294 2706248 2953294 3234881 3427742 3465783 3409720 3325868 3149080 2877719 2658019 2592988
13284 2592988 2640253 2687866 2666617 2533135 2236150 1794429 1296170 843956 545740 509736
13274 509736 763434 1128944 1300198 1131677 781581 527156 564850 936077 1520757 2154209
13264 2154209 2691149 3059341 3359844 3716337 4087880 4353698 4464185 4397778 4086797 3567502
13254 3567502 3062392 2723661 2452042 2149009 1955304 2001780 2180735 2391747 2675504 3038946
13244 3038946 3374298 3497566 3287132 2895739 2567963 2351161 2099535 1589513 761799
13235 761799 -166442 -890224 -1224221 -1228421 -1102453 -882219 -441632 242448 1029604 1737125
13225 1737125 2212436 2389639 2358584 2303163 2306930 2271157 2086912 1829200 1592175 1258871
13215 1258871 634512 -226745 -1001663 -1427786 -1507739 -1339638 -928123 -262372 576410 1351512
13205 1351512 1782774 1804324 1629821 1536317 1618015 1767377 1814864 1661694 1324271 893448
13195 893448 546922 503036 829780 1407925 2015165 2456523 2650505 2574398 2283852 1916670
13185 1916670 1545744 1178822 871974 684485 592059 507326 419313 433780 585738 829622
13175 829622 1175651 1578953 1886171 2016842 2010796 1984580 2058777 2182130 2202487 2094180
13165 2094180 1916423 1697849 1440148 1100293 607241 -16675 -627987 -1114119 -1463606
13156 -1463606 -1727271 -1936777 -2051573 -2068070 -2006435 -1777093 -1304998 -722507 -289564 -168169
13146 -168169 -331553 -598492 -728829 -591192 -265232 77408 333461 470233 519245 621398
13136 621398 880165 1214145 1485565 1567983 1370978 940371 422483 7498 -142347 -21081
13126 -21081 179897 241873 72916 -285504 -722901 -1214937 -1815211 -2518329 -3255075 -3932393
13116 -3932393 -4432547 -4705959 -4857499 -4980418 -4972052 -4702327 -4253786 -3882898 -3846803 -4183713
13106 -4183713 -4597611 -4704711 -4386639 -3822216 -3202281 -2660683 -2306598 -2067410 -1750553
13097 -1750553 -1287539 -704593 -64740 372038 303784 -206258 -771649 -1114667 -1249057 -1289062
13087 -1289062 -1248743 -1105261 -917913 -807681 -795747 -720662 -421537 27842 369585 443361
13077 443361 268606 -103980 -615621 -1104461 -1387389 -1374768 -1096476 -684020 -305398 -78179
13067 -78179 92383 395713 864990 1386092 1814937 2153508 2565861 3128039 3664750 3950788
13057 3950788 3946961 3775701 3596438 3424431 3052399 2253310 1034474 -340535 -1506144
13048 -1506144 -2227672 -2485863 -2368613 -2009165 -1530549 -1035533 -670076 -555386 -588215 -473355
13038 -473355 -34473 617815 1205535 1547441 1676347 1763696 1951677 2213875 2480003 2749824
13028 2749824 2985954 3039053 2796732 2361155 2084989 2250280 2800171 3488921 4138627 4737084
13018 4737084 5285103 5699623 5887825 5843985 5631791 5362606 5188375 5175264 5255222 5376535
13008 5376535 5497231 5532209 5439332 5211401 4847737 4449785 4137152 3874633 3516164 2969585
12998 2969585 2272749 1518338 762746 86941 -405839 -708969 -927085 -1184977 -1486054
12989 -1486054 -1726041 -1878004 -2040951 -2240903 -2381671 -2339810 -2015547 -1462575 -932430 -702313
12979 -702313 -859442 -1240557 -1605599 -1790836 -1783858 -1748138 -1916282 -2402484 -3050667 -3535631
12969 -3535631 -3648334 -3449932 -3153636 -2853403 -2494518 -2069623 -1656982 -1328714 -1075635
12960 -1075635 -821091 -530868 -313094 -281089 -367263 -485630 -686730 -1069117 -1692532 -2463546
12950 -2463546 -3108031 -3368021 -3180867 -2648464 -1908191 -1030153 -24691 978015 1728467
12941 1728467 2133457 2321854 2401306 2331960 2038030 1563503 1112599 879800 895292 1071591
12931 1071591 1337746 1594700 1639781 1314983 682275 -67107 -771722 -1272877 -1386705 -1051983
12921 -1051983 -465285 55384 263504 142609 -127999 -359727 -444913 -382758 -302500 -338121
12911 -338121 -546947 -892532 -1256688 -1550304 -1725091 -1733380 -1592685 -1445747 -1479734 -1731916
12901 -1731916 -2133726 -2612674 -2989155 -3114718 -3095229 -3099472 -3101346 -3038583 -3029737 -3208057 -3595042
12890 -3595042 -4087855 -4491529 -4774078 -5081365 -5447071 -5757829 -5866310 -5671591 -5218470
12881 -5218470 -4612697 -3915554 -3159432 -2378965 -1717095 -1378379 -1389027 -1591947 -1878254 -2208583
12871 -2208583 -2461483 -2527044 -2368225 -1908678 -1123560 -208375 520678 861691 840152 678986
12861 678986 529554 308961 -87760 -650468 -1331134 -2101901 -2881235 -3559946 -4064456 -4309721
12851 -4309721 -4264119 -4037327 -3718034 -3220508 -2459970 -1643839 -1122299 -990134 -1091105 -1288945
12841 -1288945 -1483147 -1490491 -1199257 -735034 -282390 93917 417886 670428 809238 957159
12831 957159 1203594 1338976 1154091 793557 563674 618575 899621 1221697 1387139 1292301
12821 1292301 968715 533489 109601 -228181 -435925 -448625 -189890 283337 710282 877598
12811 877598 866538 920982 1105762 1119046 630232 -271886 -1214066 -1934264 -2394456 -2593027
12801 -2593027 -2514612 -2287910 -2140904 -2217687 -2533829 -3032901 -3630041 -4222339 -4653672 -4793608
12791 -4793608 -4724444 -4674434 -4758209 -4795522 -4484968 -3810777 -3046864 -2524588 -2412859 -2577299
12781 -2577299 -2773338 -2923719 -3079261 -3244716 -3285659 -2969790 -2180031 -1113137 -149024
12772 -149024 507305 882634 1000504 838760 494026 154357 -155666 -559680 -1054642 -1497088
12762 -1497088 -1774512 -1846680 -1675059 -1254736 -704771 -183379 249312 606515 879732 1035412
12752 1035412 1080469 1080552 1126836 1297673 1622850 2052631 2410866 2499481 2333456 2207336 2396852
12741 2396852 2804964 3103648 3129145 2993240 2889021 2806493 2558546 2061735 1408434 840131
12731 840131 659114 954359 1457903 1811897 1908215 1860717 1849921 1976398 2157557 2217411
12721 2217411 2097072 1934296 1857239 1880068 1973525 2067231 2117333 2104978 2033930 1979631 1951743
12710 1951743 1845549 1626747 1387744 1186361 960072 679726 479168 480056 580582 504185
12700 504185 50682 -719931 -1590358 -2325381 -2725165 -2666957 -2165685 -1409843 -642992 44363
12690 44363 764939 1575085 2294667 2721174 2772841 2468260 1900040 1131699 203707 -751115
12680 -751115 -1548096 -2116581 -2520305 -2843861 -3063656 -3014392 -2634995 -2170315 -1932181 -1955228
12670 -1955228 -2038958 -1987799 -1717733 -1361465 -1255285 -1639596 -2432427 -3295632 -3828316 -3818640
12660 -3818640 -3361100 -2619350 -1663650 -648464 247323 1009630 1613941 1900030 1778047
12651 1778047 1370623 854243 215381 -594656 -1322961 -1606007 -1391859 -962946 -620172
12642 -620172 -500262 -581982 -709855 -753972 -780217 -968942 -1346564 -1741883 -2064866 -2388753
12632 -2388753 -2756591 -3121846 -3422115 -3618297 -3661781 -3505282 -3154540 -2571462 -1707445 -712807
12622 -712807 100696 529021 629089 624502 726839 918824 1013897 965574 886002 857721 901817
12611 901817 1036023 1187968 1212198 1133663 1146270 1342953 1626973 1924563 2328473 2917712
12601 2917712 3620426 4263742 4608238 4409884 3590446 2344442 990030 -185054 -939337
12592 -939337 -1223192 -1175133 -891581 -418935 125223 519742 593590 422089 202118 17864
12582 17864 -216771 -604024 -1036230 -1320217 -1398506 -1296950 -917651 -216083 552957 1140626
12572 1140626 1571691 2001188 2503646 2987344 3272298 3246967 2940266 2443721 1843692 1226610
12562 1226610 659400 155591 -316110 -736436 -979923 -931980 -615636 -170763 296179 699795
12552 699795 858793 628167 64326 -620252 -1264983 -1819488 -2250960 -2509074 -2532822 -2278663
12542 -2278663 -1722613 -869123 178968 1171332 1806166 2010997 1982200 1926610 1884726 1716475
12532 1716475 1263222 553815 -212864 -815785 -1174218 -1434983 -1671973 -1740149 -1549894 -1216357
12522 -1216357 -941616 -819457 -858569 -1093616 -1468224 -1767095 -1846632 -1843336 -1985437 -2308660
12512 -2308660 -2684196 -2967158 -3029342 -2819110 -2399018 -1908660 -1504687 -1275450 -1215136 -1281339
12502 -1281339 -1398910 -1415226 -1206117 -838680 -503051 -245443 83179 530594 931885 1126766
12492 1126766 1017085 535549 -241559 -1049197 -1584107 -1705704 -1445597 -929827 -397941
12483 -397941 -127352 -204473 -470053 -717206 -877329 -1010374 -1091441 -1051451 -964490 -888434
12473 -888434 -685413 -296187 119080 513088 926248 1278172 1490203 1544229 1486844 1521471
12463 1521471 1859664 2453062 3022898 3287292 3129302 2608647 1872818 1100346 497948
12454 497948 225891 332242 728058 1194905 1542993 1785701 2071930 2468433 2875555 3131333
12444 3131333 3161990 3000066 2666775 2211541 1735378 1297535 894871 430405 -177452 -822597
12434 -822597 -1276186 -1326898 -925460 -293463 214403 337929 116973 -131149 -148073 12645
12424 12645 142025 148685 109896 188157 498018 997190 1517015 1867310 1981479 1983024 1985731
12413 1985731 1943089 1803938 1676268 1696131 1783560 1704696 1352356 777363 94556 -444333
12403 -444333 -562893 -282633 109354 344187 312961 38496 -341928 -587491 -558524 -339607
12393 -339607 -7465 421703 819501 972189 727705 102477 -680712 -1296480 -1576885 -1635381
12383 -1635381 -1673811 -1803808 -2080553 -2500808 -2933956 -3199712 -3234476 -3125601 -2962820 -2743855
12373 -2743855 -2478913 -2244841 -2150680 -2233799 -2412216 -2587469 -2709981 -2761071 -2719365 -2585597
12363 -2585597 -2365958 -2065245 -1709910 -1367475 -1147776 -1079876 -1051809 -930763 -651749 -242343
12353 -242343 180443 471788 593045 587694 458121 309515 318220 516532 786583 1001336
12343 1001336 1098517 1038413 764535 283445 -290248 -889888 -1521020 -2121577 -2577328 -2885454
12333 -2885454 -3153672 -3377951 -3393311 -3106761 -2653851 -2238731 -1930489 -1647338 -1283831 -801528
12323 -801528 -180297 542214 1241101 1816887 2298450 2787844 3259841 3566617 3611337 3374286
12313 3374286 2882309 2300067 1861682 1672337 1707421 1853030 1920526 1721617 1192252 413546
12303 413546 -494318 -1409492 -2246756 -2932480 -3421791 -3742964 -3904641 -3958912 -4029816 -4085066
12293 -4085066 -3950871 -3564730 -2990373 -2275647 -1474772 -757079 -344699 -321377 -481179 -507882
12283 -507882 -303221 3709 203124 171536 45590 79904 287228 404774 151016 -545862
12273 -545862 -1417224 -2074784 -2406314 -2534456 -2512788 -2305701 -1936552 -1423539 -715735 116214
12263 116214 803346 1153730 1219944 1144898 1117543 1325217 1678580 1823783 1561852 1055661
12253 1055661 575361 241886 -39421 -447767 -998190 -1502123 -1812633 -1944787 -1935060 -1825069
12243 -1825069 -1678331 -1478204 -1144266 -595419 132931 750525 923634 537842 -271828
12234 -271828 -1217940 -2066771 -2620583 -2669677 -2180840 -1328122 -389574 349347 756452 922706
12224 922706 1002860 994554 753058 239588 -443547 -1158108 -1747821 -2093005 -2160760 -1952721
12214 -1952721 -1489121 -926200 -528548 -459580 -674862 -982534 -1153642 -1076438 -838869 -558842
12204 -558842 -306342 -160542 -157801 -237392 -310409 -351683 -422658 -570695 -710426 -754077 -741238
12193 -741238 -707095 -646614 -588174 -569052 -594649 -685553 -888761 -1142481 -1271680 -1208687 -1029250
12182 -1029250 -855920 -808748 -928720 -1121086 -1287661 -1436874 -1557290 -1541126 -1342626 -1067797
12172 -1067797 -760078 -314454 314007 1029481 1664105 2155619 2606826 3051655 3305632
12163 3305632 3154498 2603892 1901045 1373360 1184761 1229837 1284906 1192285 934248 639818
12153 639818 448729 392727 383866 296959 99306 -71471 -51480 113420 238589 212340 79609
12142 79609 -37969 -110085 -230747 -483690 -898903 -1479469 -2124863 -2704034 -3243567 -3821359
12132 -3821359 -4401532 -4836864 -5007132 -4931279 -4703691 -4431123 -4213216 -4087903 -4068556 -4224633
12122 -4224633 -4558290 -4876312 -4947474 -4698195 -4193633 -3502073 -2683526 -1863559 -1126486 -372855
12112 -372855 493201 1325462 1875850 2037728 1843922 1384918 870172 488545 217834 -30986
12102 -30986 -297384 -586464 -760319 -581234 -16769 673594 1184408 1397775 1407857 1363674
12092 1363674 1378021 1486801 1638784 1768616 1828700 1787171 1665900 1529905 1468088 1563271
12082 1563271 1844918 2259105 2584753 2572670 2316599 2157155 2190855 2236146 2120160 1798849
12072 1798849 1376170 1014180 751669 501432 273881 212153 370660 630878 810586 756558
12062 756558 457424 45810 -335774 -584147 -720329 -891845 -1169984 -1466257 -1709046 -1940913
12052 -1940913 -2203063 -2449447 -2611297 -2733159 -2885161 -3021566 -3101913 -3084028 -2837126 -2325446
12042 -2325446 -1664455 -955965 -236937 436506 1031093 1614906 2185916 2607661 2830428
12033 2830428 2968016 3129742 3258404 3250425 3123093 3043806 3215562 3606519 3939717 4019378
12023 4019378 3905669 3766334 3710178 3670523 3432749 2876463 2130721 1460885 978475 554496
12013 554496 80374 -397358 -867740 -1427787 -2066943 -2590015 -2854471 -2918455 -2934265 -3028970
12003 -3028970 -3245524 -3424384 -3336460 -3055869 -2930260 -3175113 -3681792 -4272735 -4854714 -5244509
11993 -5244509 -5280434 -5015827 -4540990 -3893392 -3228610 -2699524 -2203587 -1592115 -908114 -264622
11983 -264622 305337 775591 1069676 1203292 1256762 1246699 1172546 1000322 620791 7521
11973 7521 -627901 -973772 -883021 -423937 226469 893290 1428831 1702930 1601220 1128246
11963 1128246 453399 -228658 -704334 -833447 -723215 -616827 -659903 -807842 -978082 -1239884
11953 -1239884 -1706818 -2341727 -3075719 -3850398 -4403123 -4424368 -3895643 -3052788 -2135841 -1247769
11943 -1247769 -373214 483727 1267202 1949212 2502931 2932693 3285871 3599953 3895152
11934 3895152 4138450 4164338 3762845 2952724 1960163 1020864 345514 66832 187978 636105
11924 636105 1269652 1894592 2310639 2395613 2186855 1853016 1635962 1756720 2226748 2762783
11914 2762783 2977499 2681604 2016294 1321751 910200 869748 1015057 1049483 746245 165066
11904 165066 -421425 -895986 -1322797 -1671182 -1790849 -1660184 -1446110 -1377574 -1547502 -1797454
11894 -1797454 -1905370 -1816681 -1663091 -1571256 -1518957 -1492211 -1495732 -1459208 -1302616 -1014847 -649707
11883 -649707 -293546 -31656 152816 347388 572003 740766 799616 806664 767748 598680
11873 598680 288606 -97145 -463334 -714725 -808660 -731451 -577477 -553820 -756977 -1121520
11863 -1121520 -1585017 -2067745 -2366592 -2294175 -1860317 -1210070 -579157 -229745 -249940 -590143
11853 -590143 -1094378 -1463634 -1402937 -845660 -22454 724381 1155742 1202497 975537 627273
11843 627273 196365 -237306 -501419 -537549 -491114 -531343 -650961 -736776 -688428 -429356
11833 -429356 -61580 170228 156695 -105118 -636478 -1285243 -1693715 -1672217 -1325988 -864489
11823 -864489 -465155 -231808 -201545 -389190 -698414 -915916 -924965 -746670 -446515 -79455
11813 -79455 397521 1071814 1892423 2664241 3158565 3298953 3278554 3336458 3475791 3472375
11803 3472375 3222250 2870360 2605797 2478676 2410878 2362051 2293685 2104176 1666244 930664
11793 930664 70115 -638538 -1035844 -1064101 -753722 -313113 -2574 71768 -43361 -238701
11783 -238701 -423934 -530517 -529879 -449026 -322313 -176997 13552 320734 715014 962930
11773 962930 888181 552523 51825 -521273 -1044005 -1484743 -1891759 -2252276 -2461872 -2442481
11763 -2442481 -2190763 -1703978 -972534 -96532 706999 1268918 1618211 1865116 2042387
11754 2042387 2143820 2164313 2029231 1665725 1146535 601821 45055 -604629 -1302895 -1805316
11744 -1805316 -1848627 -1365878 -462718 640756 1675596 2499844 3096207 3449581 3528895
11735 3528895 3311974 2773717 1946432 969462 -14281 -869700 -1474631 -1800217 -1845100 -1592284
11725 -1592284 -1069478 -425302 81201 230047 -11729 -524690 -1049657 -1196194 -734554
11716 -734554 173941 1171031 1990916 2469027 2496785 2145127 1669443 1229413 816148 505596
11706 505596 459829 718584 1194279 1734566 2137399 2206029 1918755 1488828 1115788 787406
11696 787406 344926 -250188 -775888 -962808 -727456 -169730 543761 1210099 1691401 2035947
11686 2035947 2372664 2709882 2887099 2727048 2231059 1569922 831455 -11814 -853951
11677 -853951 -1470826 -1723834 -1616419 -1275275 -859514 -474639 -143409 154879 484525 982497
11667 982497 1650535 2256473 2580028 2640720 2665638 2847676 3199396 3649799 4132850 4542388
11657 4542388 4737190 4620208 4288036 4030821 4077249 4384509 4668405 4657627 4218014 3301227
11647 3301227 2065767 839242 -118846 -616252 -607055 -358845 -213865 -229709 -329551 -524862
11637 -524862 -812411 -1061138 -1152611 -1070796 -804352 -397933 -30365 175295 312646 481420
11627 481420 605312 610974 594409 689003 908751 1147504 1337722 1519116 1641654 1538001
11617 1538001 1082371 288144 -646466 -1470207 -2030742 -2193189 -1893723 -1304821 -712777
11608 -712777 -236827 152725 449994 615061 612023 481672 408545 486122 594953 689978
11598 689978 840380 1015390 1134401 1217099 1370262 1653319 2033809 2410533 2644962 2670771
11588 2670771 2625083 2765110 3118101 3426343 3498631 3423405 3388403 3451953 3518631 3515040 3522555
11577 3522555 3673839 3984504 4292583 4393267 4222288 3921507 3692939 3635219 3761165 3984457
11567 3984457 4130306 4117636 3973186 3691961 3206688 2504657 1816205 1424075 1365340 1513134
11557 1513134 1800554 2215165 2685710 3060819 3184371 3051601 2783047 2518810 2382942
11548 2382942 2369637 2293709 1943926 1315526 658757 175675 -160804 -475266 -877505 -1406435
11538 -1406435 -1980489 -2387816 -2363285 -1873126 -1260622 -948285 -1042644 -1285725 -1403013 -1363082
11528 -1363082 -1252804 -1071426 -720333 -164401 482711 1019508 1300254 1297464 1068425 786955
11518 786955 656926 704427 810960 906604 949049 827262 503030 105550 -218556 -453307
11508 -453307 -668896 -875308 -1025663 -1082543 -1033686 -917253 -803738 -739208 -721403 -733698
11498 -733698 -779526 -801923 -675783 -346442 157520 757050 1319030 1793576 2223766 2501604
11488 2501604 2389661 1890777 1295921 845846 645729 780563 1266192 1967367 2642146
11479 2642146 3091879 3278285 3362675 3545732 3880908 4252603 4468471 4367917 3884446 3084002
11469 3084002 2135040 1220611 513745 185297 256343 555592 905384 1194101 1348258 1307669
11459 1307669 1064070 681382 234508 -247579 -784185 -1302685 -1611083 -1605098 -1418234 -1304913
11449 -1304913 -1398984 -1623275 -1801663 -1752420 -1426845 -986154 -605654 -317825 -11787 476684
11439 476684 1184251 1923272 2458343 2738788 2847501 2843932 2748950 2647571 2673364 2794273
11429 2794273 2818544 2642314 2289877 1800145 1206862 585518 85654 -194293 -270687 -114455
11419 -114455 309339 872092 1358680 1599373 1596591 1518392 1426067 1259050 1074697 979418
11409 979418 895619 675523 390942 231141 265728 470907 733756 840216 628560 128929
11399 128929 -492914 -1079205 -1544089 -1888535 -2181939 -2441504 -2535016 -2284247 -1683903 -1021690
11389 -1021690 -693110 -875473 -1406980 -1866979 -1779378 -1016230 111868 1249965 2183504
11380 2183504 2889048 3451267 3834189 3971183 3969039 3974614 3914813 3638532 3184523 2769400
11370 2769400 2530985 2354254 2100258 1818542 1666319 1761600 2060369 2312367 2213670 1693038
11360 1693038 995131 496703 407283 555427 560985 211264 -426594 -1176260 -1917891 -2583711
11350 -2583711 -3119369 -3475456 -3653468 -3667562 -3429229 -2851147 -2020021 -1157032 -494583 -141484
11340 -141484 -111424 -364505 -768377 -1148039 -1331995 -1196755 -717536 22119 845523 1512063
11330 1512063 1821310 1758904 1496775 1256138 1214591 1403979 1615061 1631688 1488377 1353713
11320 1353713 1264745 1103050 791988 304411 -427678 -1408664 -2452234 -3272656 -3694467
11311 -3694467 -3698836 -3297016 -2655121 -2124890 -1943668 -2169986 -2759475 -3567476 -4386712 -5051864
11301 -5051864 -5522971 -5736874 -5508771 -4747518 -3616749 -2378145 -1206912 -243517 311535
11292 311535 335017 -11295 -410997 -662607 -738907 -696413 -583969 -453803 -407359 -485115
11282 -485115 -619297 -732294 -709534 -521929 -366646 -411085 -554001 -553692 -313507 -3827
11272 -3827 140777 85843 -57596 -206314 -319948 -424900 -654054 -1134585 -1778075 -2319194
11262 -2319194 -2629888 -2781481 -2847948 -2873576 -2975834 -3281432 -3667743 -3821751 -3627176 -3250687
11252 -3250687 -2900835 -2640634 -2411592 -2174520 -1999452 -1928826 -1829724 -1602888 -1364632 -1264313
11242 -1264313 -1314783 -1435412 -1504330 -1371961 -997165 -507172 -15609 429710 709062 706867
11232 706867 476153 149943 -250308 -844762 -1614712 -2325026 -2765361 -2853202 -2616280 -2193104
11222 -2193104 -1775462 -1492269 -1329782 -1259134 -1309436 -1418046 -1441054 -1256414 -814445 -222016
11212 -222016 302778 606915 709190 716756 663172 553111 468421 407265 240794 -43000
11202 -43000 -332723 -546828 -632689 -570275 -418137 -235122 -89504 -110169 -301022 -506787
11192 -506787 -587723 -502538 -369956 -466569 -1010740 -1864960 -2609156 -2977844 -3009315 -2833367
11182 -2833367 -2543094 -2146821 -1546364 -691215 317877 1332066 2175906 2630267 2637719
11173 2637719 2363221 2005047 1658735 1272602 745837 91471 -595892 -1230632 -1767825
11164 -1767825 -2204768 -2546122 -2782043 -2851482 -2614329 -1984482 -1119691 -272352 472495 1110919
11154 1110919 1557455 1758831 1810085 1901681 2191342 2628099 3010585 3221913 3256709 3157596
11144 3157596 3014521 2908460 2797386 2509098 1924558 1111301 184716 -800327 -1742615
11135 -1742615 -2484866 -2974602 -3244335 -3207752 -2737995 -1832143 -599274 754223 1981043
11126 1981043 2876394 3336247 3295075 2688938 1607939 418459 -450269 -859801 -940378
11117 -940378 -860337 -778534 -823362 -999613 -1185548 -1246846 -1240687 -1382797 -1779943 -2407127 -3255821
11106 -3255821 -4268676 -5206750 -5853192 -6218545 -6280297 -5940042 -5307696 -4618076 -4066336
11097 -4066336 -3698872 -3366715 -2857920 -2117092 -1269298 -392631 610327 1787164 2911076
11088 2911076 3665865 3892596 3639530 3156478 2719249 2407514 2164040 1909409 1604701
11079 1604701 1340110 1253409 1419121 1807320 2208216 2273914 1814581 985402 49859 -855886
11069 -855886 -1704555 -2528064 -3372152 -4230390 -4983821 -5429966 -5356206 -4739918 -3838436 -2986789
11059 -2986789 -2467417 -2398237 -2639130 -2899482 -2990913 -3003594 -3162337 -3508872 -3912521 -4220838
11049 -4220838 -4323966 -4203744 -3864239 -3278016 -2497787 -1687777 -948545 -363563 -79261
11040 -79261 -61952 -142686 -298148 -530753 -718211 -738964 -551100 -176085 241622 508298
11030 508298 637500 813073 1115653 1444347 1687870 1888400 2177407 2618518 3146176 3650341
11020 3650341 4137629 4666571 5169055 5467758 5428841 4987307 4149251 3094656 2108561
11011 2108561 1407324 1028391 839287 784277 972783 1512611 2351491 3250709 3930557 4188252
11001 4188252 4022073 3636789 3270434 3063682 3005537 2988016 2945845 2953731 3140803 3435129
10991 3435129 3624689 3671802 3711606 3825147 4014055 4284457 4582080 4729653 4562180 4152604
10981 4152604 3746339 3546755 3572554 3654309 3605434 3340521 2943841 2633910 2490694 2330676
10971 2330676 1985089 1541502 1150761 779927 337512 -153463 -563034 -742083 -672456 -474926
10961 -474926 -236684 -18214 95755 131599 236469 434278 578188 516511 224500 -229839
10951 -229839 -761870 -1177781 -1232061 -875633 -294924 299299 766864 1063905 1292923 1561751
10941 1561751 1796095 1832688 1638284 1279179 781117 212779 -187788 -162043 255341 732444
10931 732444 968740 921526 760503 728852 981203 1495687 2112603 2551516 2582285 2274111
10921 2274111 1898649 1616678 1401483 1180639 920751 625862 286449 -128393 -621659
10912 -621659 -1186612 -1805684 -2358926 -2626780 -2563422 -2363419 -2144012 -1864499 -1445518 -793194
10902 -793194 150367 1252519 2218363 2806646 2954306 2755245 2418493 2167106 2057215
10893 2057215 2031603 2089140 2190515 2139779 1849913 1499917 1238459 1041465 936056 1034905
10883 1034905 1334062 1720409 2112136 2449692 2704894 2928356 3109278 3113932 2860123 2413873
10873 2413873 1857775 1189255 409723 -420952 -1170793 -1711930 -2007589 -2050144 -1865392 -1509601
10863 -1509601 -1059243 -681202 -473121 -270698 126590 675225 1183034 1528902 1681197
10854 1681197 1622757 1410791 1153446 916863 760770 774562 953307 1155822 1209662 999575
10844 999575 548026 15539 -458597 -860014 -1153180 -1256566 -1203437 -1112092 -1043231 -1037162
10834 -1037162 -1169744 -1437312 -1678466 -1751913 -1682333 -1566945 -1476907 -1410408 -1389425 -1533659
10824 -1533659 -1908667 -2482580 -3140177 -3670427 -3890338 -3729786 -3262560 -2727148 -2310684
10815 -2310684 -1984519 -1659357 -1321339 -995621 -606449 -68914 498711 892230 1056018
10806 1056018 1055273 984989 948051 951539 926132 874797 841943 812278 685292 378536 1825
10795 1825 -207062 -128536 163576 524859 868434 1195807 1521455 1841557 2183506 2552086
10785 2552086 2894768 3144745 3191886 2960107 2544560 2142136 1843493 1546897 1124281 688211
10775 688211 544722 822844 1329583 1788819 2125347 2446475 2755370 2842708 2632524 2342301
10765 2342301 2245385 2440344 2762017 2975847 3028189 2997518 2896600 2675332 2290855 1771245
10755 1771245 1281861 983091 889953 894587 877590 811115 711185 603607 480110 313603
10745 313603 71783 -289972 -778538 -1280062 -1587142 -1637138 -1598404 -1621308 -1700089 -1784390
10735 -1784390 -1778397 -1578863 -1207070 -747846 -223934 342281 853699 1248389 1547902 1789579
10725 1789579 2009936 2152069 2043351 1554250 723640 -226224 -1084193 -1779549 -2279082
10716 -2279082 -2580904 -2734029 -2838293 -3090560 -3615118 -4313176 -4952626 -5363239 -5629175
10707 -5629175 -5944395 -6288181 -6400203 -5984529 -4993568 -3704956 -2464735 -1507432 -883856
10698 -883856 -498033 -277783 -149140 7177 291680 695810 1052386 1243176 1325203 1396348
10688 1396348 1475357 1495606 1456702 1416025 1461929 1759985 2405523 3286843 4123579 4668743
10678 4668743 4886925 4925224 5017877 5278431 5565611 5608755 5237855 4584580 3980151 3623587
10668 3623587 3401374 3079612 2602584 2089996 1620563 1193425 770530 269469 -298720
10659 -298720 -805776 -1120328 -1180684 -1109830 -1105605 -1207812 -1336171 -1398384 -1244398 -737852
10649 -737852 15277 624708 728402 336597 -262500 -852776 -1361817 -1731406 -1887412 -1790804
10639 -1790804 -1478060 -987802 -325991 422720 1089993 1573599 1861473 1925315 1746523 1418899
10629 1418899 1119942 946959 922458 1061694 1303303 1585211 1904703 2228817 2491564 2610261
10619 2610261 2504669 2157560 1637384 1106355 679303 262077 -286350 -944403 -1588516
10610 -1588516 -2124076 -2542254 -2913012 -3241580 -3367046 -3044822 -2160065 -929055 227871
10601 227871 960039 1108999 778949 294041 51662 345947 1096062 1867295 2311141 2359639
10591 2359639 2042479 1412436 627323 -137358 -858144 -1479592 -1722193 -1394894 -703678
10582 -703678 31014 731527 1447779 2135437 2683708 2976461 2953982 2705822 2394532 2122748
10572 2122748 1916802 1798043 1735610 1647689 1497314 1257962 821063 140693 -564019 -1008923
10562 -1008923 -1135961 -1037425 -775166 -450879 -262575 -309253 -557161 -917854 -1229766 -1361294
10552 -1361294 -1340761 -1317929 -1431480 -1681937 -1922689 -1965570 -1742301 -1378768 -1099114 -1058445
10542 -1058445 -1260729 -1612772 -2013296 -2383604 -2721226 -3113565 -3611015 -4093038 -4280069
10533 -4280069 -3984258 -3297076 -2524999 -1940493 -1618276 -1470724 -1267270 -821300 -252233
10524 -252233 227033 507038 513086 199515 -400520 -1120680 -1708422 -1961868 -1874072 -1657038
10514 -1657038 -1572031 -1751906 -2170193 -2720729 -3284065 -3787736 -4192612 -4383848 -4275443 -3936047
10504 -3936047 -3444259 -2797825 -2095768 -1585539 -1438862 -1543635 -1684643 -1754282 -1731661 -1717139
10494 -1717139 -1853516 -2135290 -2438019 -2688573 -2848490 -2854978 -2731378 -2622919 -2678808 -2898092
10484 -2898092 -3096919 -3144190 -3123691 -3117500 -3092337 -3004533 -2820442 -2575596 -2344623 -2210266
10474 -2210266 -2249036 -2398554 -2418204 -2081800 -1398364 -588413 64389 362253 305969 -36606
10464 -36606 -610656 -1301263 -1991818 -2677516 -3368552 -3963835 -4352262 -4517499 -4541818 -4552116
10454 -4552116 -4615782 -4712773 -4834903 -4934208 -4833705 -4405540 -3682017 -2768248 -1846953 -1166472
10444 -1166472 -864645 -822476 -743997 -466152 -88871 195922 269881 189408 143102 218993
10434 218993 340577 400942 391977 449808 736778 1261802 1859184 2337823 2562802 2499207
10424 2499207 2289609 2166784 2180774 2185516 2111742 2019527 1974728 2001709 2012480 1883191 1688620
10413 1688620 1627307 1748365 1934072 2117177 2330784 2497115 2399918 1924719 1154668 238380
10403 238380 -699865 -1582008 -2362581 -2926390 -3086395 -2775534 -2176796 -1594882 -1186898 -897282
10393 -897282 -626539 -378685 -279174 -391104 -594413 -792053 -1055115 -1346639 -1416156 -1161428
10383 -1161428 -835768 -677522 -582808 -383283 -204515 -316048 -692154 -1078858 -1360913 -1557851
10373 -1557851 -1684520 -1797781 -1858070 -1673502 -1150872 -418062 268729 764365 1115216 1424894
10363 1424894 1788419 2202691 2525291 2582479 2304790 1779243 1203875 826303 857616 1264949
10353 1264949 1706126 1815170 1557416 1215044 1021898 981143 1079628 1314997 1493351 1395524
10343 1395524 1099623 866448 841695 1032317 1340418 1664254 2016091 2460536 3047010 3744599
10333 3744599 4218889 3975685 2937020 1580926 473962 -124463 -311250 -353161 -427276
10324 -427276 -555903 -736765 -961355 -1122858 -1115587 -907167 -518954 -49533 352700 557231
10314 557231 507143 276029 62102 8406 82826 154061 161074 119598 85427 142080 266800
10303 266800 318915 262447 260173 448386 751616 1035179 1233094 1332863 1265394 1004944 759165
10292 759165 779441 1032298 1234902 1229148 1126068 1123844 1277666 1460478 1513556 1406556 1240019
10281 1240019 1104973 974062 784087 558213 329596 46675 -366257 -932368 -1558929
10272 -1558929 -1998993 -2070196 -1940864 -1899496 -2022310 -2268284 -2602948 -2944676 -3224809 -3474528
10262 -3474528 -3695020 -3756828 -3578521 -3226847 -2787544 -2319604 -1939157 -1676348 -1382238 -981440
10252 -981440 -535655 -139210 95272 102827 -55905 -248841 -325803 -163788 156987 383372
10242 383372 312244 -69211 -687672 -1459561 -2248239 -2919366 -3424444 -3840542 -4240043 -4531076
$$ [...]
##END NTUPLES=NMR SPECTRUM
##END=
