##TITLE=31P ikalashn
LR-787-OM-C1
14.10.2024
##JCAMPDX= 6.0         $$ Bruker NMR JCAMP-DX V2.0
##DATA TYPE= NMR SPECTRUM
##DATA CLASS= NTUPLES
##ORIGIN= UXNMR, Bruker Analytische Messtechnik GmbH
##OWNER= root
$$ TOPSPIN		Version 1.3
$$ 2024-10-14 16:09:29.156 +0400  Irina@DPX200
$$ Compression mode = diff/dup
##.OBSERVE FREQUENCY= 81.01967998063
##.OBSERVE NUCLEUS= ^31P
##.ACQUISITION MODE= SIMULTANEOUS
##.ACQUISITION SCHEME= undefined
##.AVERAGES= 16
##.DIGITISER RES= 17
##SPECTROMETER/DATA SYSTEM= spect
##.PULSE SEQUENCE= zgpg
##.SOLVENT NAME= CDCl3
##.SHIFT REFERENCE= INTERNAL, CDCl3, 1, 298.5841
##AUDIT TRAIL= $$ (NUMBER, WHEN, WHO, WHERE, WHAT)
$$ ##TITLE= Audit trail, TOPSPIN		Version 1.3
$$ ##JCAMPDX= 5.01
$$ ##ORIGIN= Bruker BioSpin GmbH
$$ ##OWNER= Irina
$$ $$ F:/spectra/data/iren/nmr/P31dec/1/pdata/1/auditp.txt
$$ ##AUDIT TRAIL=  $$ (NUMBER, WHEN, WHO, WHERE, VERSION, WHAT)
(   1,<2024-10-14 16:09:04.546 +0400>,<Irina>,<DPX200>,<TOPSPIN 1.3>,
      <created by zg
	started at 2024-10-14 16:08:33.296 +0400,
	POWCHK disabled, PULCHK disabled
       terminated by command 'halt'
       configuration hash MD5:
       BE 6D 3F 07 2A EA 11 49 91 17 2B D3 AF B3 58 0D
       data hash MD5: 32K
       77 59 79 50 CE 1C 96 13 7B C8 5B 38 AC 12 A6 35>)
(   2,<2024-10-14 16:09:05.031 +0400>,<Irina>,<DPX200>,<TOPSPIN 1.3>,
      <Start of raw data processing
       efp BC_mod = 2 LB = 6 FT_mod = 6 PKNL = 1 PHC0 = 194.5578 PHC1 = 95.1705 SI = 32K 
       data hash MD5: 32K
       20 F4 A1 15 3C 4D B2 ED 8E 79 53 FB 59 31 B4 E4>)
(   3,<2024-10-14 16:09:07.203 +0400>,<Irina>,<DPX200>,<TOPSPIN 1.3>,
      <apk 
       data hash MD5: 32K
       2E E3 D9 DE 75 47 E2 53 3C 63 0C 27 D0 AD F2 87>)
(   4,<2024-10-14 16:09:09.171 +0400>,<Irina>,<DPX200>,<TOPSPIN 1.3>,
      <abs n ABSG = 5 
       data hash MD5: 32K
       33 74 90 17 FC 51 5D BC 70 5C 5F 8D 4B 4A D9 4B>)
$$ ##END=
$$ 
$$ $$ hash MD5
$$ $$ E6 6E A5 FD CA 79 A9 08 28 C5 49 31 3C 5A A6 38
##$RELAX= 
##$RELAX= 
##$RELAX= 
##$RELAX= 
##$RELAX= 
##$RELAX= 
##$RELAX= 
##$RELAX= 
##$RELAX= 
##$RELAX= 
##$RELAX= 
$$ Bruker specific parameters
$$ --------------------------
##$DU= <F:/spectra>
##$EXPNO= 1
##$NAME= <P31dec>
##$PROCNO= 1
##$TYPE= <nmr>
##$USER= <iren>
##$AMP= (0..31)
100 100 100 100 100 100 100 100 100 100 100 100 100 100 100 100 100 100 
100 100 100 100 100 100 100 100 100 100 100 100 100 100 
##$ANAVPT= -1
##$AQSEQ= 0
##$AQ_mod= 1
##$AUNM= <au_zg>
##$AUTOPOS= <>
##$BF1= 81.014009
##$BF2= 200.13
##$BF3= 200.13
##$BF4= 200.13
##$BF5= 200.13
##$BF6= 200.13
##$BF7= 200.13
##$BF8= 200.13
##$BYTORDA= 1
##$CFDGTYP= 0
##$CFRGTYP= 5
##$CHEMSTR= <none>
##$CNST= (0..63)
1 1 145 1 1 1 1 1 1 1 1 1 1 1 1 1 1 1 1 1 1 1 1 1 1 1 1 1 1 1 1 1 1 1 
1 1 1 1 1 1 1 1 1 1 1 1 1 1 1 1 1 1 1 1 1 1 1 1 1 1 1 1 1 1 
##$CPDPRG= <waltz16>
##$CPDPRG1= <>
##$CPDPRG2= <waltz16>
##$CPDPRG3= <>
##$CPDPRG4= <mlev>
##$CPDPRG5= <mlev>
##$CPDPRG6= <mlev>
##$CPDPRG7= <mlev>
##$CPDPRG8= <mlev>
##$CPDPRGB= <>
##$CPDPRGT= <>
$$ [...]
##$SW_h= 37037.037037037
##$TD= 32768
##$TD0= 1
##$TE= 300
##$TE2= 300
##$TE3= 300
##$TEG= 300
##$TL= (0..7)
0 120 53 12 22 120 120 120 
##$TP= (0..7)
150 150 150 150 150 150 150 150 
##$TP07= 0
##$TPNAME0= <>
##$TPNAME1= <>
##$TPNAME2= <>
##$TPNAME3= <>
##$TPNAME4= <>
##$TPNAME5= <>
##$TPNAME6= <>
##$TPNAME7= <>
##$TPOAL= (0..7)
0.5 0.5 0.5 0.5 0.5 0.5 0.5 0.5 
##$TPOFFS= (0..7)
0 0 0 0 0 0 0 0 
##$TUNHIN= 0
##$TUNHOUT= 0
##$TUNXOUT= 0
##$USERA1= <user>
##$USERA2= <user>
##$USERA3= <user>
##$USERA4= <user>
##$USERA5= <user>
##$V9= 5
##$VALIST= <valist>
##$VCLIST= <CCCCCCCCCCCCCCC>
##$VD= 0
##$VDLIST= <DDDDDDDDDDDDDDD>
##$VPLIST= <PPPPPPPPPPPPPPP>
##$VTLIST= <TTTTTTTTTTTTTTT>
##$WBST= 1024
##$WBSW= 4
##$XGAIN= (0..3)
0 0 0 0 
##$XL= 0
##$YL= 0
##$YMAX_a= 1029
##$YMIN_a= -1192
##$ZGOPTNS= <>
##$ZL1= 120
##$ZL2= 120
##$ZL3= 120
##$ZL4= 120
##$ABSF1= 298.5841
##$ABSF2= -158.5842
##$ABSG= 5
##$ABSL= 5
##$ALPHA= 0
##$AQORDER= 0
##$ASSFAC= 0
##$ASSFACI= 0
##$ASSFACX= 0
##$ASSWID= 0
##$AUNMP= <proc_1d>
##$AXLEFT= 0
##$AXRIGHT= 0
##$AXTYPE= 0
##$AXUNIT= <>
##$AZFE= 0.1
##$AZFW= 0.5
##$BCFW= 0
##$BC_mod= 2
##$BYTORDP= 0
##$COROFFS= 0
##$CY= 12.5935478210449
##$DATMOD= 1
##$DC= 0
##$DFILT= <>
##$DTYPP= 0
##$F1P= 47.1127640792319
##$F2P= -24.0371245302204
##$FCOR= 0.5
##$FTSIZE= 32768
##$FT_mod= 6
##$GAMMA= 0
##$GB= 0
##$INTBC= 1
##$INTSCL= 7.269226e-011
##$ISEN= 30
##$LB= 6
##$LEV0= 0
##$LPBIN= 0
##$MAXI= 12.09355
##$MC2= 0
##$MEAN= 0
##$ME_mod= 0
##$MI= 0.7550151
##$NCOEF= 0
##$NC_proc= -11
##$NLEV= 6
##$NOISF1= 298.5841
##$NOISF2= 270.0111
##$NSP= 0
##$NTH_PI= 0
##$NZP= 0
##$OFFSET= 298.5841
##$PC= 1.4
##$PHC0= 196.5489
##$PHC1= 95.1705
##$PH_mod= 1
##$PKNL= yes
##$PPARMOD= 0
##$PPDIAG= 0
##$PPIPTYP= 0
##$PPMPNUM= 100
##$PPRESOL= 1
##$PSCAL= 0
##$PSIGN= 0
##$REVERSE= no
##$SF= 81.014009
##$SI= 32768
##$SIGF1= 270.0111
##$SIGF2= -158.5842
##$SINO= 77.54984
##$SIOLD= 32768
##$SREGLST= <31P.CDCl3>
##$SSB= 0
##$STSI= 32768
##$STSR= 0
##$SW_p= 37037.037037037
##$SYMM= 0
##$S_DEV= 0
##$TDeff= 32768
##$TDoff= 0
##$TI= <>
##$TILT= no
##$TM1= 0
##$TM2= 0
##$TOPLEV= 0
##$USERP1= <user>
##$USERP2= <user>
##$USERP3= <user>
##$USERP4= <user>
##$USERP5= <user>
##$WDW= 1
##$XDIM= 32768
##$YMAX_p= 407024213
##$YMIN_p= -5977969
$$ End of Bruker specific parameters
$$ ---------------------------------
##NTUPLES= NMR SPECTRUM
##VAR_NAME=  FREQUENCY,     SPECTRUM/REAL,   SPECTRUM/IMAG
##SYMBOL=    X,             R,               I
##VAR_TYPE=  INDEPENDENT,   DEPENDENT,       DEPENDENT
##VAR_FORM=  AFFN,          ASDF,            ASDF
##VAR_DIM=   32768,         32768,           32768
##UNITS=     HZ,            ARBITRARY UNITS, ARBITRARY UNITS
##FACTOR=    1.13031516577767, 1,            1
##FIRST=     37037.037037037, 1897201,       912652
##LAST=      0,             -1641035,        1038637
##MIN=       0,             -5977969,        0
##MAX=       37037.037037037, 407024213,     0
$$ Real data points
##PAGE= N=1
##DATA TABLE= (X++(R..R)), XYDATA
$$ [...]
20181 -1183163 -1628997 -2071162 -2456313 -2598447 -2518109 -2343106 -2121362 -1901986 -1595504 -1153874
20171 -1153874 -874659 -937251 -1064975 -1085868 -971549 -767826 -724451 -907714 -919493 -591148
20161 -591148 -278537 -35589 194924 245121 154506 -62233 -356980 -579265 -723534 -705415
20151 -705415 -424903 -72307 122992 81803 -272262 -749475 -879604 -516535 -54091 301054
20141 301054 686858 1102285 1191666 889721 567669 309739 32146 -262466 -584844 -866346
20131 -866346 -978176 -777936 -346919 -7602 117300 313290 805782 1337957 1618277 1733391
20121 1733391 1718790 1608890 1595272 1676806 1632388 1484530 1498184 1711870 1935879 2041009
20111 2041009 1926668 1555331 1063553 656718 418787 274177 198985 265424 487032 681461
20101 681461 705598 391152 -375430 -1263878 -1853813 -2040122 -1908811 -1690361 -1593636 -1614506
20091 -1614506 -1676311 -1710380 -1692683 -1507901 -1150641 -771884 -501653 -454114 -666329 -1080053
20081 -1080053 -1557226 -1820793 -1723356 -1443215 -1185171 -908008 -738740 -783818 -810163 -763741
20071 -763741 -733105 -637057 -577724 -727082 -931515 -1052992 -1216222 -1406715 -1535049 -1732591
20061 -1732591 -2074875 -2391175 -2391045 -1902624 -1150998 -448692 67374 400835 465425 43686
20051 43686 -597692 -988239 -1028722 -870589 -741741 -652235 -369552 262853 1041271 1451591
20041 1451591 1294206 871005 561960 583479 806547 910781 772831 589309 570076 716809
20031 716809 1000226 1310008 1534865 1564058 1432714 1440581 1744680 2183141 2468482 2281112
20021 2281112 1745137 1252477 931723 800250 919894 1279375 1716820 2125849 2408723
20012 2408723 2451604 2115262 1312398 539859 390841 820594 1417129 1931245 2378905 2772878
20002 2772878 2947760 2805883 2424767 1851173 1100384 377691 -21311 -70351 87384 446472
19992 446472 895949 1138156 1028503 727422 396547 70066 -226467 -544885 -944557 -1386498
19982 -1386498 -1687608 -1639225 -1347494 -987538 -596743 -322944 -302930 -553363 -1029000 -1611818
19972 -1611818 -2226837 -2810560 -3137350 -3007651 -2578478 -2261531 -2210730 -2295087 -2542460 -2962451
19962 -2962451 -3227484 -3212145 -2971384 -2606113 -2216054 -1719996 -1162417 -632287 -245871 -250616
19952 -250616 -685081 -1201106 -1522517 -1729682 -1884282 -1954382 -1945908 -1838039 -1760660 -1783328
19942 -1783328 -1747217 -1446419 -960436 -393115 149108 470532 607705 697622 805710 777922
19932 777922 439589 15381 -208148 -264558 -278684 -206403 -16779 228847 382275 249457
19922 249457 -33149 -192583 -98481 98520 82507 -231218 -537548 -585206 -534738 -513794
19912 -513794 -417642 -213802 26847 259906 422358 361796 -5917 -432058 -615215 -517592
19902 -517592 -306137 -262429 -491845 -729287 -835995 -857058 -765399 -675293 -763001 -1000614
19892 -1000614 -1113483 -978288 -745530 -710411 -782907 -604437 -195721 242522 639941 1213042
19882 1213042 2111845 3075957 3793807 4112815 4057617 3675795 3177312 2847025 2716940 2630442
19872 2630442 2471329 2228014 1886539 1426742 856271 471733 552915 849396 1092169 1316809
19862 1316809 1565640 1819779 1849477 1480276 956564 620395 406264 115423 -62038 75737
19852 75737 404125 738628 1005903 1040281 713570 210782 -150010 -101582 422367 1229702
19842 1229702 1936329 2191925 1989030 1663357 1570600 1716454 1814748 1680533 1436346 1176879
19832 1176879 1007303 1062350 1247571 1315619 1152432 987408 1126620 1402825 1416314 1061406
19822 1061406 472595 -142833 -522807 -457255 -70261 302883 361070 147723 -90656 -290302
19812 -290302 -443300 -411637 -136951 251160 597279 743605 650869 492682 420865 293267
19802 293267 35038 -267511 -609811 -1054403 -1563482 -1932121 -2101129 -2127784 -2014004 -1827728
19792 -1827728 -1631870 -1404991 -1174806 -1013517 -977053 -1077706 -1310482 -1448315 -1172919 -580579
19782 -580579 34461 460609 565021 344214 153463 305209 575761 662122 669979 759894
19772 759894 1059087 1473997 1774011 1848548 1860400 1951575 1838502 1341002 670718 62877
19762 62877 -344536 -424754 -232056 -114473 -236508 -470850 -693281 -776384 -690215 -357979
19752 -357979 84881 321137 175938 -262333 -826087 -1487992 -2201355 -2696284 -2723376 -2409476
19742 -2409476 -2052428 -1830077 -1767139 -1913866 -2306912 -2633025 -2519602 -2133468 -1747085 -1149349
19732 -1149349 -273883 549926 1039501 991755 489887 -30237 -203820 -206861 -349208 -380624
19722 -380624 -108886 230518 428251 532817 615429 559517 286025 -79987 -235186 45299
19712 45299 656173 1234991 1548915 1630048 1624510 1534916 1286195 1089819 1143589 1277876 1138240
19701 1138240 809600 575772 408388 175378 63596 295322 732527 1036227 1093322 1132782
19691 1132782 1282773 1438938 1415597 1200073 790309 91774 -674076 -1226389 -1491070 -1492182
19681 -1492182 -1415597 -1315058 -1209480 -1114814 -1088645 -1178221 -1250398 -1237547 -1108943 -828337
19671 -828337 -466509 -229472 -100810 20173 60480 16677 -22518 -25729 -79986 -328987 -492251
19660 -492251 -535279 -749663 -1186427 -1623826 -1792744 -1642893 -1298523 -877472 -509782 -334435
19650 -334435 -432608 -698426 -947170 -1132520 -1241483 -1249524 -1106390 -900524 -789769 -912735
19640 -912735 -1201760 -1294496 -1067707 -641609 -406813 -539495 -712969 -772360 -821071 -1022063
19630 -1022063 -1267683 -1370409 -1340266 -1297307 -1271071 -1178103 -935325 -518859 -81784 261509
19620 261509 565337 802525 849884 806379 799104 666519 376711 135740 203626 559166
19610 559166 938967 1196876 1323976 1297504 1122549 955929 772883 437520 23667 -333028
19600 -333028 -695323 -1019742 -907680 -295428 313948 493688 242323 -90367 -198758 -89209
19590 -89209 -22740 -51039 84384 432553 924625 1628953 2516629 3150557 3201440 2726608
19580 2726608 1976750 1293026 910232 706108 519273 397328 384872 321068 56181 -269452
19570 -269452 -365665 -186877 -79331 -98919 -15281 62817 -37909 -275823 -505364 -525552
19560 -525552 -299281 -111257 -49916 9437 84824 89488 -177782 -816209 -1543226 -1967182
19550 -1967182 -2016681 -1748164 -1222126 -561646 105744 720887 1182460 1237168 1045038 989309
19540 989309 1069273 1136112 1050591 707085 180784 -256315 -370314 -190299 -32341 -6324
19530 -6324 178309 587185 998104 1205927 1125927 841532 693719 889983 1155561 1222879
19520 1222879 1094406 982404 1053279 1348197 1822758 2202530 2284252 2096018 1684771 1063717
19510 1063717 475377 132725 -24178 -38893 42325 145611 202297 134127 -17949 -26509
19500 -26509 80689 101947 -33337 -307070 -666242 -1024553 -1407772 -1806230 -2159531 -2346612
19490 -2346612 -2199708 -1747433 -1164004 -656376 -317516 -48804 173629 101128 -209594 -436437
19480 -436437 -354907 13749 374907 492811 347391 -32153 -664587 -1244354 -1340293 -1017028
19470 -1017028 -678484 -568955 -489776 -167668 314833 744418 1103356 1356310 1436891 1390582
19460 1390582 1233146 871255 278694 -493419 -1366118 -2098224 -2358991 -2185571 -1806692
19451 -1806692 -1228496 -622806 -251265 132891 751800 1344067 1628207 1407300 886899
19442 886899 612982 707614 907284 951078 843430 643623 392947 260543 267662 392977
19432 392977 635299 909790 1082526 1117271 1177229 1305214 1311771 1180399 989623 785858
19422 785858 565003 368310 293620 324594 381116 392081 334945 288435 537501 1068317 1446676
19411 1446676 1563844 1659748 1679734 1369232 747702 88323 -380541 -599970 -505449 -122496
19401 -122496 365908 685158 726940 540654 240243 -47165 -339155 -554487 -485192 -213745
19391 -213745 -113337 -334263 -714061 -1122635 -1431292 -1545338 -1534806 -1542885 -1682674 -2019454
19381 -2019454 -2431978 -2531088 -2131995 -1454332 -766864 -101389 498597 820140 771497 475019
19371 475019 134781 98060 448723 859915 989550 916179 870109 797451 591752 327313
19361 327313 25953 -425574 -865029 -1043745 -1070706 -1139466 -1183315 -1076704 -831634 -509329
19351 -509329 -149946 97174 304328 659914 850138 511785 -68084 -350295 -229296 -100520
19341 -100520 -52585 203089 680488 1071404 1137657 908202 627983 514614 659198 1005865
19331 1005865 1361030 1557400 1681407 1867654 2075137 2103990 1894307 1545924 1183730 899559
19321 899559 787505 909613 1123515 1219963 1169970 1077782 1054503 1266828 1808921 2439062
19311 2439062 2734148 2582848 2122349 1612756 1324392 1155548 852531 499922 350357
19302 350357 431585 505420 490973 532479 720166 1025816 1332165 1613954 1703049 1562774
19292 1562774 1334871 861133 275511 -41195 -17489 140796 225857 310609 498057 730727
19282 730727 890538 769231 322942 -184361 -515614 -630754 -582131 -607300 -830787 -1081421
19272 -1081421 -1329397 -1566462 -1576078 -1253566 -854873 -722461 -803549 -885800 -891712 -916643 -1034904
19261 -1034904 -1202942 -1437382 -1707256 -1811685 -1707617 -1459728 -1155025 -867941 -660796
19252 -660796 -364402 244977 911662 1414213 1655124 1486063 1066436 748642 659192 772258
19242 772258 915687 936009 1110856 1601839 2072762 2237242 2163672 2064270 2040590 2039328 1895826
19231 1895826 1548906 1240097 1037535 736820 369345 116336 79732 166722 280511 383532
19221 383532 455575 533620 588255 504918 145573 -577205 -1517921 -2198184 -2187857 -1581493
19211 -1581493 -765289 -160195 24797 -68689 -249614 -613550 -1346870 -2286070 -2999392 -3273070
19201 -3273070 -3217509 -3125596 -3234306 -3388403 -3476939 -3604095 -3769289 -3973372 -3999504 -3555566
19191 -3555566 -2919085 -2393847 -1856760 -1395209 -1259052 -1339192 -1375684 -1253798 -1060889 -826314
19181 -826314 -641260 -624802 -675341 -717084 -631631 -311919 131859 449287 586815 550946
19171 550946 325026 82348 -69732 -106387 -26107 214286 679289 1333457 1828325 1823701
19161 1823701 1397528 821813 175488 -494075 -1041622 -1311861 -1345183 -1343792 -1276153 -1041297
19151 -1041297 -728144 -405865 -88422 128860 183573 10388 -429216 -914631 -1171949 -1222913
19141 -1222913 -1097574 -677318 -62518 473188 920980 1403046 1696531 1634061 1487970 1360364
19131 1360364 1296547 1449754 1755143 1926091 1925211 1924843 1895877 1712074 1373987 950043 429596
19120 429596 -134874 -601198 -880400 -955872 -922569 -814197 -466546 107380 503876 531504
19110 531504 532242 749059 960435 837689 455883 82934 -163303 -257335 -206232 -107302 -106048
19099 -106048 -176869 -115993 29312 78333 111236 176623 300822 577448 875968 1114608
19089 1114608 1397227 1658084 1896300 2058316 1923968 1432384 785384 226838 -111221
19080 -111221 -236572 -147248 93620 202329 185299 198155 283005 510894 779430 854051
19070 854051 783969 582331 295478 115917 52053 946 -67702 -133793 -146273 -117257 -63029
19059 -63029 -103581 -312748 -620713 -782132 -593150 -273231 -110238 -219870 -630299 -1335019
19049 -1335019 -1979865 -2182692 -1981383 -1657357 -1368231 -1133049 -958598 -846628 -738034
19040 -738034 -716839 -949928 -1297845 -1468606 -1462033 -1368993 -1325196 -1580865 -2176641 -2768998
19030 -2768998 -2948939 -2604892 -2005622 -1387752 -863461 -529157 -342475 -176105 124090
19021 124090 548632 1098037 1711216 2150943 2210517 1869335 1320334 760346 258035 -197247
19011 -197247 -586478 -855550 -983137 -1014118 -995010 -813345 -474088 -72191 336153 532474
19001 532474 489735 567833 1053789 1718126 2092144 1977432 1367803 501780 -94218 -236570
18991 -236570 -119422 91753 457146 985129 1676127 2497247 3256238 3855863 4157947 3978912
18981 3978912 3318775 2431172 1603978 1010514 686025 561041 718300 1118362 1540594
18972 1540594 1943168 2373738 2601145 2277141 1560608 935078 431549 -69297 -508141
18963 -508141 -899406 -1143786 -1129687 -1083451 -1243033 -1504366 -1615161 -1525804 -1529478 -1783141
18953 -1783141 -2121187 -2309724 -2314833 -2099397 -1612921 -1031082 -561718 -242315 74960 341727
18943 341727 297079 -58075 -401163 -576603 -786901 -1044850 -1022419 -596939 58346 838870
18933 838870 1551317 2001992 2170323 2161800 2160048 2126659 1686666 737218 -205552 -672259
18923 -672259 -709259 -517556 -366475 -297522 -84595 296082 548725 509966 417931 486066
18913 486066 506961 254616 -107921 -364033 -433387 -187659 277426 728504 1125717 1631395
18903 1631395 2221056 2520990 2415018 2175037 2065293 2077224 2131114 2138994 1866004 1213639
18893 1213639 475142 14630 -70902 13644 -5251 -266004 -646707 -884797 -809339 -422058
18883 -422058 74431 428298 391166 57521 -138396 109147 637068 1159349 1655769 1987717
18873 1987717 1907711 1645610 1749960 2257270 2900913 3527270 4013906 4128456 3886853 3508529
18863 3508529 3045490 2298640 1236360 249765 -366287 -619486 -534068 -273379 -91517
18854 -91517 116186 493513 775854 710686 303160 -270278 -692346 -792607 -651711 -354712
18844 -354712 39237 441600 643070 526661 37840 -796651 -1682398 -2172007 -2040711 -1520057
18834 -1520057 -1049359 -966684 -1225395 -1509409 -1496823 -1027100 -301898 128134 10983 -431242
18824 -431242 -792635 -874733 -838838 -878429 -1088337 -1483131 -1904791 -2085314 -1827350 -1184303
18814 -1184303 -494715 -259875 -610239 -1204052 -1678608 -1912718 -1915089 -1763261 -1703356 -1767776
18804 -1767776 -1599214 -1118071 -604967 -291611 -250777 -405391 -704183 -1134566 -1539042 -1818006
18794 -1818006 -1974732 -1978424 -1765663 -1355227 -962142 -743582 -598292 -292363 185259 681094
18784 681094 1037311 1348277 1732541 1791652 1233519 443498 -195817 -577651 -553079 -316331
18774 -316331 -232298 -302390 -448800 -669351 -832264 -862490 -791744 -747286 -931600 -1370939
18764 -1370939 -1962095 -2579365 -2998218 -3156719 -3179144 -3039458 -2659421 -1994552 -1170984 -352115
18754 -352115 309932 619520 657175 554581 289156 -87138 -285682 -142127 132844 366158
18744 366158 543738 618170 762361 1056504 1224467 1160369 1070455 1137495 1140418 783421 83617
18733 83617 -549379 -766997 -847300 -1050704 -1194054 -1143002 -918097 -596429 -336060 -283837
18723 -283837 -172682 257959 723436 930845 1004459 1089526 1096093 960418 764376 656485
18713 656485 808052 1147223 1326871 1216911 913896 574551 431630 545130 732414 822345
18703 822345 675643 401065 218812 74637 -130437 -334693 -441278 -340700 -55659 33915
18693 33915 -190710 -337576 -292073 -309152 -411506 -438662 -415592 -527181 -799962 -1146610
18683 -1146610 -1495255 -1629891 -1411690 -1069259 -822843 -501726 -158948 -101869 -282438 -446593
18673 -446593 -401576 -194614 73504 282581 316511 222304 148614 216132 496408 939070
18663 939070 1333530 1619426 1886824 2120449 2118238 1890058 1693252 1664463 1661381 1470194
18653 1470194 1115204 897608 1229355 1940741 2367502 2314639 2191550 2289838 2504835 2563934
18643 2563934 2317167 1905573 1469427 1064887 891982 1109023 1574812 1829365 1644358
18634 1644358 1249326 830341 483562 500488 899882 1255567 1431434 1520723 1533379 1463874
18624 1463874 1322371 1178981 921127 457047 12567 -120769 212964 907622 1502877
18615 1502877 1583897 1293326 885949 569822 563486 816517 948808 676937 235276 -12573
18605 -12573 -4475 9496 -146095 -417434 -740164 -1188532 -1754506 -2270289 -2721459 -3055560
18595 -3055560 -3079192 -2746176 -2250066 -1761822 -1368997 -1219612 -1249282 -1356924 -1634367 -1959873
18585 -1959873 -2076510 -1975924 -1911629 -2089090 -2255659 -2140561 -1875352 -1721304 -1761273 -2018463
18575 -2018463 -2315107 -2437456 -2400219 -2239935 -1993588 -1811101 -1561818 -1125466 -719948 -415050
18565 -415050 -97266 310804 683625 841816 765874 655828 622674 571569 506143 489525
18555 489525 614767 724725 540532 277053 222979 334419 436739 445390 412823 418129 418411
18544 418411 340215 221959 159610 151131 -70532 -568940 -1058589 -1365220 -1455545 -1149884
18534 -1149884 -404712 268902 539967 599814 591231 534531 563188 769995 1085727 1186264
18524 1186264 843717 365873 159033 242157 348713 287237 312961 695664 1226634 1601968
18514 1601968 1791390 1856092 1909488 2055257 2265956 2469284 2562218 2463641 1967171 954984
18504 954984 -246263 -1115565 -1479954 -1545078 -1614622 -1777809 -1924180 -2083671 -2241216 -2277450
18494 -2277450 -2180123 -2094576 -2020203 -1920391 -1754314 -1508289 -1252140 -1072767 -988100 -921101
18484 -921101 -884291 -756929 -341356 293810 948032 1345066 1328703 962304 407845 -124594
18474 -124594 -416073 -435222 -431584 -530615 -723764 -1019744 -1333559 -1619332 -1809532 -1834106
18464 -1834106 -1702687 -1338682 -929502 -794373 -1034567 -1419653 -1471535 -1007891 -158721 837950
18454 837950 1499343 1556296 1176769 607295 96182 -232410 -454774 -730666 -1124992 -1478250
18444 -1478250 -1527294 -1283159 -1028696 -1070998 -1333715 -1593677 -1939063 -2400500 -2486901 -1827838
18434 -1827838 -631312 732323 1745277 2065161 1922599 1688883 1698136 1981666 2126854
18425 2126854 1989121 1926099 2115862 2307879 2322712 2276578 2352205 2602278 2816200 2760052
18415 2760052 2580758 2342368 2005841 1599420 1010655 228186 -598566 -1180849 -1396448
18406 -1396448 -1280699 -1004057 -864315 -851832 -698606 -263122 457385 1368289 2019862 2024726
18396 2024726 1664915 1308853 1079022 892714 701970 528511 379261 321189 335642 439326
18386 439326 589112 511736 147753 -167874 -259972 -217861 -116229 -56695 -82227 -191361
18376 -191361 -401562 -709829 -987133 -1026878 -813298 -557841 -373913 -237198 -216705 -348638
18366 -348638 -624004 -859979 -891816 -758667 -604829 -425772 -131540 310209 709617 980901
18356 980901 1191809 1322677 1394854 1458833 1495372 1573388 1725909 1838174 1795008 1551881
18346 1551881 1240934 1029193 910192 773536 502282 95054 -256179 -305348 -3626 503418
18336 503418 1045003 1483952 1835108 2059027 2021397 1512351 550826 -277689 -645399 -752944
18326 -752944 -758974 -747152 -909395 -1272219 -1677077 -1908269 -1867802 -1758765 -1666707 -1491951
18316 -1491951 -1252177 -1087827 -1002193 -927876 -951568 -1026304 -1001538 -867378 -658203 -531438
18306 -531438 -551316 -513926 -360002 -212594 -109016 124427 393972 354761 48904 -137494
18296 -137494 -25592 212311 485181 850165 1255114 1496624 1492528 1345077 1001404 449671
18286 449671 -157955 -618871 -640273 -157949 513749 1069061 1448963 1744003 1926974 1947846
18276 1947846 1814486 1731897 1893730 2167070 2309340 2190380 1861732 1465110 1133335 962941
18266 962941 946586 993266 1038773 1145695 1312503 1224647 700845 -138529 -1010760 -1638911
18256 -1638911 -1914897 -1811829 -1386251 -864149 -286552 279820 514969 414175 306156
18247 306156 310235 152081 -408150 -1120105 -1650450 -1951466 -1912856 -1388602 -802926 -632115
18237 -632115 -758377 -739384 -459398 -212039 -276379 -572623 -849403 -1026288 -1078254 -1063113
18227 -1063113 -1127573 -1183566 -1122340 -1020624 -930469 -949193 -1031434 -921860 -618301 -469381
18217 -469381 -596097 -763358 -786026 -806561 -1053331 -1452950 -1695571 -1724922 -1748527 -1821167
18207 -1821167 -1862829 -1908744 -2023706 -2102464 -1947195 -1627148 -1474703 -1605366 -1715240 -1464362
18197 -1464362 -805324 -84052 224534 241284 418587 831595 1144957 1140625 1047313 1026931
18187 1026931 1001520 882708 696701 588283 726661 1160641 1721455 2114124 2095383 1742094
18177 1742094 1350280 1083734 861432 585119 388732 461916 694164 787708 746104 652525
18167 652525 456858 57659 -568659 -1176330 -1484156 -1370394 -1059804 -880346 -774515 -622704
18157 -622704 -453576 -335667 -322574 -224571 1067 335205 916853 1595180 2073556 2186718
18147 2186718 2016816 1802209 1729831 1908570 2161334 2203744 2044657 1928219 1882403 1780090
18137 1780090 1854249 2237456 2788623 3280694 3457935 3224138 2819138 2484309 2376288 2540589
18127 2540589 2679110 2535381 2226015 2012987 2026151 2086148 2013881 1823646 1530536 1180103
18117 1180103 829306 573519 527353 457005 98188 -252198 -307111 -269612 -182269 29356
18107 29356 205860 209558 92119 -79916 -266048 -375279 -322761 -56592 356618 722993
18097 722993 874573 868148 721294 400005 38 -492318 -994086 -1306382 -1650835 -2207673
18087 -2207673 -2843042 -3313684 -3360391 -2985855 -2437967 -1939890 -1554141 -1143173 -691352 -511723
18077 -511723 -753282 -1081474 -1238904 -1218168 -893829 -275910 183730 124360 -200134 -370044
18067 -370044 -443111 -562773 -695236 -879238 -1272790 -1774969 -2127124 -2111110 -1937695 -1936812
18057 -1936812 -2036834 -2085787 -1953178 -1687479 -1377466 -961349 -512471 -123492 281638 662248
18047 662248 776397 528839 90199 -209464 -216809 -114455 -81958 -158873 -265639 -238713
18037 -238713 -102516 -78219 -178458 -247283 -354813 -672958 -1056638 -1253091 -1306351 -1476429
18027 -1476429 -1893404 -2437930 -2729922 -2505492 -1920953 -1334307 -950853 -829732 -993158
18018 -993158 -1300843 -1413143 -1244101 -1080936 -1136793 -1294684 -1293845 -1177418 -1109426 -1114521 -1277520
18007 -1277520 -1745471 -2448535 -2997717 -3088451 -2596366 -1838754 -1261774 -912510 -705033 -617837
17997 -617837 -702133 -974715 -1281430 -1339061 -1175673 -1017596 -868848 -672715 -393488 28454
17987 28454 445354 722627 785286 532450 57337 -405760 -637557 -667631 -623320 -585928
17977 -585928 -636919 -758240 -927625 -1040041 -969390 -776241 -641566 -636807 -593450 -395740
17967 -395740 -86998 137749 18274 -301959 -445946 -413788 -482339 -809706 -1299982 -1881618
17957 -1881618 -2495143 -2942215 -3087899 -2920972 -2583589 -2209820 -1780299 -1315267 -1041175
17948 -1041175 -1118741 -1252644 -1105587 -718807 -329056 -47979 152984 246279 398345 756954
17938 756954 1183055 1461509 1618137 1666022 1461485 1223263 1186915 1170898 1012188 733068
17928 733068 466333 457940 786251 1045956 934589 618625 333196 76282 -252473 -530367
17918 -530367 -650756 -677056 -591151 -377866 -195235 -250139 -553441 -1061945 -1646446 -2002323
17908 -2002323 -2050404 -1986520 -1856015 -1631760 -1392409 -1365146 -1534631 -1484232 -1187297 -963858
17898 -963858 -929752 -936184 -812261 -568818 -387535 -404779 -566931 -622093 -453621 -99984
17888 -99984 417818 994585 1354915 1333834 1161039 1134526 1034460 625277 207195 104094
17878 104094 299467 618057 947008 1184823 1212953 939999 452480 84336 32909 212205
17868 212205 532352 870352 938665 701838 506657 593632 840082 1062309 1115172 939684
17858 939684 635220 287387 -44921 -321906 -656512 -875758 -699531 -408484 -339096 -560588
17848 -560588 -1153815 -1849680 -2153627 -2220887 -2369635 -2559212 -2665440 -2787627 -2921719 -2929233
17838 -2929233 -2715647 -2110999 -1277816 -713216 -547253 -458140 -181417 112223 273182 243055
17828 243055 -69169 -600487 -1111693 -1341596 -1365311 -1226999 -874955 -525801 -377099 -357008
17818 -357008 -251905 -48454 11504 -166664 -480586 -868143 -1288313 -1630489 -1808404 -1826438
17808 -1826438 -1726819 -1638824 -1581037 -1611265 -1821752 -2059732 -2146714 -1983704 -1554773 -1031245
17798 -1031245 -584543 -552838 -1124496 -1810604 -2228707 -2472697 -2660352 -2589189 -2058994 -1221720
17788 -1221720 -491869 -231967 -442815 -898923 -1370323 -1748797 -1917784 -1865902 -1756392 -1750482
17778 -1750482 -2035929 -2624195 -3176726 -3242867 -2661532 -1724877 -738714 267980 1077992
17769 1077992 1296710 915712 267369 -470045 -1150825 -1575466 -1739856 -1709856 -1443033 -888623
17759 -888623 -195663 256739 324632 249877 160340 3117 -117234 47547 447832 538777
17749 538777 186242 -138942 -21941 567270 1353230 1938936 2149214 2034934 1724499 1407308
17739 1407308 1208752 956259 529274 92045 -216189 -387256 -444670 -378249 -289614 -330814
17729 -330814 -373413 -218095 -79286 -225359 -442680 -507662 -503053 -485330 -317024 13855
17719 13855 265701 262718 131485 -43053 -251559 -320437 -164902 50724 77829 -186011
17709 -186011 -461407 -467198 -332462 -142119 183199 438898 610695 911427 1217520 1305141
17699 1305141 1165468 1042423 997171 974616 897154 689478 562348 537631 561282 769159
17689 769159 1138501 1647325 2252797 2580673 2455617 2062927 1539080 1069902 720261 347122
17679 347122 -96166 -412829 -530131 -538576 -458362 -363785 -350754 -302290 80919 658680 990753
17668 990753 1024871 868879 484149 28968 -122991 71824 332257 505821 676350 950626
17658 950626 1431982 2048592 2523160 2591882 2002799 899616 -56289 -400322 -254154 131266
17648 131266 431280 326816 -84888 -557557 -1021645 -1720837 -2554709 -2913249 -2630143 -2064987
17638 -2064987 -1491011 -945673 -481251 -144102 217197 668234 1104894 1463565 1730080
17629 1730080 1816310 1701022 1583723 1471716 1086724 549892 144507 -71393 -153212 -182253
17619 -182253 -246244 -353807 -356866 -158259 209274 646057 1011900 1252688 1528986 1930919
17609 1930919 2254444 2342490 2314723 2302842 2377912 2418101 2273915 1869751 1163211 445231
17599 445231 -10032 -124899 -64802 -176823 -543268 -938607 -1260174 -1687853 -2242435 -2548898
17589 -2548898 -2341586 -1813017 -1305307 -810647 -394997 -291837 -356010 -377767 -579117 -1077160
17579 -1077160 -1474711 -1378584 -815551 -150866 193522 58044 -316217 -634562 -804831 -827917
17569 -827917 -628251 -295660 8315 369015 786631 975104 740211 301019 98513 245638
17559 245638 332536 219155 147657 129498 97003 101625 145044 188447 220943 238572 126181
17548 126181 -136859 -329732 -266171 -181699 -436986 -976528 -1614460 -2382960 -3115260 -3438722
17538 -3438722 -3314013 -3051900 -2899225 -2773376 -2376947 -1836440 -1524535 -1433395 -1370718 -1272911
17528 -1272911 -1134883 -949122 -565206 86530 782289 1292407 1575451 1763888 1844447 1744522
17518 1744522 1583234 1470496 1376700 1299155 1342982 1523853 1574125 1257303 533324 -347102
17508 -347102 -1053303 -1521758 -1884950 -2231479 -2605433 -2909544 -2984798 -2807850 -2470807 -2048993
17498 -2048993 -1660677 -1371496 -1177079 -1112903 -1223692 -1404192 -1569486 -1783481 -1945158 -1960090
17488 -1960090 -1911520 -1960831 -2068512 -2128811 -2146931 -2141406 -2166800 -2274961 -2544451 -2936260 -3244019
17477 -3244019 -3338661 -3359136 -3352024 -2992421 -2248529 -1579359 -1226825 -1034491 -918773 -966038
17467 -966038 -1139590 -1097382 -786006 -480705 -284081 -368678 -715090 -974727 -1038647 -1098623
17457 -1098623 -1294443 -1711715 -2408054 -3059031 -3289846 -3045353 -2430912 -1590972 -668226
17448 -668226 137644 650479 844500 667162 53247 -642048 -925967 -695892 -274998 -12886
17438 -12886 -74330 -407901 -861875 -1256319 -1518094 -1758208 -1826539 -1353109 -469257 105269
17428 105269 -29076 -532718 -960867 -1250385 -1400371 -1480981 -1799217 -2424544 -3025566 -3268839
17418 -3268839 -3197804 -2976368 -2692960 -2374357 -2067392 -1761014 -1610357 -1747990 -1955771 -2088115
17408 -2088115 -2080229 -2021048 -2042283 -1876820 -1349200 -579373 228009 796367 968452 835304
17398 835304 594304 519681 685895 983738 1250297 1330761 1148042 587991 -121690 -572692
17388 -572692 -788865 -1064049 -1526728 -1998398 -2207249 -1960789 -1213549 -332585 250935 402480
17378 402480 215399 -183660 -812051 -1519396 -1968229 -2121464 -2011471 -1586343 -1117384 -896510
17368 -896510 -758104 -562049 -429633 -406414 -448430 -516090 -539113 -521466 -623735 -987646
17358 -987646 -1348811 -1319970 -888286 -408184 -117753 177550 631340 1032741 1214357 1362475
17348 1362475 1630430 1820289 1750060 1594202 1610983 1666209 1593841 1432810 1363653 1437346
17338 1437346 1456507 1289380 1021579 795586 526895 195129 37904 96831 150006 73050
17328 73050 -52380 -53687 211910 517017 512725 91719 -434634 -619623 -485411 -437012 -664520
17317 -664520 -981066 -1133068 -1030298 -813830 -650357 -586955 -447696 -137281 170937 217792
17307 217792 68880 13631 86969 204661 424676 712774 854187 771399 489764 -17812
17297 -17812 -543363 -847718 -831112 -509784 -132627 92029 216739 260281 198998 27022
17287 27022 -205819 -320678 -172951 284264 869988 1275457 1414602 1501784 1811227 2261474
17277 2261474 2553892 2517397 2233365 1902984 1575786 1324025 1255361 1250146 1029638 556994
17267 556994 7485 -515702 -896822 -1012324 -901224 -687422 -567104 -726748 -1201564 -1829903
17257 -1829903 -2222603 -2264459 -2209338 -2265300 -2387178 -2425172 -2333390 -2129616 -1753072 -1438494
17247 -1438494 -1463800 -1810514 -2397823 -2984336 -3244301 -3087923 -2738076 -2463961 -2224627 -1763207
17237 -1763207 -986251 -142546 476253 815632 1032388 1324122 1627669 1850828 1961813
17228 1961813 1900525 1716220 1515961 1399512 1400874 1491436 1553860 1516064 1438030 1313597 1108516
17217 1108516 930279 836736 817342 846691 907159 941086 836490 640268 332303 -152208
17207 -152208 -673814 -978314 -909374 -520732 -73612 221324 484299 793444 1010272 1086580
17197 1086580 1031683 880624 597075 199031 70049 532666 1403652 2209885 2603245 2723802
17187 2723802 2725731 2489614 1930465 1123657 137962 -737476 -1063948 -847712 -399811 162670
17177 162670 823230 1413230 1853664 2223285 2508286 2652225 2740845 2786736 2786282 2712833 2512820
17166 2512820 2143196 1454369 664186 230612 325884 731896 1123562 1451078 1659604 1564723
17156 1564723 1263956 1008970 1084609 1611579 2213296 2506800 2517252 2435253 2317594 2134770
17146 2134770 2017169 2196614 2466260 2472156 2193300 1788599 1397773 1216225 1278394 1295319
17136 1295319 1087990 725117 204651 -442816 -1018205 -1252399 -1020802 -490976 94921
17127 94921 563424 791519 827079 807532 850749 961081 998081 888906 559530 226359
17117 226359 133257 42663 -200422 -487721 -773106 -932619 -810684 -475719 -35778 497731
17107 497731 840459 806014 560430 222031 2978 10515 12250 -154544 -317025 -459074
17097 -459074 -655014 -831726 -1081934 -1370522 -1578690 -1840367 -2193357 -2357847 -2188111 -1723271
17087 -1723271 -1198546 -853518 -625430 -408884 -171042 146748 514903 870437 1182443
17078 1182443 1247177 960375 549556 249618 140684 268620 555976 804673 1035649 1319127
17068 1319127 1569966 1856674 2117635 2105562 1861449 1615594 1422243 1049905 409571 -311644
17058 -311644 -855834 -1016182 -791990 -344346 61209 209122 166773 245248 638038 1211561
17048 1211561 1713624 2029716 2083523 1796873 1313272 1015598 1169961 1660073 2121596 2221892
17038 2221892 2004088 1691769 1303097 727334 13222 -463559 -364569 58342 195826 -227170
17028 -227170 -852334 -1362534 -1740824 -2137115 -2604437 -3011087 -3156489 -2962867 -2546758 -2010856
17018 -2010856 -1398960 -811382 -480172 -550732 -1009111 -1710100 -2231797 -2176697 -1723677 -1336619
17008 -1336619 -1147930 -989470 -750525 -431781 -215765 -350647 -690962 -862732 -874995 -864517
16998 -864517 -746233 -562056 -499160 -541300 -578250 -606445 -684043 -902387 -1212591 -1509569
16988 -1509569 -1712273 -1723861 -1611494 -1597073 -1692465 -1687613 -1557221 -1478186 -1535716 -1774380 -2096570
16977 -2096570 -2160898 -1949137 -1691311 -1501110 -1355081 -1168644 -981604 -1002021 -1414169 -1970110
16967 -1970110 -2210223 -2024757 -1717160 -1654319 -1745603 -1652201 -1379560 -1115750 -1140605 -1529764
16957 -1529764 -1792101 -1571915 -1254050 -1317985 -1480245 -1216384 -656760 -139393 253567 531933
16947 531933 623299 375008 -72864 -315293 -259072 -279010 -516676 -872257 -1147832 -1139201
16937 -1139201 -862347 -382499 226935 690884 761836 538261 314856 338957 530285 553572
16927 553572 362576 91149 -221254 -497556 -652555 -663674 -635392 -692192 -803406 -803873 -569788
16916 -569788 -66885 362324 241859 -308364 -885077 -1328060 -1676814 -1939460 -2081500 -2110034
16906 -2110034 -2070008 -1800819 -1219520 -664600 -464654 -637857 -866280 -936848 -873613 -786821
16896 -786821 -744333 -543212 54280 762037 1221633 1437669 1461248 1472272 1497484 1359688
16886 1359688 1058185 501532 -164854 -598724 -861675 -1016106 -1065449 -1008641 -836056 -785849
16876 -785849 -981410 -1257125 -1546177 -1693079 -1407034 -765421 -202252 35953 127207 226815
16866 226815 328935 398158 447276 535273 570112 641795 848044 981838 936795 844868 757893
16855 757893 645098 559589 818763 1437659 2042761 2551081 2958275 3029874 2689136 2103431
16845 2103431 1565226 1289995 1070452 575580 -114195 -715986 -984711 -688764 37187
16836 37187 687303 1101396 1349973 1196460 684619 351742 402924 612204 746886 615601
16826 615601 195028 -358557 -781030 -889321 -770699 -529501 -247724 -31911 9760 75847
16816 75847 332348 488578 372043 190162 47782 -41500 -82426 -170694 -321859 -522601
16806 -522601 -715574 -809944 -731614 -531459 -364986 -335326 -476056 -761719 -1080631 -1243643
16796 -1243643 -1167196 -996254 -826654 -662581 -457042 -203617 -85607 -179600 -330931 -560998
16786 -560998 -923400 -1349931 -1714977 -1869681 -1723403 -1261197 -724627 -354744 -286693 -477761
16776 -477761 -762844 -1045776 -1247768 -1349958 -1364691 -1475977 -1621979 -1687087 -1821547 -1982287
16766 -1982287 -1933593 -1721178 -1556685 -1408138 -1272690 -1235042 -1256878 -1165327 -783771 -265731
16756 -265731 57276 222336 364309 503696 629097 737885 606229 63821 -556507 -933341
16746 -933341 -1124091 -1116086 -758120 -306959 -227357 -635177 -1176132 -1424823 -1222670 -725618
16736 -725618 -174051 228155 413736 486138 610365 773401 801685 694141 671180 829648
16726 829648 925212 811449 552979 286780 233535 380013 450158 415261 485691 680615
16716 680615 866621 978136 1088372 1241077 1429340 1630216 1697332 1582512 1393350 1280513
16706 1280513 1327107 1447978 1526265 1490962 1284228 864052 353274 -20648 -1382 491507
16696 491507 1217856 1711354 1746313 1505092 1003784 198288 -512337 -691107 -379244 27663
16686 27663 250017 190912 -5547 -130227 -259686 -375477 -357038 -217511 -108888 -178904
16676 -178904 -447195 -754848 -864523 -792157 -603573 -362609 -259877 -410462 -543330 -488814
16666 -488814 -424702 -345065 -88122 253681 346833 226473 134615 31363 -206538 -553478
16656 -553478 -823924 -779659 -462216 -64864 310640 628793 953249 1128343 1034615 820344
16646 820344 633412 608748 628105 332056 -307221 -930745 -1269340 -1334307 -1261626 -1241100
16636 -1241100 -1268276 -1115250 -826124 -503302 -36566 659021 1297805 1604793 1627296 1465316
16626 1465316 1164940 747446 337322 -102816 -707205 -1303929 -1732379 -2010174 -1997448 -1745784
16616 -1745784 -1576395 -1739388 -2042283 -1997171 -1530350 -887869 -157742 505204 864062 1077821
16606 1077821 1475613 1916807 1942635 1476571 811985 194606 -269826 -449234 -272023 14495
16596 14495 40159 -299442 -719809 -932339 -917383 -821605 -824018 -920728 -1043040 -1047200 -845055
16585 -845055 -567076 -312893 13432 396148 572144 460052 359133 439130 604086 691014
16575 691014 413358 -233173 -690874 -672770 -395973 -177716 -202410 -397147 -651740 -1027348
16565 -1027348 -1453028 -1728321 -1739479 -1384976 -729570 -91843 293909 399456 425520 668445
16555 668445 1140941 1495967 1536928 1358480 1001338 616024 336262 130913 49611 266448
16545 266448 701565 1036918 1125999 984302 621799 111036 -419442 -925872 -1287993 -1252230
16535 -1252230 -777002 -111251 465700 864481 998143 787719 429152 298502 423249
16526 423249 575055 633565 486550 40339 -597470 -1192553 -1614864 -1876024 -2047838 -2168784
16516 -2168784 -2162035 -1948967 -1635652 -1428571 -1331509 -1300238 -1412661 -1503496 -1256655 -609654
16506 -609654 118121 571093 783092 1027844 1306812 1462464 1531635 1403401 1008500 617483
16496 617483 325646 81278 -55275 40176 490205 1061572 1415219 1483883 1417000 1166354
16486 1166354 751365 475902 558393 738790 649101 323689 -5054 -217923 -435551 -688979
16476 -688979 -781335 -444902 211164 694403 718993 509754 497909 917161 1612704 2157070
16466 2157070 2393550 2661560 3201996 3903701 4567376 4870774 4240431 2958765 2122696
16457 2122696 1782303 1425241 874664 109476 -642749 -1109176 -1167959 -1108280 -1368137 -1961792
16447 -1961792 -2436337 -2424113 -2181615 -2053637 -2028351 -2007301 -2052841 -2078506 -2030212 -2104188 -2407486
16436 -2407486 -2656035 -2639602 -2473219 -2246904 -2023180 -1864499 -1822526 -1868141 -1696216 -1266085
16426 -1266085 -982614 -840900 -470946 222602 886734 1272007 1357607 1135182 705996 291193
16416 291193 55086 20667 88913 225009 350139 482780 672557 810697 880343 1135654
16406 1135654 1693097 2295956 2655981 2451822 1677924 798946 249987 296993 821940 1260943
16396 1260943 1407473 1607144 2245427 3211227 4194725 4951552 5240424 5067043 4644660
16387 4644660 4396150 4607739 5019424 4980248 4152767 2853980 1634807 905558 656349
16378 656349 295787 -612969 -1683876 -2337306 -2411797 -2051103 -1581231 -1359555 -1613777 -2187182
16368 -2187182 -2717966 -2916673 -2756088 -2325728 -1748265 -1402042 -1472178 -1746573 -1923454 -1755153
16358 -1755153 -1239229 -448881 467595 1075420 1167060 907816 559473 447901 807072 1616568
16348 1616568 2677724 3563795 3982728 4047782 4028956 4016366 3947117 3757086 3250006 2276741
16338 2276741 1122979 133942 -467882 -573499 -481294 -573991 -890851 -1223157 -1356370 -1291495
16328 -1291495 -1250970 -1195088 -1024343 -968106 -1117220 -1144291 -1023025 -954200 -1141194 -1711725
16318 -1711725 -2493442 -3097143 -3217834 -2795526 -2023660 -1381629 -1252461 -1673725 -2474802
16309 -2474802 -3291613 -3512644 -2848640 -1845554 -1099479 -789716 -909109 -1161605 -1227329
16300 -1227329 -1021003 -766608 -718156 -889118 -1157102 -1363254 -1503398 -1517025 -1434236 -1430044
16290 -1430044 -1512314 -1553888 -1586030 -1705487 -1842595 -1800686 -1542737 -1202163 -837518 -432095
16280 -432095 -51989 -28182 -594472 -1480325 -2317335 -3029064 -3474854 -3568459 -3430677 -3213270
16270 -3213270 -3139514 -3328879 -3523360 -3580260 -3541795 -3330042 -2871573 -2149553 -1319569 -666944
16260 -666944 -357854 -311125 -450464 -697664 -884295 -954291 -1208264 -1741622 -2110149 -1927046
16250 -1927046 -1335945 -678709 93557 1075646 1921691 2299803 2199506 1861706 1489175
16241 1489175 1092106 668783 245329 -144106 -487626 -681266 -685541 -657612 -551286 -144440
16231 -144440 665449 1453169 1692270 1355215 744469 381783 536695 1065543 1648684 1940991
16221 1940991 1686732 1033900 351751 -62078 -56460 312182 736612 939693 956043 975040
16211 975040 1005803 1026406 993557 756586 376102 93182 -58389 -207543 -312859 -407187
16201 -407187 -655217 -1145676 -1935151 -2825072 -3563052 -4034847 -4078992 -3598379 -2687483 -1702673
16191 -1702673 -934510 -366874 107089 488627 792291 1069769 1280417 1484071 1765353
16182 1765353 1949854 1811104 1265783 526798 -99664 -495254 -529709 -187283 277351 707374
16172 707374 1218418 1707508 2019244 2277514 2694230 3227988 3548065 3240553 2449416 1685387
16162 1685387 1251204 980852 721676 562695 483728 546180 921716 1611810 2302069 2646155
16152 2646155 2645908 2440884 2076824 1688860 1490935 1546042 1700984 1728281 1597951 1607856 1884753
16141 1884753 2318912 2582816 2302556 1573891 727778 -16302 -410182 -360918 -63006 156458
16131 156458 58054 -302329 -459226 -7519 732233 1236805 1318720 957120 309181 -472362
16121 -472362 -1094889 -1302393 -1148045 -655495 161834 1052792 1683927 2107386 2224883 1798714
16111 1798714 1040133 441112 223898 305745 507456 768904 1028363 1197700 1331139 1410822
16101 1410822 1380900 1342765 1359598 1405484 1363336 1149053 849335 566462 404233 377640
16091 377640 292491 41985 -92731 -21832 84997 148240 97118 10196 35850 133210 183442
16080 183442 193614 262082 320238 213571 5132 -211241 -478780 -785070 -1059346 -1259522
16070 -1259522 -1418880 -1360814 -1090447 -933663 -883175 -782698 -675506 -599432 -506120 -542308
16060 -542308 -790246 -949244 -760160 -383767 -75523 157036 512642 1073724 1689789 2133545
16050 2133545 2168913 1780820 1255080 767864 370602 172544 43767 -139221 -224682 -45426
16040 -45426 351123 858723 1499582 2283575 3030646 3372867 3136987 2424035 1597347 1051159
16030 1051159 810503 675690 478146 235223 -6687 -199697 -417224 -564626 -456739
16021 -456739 -321895 -298245 -320692 -369731 -349848 -228964 -52009 21258 -165313 -473795
16011 -473795 -474644 -75786 242643 81108 -387963 -586083 -367081 -6668 211830 27495
16001 27495 -408959 -662529 -563765 -274361 139664 665881 1061785 1065236 731442 375536
15991 375536 186511 30262 -195448 -391093 -594881 -764582 -626365 -140515 421464 1011900
15981 1011900 1603910 1993677 1994942 1553111 1011727 710452 594561 540165 512377 443347
15971 443347 263804 135637 244803 549096 908708 1120242 1019686 698286 385821 187707
15961 187707 215017 507414 851213 883221 540177 49860 -349909 -561207 -563704 -412212
15951 -412212 -188952 64308 187632 156258 163727 394468 836509 1463893 2237189 2939149
15941 2939149 3383335 3505162 3412204 3262233 2981351 2318753 1566925 1319010 1464911 1547687
15931 1547687 1536496 1646173 1805925 1706509 1262156 875149 942842 1388425 1813947 2072244
15921 2072244 2180271 2251531 2437671 2560780 2507882 2341661 2020402 1614229 1221257 805234
15911 805234 386621 63423 -233964 -603790 -964124 -1053107 -710051 -105411 597375 1245115
15901 1245115 1758533 2085351 2192066 2136510 2002099 1899996 1802680 1707080 1699097 1604674
15891 1604674 1338153 964972 532631 82466 -201302 -200461 2519 267856 495795 596799
15881 596799 427233 35934 -239049 -102599 284683 646898 854291 756745 362134 -107669
15871 -107669 -497432 -802196 -967228 -859214 -680449 -641755 -693465 -854501 -1083127 -1212145
15861 -1212145 -1191063 -1102055 -913489 -542182 -148158 187218 523851 677281 465539 39043
15851 39043 -296249 -452829 -434023 -263881 -82279 137598 441480 628484 483606 100420
15841 100420 -235244 -397763 -429134 -407501 -440480 -510996 -489372 -430965 -598188 -893181 -1029327
15830 -1029327 -927159 -624925 -213615 207480 493315 612033 646540 768399 894385 810520
15820 810520 409086 -254198 -953653 -1614733 -2150935 -2431009 -2474196 -2367446 -2154298 -1896246
15810 -1896246 -1710859 -1577182 -1464788 -1346852 -1094522 -773809 -657149 -701741 -613255 -252513
15800 -252513 300545 993310 1619194 1792477 1410210 789849 261893 -171588 -477470 -515541
15790 -515541 -403942 -417036 -471033 -344566 -133001 53556 255954 632263 1130459 1393239
15780 1393239 1254245 981252 995924 1302297 1456331 1253663 1164344 1484165 1955753 2242237
15770 2242237 2198240 1969224 1718037 1565279 1672204 2042850 2556124 2915305 2910678 2683658
15760 2683658 2289366 1842921 1492028 1163509 869193 569021 176382 -174484 -299136
15751 -299136 -275675 -234513 -262173 -450505 -669955 -551673 -106793 388225 811212 1115586
15741 1115586 1272634 1277090 1222862 1063470 647944 -74432 -984815 -1774959 -2278336 -2571896
15731 -2571896 -2686306 -2514681 -2013729 -1381463 -902562 -639892 -529444 -507395 -446392 -334853
15721 -334853 -366135 -573859 -788223 -806305 -484305 117790 732757 1184297 1339957 1167669
15711 1167669 900435 751845 650739 463705 265303 -4686 -462932 -830331 -891374 -797455
15701 -797455 -669198 -474111 -164706 233510 667793 1027559 1266827 1452687 1613592 1641766
15691 1641766 1448382 1150038 841686 496072 62159 -430370 -808700 -1071678 -1461884
15682 -1461884 -1889743 -1986807 -1722254 -1313996 -857157 -461055 -357803 -432207 -449372 -458187
15672 -458187 -500660 -478398 -370637 -243271 -232259 -411531 -568611 -552145 -489879 -281767
15662 -281767 263394 912311 1252484 1173617 858504 525896 298658 96664 -84938 -59231
15652 -59231 380516 1286613 2327919 2935262 2807180 2186447 1479247 1057298 1062785 1389057
15642 1389057 1804421 2114036 2293320 2423105 2560809 2589339 2373132 1990704 1778471 1776137
15632 1776137 1702714 1500005 1315521 1299315 1502429 1747185 1870543 1903282 1902533 1694611
15622 1694611 1300451 1016172 813498 527136 104038 -437217 -808781 -616251 20634
15613 20634 745631 1385217 1877332 2313653 2751740 3188000 3667133 4183051 4562106 4668036
15603 4668036 4607252 4478895 4158837 3501777 2611087 1801345 1328762 1145424 1041027 983066
15593 983066 1067871 1295755 1588843 1959740 2460306 3044298 3570924 3958980 4217307 4426661
15583 4426661 4629155 4699997 4365884 3610149 2634531 1706482 1026074 497019 -33522 -469647
15573 -469647 -670678 -747923 -846259 -914301 -844195 -670040 -651501 -682754 -452718 -91613 289777
15562 289777 807263 1430843 1868305 2051855 2100621 1954202 1664536 1474873 1535726 1862189
15552 1862189 2352517 2785763 2974214 2845318 2389594 1779117 1389190 1301699 1124910 703596
15542 703596 332297 250861 428602 689162 966470 1147201 1060017 793480 561554 481105
15532 481105 592005 854623 1161436 1467524 1604212 1284263 581309 -34970 -312750 -338137
15522 -338137 -257430 -117521 64441 341779 856005 1554282 2033331 1943555 1363296 697132
15512 697132 336731 448776 782081 983430 891787 574474 314796 250420 354590 468050
15502 468050 565217 795392 1104127 1339965 1480114 1538503 1493160 1587190 1902013 2101530
15492 2101530 2165358 2316281 2431414 2417703 2434329 2426945 2169850 1615707 923426 295466
15482 295466 -148720 -362819 -336076 -139560 83768 182109 55767 -93731 -16289 91170
15472 91170 -17302 -211835 -183439 277251 1137717 2213281 3218170 3844374 4079520 4088538
15462 4088538 3904634 3510993 2920409 2262566 1839972 1712464 1619377 1470125 1295333 1114539
15452 1114539 1075028 1105826 1004496 896120 884867 645179 -7836 -707611 -1027531 -908447
15442 -908447 -506697 32582 441231 656805 810474 973242 1096382 996116 835010 982576
15432 982576 1395924 1657836 1621065 1298364 779428 410264 225943 57483 -48980 -155260
15422 -155260 -383178 -684358 -1092435 -1537899 -1738094 -1610077 -1591600 -1985072 -2532676 -2864065
15412 -2864065 -2938690 -2864002 -2617749 -2142737 -1669255 -1481219 -1495009 -1326705 -905414 -593555
15402 -593555 -481460 -480775 -540760 -532752 -412559 -215141 -45158 -64051 -163033 -130622 -91035
15391 -91035 -156059 -337949 -720385 -1316608 -2010598 -2585315 -2850960 -2763104 -2421893 -1977072
15381 -1977072 -1467030 -903136 -553637 -539247 -617889 -803426 -1175277 -1549409 -1734940 -1687450
15371 -1687450 -1552812 -1420780 -1233318 -942841 -587202 -321190 -155577 117297 415061
15362 415061 571507 712910 896281 968882 916855 943232 1186582 1539320 1897573 2312981
15352 2312981 2695360 2775853 2627658 2472295 2401464 2368699 2560932 3162239 3731767 3823675
15342 3823675 3574284 3210507 2662194 1847038 914847 115486 -340250 -424128 -205271 188366
15332 188366 612270 1090733 1632145 1870328 1575027 1028267 617748 639833 1269394 2499668
15322 2499668 4070603 5640840 7138100 8537998 9537981 9795772 9488236 9118897 8616803
15313 8616803 7709870 6509681 5348062 4463989 3880764 3620476 3669045 3915264 4274839
15304 4274839 4477461 4435463 4217871 4025560 4226137 4717747 5082172 4983854 4465066 3979569
15294 3979569 3927776 4393563 5174245 6021316 7038323 8475239 10276428 12248777 14340390
15285 14340390 16229285 16969126 16056383 14123187 12081640 10327940 8782664 7531583
15277 7531583 6761408 6218242 5590254 4982734 4630762 4596766 4806670 5218865 5735063 6066299
15267 6066299 6211423 6257029 6237611 6200998 6066275 6080664 6734194 8028048 9341633 10221889
15257 10221889 10690714 10811877 10641852 10356712 10127813 10049559 10290237 10855064 11438227
15248 11438227 11701011 11531669 11171987 10913925 10801043 10935951 11341799 11702514 11662087
15239 11662087 11019631 9931784 8801528 8002583 7588938 7275801 6950586 6811316 6877245
15230 6877245 6889664 6821055 6816889 6804118 6664384 6414313 6341893 6441539 6294524 5865671 5563967
15219 5563967 5465910 5395486 5338370 5334744 5415227 5489645 5480829 5457721 5594205 5930843 6239819
15208 6239819 6326374 6171988 6101785 6420282 6983001 7568644 8060015 8444570 8893647 9495558
15198 9495558 10122893 10634332 10938995 11051700 11185770 11547298 12168086 12953884 13753357
15189 13753357 14367809 14754133 14955920 14997534 14978829 15163961 15693126 16393794 17076038 17723263
15179 17723263 18348886 18946899 19642749 20518956 21655573 23058303 24578121 25909184 26907077
15170 26907077 27931729 29333383 31121764 33051956 34704448 36042615 37521150 39606843
15162 39606843 42601442 46469615 51014426 56209416 62344960 69733559 78483338 88702254
15154 88702254 100578985 114557388 131419530 151584471 174267378 196716014 213244599
15147 213244599 218011895 211730849 201415397 193575336 191636976 197297743 211478688 234646684
15139 234646684 267229289 308617711 354315434 392782277 407024213 387516374 343282118
15132 343282118 292058231 245684979 208102020 179209835 157896355 143356493 134880090
15125 134880090 131664866 133330143 140231593 152936994 171951358 197200300 226981663
15118 226981663 256761159 277867494 279864402 260049615 227544521 193488859 163576688
15111 163576688 139224507 120133604 105611328 94760131 86344972 79096458 72302404
15104 72302404 65801207 59462547 53417647 48165254 43884006 40338123 37463976 35399472
15096 35399472 34091638 33409079 33298457 33534598 34140215 35445905 37596145 40550402 43949540
15087 43949540 47104196 49328163 50219753 49920848 49023031 47924238 46667363 45102358
15079 45102358 42981778 40237917 37136321 33895202 30618844 27414092 24442476 21742900
15071 21742900 19241129 16996535 14964005 13130806 11532172 10216374 9405417 9221656
15063 9221656 9527926 10131859 10932558 11783205 12438431 12769284 12708577 12300414 11750407 11239013
15053 11239013 10788882 10413119 10086497 9609003 8946750 8137326 7223466 6418255 5914615
15044 5914615 5774418 5950096 6136122 5928392 5225611 4230584 3339650 2887941 2935643 3168955
15034 3168955 3296571 3370438 3497727 3599182 3527248 3210065 2577143 1776719 1245133 1102165
15024 1102165 1187261 1646326 2534970 3451452 3965874 4014760 3788351 3386059 2838555 2218087
15014 2218087 1753656 1670192 1997276 2393295 2484933 2293560 1931159 1377796 788042 403284
15004 403284 114941 -149813 -271280 -162655 73897 242746 421144 791419 1292888 1629376
14994 1629376 1774625 1871195 1886664 1858905 1862931 1873238 1835062 1636973 1287834 960383 853279
14983 853279 1011342 1230609 1456274 1714650 1907293 1914907 1671312 1160335 513117 -123842
14973 -123842 -702471 -1117325 -1225974 -1025795 -704762 -523716 -672680 -989167 -1231539 -1432478
14963 -1432478 -1579887 -1605091 -1604599 -1838301 -2377690 -2927557 -3124471 -3015992 -2825469 -2559279
14953 -2559279 -2081393 -1248670 -224857 654476 1161102 1310892 1257524 1235826 1499291 1953452
14943 1953452 2234494 2140935 1846067 1699337 1874819 2113766 2192575 2223046 2354725 2483903
14933 2483903 2368384 2077584 1931631 1878571 1634311 1168212 712488 434753 283934 164669
14923 164669 137721 421733 922728 1317942 1333963 989301 587220 331733 257656 288680
14913 288680 320568 364692 579259 1023440 1381413 1401211 1078703 600536 224501 -60366
14903 -60366 -425712 -892620 -1384631 -1796337 -2020119 -2018245 -1764850 -1058780 406799 2151785
14893 2151785 3158858 3409651 3565369 3781189 3776156 3467441 2975261 2384727 1830130 1533385
14883 1533385 1723757 2267148 2768147 2899723 2641433 2204843 1753344 1283247 734391
14874 734391 263577 42359 55416 150137 109051 -138091 -308462 -60682 400146 767860
14864 767860 1200371 1790220 2267458 2327774 2060419 1932715 2064785 2196684 2149246 1981672
14854 1981672 1776726 1508364 1181625 631389 -469669 -2075718 -3435097 -3571839 -2657940
14845 -2657940 -1468398 -572365 -288901 -466978 -659343 -556549 -313896 -117666 92329
14836 92329 276907 308971 284504 320092 347645 418528 643667 745273 455632 -109679 -681925
14825 -681925 -1045254 -1103708 -1034908 -1033903 -1047182 -1005830 -874126 -577078 -125500 309979 514373
14814 514373 524296 468996 334559 161849 38353 -57146 -73704 45356 344926 810519
14804 810519 1168920 1306674 1351788 1360448 1267107 1232076 1340964 1343101 1083899 642055 267431
14793 267431 196908 255341 229611 246051 244235 10931 -210862 -262980 -294955 -206263 85578
14782 85578 380060 538695 654221 725517 598003 275997 28482 15725 180042 339807
14772 339807 295886 63085 -356749 -881206 -1191801 -1162980 -965037 -860896 -971623 -1263993
14762 -1263993 -1492415 -1309483 -648076 89035 585108 822163 970046 1196953 1503039
14753 1503039 1706932 1664985 1391854 934681 457017 172315 146031 308264 445333 484252
14743 484252 528524 590705 657521 665750 495532 289037 454639 1016659 1415462 1446792 1270977
14732 1270977 816603 10640 -958866 -1783102 -2248981 -2390925 -2331827 -1959321 -1258602 -604036
14722 -604036 -304658 -306766 -274517 -48491 238477 459568 584615 668790 863666 1208501
14712 1208501 1591955 2015487 2466102 2606395 2211250 1522372 846680 195376 -327842
14703 -327842 -461168 -206669 215752 445775 304597 139819 239645 408757 387082 253376
14693 253376 287858 509525 771911 1073640 1404882 1763489 2187459 2618822 2977801 3231967
14683 3231967 3207067 2729507 1916411 1056514 473716 327261 565955 946983 1139407 1069047
14673 1069047 891664 750608 780012 888600 1034142 1221802 1209508 994655 727946 554372
14663 554372 398349 71953 -297884 -446331 -285881 9688 170677 181578 130402 67912
14653 67912 97651 174280 151216 31954 40575 245707 394505 284640 174585 324536 601436
14642 601436 754966 810829 924693 933339 556366 7119 -340247 -427501 -291983 -146564
14632 -146564 -143221 -195446 -284226 -295111 -149557 133532 509171 935592 1273135 1188557 668995
14621 668995 88733 -240603 -328751 -327321 -240361 -129429 -39152 93223 173228 95222 -53200
14610 -53200 -125009 -60447 -47220 -380380 -896934 -1121214 -1056807 -1022765 -1095024 -1045225 -763715
14599 -763715 -482655 -386670 -332622 -267026 -260282 -98612 323340 734241 924894 837076 478601
14588 478601 -84001 -660625 -1211527 -1800435 -2207406 -2155487 -1805881 -1527840 -1467425 -1581915
14578 -1581915 -1723748 -1720547 -1466173 -1127372 -1067210 -1257611 -1401822 -1361527 -1084501 -586046
14568 -586046 -125031 45385 40147 177037 599902 1163284 1665748 2168616 2820623 3536882
14558 3536882 3846145 3579227 3112825 2590576 2067442 1741592 1441570 768597 -123829
14549 -123829 -823106 -1107461 -1096623 -1155308 -1336261 -1395840 -1259334 -1114538 -1049900 -1029168
14539 -1029168 -937179 -673001 -399999 -403684 -630835 -823270 -1010039 -1365667 -1805025 -2183461
14529 -2183461 -2480560 -2539495 -2240254 -1804802 -1588689 -1696329 -1821120 -1807119 -1855564 -2171958
14519 -2171958 -2707877 -3143818 -3196247 -2777123 -2113267 -1527836 -1031509 -505627 -80700 154644
14509 154644 327663 458301 398115 118228 -265744 -562522 -742664 -745449 -581586 -441780
14499 -441780 -277315 -75224 -74767 -350483 -712441 -1068010 -1444331 -1699579 -1641658 -1367379
14489 -1367379 -1062549 -739352 -336206 81303 282690 169591 -69267 -134682 -220120 -737668
14479 -737668 -1620748 -2331469 -2483262 -2229723 -1818220 -1158288 -330995 399566 943730 1176834
14469 1176834 928643 368090 -207960 -642985 -920479 -1017310 -894110 -652134 -352777 -96337
14459 -96337 72020 312986 805215 1323609 1536230 1562820 1613024 1705455 1712531 1411583 831767
14448 831767 304196 143896 371096 712326 938503 908901 555668 -28799 -556179 -782754
14438 -782754 -860052 -1101464 -1362049 -1303676 -1036651 -862498 -821472 -860414 -929430 -1040268
14428 -1040268 -1153445 -1129030 -822928 -303894 199284 487855 664510 928595 1289753 1607518
14418 1607518 1611083 1232030 675574 161300 -324664 -818235 -1166814 -1120491 -868483 -932959
14408 -932959 -1501012 -2168841 -2594782 -2656869 -2370408 -1869768 -1386598 -1170003 -1347640 -1889330
14398 -1889330 -2439106 -2579522 -2368345 -2097226 -1717898 -1157546 -604779 -208490 82192
14389 82192 256733 393546 620390 752215 663970 472101 418170 627121 984481 1191896
14379 1191896 982424 509179 172854 -27029 -341673 -703934 -886596 -911034 -987977 -1062401
14369 -1062401 -980270 -920371 -1086412 -1391027 -1463176 -1111097 -542405 -14531 497773 1215040
14359 1215040 2079500 2738152 3005422 2823507 2335939 1773004 1276008 896777 576544
14350 576544 205778 -329464 -986862 -1493771 -1575518 -1246494 -792475 -443341 -227551 -101844
14340 -101844 -41846 -53487 -188856 -464232 -691986 -629383 -236978 135270 129328 -250958
14330 -250958 -878148 -1554834 -1844472 -1558429 -975485 -489460 -139441 191627 411883 475557
14320 475557 306844 -125585 -633796 -1147100 -1504237 -1546342 -1443515 -1468092 -1599088 -1753833
14310 -1753833 -1949980 -2094543 -2019712 -1521918 -582252 408852 965684 1041510 794615 306004
14300 306004 -270410 -783534 -1151943 -1372134 -1353203 -1066050 -742174 -700938 -1045384 -1605283
14290 -1605283 -2029899 -2052399 -1826505 -1546210 -1262872 -1109407 -1099011 -1155462 -1260828 -1384366
14280 -1384366 -1499627 -1574876 -1605373 -1673083 -1815088 -1935075 -1920345 -1809314 -1888767 -2338691
14270 -2338691 -2903059 -3090108 -2683524 -1925880 -1349648 -1151311 -993251 -626080 -90688
14261 -90688 374169 568895 624961 635910 489919 169796 -192534 -673486 -1436646 -2328178
14251 -2328178 -3043797 -3247694 -2831688 -2172169 -1668006 -1367216 -1138054 -885418 -700695
14242 -700695 -773583 -872000 -506261 343062 1231416 1682332 1488460 805531 75290 -317477
14232 -317477 -443704 -513441 -369493 134226 703509 1192421 1830673 2507836 2883107 2815748
14222 2815748 2493654 2168025 2047206 2064175 2022765 1948403 1931907 1961822 2005266 2011010 1803037
14211 1803037 1397740 998687 643287 237417 -194773 -518369 -752671 -929742 -950373 -844130
14201 -844130 -654893 -428008 -328199 -424400 -601609 -776927 -821552 -544716 -70471 351609
14191 351609 680076 874675 933372 931879 986545 1142916 1371030 1671528 2063320 2407225
14181 2407225 2536965 2545848 2482468 2384746 2160365 1688972 1142586 600575 286576 422027
14171 422027 816796 1090576 1111165 1079766 1217439 1519169 1667825 1516571 1355194 1320636
14161 1320636 1169963 755788 347153 333378 647827 989326 1271559 1393494 1119172 409293
14151 409293 -326600 -737197 -795597 -633184 -319227 148769 614248 844606 808193 648849
14141 648849 408294 125628 52980 316997 746271 1109077 1473954 1838333 2094068 2340309
14131 2340309 2561406 2493233 2082334 1639729 1426319 1374955 1229291 867067 410835 46433
14121 46433 -220576 -488201 -641977 -402325 116377 558627 789703 948403 1091919 998777
14111 998777 731684 517394 435130 482316 566707 593267 502524 157578 -578552 -1396213
14101 -1396213 -1837783 -1795354 -1455662 -1009864 -605172 -289806 -128526 -247360 -522481 -678372
14091 -678372 -576308 -374441 -322072 -412628 -495826 -636687 -1138783 -1868154 -2306934 -2329935
14081 -2329935 -2056327 -1537775 -844103 -124877 358394 377452 3515 -427489 -699309 -754591
14071 -754591 -696362 -669564 -739713 -691967 -311438 139699 400492 502819 457492 335048
14061 335048 210034 59816 -116764 -365852 -526093 -404001 -254915 -347441 -454444 -283461
14051 -283461 -29278 131393 251992 342845 521439 914483 1485017 2130976 2680510 3047168
14041 3047168 3104633 2779149 2271402 1938608 2087625 2530862 2697270 2368551 1800608 1453475
14031 1453475 1540589 1798572 1902225 1835295 1739519 1590002 1383764 1124890 791258 589198
14021 589198 446252 121093 -187227 -309807 -356207 -481440 -728912 -907543 -871534 -715507
14011 -715507 -508653 -217438 86900 238802 310713 426908 468657 296364 -8017 -210291
14001 -210291 -270717 -207609 2694 361912 748050 1095174 1314957 1201355 734643 178296
13991 178296 -211409 -321598 -137822 163248 446239 714470 779550 396313 -291057 -897743
13981 -897743 -1158686 -1089459 -973437 -866367 -638949 -272803 -46248 -229631 -663265 -1174847
13971 -1174847 -1741322 -2285304 -2603794 -2696565 -2530393 -2161018 -1901881 -1781350 -1686730 -1676143
13961 -1676143 -1688810 -1439923 -877525 -233674 439093 1131020 1629177 1733432 1624776 1487117
13951 1487117 1262106 973989 745067 653966 598869 521374 407539 222636 141895 129343
13941 129343 -25345 -303476 -516830 -653571 -784648 -763274 -435382 16254 338797 492161
13931 492161 710064 1122282 1505078 1699956 1871590 1994782 1923719 1691230 1343054 901463
13921 901463 371606 -116699 -461904 -764635 -1118903 -1404197 -1397027 -1021861 -600531 -501760
13911 -501760 -623630 -707578 -798796 -1091921 -1590418 -2044366 -2146340 -1713260 -992700 -404676
13901 -404676 -31389 208003 323596 385063 518911 763712 1011764 1170594 1395890 1684806
13891 1684806 1726333 1484615 1248030 1158017 1257900 1596708 2109772 2541182 2741941 2585310
13881 2585310 2210384 1961419 1899979 1961651 1987739 1770363 1377666 1059368 944836 841300
13871 841300 591880 337266 130312 -65671 -141604 -33794 164677 368367 562460 600423
13861 600423 484003 374515 255891 61033 -257539 -606140 -750233 -605039 -460376 -366468
13851 -366468 -82574 345849 784302 1154844 1491441 1884627 2185176 2140700 1828272 1465853
13841 1465853 1078340 688015 54674 -974713 -1910244 -2353565 -2450692 -2624600 -3038907
13832 -3038907 -3347818 -3256404 -2996108 -3036785 -3234560 -3170671 -2660779 -1860835 -1130925 -625466
13822 -625466 -142172 509815 1209241 1803064 2122163 1888857 1206985 432879 -336711 -961896
13812 -961896 -1243176 -1201339 -1013981 -790682 -510910 -151396 201491 351166 227006 -98769
13802 -98769 -543234 -1003330 -1457813 -1933035 -2237379 -2195420 -1868146 -1292946 -655183 -225954
13792 -225954 41808 206229 188517 67136 16525 62949 150066 185308 23873 -291611
13782 -291611 -593319 -955240 -1332574 -1449428 -1482410 -1607330 -1733152 -1834334 -1928549 -2018925
13772 -2018925 -1935238 -1521998 -924996 -534973 -438172 -250438 208036 611666 489750 -247958
13762 -247958 -1107826 -1602901 -1650514 -1329974 -863673 -536446 -384878 -318554 -264689 -116886
13752 -116886 54997 -25191 -372569 -666020 -633760 -447528 -270591 -15480 436145 898265
13742 898265 1095484 995699 571351 49016 -265801 -330928 -228394 -265868 -680612 -1292604
13732 -1292604 -1870243 -2213582 -2274023 -2197416 -2075139 -1996435 -2092433 -2164175 -1813275 -1036161
13722 -1036161 -226908 282301 226259 -320061 -848009 -1210909 -1590137 -1856198 -1933711 -1924812
13712 -1924812 -1851635 -1700610 -1445958 -1144557 -899094 -766291 -521931 4163 558950 805715
13702 805715 777478 720993 683625 739566 841724 949448 1213447 1684798 2246161 2690900
13692 2690900 2961263 3046414 2978338 2821884 2619104 2378659 2254964 2402746 2727241 2864864
13682 2864864 2612805 2219479 1877085 1525994 1200771 978888 774323 547536 376258
13673 376258 383570 455512 396894 385560 616205 998791 1427229 1918390 2398473 2501541
13663 2501541 2030517 1277657 584321 125114 -156149 -413420 -771353 -1222608 -1454628
13654 -1454628 -1297805 -1091983 -1101846 -1248269 -1457230 -1738107 -2013443 -2221507 -2381644 -2439191
13644 -2439191 -2291914 -1915833 -1542362 -1492085 -1713120 -1957836 -2192206 -2347016 -2338191 -2351266
13634 -2351266 -2329313 -1957212 -1404275 -1043218 -926065 -962013 -1061245 -1078545 -974050 -935215
13624 -935215 -940828 -858831 -696572 -518151 -357083 -78858 420298 876021 1032392 881527
13614 881527 703432 666976 597577 335183 -81541 -362522 -223458 208249 429924 254026
13604 254026 -50051 -272759 -296782 -15458 478049 958339 1288323 1440814 1579586 1783437
13594 1783437 1876330 1683126 1336770 1058828 921477 757698 383851 -169995 -900819 -1670949
13584 -1670949 -2211119 -2475261 -2557159 -2490678 -2267946 -1941987 -1723715 -1688989 -1654615 -1606168
13574 -1606168 -1749477 -1878933 -1650056 -1181852 -841928 -703628 -606785 -541180 -699124 -1127936
13564 -1127936 -1694164 -2154954 -2355468 -2297016 -2124332 -1783722 -1141223 -292523 532663 1165707
13554 1165707 1450492 1314460 788810 -54803 -986821 -1683319 -2124665 -2399912 -2492468 -2420292
13544 -2420292 -2228591 -1869052 -1418110 -1019911 -744222 -679370 -801130 -937687 -980348 -847128
13534 -847128 -439556 124213 842135 1768615 2600189 2986392 2966324 2810135 2671682 2542105
13524 2542105 2346142 2039783 1662763 1308564 1107006 1166687 1400313 1695784 1935147 1929370
13514 1929370 1861741 2116893 2567644 2751646 2589421 2273469 1993121 1916122 2112142 2307033
13504 2307033 2330378 2315607 2373864 2563080 2738794 2619663 2054810 1204047 365961 -345684
13494 -345684 -936491 -1401561 -1711776 -1799351 -1711303 -1468192 -1008390 -490592 -107693 128032
13484 128032 314915 512173 633470 477030 83224 -255323 -342624 -216911 -10179 267176
13474 267176 565339 577524 236548 -99138 -302444 -631267 -1111762 -1357324 -1213589 -897714
13464 -897714 -707974 -780298 -962539 -1074922 -1032667 -795859 -488877 -306996 -243976 -25446
13454 -25446 550255 1273192 1887400 2445866 2890846 3031233 2837988 2300769 1457488 626680
13444 626680 66148 -151185 -105945 66556 342183 545504 594132 626432 698481 819358
13434 819358 837780 582611 227923 -40768 -298170 -586840 -660409 -411193 -115076 61681
13424 61681 239216 519990 769141 707835 305570 -233527 -744564 -1116322 -1278739 -1291402
13414 -1291402 -1186452 -828002 -416455 -338846 -543732 -633852 -385546 -32622 136003 38697
13404 38697 -381476 -890060 -1172256 -1174784 -933417 -469144 137078 768390 1280440 1526228
13394 1526228 1651520 1966135 2410398 2686545 2627570 2282321 1845704 1642034 1702815 1713621
13384 1713621 1314120 444447 -393733 -861261 -1000815 -1046274 -1239499 -1595500 -1880807 -1893136
13374 -1893136 -1587201 -1079114 -525100 -60591 193581 249582 104465 -159573 -368458 -424834
13364 -424834 -356260 -309692 -413330 -576292 -659890 -607819 -450420 -297066 -234564 -315386 -585676
13353 -585676 -1041145 -1544371 -2012545 -2325717 -2273346 -1947214 -1671369 -1665567 -1863853 -1976492
13343 -1976492 -1954905 -1808797 -1524087 -1118816 -553816 70386 418288 265396 -273511 -852004
13333 -852004 -1341178 -1807298 -2193900 -2254962 -1890859 -1418189 -1028321 -579785 -51444 415584
13323 415584 823741 1040749 1060808 1196001 1359323 1223847 822558 464554 233513 77408
13313 77408 -29321 90634 486614 782405 836074 715115 561338 763261 1454520 2295673
13303 2295673 2927267 3164512 2873188 2201456 1684949 1532875 1613875 1847809 2050935 1854792
13293 1854792 1121045 160331 -725265 -1341512 -1428230 -974395 -314886 267363 674940 844865
13283 844865 902739 1051465 1087448 695304 79046 -302854 -341821 -169207 110277 428589
13273 428589 764374 1081944 1389113 1625910 1667033 1443915 1073694 794051 608102 528741
13263 528741 645820 981326 1345685 1483711 1290993 855934 466157 221467 -78734 -439682
13253 -439682 -647379 -500950 108926 918478 1453541 1503594 1202131 674661 43384 -483090
13243 -483090 -825701 -1002172 -1045763 -900905 -631992 -412503 -244920 -75532 145898 379196
13233 379196 429531 282487 51565 -206642 -475945 -785679 -1024181 -1160485 -1261208 -1375043
13223 -1375043 -1651259 -2036082 -2246328 -2197224 -2073334 -1997893 -1960301 -1863243 -1586009 -1112769
13213 -1112769 -713814 -644509 -828474 -956552 -900777 -870056 -924008 -829630 -720349 -959073
13203 -959073 -1334761 -1521295 -1535360 -1593679 -1870718 -2286684 -2603479 -2747339 -2584397 -2019462
13193 -2019462 -1138009 -206163 423902 593350 371350 -23913 -336163 -344101 -133360 94677
13183 94677 242347 351866 576539 814417 838813 628243 234956 -123661 -125322 268815
13173 268815 699841 716970 243365 -448599 -1005484 -1129807 -907485 -686751 -514085 -333363
13163 -333363 -267279 -326571 -300040 -185496 -247026 -439436 -460967 -250155 8793 63061 -252595
13152 -252595 -710525 -894862 -760069 -477595 -204728 -29473 100180 316671 719864 1113963
13142 1113963 1302463 1347368 1351888 1404760 1517841 1432990 1058595 836295 1004837 1337971
13132 1337971 1750182 2085796 2137848 1931971 1540883 1060628 466860 -271658 -972390 -1398863
13122 -1398863 -1455604 -1227323 -833634 -416417 -193970 -153241 -3321 292456 412758 367506
13112 367506 362659 440350 676297 1025773 1319248 1468474 1471705 1367014 1118629 700386
13102 700386 186763 -207283 -321184 -156424 322510 931878 1186702 1054011 911585 756216
13092 756216 390645 -62993 -336464 -493804 -688704 -783797 -647975 -426575 -282443 -258966
13082 -258966 -297853 -250388 -6302 318273 485242 319509 -38818 -215796 -177236 -54876
13072 -54876 105682 292733 418249 319017 -105784 -654115 -1147113 -1561215 -1754496 -1666707
13062 -1666707 -1491095 -1360983 -1176752 -846937 -343384 295009 1017337 1723508 2150112
13053 2150112 2216648 2142111 2086435 2124328 2269972 2325412 2069027 1250021 -10877 -1008138
13043 -1008138 -1428418 -1573372 -1617725 -1605887 -1731227 -1962726 -2113286 -2164451 -2040745 -1719745
13033 -1719745 -1348405 -1086165 -1050967 -1161311 -1276832 -1363723 -1481928 -1547806 -1198207 -389521
13023 -389521 400340 825038 929847 842537 775197 943665 1177722 1171023 815156 255282
13013 255282 -122082 -124952 157159 411758 441644 422149 450170 424003 213294 -253607 -759294
13002 -759294 -989699 -1014538 -1029491 -943785 -761183 -739973 -961035 -1202814 -1225957 -921083
12992 -921083 -455176 -68515 188948 428819 691675 955246 1075867 925892 645455 367896
12982 367896 66614 -128608 -26294 411666 886640 1074944 1025636 804745 551429 363339
12972 363339 167015 113882 340520 778408 1164637 1310257 1136082 696008 184735 -217784
12962 -217784 -252013 65096 466738 822872 1039259 1019793 755501 295175 -342262 -979145
12952 -979145 -1314486 -1356682 -1370740 -1450289 -1501246 -1485264 -1268167 -887477 -621203 -693351 -968901
12941 -968901 -1080643 -939555 -708206 -441287 -209782 -95536 -36843 103413 315340 491436
12931 491436 387187 1340 -302598 -411946 -518917 -608803 -534333 -286712 18121 205345
12921 205345 228630 232988 285040 275861 61206 -270381 -472721 -416688 -49775 486870 803044
12910 803044 697825 419885 207736 63111 -57237 -329824 -682770 -766390 -561808 -255905
12900 -255905 3394 131887 136401 -25329 -283870 -434372 -526839 -764668 -1020642 -1077203
12890 -1077203 -1015405 -838390 -531335 -159761 285829 690613 856156 730560 578547 638222
12880 638222 843275 1090258 1246482 1256867 1083015 580657 -179222 -932454 -1459726 -1531312
12870 -1531312 -1195959 -918595 -994131 -1228285 -1438681 -1675916 -1882144 -1892522 -1663131 -1331160
12860 -1331160 -1015870 -836565 -845912 -962111 -1099867 -1198685 -1221955 -1196430 -1297719 -1622068
12850 -1622068 -1919665 -2069707 -2303161 -2571305 -2639032 -2568221 -2516849 -2642301 -3002594 -3413414
12840 -3413414 -3631831 -3473688 -2908148 -2140415 -1535640 -1336050 -1482088 -1790496 -1964853
12831 -1964853 -1759719 -1162921 -462101 -49636 -105600 -414003 -714896 -934238 -1090355 -1193740
12821 -1193740 -1172336 -1040558 -992207 -1122892 -1328001 -1418890 -1250914 -817258 -287951 144777
12811 144777 457231 615117 544196 208099 -492145 -1327788 -1778825 -1622990 -1159531 -643781
12801 -643781 -256016 -157036 -116256 -57 -38458 -500699 -1175052 -1742061 -2138166 -2272048
12791 -2272048 -2056393 -1696071 -1466435 -1304095 -1027664 -611555 -268935 -320028 -645026 -888321
12781 -888321 -992347 -1007657 -919356 -709751 -376118 -45233 179194 335563 398529 245154
12771 245154 -92573 -377391 -382496 -146371 108466 187202 24430 -265621 -415779 -341378
12761 -341378 -140679 82802 214209 296619 402677 569128 670689 595529 527623 568051
12751 568051 599710 546752 430101 273805 104405 -62630 -367578 -848493 -1346476 -1687304
12741 -1687304 -1723355 -1481294 -1269352 -1386025 -1793988 -2064546 -1932509 -1573390 -1199396 -774867
12731 -774867 -35361 1092427 2216446 2715176 2457633 2041603 1816510 1706811 1652154
12722 1652154 1662502 1706840 1739283 1743608 1739186 1705558 1577336 1500118 1556399 1550047 1416504
12711 1416504 1237778 1120119 1138058 1149201 1146278 1240617 1340921 1332372 1353254 1497841 1663545
12700 1663545 1667161 1506150 1311007 1174587 1231312 1342669 1303929 1227394 972735 438494
12690 438494 -233392 -936656 -1356929 -1289033 -869522 -288889 230735 440452 291831 81071
12680 81071 179629 664891 1260948 1561527 1556992 1598359 1726496 1736109 1556232 1063873 164223
12669 164223 -823577 -1449689 -1495954 -1022146 -413695 -11939 216248 444144 770650 1084297
12659 1084297 1316235 1499108 1609121 1611284 1586294 1671329 1633071 1261344 745895 293752
12649 293752 53110 -63281 -104638 -125322 -278850 -513857 -759800 -938226 -1072802 -1294775
12639 -1294775 -1530698 -1509876 -1197894 -671221 -13906 459873 599071 431064 15107 -593972
12629 -593972 -1119929 -1262385 -1014254 -471828 162921 741081 1194486 1365405 1219245 984873
12619 984873 901963 910108 1022959 1274429 1598370 1910925 2119380 2170823 1977769 1518501
12609 1518501 1059383 798197 729536 818026 910683 952602 990099 1062312 1202929 1336768
12599 1336768 1301880 1042793 751581 529157 258504 -26784 -203565 -391285 -703327 -1132576
12589 -1132576 -1572309 -1846569 -2016520 -2358662 -3006030 -3733707 -4150086 -4067308 -3586510 -3089860
12579 -3089860 -2724373 -2148919 -1332170 -706414 -487822 -660017 -1067257 -1393147 -1328080 -863024
12569 -863024 -346617 -109093 -299574 -672251 -1004930 -1315686 -1527039 -1428926 -1169760 -1036734
12559 -1036734 -995914 -959995 -950881 -969794 -938891 -747729 -530220 -494607 -521409 -404769 -178265
12548 -178265 -91302 -174208 -180996 -62743 83268 232591 365048 435036 531024 695144 707193
12537 707193 306045 -454741 -1252458 -1921666 -2407173 -2365923 -1713263 -947098 -506761 -343188
12527 -343188 -360084 -488918 -535988 -498009 -526416 -608639 -661169 -641634 -385662 106147 568717
12516 568717 1032658 1597069 2075171 2356889 2504672 2569418 2630236 2707042 2751766 2766620
12506 2766620 2777272 2649145 2267216 1844895 1666885 1673223 1625242 1384305 1111599 1018976
12496 1018976 1091224 1188725 1150838 889951 590860 543473 645962 464438 -82685 -597818
12486 -597818 -712878 -391240 223133 873035 1222593 1164639 987676 913221 879948 760226
12476 760226 576087 395815 160201 -121258 -415140 -823346 -1221828 -1406676 -1414019 -1326627
12466 -1326627 -1258060 -1168424 -916745 -539581 -84046 339249 562496 587056 497920 445516
12456 445516 549145 842855 1206193 1242975 701664 -206098 -1097266 -1802097 -2265903 -2320048
12446 -2320048 -1925778 -1281801 -604104 9890 370003 384943 263860 256404 436614 625241
12436 625241 719130 775027 654803 420562 370656 545913 784626 906622 783542 481101
12426 481101 71464 -396531 -890551 -1234988 -1250109 -1027461 -793631 -542142 -276976 -131866
12416 -131866 -170002 -348486 -448467 -343407 -61246 249261 340365 264165 311803 580653
12406 580653 804410 877937 906815 871016 750878 456248 48889 -266587 -475385 -507983
12396 -507983 -276761 158847 571589 664068 405595 143330 8670 -143109 -209230 -105362
12386 -105362 127957 381210 338213 -24451 -354069 -515010 -600997 -688790 -753316 -811225
12376 -811225 -811242 -758110 -750575 -757810 -620051 -300260 16428 86193 -15231 -92096 -171375 -241075
12364 -241075 -282042 -341527 -475640 -632762 -728639 -692451 -453334 -168365 -66563 -168811
12354 -168811 -257495 -125273 96258 251580 438875 567827 491632 216754 -27292 -13614
12344 -13614 222847 529783 695856 520198 125215 -281449 -575065 -786564 -1058190 -1278237
12334 -1278237 -1467142 -1662573 -1682156 -1603517 -1608029 -1778534 -2163140 -2575640 -2709937 -2420269
12324 -2420269 -1771034 -898379 -130914 264812 236380 -81975 -495310 -857201 -959483 -844520
12314 -844520 -686837 -560686 -556114 -701541 -931054 -1083792 -1049375 -831781 -556784 -397692
12304 -397692 -310310 -188619 -7748 178816 379637 676954 1023277 1589626 2473751 3252672
12294 3252672 3543839 3437800 3273863 3183806 3067540 2875603 2536046 2120237 1843044 1836251
12284 1836251 1966011 2008063 1899730 1714987 1560673 1508379 1463147 1326163 1287770 1425764
12274 1425764 1694245 2112302 2566037 2865243 2939584 2809282 2545881 2252140 2062855 2076447
12264 2076447 1953807 1381050 635266 111684 -41216 79693 270336 454781 631889
12255 631889 809953 1070889 1439742 1784558 1908386 1816970 1652988 1512248 1385449 1143263
12245 1143263 781611 397951 -7980 -398384 -744470 -1170340 -1592537 -1742207 -1448126
12236 -1448126 -802724 -169161 261984 685530 1239520 1887401 2508239 2831367 2793670 2429900
12226 2429900 1707861 807420 81697 -155213 285038 1233820 2182827 2664487 2643914 2410295
12216 2410295 2232852 2104775 2034274 2009398 1965113 1902011 1786708 1762416 1918916 2133251
12206 2133251 2334460 2454250 2386949 2109109 1695827 1343698 1215361 1292992 1413519 1336403
12196 1336403 1115275 894503 604399 394718 494657 841033 1251532 1445187 1195057 655663
12186 655663 213735 103930 316945 766900 1337847 1898112 2286892 2535220 2770710 2877219
12176 2877219 2622431 1970070 1062887 12213 -970581 -1611391 -1859918 -1826424 -1738839 -1726189
12166 -1726189 -1629317 -1341202 -1071692 -1038991 -1295775 -1596999 -1726420 -1685742 -1687707 -1672240
12156 -1672240 -1279965 -611379 -39428 319959 562976 732834 722085 450113 81588 -169974
12146 -169974 -378480 -633652 -819654 -927623 -982364 -981572 -985675 -1073558 -1282745 -1402789 -1097719
12135 -1097719 -483475 17126 231938 183437 -26594 -301836 -581462 -686097 -370686 398688
12125 398688 1313003 2064544 2509231 2607440 2373617 1821135 975962 -53669 -1035109 -1618712
12115 -1618712 -1648575 -1402254 -1091933 -758837 -495464 -238567 4370 208673 421596 601190
12105 601190 506026 159101 13552 145878 292497 455593 531922 213569 -485027 -1177058
12095 -1177058 -1484204 -1427336 -1142045 -625032 -55554 281489 320268 135885 -287953 -866302
12085 -866302 -1305480 -1491022 -1480068 -1405187 -1471014 -1666433 -1790175 -1664576 -1215889 -485548
12075 -485548 193953 530002 577187 407581 49499 -375758 -879169 -1438485 -1732552 -1576611
12065 -1576611 -1241366 -1131768 -1263596 -1341640 -1308709 -1354041 -1571906 -1906724 -2192316 -2265422
12055 -2265422 -1954443 -1226265 -291848 558366 1105682 1294685 1190859 809193 270799
12046 270799 -170511 -337198 -277345 -133057 159017 595827 942382 1040167 867310 520451
12036 520451 217441 -58865 -394311 -733131 -948064 -963660 -777061 -441759 -113782 65191
12026 65191 70301 -38160 -264578 -565283 -764861 -790960 -727541 -628827 -563487 -526374 -500667
12015 -500667 -520394 -400815 -112313 14897 -155088 -276020 -91977 86720 -202377 -761102
12005 -761102 -1192051 -1452226 -1546083 -1444477 -1290746 -1258060 -1310349 -1275640 -1081490 -846710
11995 -846710 -810486 -1221013 -1918874 -2507189 -2809418 -2902548 -2816263 -2608659 -2488431 -2362326
11985 -2362326 -1991492 -1513040 -1073072 -674880 -373092 -172317 967 92070 28415 -111396
11975 -111396 -162107 -86662 -23301 -130659 -326962 -420778 -410503 -360583 -351782 -475781 -677731
11964 -677731 -870996 -898851 -719175 -445225 -68231 335152 559370 499872 265794 93676
11954 93676 255576 690661 1115737 1298430 1104852 590707 79488 -39607 163276 457550
11944 457550 669442 718020 692525 622382 515463 409789 173952 -286262 -693150 -737112
11934 -737112 -463596 -176440 -214292 -421816 -418653 -218260 -85072 -60082 64498 249584
11924 249584 45163 -749976 -1521108 -1607841 -1202894 -811846 -506797 -87556 448490 934813
11914 934813 1281300 1496224 1578138 1594272 1708333 1847376 1840526 1671087 1359655 953933
11904 953933 732616 899736 1274594 1577708 1660288 1461721 1186002 940239 665000 376158
11894 376158 86380 -103598 -201124 -281792 -414560 -617947 -868149 -1092647 -1087850 -810638
11884 -810638 -447034 -200821 -30116 134839 287153 563473 935042 1390010 1943177 2318700
11874 2318700 2248400 1925165 1598301 1384250 1274459 1133532 866433 459058 -22763 -488371
11864 -488371 -771352 -908011 -1114735 -1400802 -1504274 -1261798 -954067 -1034381 -1495565 -1822885
11854 -1822885 -1723949 -1289089 -656195 -85057 145260 5231 -86304 281067 1002077 1625738
11844 1625738 1976932 2076770 1843787 1446907 1093949 826026 764527 776065 622513 234056
11834 234056 -322635 -794633 -966522 -949742 -992420 -1112599 -1168556 -901162 -314413 128028
11824 128028 212634 126954 -39065 -213768 -315448 -410210 -598645 -888367 -1131455 -1165179
11814 -1165179 -826403 -233667 151836 179184 140067 215384 265371 246829 191061 31457
11804 31457 -3745 472134 1261135 1869568 2076057 1975909 1795060 1684655 1747774 2080216
11794 2080216 2506383 2707825 2611614 2233696 1626446 937018 240988 -439347 -1063874 -1665056
11784 -1665056 -2099559 -2138371 -1788712 -1297164 -918750 -617791 -160248 380400 721438 713638
11774 713638 475175 290582 227263 143366 -18820 -203347 -374822 -389251 -158585 118688
11764 118688 248682 310928 277919 -3175 -410354 -687878 -754974 -880681 -1166575 -1422281
11754 -1422281 -1577833 -1599900 -1470060 -1358805 -1411839 -1416780 -1291395 -1285067 -1548044 -1872117
11744 -1872117 -2023046 -2093645 -2165612 -2138682 -1965501 -1736924 -1675594 -1929972 -2240150 -2171775
11734 -2171775 -1637996 -851838 -63562 405581 390270 133064 43623 318674 767574 1139726
11724 1139726 1331888 1326610 1164801 801082 271308 -253531 -601983 -840599 -986122 -835937
11714 -835937 -436479 -66108 106 -233068 -416014 -383249 -166742 170310 370458 267253
11704 267253 -7293 -242913 -348314 -224912 87605 370055 508240 622610 874775 1244829
11694 1244829 1378316 1074019 650745 540096 612947 472409 205200 21077 -164294 -427638
11684 -427638 -638463 -751037 -831240 -930812 -924970 -643041 -203604 65173 72983 -39081 -133496
11673 -133496 -77180 236876 655201 718393 352016 18334 95183 452802 712529 837472
11663 837472 1032197 1362351 1706565 1854559 1824989 1893601 1950365 1723310 1259800 591234
11653 591234 -143676 -643018 -927533 -1041107 -978037 -894352 -774406 -533485 -263248 25954
11643 25954 319870 411561 195743 -328866 -1003211 -1654284 -2111436 -2392782 -2550720 -2435577
11633 -2435577 -2172200 -1848141 -1347150 -696856 -105020 238911 326936 336194 402156 498394
11623 498394 458776 236785 -53481 -443630 -893831 -994360 -500470 233833 770365 1085186
11613 1085186 1258101 1246691 1001423 544195 105168 -48248 -35956 -133137 -142069 30739
11603 30739 97987 30748 -100597 -227193 -244296 -166356 -27857 156264 473401 875804
11593 875804 1292728 1865871 2505969 2849865 2733323 2285116 1705780 1213425 909426 693595
11583 693595 575865 601310 707665 916837 1085870 910204 283238 -469624 -880836 -912510
11573 -912510 -869259 -869155 -734305 -462823 -153071 224951 654675 950939 1042035 999372 654062
11562 654062 -31066 -694058 -788202 -176357 700734 1204052 1151914 799965 303670 -214337
11552 -214337 -752867 -1354655 -1939950 -2382421 -2441542 -2143474 -1870741 -1665245 -1373623 -1130841
11542 -1130841 -1047339 -1081910 -1168728 -1184853 -962469 -541549 -189165 5949 105070 142104
11532 142104 123214 12182 -226708 -615999 -952418 -892891 -402057 195896 573511 624503
11522 624503 475383 348750 301670 193246 -37867 -401836 -777005 -1063113 -1398951 -1770315
11512 -1770315 -1983444 -1869327 -1419036 -968410 -867987 -986490 -920641 -566930 -139232 111906
11502 111906 207300 394995 687712 858023 816411 829658 1168467 1682143 2212710 2713398
11492 2713398 3056024 3106334 2770702 2197166 1557888 998038 636550 356060 215911 438074
11482 438074 872511 1278878 1462531 1509459 1647333 1885096 2036123 1994531 1729560 1269763
11472 1269763 795472 552431 678190 955452 1022068 743615 125114 -630736 -1254917 -1653366
11462 -1653366 -1876127 -1891205 -1502721 -775537 -87170 302603 458933 420483 53889 -517357
11452 -517357 -1057529 -1545015 -2069109 -2441820 -2389906 -2017639 -1414772 -686276 -28990 509119
11442 509119 815364 844112 623090 191826 -272746 -517158 -401450 104562 880903 1708575
11432 1708575 2280311 2408978 2163828 1583413 905624 533931 639662 1010229 1287389
11423 1287389 1255929 939869 488045 -69087 -683295 -1106803 -1211815 -1147910 -898006 -300889
11413 -300889 531673 1331266 1765549 1634392 1115940 548674 203842 -35396 -353141 -505400
11403 -505400 -260123 194877 447328 309797 -16945 -414555 -950127 -1476371 -1784226 -1902623
11393 -1902623 -1913051 -1829272 -1697832 -1662070 -1672741 -1524921 -1401158 -1597804 -2062836 -2646219
11383 -2646219 -3187912 -3451094 -3296697 -2857803 -2391006 -2022431 -1808199 -1748184 -1668721 -1258291
11373 -1258291 -476300 289814 679841 754430 769587 701879 449614 105639 -345765 -974187
11363 -974187 -1651223 -2246658 -2694455 -2791879 -2423986 -1779683 -955246 -89247 500363 683918
11353 683918 588069 476066 516174 683452 914144 998400 800011 616890 536655 313692
11343 313692 -193547 -806301 -1339768 -1725723 -1937166 -1906288 -1529799 -1003924 -645650 -387313
11333 -387313 41940 750258 1462673 1676620 1317396 768048 276221 -121448 -360449 -501256
11323 -501256 -624038 -602767 -388819 -80213 252045 426568 428689 389888 473798 742840
11313 742840 953999 927630 734605 636589 596796 391009 35158 -401272 -817111 -1030795
11303 -1030795 -954769 -607265 -4139 583508 817074 690371 465739 267175 71131 11296
11293 11296 113928 227031 334998 602675 1087084 1563261 1677889 1418289 1184224 1243972
11283 1243972 1523728 1943731 2500524 3077522 3361597 3251884 3008536 2828768 2713093
11274 2713093 2801108 3098514 3253121 3122320 2869019 2728662 2836983 3044144 3122191 3111467
11264 3111467 3205275 3430548 3575665 3496665 3215066 2715572 2139108 1776729 1698124 1677033
11254 1677033 1732076 2089481 2641507 2926007 2703412 2202444 1789109 1619924 1750300 2171232
11244 2171232 2635972 2811537 2601862 2211848 1908321 1691241 1421210 1139232 991135
11235 991135 953104 779553 421562 67038 -229712 -667574 -1343057 -2063185 -2547875 -2713889
11225 -2713889 -2687647 -2373148 -1828387 -1387125 -1176146 -1074764 -990886 -975801 -1028006 -959602
11215 -959602 -781973 -710146 -767334 -817779 -658056 -232997 368164 950153 1355269 1554731
11205 1554731 1619357 1635800 1495397 1135223 586996 -19542 -498437 -880149 -1314070 -1837505
11195 -1837505 -2426557 -2938594 -3090918 -2868262 -2532411 -2291087 -2092527 -1676463 -976195
11186 -976195 -232949 239818 398680 370853 192446 30642 109474 386474 693783 888857
11176 888857 1001796 1157206 1164627 896052 693419 788329 1013257 1059581 712493 117701
11166 117701 -353489 -547373 -602861 -590315 -360445 160446 615107 640051 398146 196854
11156 196854 247163 505605 702844 731822 687454 618545 474555 295138 282272 622650
11146 622650 1219258 1742878 2059314 2383744 2684895 2584151 2076910 1571571 1238403 1037773
11136 1037773 725991 126462 -573277 -1058494 -1296942 -1518841 -1859002 -2159312 -2308812
11127 -2308812 -2371514 -2442673 -2387275 -2163998 -1976663 -1845265 -1650436 -1425531 -1047977 -469119
11117 -469119 51595 283267 226564 48936 -71796 -107179 -57643 141136 497119 930429
11107 930429 1274003 1345217 1120406 752051 264709 -433011 -1190575 -1718591 -1899679 -1801533
11097 -1801533 -1480564 -873634 -16260 712963 976497 953434 986165 1184455 1345449 1233542
11087 1233542 897219 679009 607285 377465 55398 -121793 -146928 -122974 -54191 -97304
11077 -97304 -373200 -691177 -930901 -1091308 -1136658 -987053 -654028 -342686 -298443 -617278
11067 -617278 -1128155 -1404282 -1265449 -930958 -633144 -433520 -333208 -355751 -541375 -842085
11057 -842085 -1166010 -1393880 -1549756 -1809628 -2194940 -2593839 -2850144 -2935601 -2894565 -2762218
11047 -2762218 -2638668 -2489034 -2330407 -2264131 -2233442 -2093762 -1750230 -1177988 -487974 48893
11037 48893 135352 -203318 -577342 -714487 -608451 -413183 -300677 -378990 -512566 -457811
11027 -457811 -270795 -231451 -454712 -533100 -126568 584320 1244865 1532094 1420415 1129501
11017 1129501 770762 433788 249946 216632 221324 177313 18489 -241870 -549567 -852082
11007 -852082 -1126965 -1539494 -2008996 -2361215 -2588206 -2669918 -2506383 -2034065 -1436180 -908451
10997 -908451 -468938 -163078 -7423 159760 309551 237977 -20823 -327241 -587762 -724915
10987 -724915 -701860 -552186 -407187 -395005 -476014 -413051 -60496 377274 639102 849171
10977 849171 1158304 1444295 1596249 1642997 1738757 2006681 2495952 3052072 3473304 3887114
10967 3887114 4210619 3944498 3045566 1920708 910832 218964 -101355 19963 460286
10958 460286 786211 799824 761381 810713 713780 465365 397111 538915 662827 779466
10948 779466 1019757 1177777 1097244 937676 862339 801158 721019 670820 618344 497431 193970
10937 193970 -215901 -595408 -934129 -1225521 -1476135 -1543815 -1340403 -1103010 -978268 -1027611
10927 -1027611 -1288651 -1456023 -1251542 -708178 -13037 688335 1234946 1480747 1570776 1566265
10917 1566265 1385504 982030 452814 -114851 -590130 -643855 -226883 474537 1125412 1361260
10907 1361260 1159214 772917 397090 217535 359779 597742 592141 161811 -562191 -1220758
10897 -1220758 -1520853 -1394943 -1155907 -1111422 -1162749 -1113825 -1031542 -931771 -916486 -1056218
10887 -1056218 -1095056 -1004246 -862448 -771819 -936424 -1380464 -1904581 -2150384 -1815524 -927972
10877 -927972 41744 495969 278133 -282124 -792293 -1014265 -1029010 -981926 -915500 -826875
10867 -826875 -787017 -861342 -957580 -1035343 -1124648 -1230682 -1258228 -1085095 -803558 -637517 -648058
10856 -648058 -712127 -560334 -103954 391283 604258 401775 88744 147623 605434 1173249
10846 1173249 1644632 2083920 2351748 2285615 1993180 1691096 1617196 1906439 2440347 2918706
10836 2918706 3198921 3273404 3045684 2445409 1670814 1119939 949940 837801 603896 374475
10826 374475 125817 -234885 -591460 -802429 -829166 -724860 -587607 -385687 -132705 -18166
10816 -18166 -110180 -246700 -230023 -12699 275500 445591 562115 643038 513166 156651
10806 156651 -351109 -821546 -1190373 -1451036 -1346188 -953903 -768792 -1114708 -1871162 -2642437
10796 -2642437 -3050416 -2918165 -2280439 -1339605 -466018 4612 177969 293052 470949
10787 470949 815238 1271465 1768976 2243389 2515483 2565754 2624935 2708605 2582044 2228574
10777 2228574 1807815 1520689 1430865 1476670 1605090 1548896 1119042 629321 424970 303703
10767 303703 99253 -71154 -23829 358076 980336 1547389 1702918 1495413 1251382 1169918
10757 1169918 1191069 1211867 1152745 954889 710957 687818 1055929 1598845 1824666 1530834
10747 1530834 979431 492158 212584 160029 303697 611378 931294 1143480 1273955 1284308
10737 1284308 1182128 927589 481465 -71602 -553352 -909561 -1156297 -1324609 -1567290
10728 -1567290 -1848298 -1917428 -1448361 -438657 780513 1905446 2668534 2777218 2135408
10719 2135408 1021568 -37063 -642540 -689408 -324750 238186 923304 1454106 1446052 930634
10709 930634 170292 -538779 -934519 -1109404 -1257040 -1368915 -1313669 -1114059 -848735 -535937
10699 -535937 -167223 272560 630932 697089 515325 267425 -34565 -433575 -862514 -1158026
10689 -1158026 -1202992 -1100849 -964390 -799357 -626583 -322727 180842 699767 1083855 1286865
10679 1286865 1298108 1052657 504451 -121254 -412995 -324318 -53942 269665 682327 1161361
10669 1161361 1490457 1564107 1567232 1688052 1937340 2269235 2434958 2178098 1655875 1207480
10659 1207480 947382 806539 776708 947681 1146141 1030901 671156 336449 176800 136021
10649 136021 113627 23306 -276010 -835833 -1509244 -2083098 -2502473 -2802647 -2855232 -2529000
10639 -2529000 -1989412 -1399328 -797152 -374303 -235988 -287043 -485693 -699533 -718727 -436576
10629 -436576 95646 609975 832201 832365 864734 908392 944425 1054006 1110058 935567 577172
10618 577172 315489 191876 -9299 -228094 -245226 12204 481475 1019011 1446259 1641666
10608 1641666 1790819 2062944 2342812 2400355 2109081 1691890 1296780 926626 771795 944435
10598 944435 1290733 1563754 1673858 1584344 1337464 1070231 879159 847964 927537 1030073
10588 1030073 1036878 964646 865846 617497 240568 -156253 -509047 -639374 -498639 -216284
10578 -216284 152551 543645 697831 578534 496255 570613 681138 645977 474818 295853
10568 295853 207970 222948 318672 547853 907495 1291167 1568783 1505571 1013735 341874
10558 341874 -160741 -283695 -79538 342630 845139 1181308 1295723 1363872 1408049 1354125
10548 1354125 1394619 1635659 1766320 1542443 1158082 839188 670353 540780 401068 371719
10538 371719 413769 531014 711817 828998 673402 208567 -215861 -344755 -303277 -300957
10528 -300957 -426557 -604306 -560461 -297891 -128065 -136701 -190713 -312453 -451130 -465532
10518 -465532 -476514 -750509 -1378977 -2081233 -2562586 -2632449 -2257971 -1653707 -1031609 -423327
10508 -423327 143910 611558 895429 1200644 1800625 2380475 2433762 1970038 1318942 734915
10498 734915 331068 115590 196613 568174 853900 801395 384473 -244231 -549665 -221015
10488 -221015 287119 611551 739927 783415 787333 538318 46553 -395894 -566370 -308499
10478 -308499 211609 535201 572267 511222 363897 185768 282216 517812 618933 584951
10468 584951 452065 202235 -213846 -658206 -891365 -783699 -428918 -63707 273760 579436
10458 579436 863710 1197581 1443364 1389375 996266 421746 -109600 -397173 -443895 -452828
10448 -452828 -535285 -539909 -398193 -320795 -415603 -446206 -254928 -10764 90511 -78313 -481698
10437 -481698 -786198 -619285 -11695 608299 897498 886077 734426 553709 183059 -445287
10427 -445287 -1009928 -1324950 -1339534 -1033391 -564293 -73229 398957 612843 505398 260972
10417 260972 -160458 -781127 -1489750 -2166950 -2743143 -3205815 -3535608 -3625290 -3398517 -2933048
10407 -2933048 -2237595 -1377917 -585302 -25374 370629 701515 874309 790183 471174 96281
10397 96281 -74940 -181239 -379295 -427437 -140504 308600 538007 488218 359340 239503
10387 239503 167608 173670 281133 534491 768763 719977 480974 282916 277536 601527 1097669
10376 1097669 1238331 819200 162772 -501384 -921349 -886214 -542819 -155651 206324 553748
10366 553748 765588 768272 703580 638428 696184 1112651 1981544 3423735 5229055 6231852
10356 6231852 5907487 4914979 3945715 3358843 3121704 2844307 2254826 1605767 1188816
10347 1188816 1051206 1111835 1143744 977822 548364 47546 -115806 154363 558546 904064
10337 904064 1012344 780593 181046 -650801 -1417502 -1987481 -2371759 -2598408 -2759859 -2851054
10327 -2851054 -2797187 -2717447 -2668768 -2559846 -2446145 -2423083 -2510094 -2504111 -2272385 -2091965 -2027546
10316 -2027546 -1940568 -1788425 -1589421 -1570236 -1870148 -2186134 -2226878 -2003139 -1700973 -1477769
10306 -1477769 -1275017 -1024971 -796467 -546165 -375097 -319245 -142830 243212 645248 1001196
10296 1001196 1308174 1466763 1391794 1105349 534719 -252623 -904194 -1331751 -1489967 -1356001
10286 -1356001 -1016225 -576811 -161973 222572 595532 806806 709927 375871 -38235 -426991
10276 -426991 -652235 -484679 -34519 258019 236194 126222 94097 147568 287453 478353
10266 478353 615531 565883 218410 -374980 -893024 -1004099 -740908 -418428 -446288 -913160
10256 -913160 -1497937 -1874493 -1940183 -1819736 -1770176 -1814866 -1795711 -1671455 -1564498 -1539487
10246 -1539487 -1527831 -1502214 -1610299 -1881094 -2087081 -2055328 -1752556 -1276636 -815914 -340710
10236 -340710 181062 400785 142718 -298907 -549412 -470229 -214802 -147027 -453555 -931351
10226 -931351 -1142841 -871669 -361849 177854 786591 1418046 1942425 2258447 2256387 2037012
10216 2037012 1878850 1818911 1796333 1867112 1950132 1760572 1362623 1086539 962080 851487
10206 851487 659304 309648 -107637 -263272 101846 743282 1375460 1945717 2255296 2200723
10196 2200723 1910914 1542663 1207683 961743 694811 422385 302903 317827 409022 468527
10186 468527 359824 97775 -170913 -304970 -336641 -330690 -272627 -244426 -250680 -175432 -142086
10175 -142086 -274051 -579695 -1033097 -1554338 -2039233 -2442866 -2581040 -2329982 -2009445 -1875213
10165 -1875213 -1668107 -1166963 -472506 143072 480531 553511 548262 563704 665153 1046080
10155 1046080 1790395 2683945 3320018 3490902 3151678 2476170 1791627 1259985 827947
10146 827947 282281 -442452 -1055224 -1307765 -1320941 -1259093 -1250970 -1297872 -1308873 -1157336 -772096
10135 -772096 -365286 -71092 303571 814473 1334948 1660469 1686763 1621479 1501287 1316462
10125 1316462 1338551 1668854 2094350 2440920 2571155 2434809 2227668 2096430 1892057 1526956
10115 1526956 1202844 1004050 894486 873078 933544 1049031 1028209 839499 632864 460280
10105 460280 354380 265738 190797 116593 66666 227593 670352 1183669 1582662 1758307
10095 1758307 1541563 982307 361909 -38357 -152169 -101997 -145111 -355076 -508491 -547692
10085 -547692 -621085 -816888 -1078397 -1390816 -1776822 -2122599 -2376474 -2543957 -2526304 -2232532
10075 -2232532 -1850954 -1501829 -1081686 -709453 -596350 -656108 -656238 -513505 -204634 240177
10065 240177 521767 530692 380107 153882 43565 134181 86466 -227387 -480482 -530583
$$ [...]
##END NTUPLES=NMR SPECTRUM
##END=
