##TITLE=31P ikalashn
LR-786-B-C2
24.10.2024
##JCAMPDX= 6.0         $$ Bruker NMR JCAMP-DX V2.0
##DATA TYPE= NMR SPECTRUM
##DATA CLASS= NTUPLES
##ORIGIN= UXNMR, Bruker Analytische Messtechnik GmbH
##OWNER= root
$$ TOPSPIN		Version 1.3
$$ 2024-10-24 14:31:31.218 +0400  Irina@DPX200
$$ Compression mode = diff/dup
##.OBSERVE FREQUENCY= 81.01967998063
##.OBSERVE NUCLEUS= ^31P
##.ACQUISITION MODE= SIMULTANEOUS
##.ACQUISITION SCHEME= undefined
##.AVERAGES= 64
##.DIGITISER RES= 17
##SPECTROMETER/DATA SYSTEM= spect
##.PULSE SEQUENCE= zgpg
##.SOLVENT NAME= D2O
##.SHIFT REFERENCE= INTERNAL, D2O, 1, 298.5841
##AUDIT TRAIL= $$ (NUMBER, WHEN, WHO, WHERE, WHAT)
$$ ##TITLE= Audit trail, TOPSPIN		Version 1.3
$$ ##JCAMPDX= 5.01
$$ ##ORIGIN= Bruker BioSpin GmbH
$$ ##OWNER= Irina
$$ $$ F:/spectra/data/iren/nmr/P31dec/1/pdata/1/auditp.txt
$$ ##AUDIT TRAIL=  $$ (NUMBER, WHEN, WHO, WHERE, VERSION, WHAT)
(   1,<2024-10-24 14:31:08.046 +0400>,<Irina>,<DPX200>,<TOPSPIN 1.3>,
      <created by zg
	started at 2024-10-24 14:29:24.781 +0400,
	POWCHK disabled, PULCHK disabled
       configuration hash MD5:
       BE 6D 3F 07 2A EA 11 49 91 17 2B D3 AF B3 58 0D
       data hash MD5: 32K
       34 38 1C C5 7A DE EE FE 3A 94 F0 1B A8 D8 D9 A2>)
(   2,<2024-10-24 14:31:16.046 +0400>,<Irina>,<DPX200>,<TOPSPIN 1.3>,
      <Start of raw data processing
       efp BC_mod = 2 LB = 8 FT_mod = 6 PKNL = 1 PHC0 = 65.50082 PHC1 = 344.6366 SI = 32K 
       data hash MD5: 32K
       B9 2E 76 AA 66 22 A3 19 BE 5B F5 E3 FE 2D E6 5E>)
(   3,<2024-10-24 14:31:18.484 +0400>,<Irina>,<DPX200>,<TOPSPIN 1.3>,
      <apk 
       data hash MD5: 32K
       6D 06 63 FF 8A 98 CF D6 74 F4 5E A0 77 85 57 A0>)
(   4,<2024-10-24 14:31:20.421 +0400>,<Irina>,<DPX200>,<TOPSPIN 1.3>,
      <abs n ABSG = 5 
       data hash MD5: 32K
       26 93 E7 66 E8 FC E9 CF 48 F8 7D 6E F7 98 AD 56>)
$$ ##END=
$$ 
$$ $$ hash MD5
$$ $$ F7 7F 93 44 D5 24 9B 2B 88 2C 8D D9 8D 20 C0 26
##$RELAX= 
##$RELAX= 
##$RELAX= 
##$RELAX= 
##$RELAX= 
##$RELAX= 
##$RELAX= 
##$RELAX= 
##$RELAX= 
##$RELAX= 
##$RELAX= 
$$ Bruker specific parameters
$$ --------------------------
##$DU= <F:/spectra>
##$EXPNO= 1
##$NAME= <P31dec>
##$PROCNO= 1
##$TYPE= <nmr>
##$USER= <iren>
##$AMP= (0..31)
100 100 100 100 100 100 100 100 100 100 100 100 100 100 100 100 100 100 
100 100 100 100 100 100 100 100 100 100 100 100 100 100 
##$ANAVPT= -1
##$AQSEQ= 0
##$AQ_mod= 1
##$AUNM= <au_zg>
##$AUTOPOS= <>
##$BF1= 81.014009
##$BF2= 200.13
##$BF3= 200.13
##$BF4= 200.13
##$BF5= 200.13
##$BF6= 200.13
##$BF7= 200.13
##$BF8= 200.13
##$BYTORDA= 1
##$CFDGTYP= 0
##$CFRGTYP= 5
##$CHEMSTR= <none>
##$CNST= (0..63)
1 1 145 1 1 1 1 1 1 1 1 1 1 1 1 1 1 1 1 1 1 1 1 1 1 1 1 1 1 1 1 1 1 1 
1 1 1 1 1 1 1 1 1 1 1 1 1 1 1 1 1 1 1 1 1 1 1 1 1 1 1 1 1 1 
##$CPDPRG= <waltz16>
##$CPDPRG1= <>
##$CPDPRG2= <waltz16>
##$CPDPRG3= <>
##$CPDPRG4= <mlev>
##$CPDPRG5= <mlev>
##$CPDPRG6= <mlev>
##$CPDPRG7= <mlev>
##$CPDPRG8= <mlev>
##$CPDPRGB= <>
##$CPDPRGT= <>
##$D= (0..63)
$$ [...]
##$SW_h= 37037.037037037
##$TD= 32768
##$TD0= 1
##$TE= 300
##$TE2= 300
##$TE3= 300
##$TEG= 300
##$TL= (0..7)
0 120 53 12 22 120 120 120 
##$TP= (0..7)
150 150 150 150 150 150 150 150 
##$TP07= 0
##$TPNAME0= <>
##$TPNAME1= <>
##$TPNAME2= <>
##$TPNAME3= <>
##$TPNAME4= <>
##$TPNAME5= <>
##$TPNAME6= <>
##$TPNAME7= <>
##$TPOAL= (0..7)
0.5 0.5 0.5 0.5 0.5 0.5 0.5 0.5 
##$TPOFFS= (0..7)
0 0 0 0 0 0 0 0 
##$TUNHIN= 0
##$TUNHOUT= 0
##$TUNXOUT= 0
##$USERA1= <user>
##$USERA2= <user>
##$USERA3= <user>
##$USERA4= <user>
##$USERA5= <user>
##$V9= 5
##$VALIST= <valist>
##$VCLIST= <CCCCCCCCCCCCCCC>
##$VD= 0
##$VDLIST= <DDDDDDDDDDDDDDD>
##$VPLIST= <PPPPPPPPPPPPPPP>
##$VTLIST= <TTTTTTTTTTTTTTT>
##$WBST= 1024
##$WBSW= 4
##$XGAIN= (0..3)
0 0 0 0 
##$XL= 0
##$YL= 0
##$YMAX_a= 3792
##$YMIN_a= -3744
##$ZGOPTNS= <>
##$ZL1= 120
##$ZL2= 120
##$ZL3= 120
##$ZL4= 120
##$ABSF1= 298.5841
##$ABSF2= -158.5842
##$ABSG= 5
##$ABSL= 5
##$ALPHA= 0
##$AQORDER= 0
##$ASSFAC= 0
##$ASSFACI= 0
##$ASSFACX= 0
##$ASSWID= 0
##$AUNMP= <proc_1d>
##$AXLEFT= 0
##$AXRIGHT= 0
##$AXTYPE= 0
##$AXUNIT= <>
##$AZFE= 0.1
##$AZFW= 0.5
##$BCFW= 0
##$BC_mod= 2
##$BYTORDP= 0
##$COROFFS= 0
##$CY= 12.5935478210449
##$DATMOD= 1
##$DC= 0
##$DFILT= <>
##$DTYPP= 0
##$F1P= 47.1127640792319
##$F2P= -24.0371245302204
##$FCOR= 0.5
##$FTSIZE= 32768
##$FT_mod= 6
##$GAMMA= 0
##$GB= 0
##$INTBC= 1
##$INTSCL= 7.269226e-011
##$ISEN= 30
##$LB= 8
##$LEV0= 0
##$LPBIN= 0
##$MAXI= 12.09355
##$MC2= 0
##$MEAN= 0
##$ME_mod= 0
##$MI= 0.7550151
##$NCOEF= 0
##$NC_proc= -12
##$NLEV= 6
##$NOISF1= 298.5841
##$NOISF2= 270.0111
##$NSP= 0
##$NTH_PI= 0
##$NZP= 0
##$OFFSET= 298.5841
##$PC= 1.4
##$PHC0= 128.9239
##$PHC1= 227.9838
##$PH_mod= 1
##$PKNL= yes
##$PPARMOD= 0
##$PPDIAG= 0
##$PPIPTYP= 0
##$PPMPNUM= 100
##$PPRESOL= 1
##$PSCAL= 0
##$PSIGN= 0
##$REVERSE= no
##$SF= 81.014009
##$SI= 32768
##$SIGF1= 270.0111
##$SIGF2= -158.5842
##$SINO= 77.54984
##$SIOLD= 32768
##$SREGLST= <31P.CDCl3>
##$SSB= 0
##$STSI= 32768
##$STSR= 0
##$SW_p= 37037.037037037
##$SYMM= 0
##$S_DEV= 0
##$TDeff= 32768
##$TDoff= 0
##$TI= <>
##$TILT= no
##$TM1= 0
##$TM2= 0
##$TOPLEV= 0
##$USERP1= <user>
##$USERP2= <user>
##$USERP3= <user>
##$USERP4= <user>
##$USERP5= <user>
##$WDW= 1
##$XDIM= 32768
##$YMAX_p= 388617481
##$YMIN_p= -19551693
$$ End of Bruker specific parameters
$$ ---------------------------------
##NTUPLES= NMR SPECTRUM
##VAR_NAME=  FREQUENCY,     SPECTRUM/REAL,   SPECTRUM/IMAG
##SYMBOL=    X,             R,               I
##VAR_TYPE=  INDEPENDENT,   DEPENDENT,       DEPENDENT
##VAR_FORM=  AFFN,          ASDF,            ASDF
##VAR_DIM=   32768,         32768,           32768
##UNITS=     HZ,            ARBITRARY UNITS, ARBITRARY UNITS
##FACTOR=    1.13031516577767, 1,            1
##FIRST=     37037.037037037, 1226270,       -4036634
##LAST=      0,             1864927,         8406797
##MIN=       0,             -19551693,       0
##MAX=       37037.037037037, 388617481,     0
$$ Real data points
##PAGE= N=1
##DATA TABLE= (X++(R..R)), XYDATA
$$ [...]
17802H030732j642622j400320o62803J48126N06892L06007o4341l36043n95677
17793D289951q66870r48276p53665m01240j92438l66741o89145o32867N5087J025851
17783E19647J491360J069513K19800m82530q70812j029983j208853j380607j068163
17774b740628j75728O44333Q58661O13984L58981K46170K18359J36432j04977
17765E5587l27550l42340j85514o1165J1273L17237Q42763J141163J019350O93852
17755C164656N34154P16500P83357L42481j93992l73504j76307J20110K00728
17746E118183K2048l69773q92517j266327j230877p74588k62555m706J47898M06517
17736H93303O15480M93169k7892p24551j201794j317577j161978q05131l88724
$$ y = [8030732, 6388110, 4987790, 4324987, 4473113, 4980005, 5286012, 5221671, 4885628, 4289951, 3423081, 2474805, 1721140, 1319900, 1127462, 760721, 71576, -561291, -506204, 519647, 2011007, 3080520, 3300320, 2817790, 1946978, 916995, -291858, -1672465, -2740628, -2916356, -2272023, -1413362, -799378, -440397, -194227, 24132, 160564, 55587, -271963, -614303, -799817, -860982, -849709, -532472, 310291, 1451454, 2470804, 3164656, 3698810, 4415310, 5198667, 5541148, 5347156, 4973652, 4797345, 4917455, 5118183, 5140231, 4770458, 3877941, 2611614, 1380737, 606149, 343594, 338888, 486786, 893303, 1508783, 2001952, 1974060, 1249509, 47715, -1269862, -2431840, -3236971, -3625695]
17727c625695p6837Q9760J69241K46497L44382M09483N09404Q03259J060084Q72882
17717H02460L64148l5129k65306m30801n19021n18042l96047j57385J06515L18435
17707g30173M40885M64422M78031M86908L40821M8637q1236Q3116J43983k11818
17697A463576p22261r79417j032012j170063j282462j044036o44122l83973o7648
17688e862418M18226P59137O39126J42007k69253j62837L74484R31914J291142
17679a738472J361017J050126M68433j87707o60233n77851J22013R72997J488101
17670B298424J422053P34904k05543q07392p45702m81781p89360j575561k060802
17661b210760j780077r03605n4007L04696J61684o6452M9328K21549K4573l99700
$$ y = [-3625695, -3702532, -3612772, -3443531, -3197034, -2852652, -2443169, -1933765, -1130506, -70422, 802460, 1166608, 1131479, 866173, 435372, -83649, -601691, -997738, -1155123, -1048608, -730173, -289288, 175134, 653165, 1140073, 1480894, 1529531, 1448295, 1531411, 1675394, 1463576, 741315, -238102, -1270114, -2440177, -3722639, -4766675, -5410797, -5794770, -5862418, -5444192, -4685055, -4045929, -3903922, -4173175, -4336012, -3961528, -3029614, -1738472, -377455, 672671, 1141104, 953397, 293164, -284687, -162674, 810323, 2298424, 3720477, 4455381, 4249838, 3442446, 2696744, 2214963, 1425603, -149958, -2210760, -3990837, -4894442, -4948449, -4643753, -4482069, -4548521, -4499193, -4277644, -4253071, -4652771]
17651d652771p35869p86629n59478j49242M68725J235061J760700J721426J288883
17642d09194Q11878M57706J59717j93744n44075o97921o70054p52153j096154
17633b933994j461906j602225j499081j178845p04560k61556o5533q3132p0482
17624i861314R2871L68065O03567N78446L49791J36842q6347l45691l73696P584
17614h529882N15980P98692O82933L08350J09491L13411O44512O64333L86773
17605d105407Q8259k15198l80397j05013M75292R25198Q98361L71694k41080n00103
17595b788394m49343m61770o66643p94115n55030j1684N23882Q29844Q78332P66496
17585b728425O07543L58149J5456j24848K00429P65416J044284R23133O71281
$$ y = [-4652771, -5388640, -6175269, -6734747, -6883989, -6415264, -5180203, -3419503, -1698077, -409194, 402684, 860390, 1020107, 826363, 282288, -415633, -1085687, -1837840, -2933994, -4395900, -5998125, -7497206, -8676051, -9380611, -9642167, -9707700, -9790832, -9861314, -9768443, -9400378, -8796811, -8218365, -7868574, -7731732, -7818079, -8163770, -8537466, -8529882, -8013902, -7215210, -6532277, -6223927, -6114436, -5801025, -5156513, -4492180, -4105407, -4017148, -4232346, -4612743, -4717756, -4242464, -3317266, -2418905, -2047211, -2288291, -2788394, -3237737, -3699507, -4366150, -5160265, -5715295, -5726979, -5203097, -4373253, -3494921, -2728425, -2120882, -1762733, -1747277, -1872125, -1671696, -906280, 138004, 1061137, 1732418]
17576A732418L72079l1015m30909o24365m04677K2581J03152l14889q56149j114484
17566a546258r34364m35860J55343O09749O64411L94391K17299J29267j18306
17557h64328l77918l16066M9657K44439M7432l15663o31728q30593r17701p80839
17547d693308k52317N24685J108636J202016R67273P20779N19462L27772J41153
17538E66151j71566m78685m21763l6848L21663N22807O61564P92640Q63389P79695
17528C399047M54338j25840o21963p67720p53462p38470q20203j073036j403626
17519b450935j534048j350986j019731o28510j71379K18226L23283K46887L36195
17510f030998O07690P95667R02084J131646J416932J671433J942715J942567J401104
$$ y = [1732418, 2104497, 2073482, 1642573, 1018208, 613531, 636112, 739264, 424375, -431774, -1546258, -2480622, -2916482, -2761139, -2151390, -1486979, -1092588, -875289, -746022, -864328, -1242246, -1558312, -1508655, -1264216, -1216784, -1532447, -2164175, -2994768, -3912469, -4693308, -4945625, -4420940, -3312304, -2110288, -1143015, -422236, 97226, 424998, 566151, 394585, -84100, -505863, -542711, -221048, 301759, 963323, 1755963, 2619352, 3399047, 3853385, 3727545, 3105582, 2337862, 1584400, 845930, 25727, -1047309, -2450935, -3984983, -5335969, -6355700, -6984210, -7155589, -6937363, -6614080, -6367193, -6030998, -5423308, -4627641, -3725557, -2593911, -1176979, 494454, 2437169, 4379736, 5780840]
17501E780840O07911j35980p72547j189967j422927j626366j729633j634172j508760
17492c631601j490998j253062m29801O57293J365986J496612J206368P53324M65176
17483h60703L53656K72398L41818O78735J035856J045857N53303l37837j219145
17474A863938j600681j284205o28568k34512l02207m77191l82554j61032j64176
17465c371188n04976r49682j111080r11118m91279l7538K93008N81925J008841
17456e493087J619116K097854J989284J290127M06060k61846n57607o40809o95100
17447b46008p58075o66035l58361j00988r6876l26996n87348p49333o87321j27400
17437d704741Q37565J593776J707602J252257N45456j53428o45492q44203r56191
$$ y = [5780840, 6388751, 6252771, 5480224, 4290257, 2867330, 1240964, -488669, -2122841, -3631601, -5122599, -6375661, -6805462, -6148169, -4782183, -3285571, -2079203, -1325879, -860703, -507047, -234649, 107169, 785904, 1821760, 2867617, 3420920, 3083083, 1863938, 263257, -1020948, -1649516, -1884028, -2186235, -2663426, -3045980, -3207012, -3371188, -3876164, -4825846, -5936926, -6848044, -7339323, -7376861, -7083853, -6501928, -5493087, -3873971, -1776117, 213167, 1503294, 1909354, 1647508, 1089901, 449092, -246008, -1004083, -1670118, -2028479, -2129467, -2226343, -2553339, -3140687, -3890020, -4577341, -4704741, -3867176, -2273400, -565798, 686459, 1231915, 1078487, 432995, -411208, -1367399]
17428a367399j152334j150638o35645K17141J088449J673631J791242J418922
17420A883369N74771m68660j236486j662046j921115j904869j559133j049497
17412g343666n62932j58991K68941P94099J163953J110056P74669M57683L06920
17403c189268K55810K06539K59120L97369K89978j59875p07591j169706j362072
17394e179696j072907m46925J10987M22160N49303M42990J58496j1762P7534J78048
17384d771772k8733l50748l48252L7500N39495R42542J104828J037246Q73406
17375i64488N63008J10573j96628k70715k45242o1044L85137P73564P03407L97086
17365A194658L14365M27332M90657L74872j1451n32960q01037o40454k73074Q7318
$$ y = [-1367399, -2519733, -3670371, -4306016, -4088875, -3000426, -1326795, 464447, 1883369, 2458140, 1989480, 752994, -909052, -2830167, -4735036, -6294169, -7343666, -7906598, -8065589, -7796648, -7002549, -5838596, -4728540, -3953871, -3496188, -3189268, -2933458, -2726919, -2467799, -2070430, -1780452, -1940327, -2647918, -3817624, -5179696, -6252603, -6699528, -6588541, -6166381, -5617078, -5174088, -5015592, -5027354, -4949820, -4771772, -4800505, -5151253, -5499505, -5462005, -4922510, -3979968, -2875140, -1837894, -964488, -401480, -290907, -487535, -758250, -1003492, -1064536, -679399, 94165, 797572, 1194658, 1509023, 1936355, 2427012, 2801884, 2790433, 2257473, 1456436, 815982, 542908, 630226]
17355F30226K45712M21n08620j013293j266460j137378o78751m6514N64470R57897
17345b252290R79249P05289K58410k37348m36475k44364m820K11810O25189J008464
17335F13114R42627N59017K25478n4546m98013r79427j056845o80557j70860L53118
17325g46894Q59916J167885J030442J99610j153395k202521k391815j830997r44695
17316f012464j45955M47678P60617O32392O9462o87250j314972j598680j442196
17307i291368r33672k45240L30118N24712M58054L85138L62037L82955M32106
17298g595160M43976M11372M41298M52142J63142m49689q79366p16512k93299
17289h022096k26883n53430p22498m61532j12193J37469M83425R44627J222978
$$ y = [630226, 875938, 876359, 367739, -645554, -1912014, -3049392, -3728143, -3774657, -3210187, -2252290, -1273041, -567752, -309342, -546690, -983165, -1227529, -1232349, -1020539, -395350, 613114, 1555741, 2114758, 2340236, 2285690, 1787677, 808250, -248595, -929152, -1100012, -746894, 113022, 1280907, 2311349, 2510959, 1357564, -844957, -3236772, -5067769, -6012464, -6158419, -5710741, -4950124, -4317732, -4248270, -4935520, -6250492, -7849172, -9291368, -10225040, -10470280, -10140162, -9615450, -9157396, -8772258, -8410221, -8027266, -7595160, -7151184, -6739812, -6298514, -5846372, -5683230, -6132919, -7012285, -7728797, -8022096, -8248979, -8802409, -9524907, -9986439, -10098632, -9961163, -9477738, -8533111, -7310133]
17280g310133J042129O16701L96900M96132P92739J074540J146005J008458P38954
17271B425M19647P7564j58960j76849k25580l64162k01597L17802O44620L57786
17261F92696k24036n70322n69024m79948n88413p87453o47981j00532N54128J083161
17251a637724J250081R06554K90770k16250n91582r42285j099666j010246r51347
17242d001695j005670r03054m18604J54703K94059J45186K68879O65447P88187
17233d012562L92680m1178L4153O39527J351206J638697J238822L37275o07683
17224I70937j276647j559888j353832o69774K10305R15352J182157J006390N87553
17215A2553R9770m09211p93865p12955k63893j5504r0646p6707J69032K84045
$$ y = [-7310133, -6268004, -5651303, -5254403, -4758271, -3965532, -2890992, -1744987, -736529, 2425, 422072, 499636, 340676, 163827, -61753, -425915, -627512, -309710, 334910, 692696, 468660, -101662, -670686, -1150634, -1739047, -2526500, -3174481, -3275013, -2720885, -1637724, -387643, 518911, 809681, 593431, 1849, -940436, -2040102, -3050348, -4001695, -5007365, -5910419, -6329023, -6174320, -5880261, -5735075, -5466196, -4800749, -4012562, -3619882, -3661060, -3626907, -2987380, -1636174, 2523, 1241345, 1578620, 970937, -305710, -1865598, -3219430, -3889204, -3678899, -2763547, -1581390, -575000, 12553, 112323, -296888, -1090753, -1803708, -2067601, -2083105, -2173751, -2250458, -2081426, -1797381]
17205a797381K37290M17437Q75961J287370J390577J188633R28262Q53662Q54293
17196F236104O68996M42212M68795O75026Q48026Q35457N66226K06358m0646k34693
17186A0671861m18577n89677r14210j430450j920216k030972j608758r49973m56686
17177C52342k11644p4544j08242l56364o46968q62563j084014j319610j301780
17168e613387q16038n4350N33998Q42168J053691J115910J000887Q82045P31333
17159c23743M18529p4444n98429r22874q79785n09269o9886K47883M44347N47315
17149a720356O55264Q56376R13387Q04780Q56779J055846J044200M30684o35303
17140D261657j291804j068982m60224j08936j10489k18846k34866q864M36386
$$ y = [-1797381, -1560091, -1142654, -266693, 1020677, 2411254, 3599887, 4528149, 5381811, 6236104, 6905100, 7347312, 7816107, 8491133, 9339159, 10174616, 10740842, 10947200, 10906554, 10671861, 10253284, 9663607, 8749397, 7318947, 5398731, 3367759, 1759001, 809028, 352342, 140698, 66154, -42088, -398452, -1045420, -1907983, -2991997, -4311607, -5613387, -6429425, -6483775, -5949777, -5107609, -4053918, -2938008, -1937121, -1055076, -323743, 94786, 20342, -578087, -1500961, -2380746, -2890015, -2959901, -2712018, -2267671, -1720356, -1065092, -208716, 704671, 1509451, 2366230, 3422076, 4466276, 4896960, 4261657, 2969853, 1900871, 1440647, 1331711, 1221222, 1002376, 767510, 758646, 1195032]
17131A195032P29640O53987N49908P98163J234894J334743R00771J82921n32718
17122G047341j057464j314725j397747j198066o26328p7563J12393N4350r6977
17113A445214k46289k45784p1580q8558n67811j059572j014939n00374J08890
17104b240803N75440Q50075Q99404P16365M73486L58329M27977O09649P48294
17095C418216O73204M81840N54818R09205J075118O48425k51300r90111j248143
17086E271272j299093j200785p55868k55063j05270l31128p70961j219456j478668
17077b145020j445186j145442n51954L10339J031966J171411P67552K45732n4697
17068a815299r9969m9214J9854J93652N26853R22212J022763O13481J22880K8746
$$ y = [1195032, 1924672, 2578659, 3128567, 3926730, 5161624, 6496367, 7397138, 7580059, 7047341, 5989877, 4675152, 3277405, 2079339, 1453011, 1375448, 1487841, 1542191, 1445214, 1198925, 953141, 881561, 793003, 225192, -834380, -1849319, -2349693, -2240803, -1665363, -815288, 84116, 800481, 1273967, 1632296, 2060273, 2669922, 3418216, 4091420, 4573260, 5128078, 6037283, 7112401, 7760826, 7509526, 6519415, 5271272, 3972179, 2771394, 2015526, 1760463, 1655193, 1324065, 553104, -666352, -2145020, -3590206, -4735648, -5287602, -4977263, -3945297, -2773886, -2006334, -1760602, -1815299, -1915268, -1964482, -1944628, -1750976, -1224123, -301911, 720852, 1334333, 1457213, 1485959]
17058A485959J92213K50309J75260K02169L09458L3955o59923j096728r13212
17049b0540n09938m13719p31925j264498j823437k135654j748762o53011M79280
17040h822204J083720J176999R73458P34571O49472P45463R85550J135845R83021
17031c54105O85132L88261L6746j90477N1384O55858J034573Q29935L27701j92062
17021C272946o95729j001157q60085l68358m5149l59723j124658j681776j665524
17012d529213j221419p05900l98899k18537k987J41368J35101J10966L48959J028196
17002e312365J866560K390844K353735J666985O23050k97333p95867q66684p35630
16993H93295m70845j54094q6274k95234m86363n51436n52622m63737l43592k70264
$$ y = [1485959, 1678172, 1928481, 2103741, 2305910, 2615368, 2649323, 1989400, 892672, -20540, -530478, -944197, -1676122, -2940620, -4764057, -6899711, -8648473, -9301484, -8822204, -7738484, -6561485, -5588027, -4853456, -4203984, -3458521, -2472971, -1337126, -354105, 331027, 719288, 756034, 565557, 616941, 1272799, 2307372, 3137307, 3465008, 3272946, 2577217, 1576060, 715975, 347617, 302468, -57255, -1181913, -2863689, -4529213, -5750632, -6456532, -6855431, -7073968, -7076955, -6935587, -6800486, -6689520, -6340561, -5312365, -3445805, -1054961, 1298774, 2965759, 3588809, 3291476, 2495609, 1628925, 893295, 422450, 268356, 182082, -113152, -599515, -1150951, -1703573, -2167310, -2510902, -2781166]
16983b781166m4921K68034J43839m46154j000381j162520q90815l91684J41242
16974f164526N71150R79463J491899J851670J741408J170484L19883m76349q92221
16965E92861r03863o46428l15769j16882j7140N9756n8712l96015o26302n44747
16955b973241j97265L43908R20090J329198J440628J164539P64355N83973N38351
16946C914536M10391J53032m3592j09601j23448m2982J56902N17488R25702R36668
16936F695096K89523o27259j264856j470641j356266j152489j053392j089305
16928a029589j029909o91197k33785J05391L12775M52302N40279N34703M65888
16919e73142L74545K37755j07958o78674r62153n82001J44666O01257N53154L50012
$$ y = [-2781166, -2826087, -2558053, -2414214, -2860368, -3860749, -5023269, -5914084, -6305768, -6164526, -5593376, -4613913, -3122014, -1270344, 471064, 1641548, 1961431, 1485082, 592861, -311002, -957430, -1273199, -1390081, -1407221, -1347465, -1406177, -1802192, -2428494, -2973241, -3170506, -2826598, -1906508, -577310, 863318, 2027857, 2792212, 3376185, 3914536, 4324927, 4477959, 4434367, 4324766, 4201318, 4158336, 4315238, 4832726, 5758428, 6695096, 6984619, 6357360, 5092504, 3621863, 2265597, 1113108, 59716, -1029589, -2059498, -2750695, -2984480, -2879089, -2566314, -2114012, -1573733, -1039030, -573142, -198597, 39158, -68800, -747474, -1709627, -2291628, -2146962, -1545705, -992551, -642539]
16909f42539L33217M16256K17850l12023o05372m41118k21289k11718l26942k53631
16899b047309J75074O48241Q13180Q24450R44638J022585P50808J64409m42104
16890B853972q10546p71585l93277O5809M34264O48074O33719L96650l4506o62960
16880B359614j289269j447665j013604m86805l34200m04277l26192k10024k32562
16871c384984j75047J48788M63875M95716L85056K82891J62166O3747N8063L0203
16861a469526k51426p27655r99018p99531p6708Q70680J558910J851015J813912
16852A770653J453750R28259N50958M18234L28221J98999M5644j34409j56731
16843E403578M7729J50363j29325o93029j256635j531492j525889j507745j533365
$$ y = [-642539, -309322, 106934, 324784, 12761, -592611, -1033729, -1255018, -1466736, -1793678, -2047309, -1872235, -1223994, -410814, 413636, 1358274, 2380859, 3131667, 3296076, 2853972, 2043426, 1271841, 878564, 944373, 1378637, 2026711, 2660430, 3057080, 3022574, 2359614, 1070345, -377320, -1390924, -1877729, -2211929, -2616206, -2942398, -3152422, -3384984, -3560031, -3411243, -2947368, -2451652, -2066596, -1783705, -1621539, -1557792, -1499729, -1469526, -1720952, -2448607, -3447625, -4247156, -4323864, -3453184, -1894274, -43259, 1770653, 3224403, 4152662, 4703620, 5121854, 5450075, 5649074, 5694718, 5560309, 5403578, 5451307, 5601670, 5472345, 4779316, 3522681, 1991189, 465300, -1042445, -2575810]
16834b575810j403081j129808r10529p95952o66526m88212n86003j073407j490678
16825a1120006j526020j309136q61897k07315K31115K04542J22479M54086J026808
16816a2985344J202060Q95032O59216P31546R40549J105138J074630Q21794K95796
16807e259583m72584j050924j089604n97594K17642Q80568R76551O65730L94435
16798e335363K87593J39952j40255m23323o81377r76473j141979q59111l7922
16789i168258R66005J484993J202781O25174L58885L26609J96705K7825K3131
16780c956150J53585K04872Q8351k8342m4053l2677L0307L78764R98482J371004
16770h35857J193537O82185K33263J75323M70974P78695P42963J71950q43145
$$ y = [-2575810, -3978891, -5108699, -6019228, -6815180, -7481706, -7969918, -8555921, -9629328, -11120006, -12646026, -13955162, -14817059, -15024374, -14793259, -14588717, -14466238, -14012152, -12985344, -11783284, -10888252, -10229036, -9497490, -8556941, -7451803, -6377173, -5555379, -5259583, -5732167, -6783091, -7872695, -8470289, -8252647, -7372079, -6395528, -5729798, -5335363, -5047770, -4907818, -5048073, -5471396, -6152773, -7129246, -8271225, -9130336, -9168258, -8202253, -6717260, -5514479, -4889305, -4530420, -4203811, -4007106, -3979281, -3956150, -3802565, -3597693, -3509342, -3537684, -3581737, -3614414, -3584107, -3205343, -2206861, -835857, 357680, 1039865, 1273128, 1448451, 1919425, 2698120, 3441083, 3613033, 2769888]
16761B769888j835435k198290j762729r09714j06142M68288Q60506R83394R67341
16752g62893J305063J991913K390256K016168J082742P8309p05325j180890j448342
16743D767001j702860j859708j534780q32959l42938k05700j36151n3262j24696
16734b026053j93258l3613J32061J37755J01162J75599J39921l30781r05790r00384
16724c703381k82870M09030P84202P60159M09939j04686n52088p34499o05058
16715c619252k31235J73467K41228n8272m25964n84413k98674L27129P46686O30632
16705c098668K15157m5327j2359J36280L46600N87000P11286O17507M17859L31116
16695B06451K48473k8285m52234r66363j516985j834352j573806q86335j74802
$$ y = [2769888, 934453, -1263837, -3026566, -3936280, -4042422, -3574134, -2713628, -1730234, -762893, 542170, 2534083, 4924339, 6940507, 8023249, 8101558, 7396233, 6215343, 4767001, 3064141, 1204433, -330347, -1163306, -1506244, -1711944, -1848095, -1901357, -2026053, -2219311, -2252924, -2120863, -1983108, -1881946, -1706347, -1566426, -1897207, -2802997, -3703381, -3986251, -3577221, -2793019, -2032860, -1622921, -1727607, -2279695, -3014194, -3619252, -3850487, -3677020, -3435792, -3494064, -3920028, -4504441, -4803115, -4475986, -3729300, -3098668, -2883511, -2928838, -2941197, -2804917, -2458317, -1871317, -1160031, -542524, -124665, 206451, 454924, 426639, -25595, -991958, -2508943, -4343295, -5917101, -6803436, -6978238]
16686f978238L63329N76681M67438K85448K35309L08295L52365M18764O52932
16677c317677Q94701Q60330M55024j44354o63253r22218q34210n02023j41063
16668d314743J84275M64483N50301L57120J09114L5744J41551K80275K92635L24504
16658a574741N33585M72462l211l76719l45692j7610L35861N71683O76062N71429
16648H43109K92614R0210R2033K44880L75115L21642J79136j425j69462k64890
16638B002962m79337q26412r68875q43149o05184j74336L37617M84071J34541
16629i38102l57516o19873n26316j38654L02718M67957K25537j82537m23787l98077
16619b588650k70172k70526k14252J04841L97229M17001K51534j5687k55059m02620
$$ y = [-6978238, -6614909, -6038228, -5570790, -5285342, -5050033, -4741738, -4389373, -3970609, -3317677, -2422976, -1562646, -1107622, -1251976, -1915229, -2837447, -3671657, -4173680, -4314743, -4130468, -3665985, -3115684, -2758564, -2649450, -2613706, -2472155, -2191880, -1899245, -1574741, -1041156, -568694, -571905, -948624, -1294316, -1311926, -976065, -404382, 271680, 843109, 1135723, 1225933, 1317966, 1562846, 1937961, 2259603, 2438739, 2437314, 2267852, 2002962, 1523625, 697213, -271662, -1114811, -1719995, -1894331, -1556714, -1072643, -938102, -1295618, -1915491, -2441807, -2580461, -2277743, -1809786, -1584249, -1766786, -2190573, -2588650, -2858822, -3129348, -3343600, -3238759, -2841530, -2424529, -2172995, -2188682, -2443741, -2846361]
16609b846361p38423j356183j913491k178569k009367j372013n82994K17982J074653
16600a1704766J722801J852443J387787N33257r9533j41919J22495M27494P86809
16591e113132R44325P19918M92667N40833O88022O45567L13285j33378k24772
16582a126665K38445O68528N17399J60297K78465O92814Q52038P23065L95904
16573C400290k2312k97127m40911p29972j169950j464887j433222j036272l16602
16564c510965L00577L77359l5042n39981p21636n84951l26696l1395K25682L79879
16554d467169M36471N16533P43452J112177J385287J242453P30136K22994j1063
16545A911271p7780j90348j49923K34554N56636M60342J85576j7717j10684k00961
$$ y = [-2846361, -3584784, -4940967, -6854458, -9033027, -11042394, -12414407, -12997401, -12779419, -11704766, -9981965, -8129522, -6741735, -6208478, -6308011, -6449930, -6327435, -5899941, -5113132, -4168807, -3448889, -2956222, -2415389, -1727367, -1081800, -768515, -901893, -1126665, -888220, -219692, 297707, 458004, 736469, 1429283, 2281321, 3004386, 3400290, 3377978, 3080851, 2639940, 1909968, 740018, -724869, -2158091, -3194363, -3510965, -3210388, -2833029, -2868071, -3408052, -4129688, -4714639, -5041335, -5072730, -4847048, -4467169, -4030698, -3514165, -2770713, -1658536, -273249, 969204, 1699340, 1922334, 1911271, 1833491, 1643143, 1493220, 1727774, 2284410, 2744752, 2930328, 2912611, 2801927, 2600966]
16535B600966l70129m01284j32052K21950L37061K91654L76086O01335O83530
16526D209117L39034j69840l50127j39956J96556K02142n13452j747353k808379
16517g82258l008850j980095k53391J306761K203130K159327J435616O32544J7512
16508A730296k75749n5373M26822O94030O94613O07682N48427M11292J4872m92737
16498D304175p30049m49690J17024M68665L00515l37090j156419j723898j781129
16489i87896j353405n11923N00709J294486J823998K136899J977732J166705K8131
16480F075436q01802r84933n95869J19433P20293O97177J7880n80617n30559j28754
16470D007685J29374J29955J47236L94596O62036P06845O29192N96769N48963
$$ y = [2600966, 2230837, 1829553, 1697501, 1919451, 2256512, 2548166, 2924252, 3525587, 4209117, 4548151, 4378311, 4028184, 3888228, 4084784, 4286926, 3773474, 2026121, -782258, -3791108, -5771203, -6024594, -4717833, -2514703, -355376, 1080240, 1712784, 1730296, 1454547, 1399174, 1825996, 2520026, 3214639, 3822321, 4370748, 4782040, 4796912, 4304175, 3574126, 3124436, 3241460, 3710125, 4010640, 3673550, 2517131, 793233, -987896, -2341301, -2853224, -2352515, -1058029, 765969, 2902868, 4880600, 6047305, 6075436, 5273634, 4288701, 3692832, 3812265, 4532558, 5229735, 5247615, 4666998, 4136439, 4007685, 4137059, 4267014, 4414250, 4808846, 5470882, 6177727, 6806919, 7403688, 7952651]
16461G952651K23301p49330k196897k883532k247171j160605l19450J79980N30938
16452f70115Q49255R25266P73327P58735R71162J046652P55923K92478n0310j81532
16442E470841k90471o81082j265896j592246j475726j105750p38529o10539p95832
16433c085230r71230p96391m01933j27802J1556J87235K94640J10716j47052m3375
16423d968866M24699R79481J298595J211857R41012O69424J74931n78461j112697
16414i60025j010909k94040O39697J316073J361019Q01378q3662j089838j826840
16405a147147j984968j756698j358796q70023m63685j34862K52856O48418P92514
16396f022391M79865n1409l69480l25561j40993j2388M371j96562o68837j322366
$$ y = [7952651, 8175952, 7426622, 5229725, 2346193, 99022, -1061583, -1381033, -1201053, -670115, 179140, 1104406, 1877733, 2636468, 3607630, 4654282, 5410205, 5702683, 5652373, 5470841, 5180370, 4499288, 3233392, 1641146, 165420, -940330, -1678859, -2289398, -3085230, -4056460, -4852851, -5254784, -5382586, -5371030, -5183795, -4889155, -4778439, -4925491, -4968866, -4544167, -3564686, -2266091, -1054234, -113222, 556202, 731133, 152672, -960025, -1970934, -2264974, -1625277, -309204, 1051815, 1853193, 1769531, 679693, -1147147, -3132115, -4888813, -6247609, -7117632, -7581317, -7716179, -7463323, -6814905, -6022391, -5542526, -5593935, -5963415, -6288976, -6429969, -6442357, -6437986, -6634548, -7303385, -8625751]
16386h625751j709904j080862Q40720L062289M053095L358956J806001M39487
16378B144031k11203n7907O88115J559233J916910J415726N43505j08662m91197
16369G398551p60302r81861j098226j056536q59587n04538p6335L27383M93543
16360B882092K29699k86109p27479r73319r92165p01019j50338L59747N64429
16351B05538N17510L51875K4028m91701r79641j183780r68404l38433M54141J048613
16341a360254J240303Q41371j34897j064945j508977j506170j036627k47545L04975
16332d472766L31812K42297M31444P14227N81977N617m82445l73481M81321J599850
16322i40147K189361K073049J669110J224471O26276k30277j241355k206840k790848
$$ y = [-8625751, -10335655, -11416517, -10575797, -7513508, -3460413, -101457, 1704544, 2144031, 1932828, 1874921, 2563036, 4122269, 6039179, 7454905, 7998410, 7889748, 7398551, 6638249, 5656388, 4558162, 3501626, 2642039, 2137501, 2061166, 2388549, 2882092, 3111791, 2825682, 2098203, 1124884, 132719, -568300, -718638, -358891, 205538, 723048, 1074923, 1098951, 607250, -372391, -1556171, -2524575, -2863008, -2408867, -1360254, -119951, 721420, 586523, -478422, -1987399, -3493569, -4530196, -4777741, -4472766, -4140954, -3898657, -3467213, -2752986, -2171009, -2165392, -2647837, -3021318, -2539997, -940147, 1249214, 3322263, 4991373, 6215844, 6842120, 6611843, 5370488, 3163648, 372800]
16313C72800k877355k863019l311189m069009l961690k390078m52153Q63452J491491
16304a7196750J637938J626626J674745J871922K066299K022725J749707J496673
16296c050115J395682J410410J388684J134189O95725K24471k52534o64340r56507
16287A325665j003691o99247l96218m05258o10658p47072o20499k05458L53750
16278c008686P03469O48594N03071M99259N54339N19978K50062k28057o42757
16269b00728o66255l05158J72802N27668O94418Q32275J033337J187810J133655
16260D409824P38430k7638p16817o85491K9668Q35300J428516J788345J558322
16251I358459J78886j824283l107063l128609k419519j670769j139416p90879
$$ y = [372800, -2504555, -5367574, -8678763, -12747772, -16709462, -19099540, -19551693, -18688241, -17196750, -15558812, -13932186, -12257441, -10385519, -8319220, -6296495, -4546788, -3050115, -1654433, -244023, 1144661, 2278850, 2974575, 3199046, 2946512, 2282172, 1325665, 321974, -377273, -773491, -1178749, -1789407, -2536479, -3156978, -3362436, -3008686, -2305217, -1656623, -1153552, -654293, -99954, 420024, 670086, 442029, -200728, -866983, -1172141, -999339, -471671, 222747, 1055022, 2088359, 3276169, 4409824, 5148254, 5120616, 4403799, 3718308, 3747976, 4583276, 6011792, 7800137, 9358459, 9537345, 7713062, 4605999, 1477390, -942129, -2612898, -3752314, -4543193]
16243d543193l88374J87041O94361R21576J034977J196570J230179R27137K97453
16234A557727m82029j010446r95754o38806m04772n77176j076329j595090j778895
16225g001570j352234m88412J53937K31424O7805Q2716L87162Q95676J412875
16216e610621J685245J466263R13078N84210M83533J90947k21593l13497O2775
16207g59660O49688J006897R03008N19323K36687K32990K16277k13963r34237
16198A857010j445929j586445j535518j284869q66068n51367l94598j60680J89916
16189e778548N09117R42564J602089J997748J522374L66272n82693q03266n83935
16180h08278l24881k67875m45299m60697p2992L11598K74055m9579l44255n82167
$$ y = [-4543193, -4931567, -4744526, -4050165, -3128589, -2093612, -897042, 333137, 1260274, 1557727, 1075698, 65252, -930502, -1569308, -1974080, -2551256, -3627585, -5222675, -7001570, -8353804, -8842216, -8688279, -8456855, -8389050, -8306334, -7919172, -7023496, -5610621, -3925376, -2459113, -1546035, -961825, -478292, -287345, -508938, -822435, -759660, -109972, 896925, 1799933, 2319256, 2555943, 2788933, 3005210, 2791247, 1857010, 411081, -1175364, -2710882, -3995751, -4861819, -5413186, -5807784, -5968464, -5778548, -5269431, -4326867, -2724778, -727030, 795344, 1161616, 578923, -224343, -808278, -1133159, -1401034, -1846333, -2307030, -2380022, -2068424, -1794369, -1843948, -2188203, -2770370]
16170b770370p37697m95428K25129Q33835Q14643K88214l50251j039406j846850
16161e078181k409893k430664j781947o28011M14090Q88949Q24985L85119j88280
16152a0003833n07386n66223o12114n38121k7686R24086J890253K274358J820839
16143e345827R60395K90620J4455k5448j43445m65209p97568q80918n88989j8277
16133g000211M83604N94398M35000L13495M97688R71159J476174J998078K414703
16124B184088K301397J609666Q07158L37954K10451K1150l68252o26121n41988
16115E935503l10914k28453k96962l03023k33496k45564l79468o47007q98983
16106B391633q50674l32176L57666O24767M37879J15390k80102o86191j041062
$$ y = [-2770370, -3508067, -4003495, -3778366, -2944531, -2129888, -1841674, -2191925, -3231331, -5078181, -7488074, -9918738, -11700685, -12328696, -11914606, -11025657, -10200672, -9815553, -10003833, -10511219, -11077442, -11689556, -12227677, -12255363, -11331277, -9441024, -7166666, -5345827, -4385432, -4094812, -4080357, -4105805, -4249250, -4714459, -5512027, -6392945, -6981934, -7000211, -6516607, -5922209, -5487209, -5173714, -4676026, -3704867, -2228693, -230615, 2184088, 4485485, 6095151, 6902309, 7240263, 7450714, 7471864, 7103612, 6477491, 5935503, 5624589, 5396136, 5099174, 4796151, 4562655, 4317091, 3937623, 3290616, 2391633, 1540959, 1208783, 1566449, 2191216, 2629095, 2744485, 2464383, 1778192, 737130]
16097G37130j385645j703237j880566j777826j400540r27065n52299l91034m65770
16088i746852o92577q91904q57763o42558n05027l69226M2046P14202J199880
16079a1749779J055198N08506K29500M63492R25622J195478J072419P48496N43486
16070e007582N76607P51889J042325J394546J555159J395750J046408O63988M37000
16061C856090N51076Q10469P57404M46046K00923j0620k55948m21471n03071n72364
16051D858534n63427o11002q54314j012995p75074k37752K22833M96011P15845
16042B238659R40733J159501J179665P29684j4746n28452n02334r3781K52567
16033E361496L06241P9759l65844p80727r75066r37090o31219j44818K75031N42620
$$ y = [737130, -648515, -2351752, -4232318, -6010144, -7410684, -8337749, -8890048, -9281082, -9746852, -10439429, -11331333, -12189096, -12831654, -13336681, -13705907, -13663861, -12949659, -11749779, -10694581, -10186075, -9956575, -9493083, -8567461, -7371983, -6299564, -5551068, -5007582, -4430975, -3679086, -2636761, -1242215, 312944, 1708694, 2755102, 3419090, 3856090, 4407166, 5217635, 5975039, 6421085, 6622008, 6611388, 6355440, 5933969, 5430898, 4858534, 4295107, 3684105, 2829791, 1816796, 1041722, 803970, 1026803, 1522814, 2238659, 3179392, 4338893, 5518558, 6248242, 6233496, 5705044, 5202710, 5108929, 5361496, 5667737, 5747496, 5381652, 4600925, 3625859, 2688769, 2057550, 1912732, 2187763, 2730383]
16023B730383O60980N57273J67281l54322o50215n84611l15881L0382L60125M79503
16013C080898L13727L3854j18603j46723k55764m37706m56035k08735J56195L94444
16003B355552L65518J96422J76727M12436P04995Q96621R88386R33471N97920
15994G628048O9135l77095p70294j193689j490217j516463j333655j034198o49816
15985f68244m37615o76568j047524r99220n50012j18202J6820j93422n86957q03167
15975f064111m86877K91770R91002J091838O97466L46997K20903J05514p6512
15966b882010j70877k2467K26430Q7619o16197j546773k303129k598743k348907
15957a2175054j619532p87719j70050N16883J461122K239144K227692J375465
$$ y = [2730383, 3391363, 3948636, 4115917, 3761595, 3111380, 2526769, 2210888, 2241270, 2601395, 3080898, 3394625, 3428479, 3309876, 3163153, 2907389, 2469683, 2013648, 1804913, 1961108, 2355552, 2721070, 2917492, 3094219, 3506655, 4211650, 5108271, 6096657, 7030128, 7628048, 7697183, 7320088, 6549794, 5356105, 3865888, 2349425, 1015770, -18428, -668244, -1105859, -1782427, -2829951, -3829171, -4379183, -4497385, -4480565, -4673987, -5260944, -6064111, -6550988, -6259218, -5268216, -4176378, -3478912, -3131915, -2911012, -2805498, -2882010, -3052887, -3075354, -2848924, -2761305, -3377502, -4924275, -7227404, -9826147, -12175054, -13794586, -14582305, -14752355, -14235472, -12774350, -10535206, -8307514, -6932049]
15949f932049L14981l81557o48730p17631o29443k91253n7374j78063l25550j56335
15939a0003004K81400O81393R80168J254027J395907J225228O00687l02787r45353
15930d832334q54967o3838Q30760J300063J378848J336023J338985J420394J289874
15921C143808P25989J25613q6923j4797J3282k98199r38405j338545j119866m95484
15911b83527J33838L93323J81407j82693n38272q88222r50776n82464j84554j22752
15901c024692k26442j71417J29488L59199J75495k91359p20549r12475o52576
15892e335328J12103J010903J653541J752558J194901L53454j35866N6456P67414
15883A430136J412961J396370P46061k7920n68696p90064p50879o14036n95700
$$ y = [-6932049, -6617068, -6998625, -7647355, -8364986, -8994429, -9285682, -9343056, -9521119, -9846669, -10003004, -9721604, -9040211, -8060043, -6806016, -5410109, -4184881, -3584194, -3886981, -4832334, -5687301, -5751139, -4920379, -3620316, -2241468, -905445, 433540, 1853934, 3143808, 3869797, 3995410, 3908487, 3893690, 3906972, 3608773, 2670368, 1331823, 211957, -283527, -149689, 243634, 425041, 242348, -295924, -1184146, -2134922, -2717386, -2901940, -3024692, -3251134, -3422551, -3293063, -2933864, -2758369, -3049728, -3770277, -4682752, -5335328, -5223225, -4212322, -2558781, -806223, 388678, 742132, 606266, 662722, 1430136, 2843097, 4239467, 4985528, 4957608, 4388912, 3598848, 2847969, 2233933, 1638233]
15874A638233o94248p68934o92799k83515L64670P41881M71483j90802p01507
15865a15538q29743o85991l88249p338L43772N01275M24457K78250N3120k94645
15855g20630o06551p15348n71542k29779J92406O02862P78811M39401j74571l99754
15845a404695j67015j81542p29228j231086j129553n80371j19037L6538L762j7869
15835e520096L7667Q682j00270q1783K66521R33772J600825J982719J944529J397062
15825B469628M84633l27954o02074m56433l87214o16870j048134j379332j241074
15816c104824o62355j4469L92634M76417L73469K05583o5844k56565j40201L5657
15806b760498j36709o03283j024149j293904j333536r92038l35928L45077P36316
$$ y = [1638233, 943985, 175051, -517748, -801263, -436593, 305288, 776771, 585969, -115538, -945281, -1631272, -2019521, -2026859, -1683087, -1181812, -757355, -479105, -425985, -720630, -1327181, -2042529, -2614071, -2843850, -2651444, -2048582, -1269771, -830370, -1004941, -1404695, -1571710, -1753252, -2482480, -3713566, -4843119, -5423490, -5542527, -5505989, -5502227, -5520096, -5482429, -5473747, -5574017, -5655800, -5389279, -4455507, -2854682, -871963, 1072566, 2469628, 2954261, 2626307, 2024233, 1567800, 1180586, 563716, -484418, -1863750, -3104824, -3767179, -3781648, -3389014, -2912597, -2539128, -2333545, -2399389, -2655954, -2796155, -2760498, -2897207, -3500490, -4524639, -5818543, -7152079, -8144117, -8480045, -8134968, -7398652]
15797g398652R08425J156805J511809J743703J640991J184270N72450J2719m04130
15788I28390o15681n45625l65761m67862q65633j208684j241771q51254j59690
15779e393571N09896Q69800Q97004Q63825R30782Q86278M74047k59470j032337
15770a253746j524250j530420j114889n49260n1436L74979P62916J166186J714447
15761b005473K158289K070948J602941J175830Q53891M39875j09019n14663n07592
15752E165027j29644L28807O64610J030475J450581J576301J162429M29924l10092
15743A1368418j000540j296352q61827k96820l33897q16976j160814j132646r05770
15734C562776p25459o43267n78168n07044m37234m01584l09164j29998n144p3225
$$ y = [-7398652, -6490227, -5333422, -3821613, -2077910, -436919, 747351, 1319801, 1332520, 928390, 312709, -232916, -598677, -1066539, -1932172, -3140856, -4382627, -5233881, -5393571, -4883675, -4013875, -3116871, -2253046, -1322264, -435986, 38061, -221409, -1253746, -2777996, -4308416, -5423305, -5972565, -6024001, -5649022, -4886106, -3719920, -2005473, 152816, 2223764, 3826705, 5002535, 5856426, 6296301, 6187282, 5672619, 5165027, 5035383, 5364190, 6028800, 7059275, 8509856, 10086157, 11248586, 11678510, 11368418, 10367878, 9071526, 8209699, 7912879, 7578982, 6762006, 5601192, 4468546, 3562776, 2837317, 2194050, 1615882, 1108838, 671604, 270020, -39144, -169142, -174286, -247511]
15724b47511k89824l44000q7337J87930J82931L9331J69769O48982J132945J192187
15714B585403O83150M0909k26132j65674j34188k62791m50962o69312q12021o57332
15704f8950k26519K00746K91184N9531j87026m50080p68870r03033q02696p57244
15694c612957p17320l08259L98539R30648J151171J289114J312951R83617L21798
15685A749302k86831l75540J49595R31225J555062J865043J789050J164647J74762
15676H716315n89729p51125m09386P5586L74575L12084j32098p46994j137745
15667E711483j209331j173284j091065o73145O1008N37751L89626j63587o98008
15658A691448j042502j076992o35441L144M21487N29474L86426J65888N7167J38359
$$ y = [-247511, -537335, -881335, -968672, -780742, -597811, -558480, -388711, 260271, 1393216, 2585403, 3268553, 3309462, 3083330, 2917656, 2783468, 2520677, 2069715, 1400403, 588382, -68950, -295469, -94723, 196461, 255992, 68966, -381114, -1149984, -2053017, -2855713, -3612957, -4330277, -4638536, -4239997, -3309349, -2158178, -869064, 443887, 1427504, 1749302, 1462471, 1086931, 1236526, 2167751, 3722813, 5587856, 7376906, 8541553, 8716315, 8126586, 7375461, 6966075, 7041661, 7416236, 7728320, 7596222, 6849228, 5711483, 4502152, 3328868, 2237803, 1564658, 1625666, 2163417, 2553043, 2389456, 1691448, 648946, -428046, -1063487, -1060343, -638856, -109382, 277044, 442932, 500099, 638458]
15648F38458L16565N03474N81350M51881K15248M0197j8187o8286k16712m09369
15638B034619m87668l67959q7462K76128N78139Q07997R53359P57120R4850o38033
15628C921090r60381q72167o87044o51871p13485m89833J74918Q01448R05418
15619A428093N66793J94021J9682K8631J44238K45456J82682j19843o22396j083734
15609I83623j162896q60240m41207p0133P3331n5693j10160J68248O19629R72486
15599A16988J071957Q11725K68190j61129k19295j15215q5091p8428j4902R607
15589A604407l7023N0696L78896P12422P30030M24234Q4754j35686k60648k49848
15579C302234j60273j89040k91219k79064k69418l79146m47915k97212M6995M28292
$$ y = [638458, 955023, 1458497, 2039847, 2491728, 2706976, 2747173, 2728986, 2660700, 2443988, 2034619, 1546951, 1178992, 1091530, 1367658, 1945797, 2753794, 3707153, 4464273, 4559123, 3921090, 2960709, 2088542, 1401498, 749627, 36142, -453691, -278773, 522675, 1428093, 1994886, 2188907, 2208589, 2237220, 2381458, 2626914, 2809596, 2689753, 2067357, 983623, -179273, -1039513, -1480720, -1550853, -1477522, -1533215, -1643375, -1475127, -855498, 116988, 1188945, 2000670, 2268860, 2107731, 1888436, 1773221, 1688130, 1609702, 1594800, 1604407, 1567384, 1618080, 1996976, 2709398, 3439428, 3863662, 3948416, 3812730, 3552082, 3302234, 3141961, 2952921, 2661702, 2382638, 2113220, 1734074, 1286159, 988947, 1035942, 1464234]
15569A464234O47215O80486O77616Q61454J301848J611768J343002N47458l16946
15560H818135p69751n96888j6566O31314J018231Q29007L01010o9833k05878k52316
15550I686465l17452m61218o44004p32434p76051q32576o71147k78276J01269
15541E074576M72095P88531P50947K21537n05897r98335j164577j240107j253917
15532B144853j016557m63678R1515K33371N829l16244o80931r96045j019246p45943
15522b763076n37321n53698m17881J76656J118240J921205K151992J900306J429757
15513D426180Q80387L80079K9400j56231j81168j00598n4690j21312k50696m88354
15503D362997q77987j042475n75941J92955N02430K15216j80718m13084o14372
$$ y = [1464234, 2111449, 2791935, 3469551, 4331005, 5632853, 7244621, 8587623, 9135081, 8818135, 8048384, 7451496, 7434930, 8066244, 9084475, 9913482, 10214492, 10144659, 9938781, 9686465, 9369013, 8907795, 8263791, 7531357, 6755306, 5922730, 5251583, 4973307, 5074576, 5546671, 6335202, 7086149, 7307686, 6801789, 5803454, 4638877, 3398770, 2144853, 1128296, 664618, 756133, 989504, 995333, 679089, -1842, -997887, -2017133, -2763076, -3300397, -3854095, -4271976, -4095320, -2977080, -1055875, 1096117, 2996423, 4426180, 5306567, 5686646, 5716046, 5559815, 5378647, 5278049, 5223359, 5102047, 4851351, 4362997, 3485010, 2442535, 1866594, 2059549, 2561979, 2777195, 2596477, 2183393, 1569021]
15494A569021p70758n76653j05168J41413j4222k50940j51852K84137P22918R72965
15484A820861R60651O30737Q1659l65084l18262J43912N38879N93904L46423m172
15474D429508l88078p99670r61653o30201K371O99576J264776J459827J240012
15465F316468P96004L28043K3078J6355J18669L7706k23752n76741r80926j387142
15455D467762j726015j852700j591415r10088p5351L74928K188r19138j534543
15446c764372j335634l30359J209183K622779L309818L330181L049921K560696
15438A0652213J947351J361163O58659k46471r93837j206081r87997p47776q64894
15429I572330j372400j912923k070427j856077j519223j089261n81385k07279
$$ y = [1569021, 798263, 221610, 116442, 257855, 243633, -7307, -159159, 124978, 847896, 1820861, 2781512, 3412249, 3493908, 3128824, 2810562, 2954474, 3493353, 4087257, 4433680, 4429508, 4041430, 3241760, 2280107, 1649906, 1652277, 2351853, 3616629, 5076456, 6316468, 7112472, 7440515, 7463593, 7479948, 7598617, 7636323, 7412571, 6835830, 5854904, 4467762, 2741747, 889047, -702368, -1612456, -1687807, -1312879, -1310691, -2229829, -3764372, -5100006, -5430365, -4221182, -1598403, 1711415, 5041596, 8091517, 10652213, 12599564, 13960727, 14619386, 14372915, 13379078, 12172997, 11185000, 10437224, 9572330, 8199930, 6287007, 4216580, 2360503, 841280, -247981, -829366, -1036645]
15421a036645n8399J01608L79085N80483O60478N86988L82616L72152N92756O75932
15411C237054N24731M65863M75645J83789l80576q12689q68851n25814l9648J93979
15401B453483R8139p8638n5052J90602M43844N80820N33997K60319j45385n32269
15391C749860p26011o57676m26339j08150J65885K14436P2426m5593q6722k00078
15381A952038l98454m88063k89482J77944O26175Q00410M93527k95649j172418
15372A406028j705647j821721j773308j737225j576852j055150j15652R68816
15364g410711J752733K079653K072665J690670R01733K38725J78161M63303N98731
15355B565663M67270L13859K55698K05337J32067J20267J11369K4411J5290J24353
$$ y = [-1036645, -1095044, -993436, -614351, -33868, 626610, 1213598, 1596214, 1968366, 2561122, 3237054, 3761785, 4227648, 4703293, 4887082, 4506506, 3693817, 2824966, 2299152, 2259504, 2453483, 2551622, 2472984, 2417932, 2608534, 3052378, 3633198, 4167195, 4427514, 4282129, 3749860, 3023849, 2366173, 1939834, 1831684, 1997569, 2212005, 2284431, 2238838, 2152116, 1952038, 1553584, 1065521, 776039, 953983, 1580158, 2380568, 2874095, 2578446, 1406028, -299619, -2121340, -3894648, -5631873, -7208725, -8263875, -8379527, -7410711, -5657978, -3578325, -1505660, 185010, 1086743, 1325468, 1503629, 1966932, 2565663, 3032933, 3346792, 3602490, 3807827, 3939894, 4060161, 4171530, 4195941, 4211231, 4335584]
15345D335584N590m01992p16834p76736o65234m28592k16702j54522j40562p4479
15335G65521J8511J39880K86454L27869p179o30481j022949r81330o40264p7074
15325a821042N72752J066417J091412O03507J62283P6290K415r7816l1317J72100
15315A797001M50034N51784L43191J5763j56964j11326j01932k28415k30670k181
15305B326285J30378O905k50782m47370l28856M3869M38667P66778J164092J670961
15295E520927J949786J683653J021027M44731K19443J63427J78788K90319L25205
15286A1797306J61047j16234l58954n78630q13093q92133o85260k93527J18079
15277H338601L89515L07538j12600o18890r82307j179092j305836j334007j127232
$$ y = [4335584, 4341174, 3939182, 3222348, 2445612, 1780378, 1351786, 1135084, 980562, 840000, 765521, 784032, 923912, 1210366, 1538235, 1531056, 900575, -122374, -1103704, -1743968, -1821042, -1248290, -181873, 909539, 1513046, 1675329, 1751619, 1754034, 1656218, 1624901, 1797001, 2247035, 2798819, 3142010, 3157773, 3000809, 2889483, 2787551, 2559136, 2328466, 2326285, 2456663, 2463568, 2212786, 1765416, 1436560, 1480429, 1919096, 2685874, 3849966, 5520927, 7470713, 9154366, 10175393, 10620124, 10839567, 11002994, 11181782, 11472101, 11797306, 11958353, 11842119, 11483165, 10904535, 10091442, 9199309, 8514049, 8220522, 8338601, 8728116, 9035654, 8923054, 8304164, 7321857, 6142765, 4836929, 3502922, 2375690]
15268B375690o77887m0553O91325J233033J288160R69593O09018K87588P5838
15259F811805N9682J95444K43453j05743q11775j392220j404264q75786j73364
15250B547232L95430P35764P21174M59314L68276N74236P91140P60426N76531
15241G929523M41543M23457M16024J29056m93703j035732j060797o60396l21041
15232E767934k75774m15449m43195j40858M61376J268468J857562J783977J304740
15223A1168781R21502P00635N65751M54257K60674J24696L00715O06915M73936
15214A5577862l58158j407869j886511j512439p44945p0380M54548P72873Q51006
15205A1675987P59023M74007J59371M0778L6693o029j13575k75176o09670j092037
$$ y = [2375690, 1697803, 1657250, 2348575, 3581608, 4869768, 5839361, 6448379, 6735967, 6811805, 6871487, 7066931, 7310384, 7204641, 6392866, 5000646, 3596382, 2720596, 2547232, 2942662, 3678426, 4399600, 4858914, 5227190, 5801426, 6592566, 7352992, 7929523, 8371066, 8794523, 9210547, 9339603, 8845900, 7810168, 6749371, 6088975, 5767934, 5492160, 5076711, 4633516, 4492658, 4954034, 6222502, 8080064, 9864041, 11168781, 12090283, 12790918, 13356669, 13810926, 14071600, 14196296, 14497011, 15103926, 15577862, 15219704, 13811835, 11925324, 10412885, 9667940, 9597560, 10052108, 10824981, 11675987, 12435010, 12909017, 13068388, 13109166, 13145859, 13139830, 13026255, 12751079, 12141409, 11049372]
15195A1049372j341362j127558o32764k18252m4552j5003J19451M66429P26043
15186H981804O93151P04990J146219J782162K217565K498058K785981K912293
15178B3722223K531030J678053P27142L5535l11815m23983l91462l75240o09574
15169B6581909j129156j617977j671684j214375n32159j17787j09740o112N63393
15160B0746312J172521J293761J084224R57875R84830R55685P38081L74168R2739
15151B8400196K14324N36243M47861l5269l74313k08017M03787J135775J783127
15142C2303714K154275K088396J815152J739547J846412J934899K092216K345753
15134D8320364K507187K718184L440393M619276N630950O169196O539673O874430
$$ y = [11049372, 9708010, 8580452, 7947688, 7729436, 7684884, 7669881, 7789332, 8255761, 8981804, 9674955, 10379945, 11526164, 13308326, 15525891, 18023949, 20809930, 23722223, 26253253, 27931306, 28658448, 28693983, 28382168, 27958185, 27566723, 27191483, 26581909, 25452753, 23834776, 22163092, 20948717, 20416558, 20298771, 20189031, 20182919, 20746312, 21918833, 23212594, 24296818, 25254693, 26239523, 27195208, 27933289, 28307457, 28400196, 28614520, 29150763, 29598624, 29563355, 29189042, 28981025, 29384812, 30520587, 32303714, 34457989, 36546385, 38361537, 40101084, 41947496, 43882395, 45974611, 48320364, 50827551, 53545735, 56986128, 61605404, 67236354, 73405550, 79945223, 86819653]
15126H6819653P029606P212227P597030Q017869Q382507Q678132Q774461Q377280
15118A50888765P524805O861368P023664Q146714J0014919J2578829J5781889
15111B18820953J9046920K1586895K3061766K3535990K2896636K0756321J7113067
15104C66818548J2420609P207613K170711k026722n228589p656583r375971j0172611
15096C54157005r813623q329877o001294l222624m11678K297449M748421O292089
15088C39715868O162032M152523Q29311k962085o670882j0180575j3286111j5559918
15080C02200163j7049453j8313426j9470244j9928425j9386833j8343797j7229914
15073A72478071j5913499j4242376j2303548j0373228q694703p350091o530795
$$ y = [86819653, 93849259, 101061486, 108658516, 116676385, 125058892, 133737024, 142511485, 150888765, 158413570, 165274938, 172298602, 180445316, 190460235, 203039064, 218820953, 237867873, 259454768, 282516534, 306052524, 328949160, 349705481, 366818548, 379239157, 386446770, 388617481, 386590759, 381362170, 373705587, 364329616, 354157005, 344343382, 336013505, 330012211, 326789587, 326377909, 328675358, 333423779, 339715868, 345877900, 350030423, 350859734, 347897649, 341226767, 331046192, 317760081, 302200163, 285150710, 266837284, 247367040, 227438615, 208051782, 189707985, 172478071, 156564572, 142322196, 130018648, 119645420, 110950717, 103600626, 97069831]
15066I7069831o195302n915788n539472n204512m802836m000753k977085k449675
15058E9984408k567078k735300k658540k575929k442599j922308r65459J18980
15050D4236175R64381J419653J438105R20870J17458m17523n85447o37085n97086
15041D6859501m37444j97845J37392M45952L80699L1613j60610o9607m4633l71652
15031D6573366q53207j174009j258190j307371j443697j253474l07116J049421
15023D0025723K042450K276482J921968J294699O75985K20769k28039o15869p71335
15014D6842833q77763j013772j023739r63651r47749r52434j052476j409271j794948
15005C6807030j834440j529578j028885m88971n1410K60864M55151N01464N20603
$$ y = [97069831, 90874529, 84958741, 79419269, 74214757, 69411921, 65411168, 62434083, 59984408, 57417330, 54682030, 52023490, 49447561, 47004962, 45082654, 44117195, 44236175, 45200556, 46620209, 48058314, 48979184, 49096642, 48679119, 48093672, 47456587, 46859501, 46422057, 46224212, 46361604, 46807556, 47188255, 47219868, 47059258, 46989651, 46945018, 46573366, 45720159, 44546150, 43287960, 41980589, 40536892, 39283418, 38976302, 40025723, 42068173, 44344655, 46266623, 47561322, 48237307, 48458076, 48230037, 47614168, 46842833, 45965070, 44951298, 43927559, 42963908, 42016159, 41063725, 40011249, 38601978, 36807030, 34972590, 33443012, 32414127, 31925156, 31873746, 32134610, 32589761, 33091225, 33611828]
14996C3611828N79119O45716Q31087J198025J518723J540869J341651J085201
14988D2352219O22042k37353j138853j541146j423307j044465o53198n25132o15325
14979C5795482o42601m27252J03918P31664J076929J108678R89875Q22735O79316
14970D0238744M49251K325m81460o81119n38556m32178o45401q57600q40833o95641
14960C5517532o66650q45278r09860p32731n37564l25089M1709M24113N81762
14951C2547944N07834L25732J40351n0240k60779m96274o48563n99480n45052
14942C0921473p26189j033161j121763q14720l08682M507q1969n87360j240460
14933B5011676j591216j438467j046681q66401j049441j306826j287289r87495
$$ y = [33611828, 34190947, 34836663, 35667750, 36865775, 38384498, 39925367, 41267018, 42352219, 42974261, 42736908, 41598055, 40056909, 38633602, 37589137, 36935939, 36410807, 35795482, 35152881, 34725629, 34829547, 35561211, 36638140, 37746818, 38736693, 39559428, 40238744, 40687995, 40690320, 40208860, 39527741, 38989185, 38557007, 37911606, 37054006, 36213173, 35517532, 34850882, 34005604, 33095744, 32363013, 31825449, 31500360, 31542069, 31966182, 32547944, 33055778, 33381510, 33521861, 33471621, 33210842, 32714568, 32066005, 31466525, 30921473, 30195284, 29162123, 28040360, 27225640, 26916958, 26921465, 26839496, 26252136, 25011676, 23420460, 21981993, 20935312, 20068911, 19019470, 17712644, 16425355, 15437860]
14925A5437860o69482n79430p31494r39889j081486j087350q24065m17893j76703
14916H930068j72923l28824o14367r88757j260040j338205j244749q34708q1595
14907B065900N43172O73276N60951M86125K76854r1730k43716P1606Q51944J804260
14897F998642K290585J859319R17349R5814m48341q03944j047179j098479r04357
14888G859409n40179r3585K99354M74009L62410J20005P4883K91120N90434Q51156
14878A0289016J038809J285095J315157P36673k38621j182287j849260k116529
14870I278053j990358j633890j114316m48915K04497P68481J092344R45377M12894
14861G514167j91095m77343l15260j5282R2982j05944m98940o56250k88570K62127
$$ y = [15437860, 14768378, 14188948, 13457454, 12517565, 11436079, 10348729, 9524664, 9106771, 8930068, 8757145, 8428321, 7813954, 6825197, 5565157, 4226952, 2982203, 2147495, 2065900, 2609072, 3282348, 3843299, 4329424, 4606278, 4514548, 4270832, 4342438, 5194382, 6998642, 9289227, 11148546, 12065895, 12161709, 11713368, 10909424, 9862245, 8763766, 7859409, 7319230, 7225645, 7524999, 7999008, 8361418, 8481423, 8556306, 8847426, 9437860, 10289016, 11327825, 12612920, 13928077, 14664750, 14426129, 13243842, 11394582, 9278053, 7287695, 5653805, 4539489, 4090574, 4295071, 5063552, 6155896, 7101273, 7514167, 7323072, 6845729, 6530469, 6515187, 6608169, 6502225, 6003285, 5347035, 5058465, 5320592]
14851E320592N60893M73962J14655l00160n30330o47609r69482j459523j751737
14842H11261j511929q11609k14024j66891m21365m37224n5485M62045O94595L71743
14832a278883q5285j4217M43099O82986M39498o6411m06102l79201j21636K24519
14822e61633N81194O97337M76101K03291J02366K17659L94231K73452j56753n85205
14812A642040q83320j064006j016307o54443j23314L86578O57236O56370N45950
14803A46784L46104n7163o33401j204687j589158j475199p71397P1239O64893
14794d501985R87449J098594J006112O76421L34702K38358K95367K07322o6487
14785B75853k70967k12132k0638J15931K92570O23183Q64488N45136k29406o01733
$$ y = [5320592, 5881485, 6355447, 6470102, 6169942, 5639612, 4992003, 4022521, 2562998, 811261, -700668, -1512277, -1726301, -1893192, -2314557, -2751781, -2807266, -2345221, -1650626, -1278883, -1364168, -1378385, -935286, -252300, 187198, 120787, -285315, -664516, -786152, -561633, 19561, 716898, 1192999, 1396290, 1498656, 1716315, 2110546, 2383998, 2227245, 1642040, 758720, -305286, -1321593, -1976036, -2099350, -1712772, -1055536, -399166, 146784, 492888, 435725, -197676, -1402363, -2991521, -4466720, -5238117, -5166878, -4501985, -3514536, -2415942, -1409830, -733409, -398707, -160349, 135018, 342340, 275853, 4886, -207246, -227884, -111953, 180617, 803800, 1668288, 2213424, 1984018, 1382285]
14775A382285o9972R01761J535163J557271J123090M06593l33898p51853p57690
14766D992750n84529l63121o1050K17346J90572l6489O7052N87341J158849J485242
14756G653963J283514N33418k88631p25820p38660n62983l97495l36033l26335
14747F094938l65672m81622m54721j93861J21195K33970n5492m82623n91344k93795
14737C530973J87381N25924N76889L57849p6443m51606n20420m19214m19046n72863
14727B719424o76525o14682n34906n11707m85706l64666k0112O06439J240164
14718A357723J393678R87678L61496j09148k51976l13231n02388p06036q25203
14709A392593q97938q38872m45875J47154N59809O47305N50244L66371K42399
$$ y = [1382285, 1312313, 2214074, 3749237, 5306508, 6429598, 6836191, 6502293, 5750440, 4992750, 4408221, 4045100, 3984050, 4201396, 4391968, 4355479, 4422531, 5009872, 6168721, 7653963, 8937477, 9470895, 9182264, 8456444, 7717784, 7154801, 6757306, 6421273, 6094938, 5729266, 5247644, 4792923, 4599062, 4720257, 4954227, 4898735, 4416112, 3824768, 3530973, 3718354, 4244278, 4821167, 5179016, 5102573, 4650967, 4130547, 3711333, 3292287, 2719424, 2042899, 1428217, 893311, 381604, -104102, -468768, -488880, 117559, 1357723, 2751401, 3739079, 4100575, 3991427, 3739451, 3426220, 2923832, 2217796, 1392593, 494655, -344217, -790092, -642938, -83129, 564176, 1114420, 1480791, 1723190]
14700A723190M10712P52014Q50287N81074J67056k30570n62712q67979j191157
14691A631915j472170j626984j646649j499448j014834k93464L49742Q03856J124465
14682c643571J355867J397062J151321P02968J72826k23985l21912j51062M6427
14673D85941Q3484k1332j29971m2223L16442P58153J059484R82059L56373m18020
14663C430390p20488o04205m24839k21804l4874m9111k02766j11756M37901J144536
14653B642984J371338Q49806P710n72832q08531r09129r26818p68046m90869j25997
14643B69616L16937O44076O75590N63436N34460M39127K23323J43743L09364N65341
14633D685013P52792Q40418Q01063P05508M94363q7147q34085j170686r86991
$$ y = [1723190, 2133902, 2885916, 3736203, 4317277, 4484333, 4253763, 3691051, 2823072, 1631915, 159745, -1467239, -3113888, -4613336, -5628170, -5921634, -5571892, -4768036, -3643571, -2287704, -890642, 260679, 963647, 1136473, 912488, 590576, 439514, 485941, 569425, 548093, 418122, 375899, 692341, 1450494, 2509978, 3492037, 3848410, 3430390, 2709902, 2105697, 1680858, 1459054, 1424180, 1375069, 1172303, 1060547, 1498448, 2642984, 4014322, 4864128, 4871838, 4299006, 3490475, 2581346, 1654528, 886482, 395613, 269616, 586553, 1230629, 1906219, 2469655, 3004115, 3443242, 3666565, 3810308, 4119672, 4685013, 5437805, 6278223, 7079286, 7784794, 8279157, 8192010, 7357925, 6187239, 5200248]
14624E200248n87027l13531l44694n32921o98629p66705p51803n85306k09753
14615D09879J70012L31204K66432N9451l23188q37397j237646j410565j316138
14606c887956j001541o30916k23850K32802O43382R88961J368811J584887J279241
14597C53821M08463o64713j326094j257348p03917j06519K17211L37882N22044
14588b219170P23864O98743L16667k50290p68279j211143j379801j097557o73847
14579e860813m95291m49996j05197M11039O43929O49908O84446Q44261J106036
14570b571678J287960J050223L18293n08461j070570j343815j326970r95992m29293
14561e590303L24068J092729J426734J106721M62925o3256j72799J95206Q66428
$$ y = [5200248, 4613221, 4299690, 3954996, 3422075, 2723446, 1956741, 1204938, 619632, 409879, 579891, 911095, 1177527, 1236978, 913790, 76393, -1161253, -2571818, -3887956, -4889497, -5520413, -5744263, -5511461, -4868079, -3879118, -2510307, -925420, 353821, 762284, 97571, -1228523, -2485871, -3189788, -3296307, -3079096, -2741214, -2219170, -1495306, -796563, -479896, -730186, -1498465, -2709608, -4089409, -5186966, -5860813, -6356104, -6806100, -6911297, -6500258, -5856329, -5206421, -4521975, -3677714, -2571678, -1283718, -233495, 84798, -423663, -1494233, -2838048, -4165018, -5161010, -5590303, -5266235, -4173506, -2746772, -1640051, -1177126, -1240382, -1413181, -1217975, -351547]
14552c51547J565365J941291J737683R19024k63796j352883j865396j602745q63704
14543a36708l02922j74547m6081M18049J029873J357241J237496P92651K24579
14534D399631j58134j54605n3859j07387j46204p7794N442J23562M02489O34359
14524D867500L40768n43784j483729j895703j571897p74167P8908Q31312J384792
14515A234000J605409J361781O61058M8544n012K25476K53192K819l54972o22320
14505D409975o44442n31075m49931l29084m8839O9984j52853l27275l00994k87341
14495A408125k86020k34945j75398r6948j40597l31430n13399o10032n91073n55421
14485b127138n37394l64277N1061N20792Q27661J032929J336612J532534J293365
$$ y = [-351547, 1213818, 3155109, 4892792, 5811816, 5548020, 4195137, 2329741, 726996, -136708, -439630, -614177, -660258, -242209, 787664, 2144905, 3382401, 4175052, 4399631, 4241497, 4086892, 4033033, 3925646, 3779442, 3701648, 3707090, 3830652, 4233141, 4867500, 5208268, 4664484, 3180755, 1285052, -286845, -1061012, -982104, -150792, 1234000, 2839409, 4201190, 4862248, 4910792, 4905780, 5131256, 5384448, 5387267, 5032295, 4409975, 3765533, 3234458, 2784527, 2455443, 2406604, 2476588, 2323735, 1996460, 1695466, 1408125, 1122105, 887160, 711762, 614814, 474217, 142787, -370612, -980644, -1571717, -2127138, -2664532, -3028809, -2977748, -2456956, -1629295, -596366, 740246, 2272780, 3566145]
14476C566145P74849J52621o47324j332434j393792q23851j02715K97030K27042
14467G17571j74789m90721m55639l32922l29576k98514J4238O55349J165569J075111
14457A545677N54741o563m70319p68863q68169q37543o73161k17879M42605Q85325
14447d14149R13579P98361P53806O27798L14663P9654K35681O25783Q45144P43199
14437E523519N69590O39991Q14978P73028L09399m20145q46736o89934k12899
14428F460791J05856l5708m27349m88519k0485L83865J92061l92892r23130j211858
14418C642632j293154j276899j155797o13646L18415R19197Q07582L09064r3535
14409A563859l1127L93939N86355L20062p0718k41596J4089N32939Q80970Q69341
$$ y = [3566145, 4340994, 4493615, 3846291, 2513857, 1120065, 296214, 193499, 490529, 717571, 542782, 52061, -403578, -736500, -1066076, -1364590, -1350352, -695003, 470566, 1545677, 2100418, 2093855, 1623536, 854673, -13496, -851039, -1524200, -1742079, -1299474, -414149, 499430, 1297791, 2051597, 2679395, 2994058, 3073712, 3309393, 3935176, 4780320, 5523519, 6093109, 6733100, 7548078, 8321106, 8630505, 8210360, 7363624, 6673690, 6460791, 6566647, 6530939, 6103590, 5615071, 5594586, 5978451, 6170512, 5777620, 4854490, 3642632, 2349478, 1072579, -83218, -696864, -378449, 540748, 1348330, 1657394, 1563859, 1532732, 1926671, 2513026, 2833088, 2762370, 2520774, 2534863, 3067802, 3948772, 4818113]
14399D818113M65524n9511j36809K74623P00072Q67332Q26712P24884O32552O20217
14389I733709N18298M0794n49021p65810o35451m44027k38037J27294N33728N41816
14379H863293P7847m81869q98381j199366j427566j440553j117813n41619l7411
14370A796562M2286l03220p36372p22799j2322R66872J630599J845941J806399
14361F313946J688916J476054J175082R84609Q37281N81847L60281K24075m1488
14352A3600603m52305q12491j157377j582433j919297j820217j174830l26813
14344D354840L58308P94794R36328P56335K89700l41186r28855j394346j736878
14335C089040j745715j342920p98829l29140J94466R04313J459379J449400Q84439
$$ y = [4818113, 5283637, 5224126, 5087317, 5361940, 6062012, 6929344, 7756056, 8480940, 9113492, 9733709, 10252007, 10292801, 9743780, 8977970, 8342519, 7898492, 7660455, 7787749, 8321477, 8863293, 8941140, 8459271, 7560890, 6361524, 4933958, 3493405, 2375592, 1833973, 1796562, 1838848, 1535628, 799256, 76457, 64135, 1031007, 2661606, 4507547, 6313946, 8002862, 9478916, 10653998, 11638607, 12475888, 13057735, 13418016, 13642091, 13600603, 13148298, 12335807, 11178430, 9595997, 7676700, 5856483, 4681653, 4354840, 4713148, 5507942, 6444270, 7200605, 7490305, 7149119, 6220264, 4825918, 3089040, 1343325, 405, -798424, -1127564, -933098, -28785, 1430594, 2879994, 3764433]
14326C764433K70687J71775O16094J145020J259097Q47014K44155j2002K63194
14317H569467O24281N14996j01308p36914r48036q76411q88156r96156q96598
14308D265165n34657j79772n1734k27853l89334j39815M32703R34247J104042
14299E212992R82474Q34484Q77141R80306R89061P62417L12045o9510k13174k08452
14289A0459784k19475l82759o88474q19729n38449M0515M98779N54612K50649
14280I155453l90185j218320j892372k182097k189474k174415k188013j902866
14272d982289j088414n1208P80617J213890J226707J018030Q25913O34496K89521
14263a32737j94852m43032j67767M15978Q63839R17465O69350K96407n1352j07584
$$ y = [3764433, 4035120, 4206895, 4822989, 5968009, 7227106, 8074120, 8318275, 8306273, 8569467, 9193748, 9708744, 9607436, 8870522, 7922486, 7046075, 6157919, 5161763, 4265165, 3730508, 3550736, 3499002, 3271149, 2881815, 2742000, 3174703, 4108950, 5212992, 6195466, 7029950, 7907091, 8887397, 9876458, 10638875, 10950920, 10881410, 10668236, 10459784, 10240309, 9857550, 9169076, 8349347, 7810898, 7851413, 8350192, 8904804, 9155453, 8765268, 7546948, 5654576, 3472479, 1283005, -891410, -3079423, -4982289, -6070703, -6121911, -5341294, -4127404, -2900697, -1882667, -1056754, -422258, -132737, -327589, -770621, -938388, -522410, 341429, 1258894, 1928244, 2224651, 2173299, 2065715]
14253B065715J35385K89616R5640k74335m08992j04164L25960L57055j10559p45391
14243A625930j197318j221957o76392L68862J409230J770202J303546N08224j1402
14234C878925j08192l3191N7318J30865J21467p1166m35818q04538r66872q07188
14224I61610n15212l14057j22870N9276j4196m12604o68290l26174L18960O83251
14214c50306O79584N61444L09723k39287q74143j095350p19521p4038N27047R99971
14204b74876J310419J177949M63298l07956o54795n98175m05626l85516n72496
14195b47774o56150n45241l55932k16901j85118j71995j04388O5097K18273K03452
14185a996677J8843k89192o72373j078930j296083j065608n12943R3355N60517
$$ y = [2065715, 2201100, 2490716, 2586356, 2312021, 1903029, 1798865, 2124825, 2481880, 2371321, 1625930, 428612, -793345, -1469737, -1100875, 308355, 2078557, 3382103, 3890327, 3878925, 3770733, 3737542, 3794860, 3925725, 4047192, 3976026, 3540208, 2735670, 1768798, 961610, 446398, 132341, 9471, 68747, 54551, -358053, -1026343, -1352517, -1033557, -350306, 329278, 890722, 1200445, 961158, 87015, -1008335, -1727856, -1801894, -1274847, -274876, 1035543, 2213492, 2676790, 2368834, 1714039, 1115864, 710238, 324722, -247774, -903924, -1449165, -1805097, -2021998, -2207116, -2379111, -2483499, -2418402, -2200129, -1996677, -1977834, -2267026, -2939399, -4018329, -5314412, -6380020, -6892963, -6799608, -6239091]
14176f239091P29724P89616J005236J227909J191868R50739O33216J95422k26192
14167B58447m95210p15538r18495j005498q05638k97114K66979O32599O11191
14158b468277K15427k35090l10113J49610Q37215J205528J014033N74078L81632
14149A364043M82878L69745n1027k43356L114K79570J75526k61461p16741j077284
14139C25007j411384j469988j028661m46793p2087J51345L62857N73834Q16457
14130b199413J018550J007217P91426M66661p4091q35272j348814j266329p43392
14121c183457m8057O20742R14054O91869L66062M53340R61680J274459R60554
14112C011246L57363k6456r3106Q9304M42759Q12189J058427J016123O32359J49388
$$ y = [-6239091, -5509367, -4719751, -3714515, -2486606, -1294738, -343999, 289217, 484639, 258447, -236763, -952301, -1870796, -2876294, -3681932, -3979046, -3712067, -3079468, -2468277, -2252850, -2487940, -2798053, -2648443, -1811228, -605700, 408333, 982411, 1364043, 1846921, 2216666, 2165639, 1922283, 1925397, 2204967, 2380493, 2119032, 1402291, 325007, -1086377, -2556365, -3585026, -4031819, -4103906, -3952561, -3589704, -3015870, -2199413, -1180863, -173646, 617780, 1084441, 1010350, 175078, -1173736, -2440065, -3183457, -3231514, -2610772, -1696718, -1004849, -638787, -185447, 776233, 2050692, 3011246, 3368609, 3342153, 3249047, 3338351, 3781110, 4593299, 5651726, 6667849, 7300208, 7449596]
14102G449596j81821m36623p48393j068193j059443n48839O5185M05407N19587
14093D396463M81897J45618m84338r33156p47585j06065M47621N62690L41938
14084D105083K3180m12551q43978p37891m8135N66352P66594O68129L09060j55027
14074D240816n23916p94440r08022q24801n14502k0814L84515N26993M72788M21131
14064B459748N32312P46842P53749K57216n22211j018082r91374o34524k93964
14055A289712j37687r0940M876K9222k67899p59704j066744j023341q50012o88707
14045c561224m01886R6500N58000O82363O54073R23018J523628J945224J723829
14036D143525R48730J76259o8428J17655P6564n65004j443766j998109j897777
$$ y = [7449596, 7267775, 6831152, 6082759, 5014566, 3955123, 3406284, 3471469, 3876876, 4396463, 4878360, 5023978, 4539640, 3606484, 2858899, 2752834, 3200455, 3763145, 4105083, 4128263, 3715712, 2871734, 2133843, 2085708, 2652060, 3418654, 4086783, 4395843, 4240816, 3716900, 2922460, 2014438, 1189637, 675135, 654321, 1038836, 1565829, 2038617, 2459748, 2992060, 3738902, 4492651, 4749867, 4227656, 3209574, 2218200, 1583676, 1289712, 1152025, 1061085, 1065961, 1095183, 827284, 67580, -999164, -2022505, -2872517, -3561224, -3963110, -3866610, -3308610, -2626247, -1972174, -1049156, 474472, 2419696, 4143525, 5092255, 5268514, 5200086, 5317741, 5394305, 4829301, 3385535, 1387426, -510351]
14027e10351j321147p54580l51478j52011j17745m3705K18122O05380J012687
14018a414828J323849J292475Q11853j1639q02524j065581p04770j62159J65414
14009e67910L62009N79096O59419L70561r7795k73921p1075K93117P02939J000537
13999B956977Q53659J14292q44649j519088j680008j336736p04354O9750R36587
13990a153570J662067K017576J915177J416366Q20365L37531m9043l80905o85225
13981E900339r71704j117245r64615o96623o32036n55974k20608L5947k7119j19982
13971F30380o9326m1042j14335j62415l7280K67302O75916J005493R80606O12702
13961C748001L15949M08802O90550O07663q6760r29765j316333j174711p53259
$$ y = [-510351, -1831498, -2586078, -2937556, -3089567, -3207312, -3251017, -3032895, -2427515, -1414828, -90979, 1201496, 2013349, 2001710, 1199186, 133605, -571165, -733324, -567910, -205901, 373195, 1032614, 1403175, 1305380, 1031459, 960384, 1253501, 1956440, 2956977, 3810636, 3924928, 3080279, 1561191, -118817, -1455553, -2159907, -2090157, -1153570, 508497, 2526073, 4441250, 5857616, 6677981, 7015512, 6966469, 6585564, 5900339, 4928635, 3811390, 2846775, 2150152, 1518116, 962142, 741534, 777481, 750362, 630380, 561054, 520012, 405677, 243262, 205982, 473284, 1149200, 2154693, 3135299, 3748001, 4063950, 4472752, 5163302, 5770965, 5684205, 4754440, 3438107, 2263396, 1510137]
13952A510137l56477k57356l91972n72132q06291j116999j377131j431935j164961
13943e965117n68447J33859O30149Q72283R78719J030142J197301J391769J184122
13934H84780O17935K14601J82050K37192J24819j12205l76222p08423j124363
13925e9836j401518j352467j143035q90100m27870J32108L50413k8658q21189
13916e642152j396034j345154r15971m34040R1962O96122J219931J358064R30502
13907e436770K39526j58624k00190l48091o47704p48951n39480P1102J055291
13898f713891J899385K113967J783707J189264M31965l29711p52714n96884R904
13889i65008O11063O76863L75698L04233M88063O78370P87392P35023N45654K52631
$$ y = [1510137, 1153660, 896304, 504332, -67800, -874091, -1991090, -3368221, -4800156, -5965117, -6533564, -6399705, -5769556, -4897273, -3918554, -2888412, -1691111, -299342, 884780, 1502715, 1717316, 1899366, 2136558, 2261377, 2149172, 1772950, 1064527, -59836, -1461354, -2813821, -3956856, -4846956, -5274826, -5142718, -4792305, -4820963, -5642152, -7038186, -8383340, -9299311, -9733351, -9641389, -8945267, -7725336, -6367272, -5436770, -5197244, -5355868, -5556058, -5904149, -6551853, -7300804, -7840284, -7769182, -6713891, -4814506, -2700539, -916832, 272432, 704397, 374686, -378028, -974912, -965008, -353945, 322918, 698616, 1002849, 1490912, 2169282, 2956674, 3691697, 4237351, 4489982]
13879D489982j56726n11492p16996q05967p13310l91991R9340N78006O98912K68499
13869B838257l21260n78838o22740q02292j046644j045989q29860n90935l07662
13860c307963K2929L75914Q03971J240562J383141J154567R29159R05411P89751
13851D297442M74604L05402N31693J023187J355203J328646J126816P44813L9549
13842A1227355o63551r51452r79699j135765j542274j857646j719778j279734
13834A097456q96429p30944p56280p19503m63542k77272m30965o64379m84712
13825d326570K00894J081253J769417J998808J740291J105358K03156o15243r45310
13816B212054q42472n99412l71982j99982J0174K54729L35853K33560J63727K61788
$$ y = [4489982, 4333256, 3821764, 3104768, 2298801, 1585491, 1193500, 1292840, 1870846, 2569758, 2838257, 2516997, 1938159, 1315419, 513127, -533517, -1579506, -2409366, -3000301, -3307963, -3285034, -2909120, -2105149, -864587, 518554, 1673121, 2602280, 3507691, 4297442, 4772046, 5077448, 5609141, 6632328, 7987531, 9316177, 10442993, 11187806, 11227355, 10563804, 9612352, 8632653, 7496888, 5954614, 4096968, 2377190, 1097456, 201027, -529917, -1286197, -2005700, -2469242, -2746514, -3177479, -3841858, -4326570, -4125676, -3044423, -1275006, 723802, 2464093, 3569451, 3772607, 3157364, 2212054, 1369582, 770170, 398188, 198206, 208380, 463109, 798962, 1032522, 1196249, 1458037]
13806A458037M00791N03913N85784O09033O25616O29955N72328L51901j11357
13797E626001n38294o69259n54940j72252L60446P36767Q76139Q33750O32946
13788G131304M08881K59530l4159o05389j098389j149737j028001j115784j280101
13779A488155j270110j055843o94401m35591m81184m97072j89124K92326P12996
13770b129848Q88974P91897N76641M41159N50540P73950O71953K21797r0491j5513
13760B681059J17243m1352l88015o58694p32680n42000k72843j43704q9747j15910
13750a86643j25400N6113L42673M82064K72590j16666k56564r6927J15007L04969
13740G91216N60369Q78531J051517R77554P32247L77207Q4755J5803R0256J26423
$$ y = [1458037, 1858828, 2362741, 2948525, 3557558, 4183174, 4813129, 5385457, 5737358, 5626001, 5087707, 4418448, 3863508, 3691256, 4051702, 4788469, 5664608, 6498358, 7131304, 7540185, 7799715, 7765556, 7160167, 6061778, 4912041, 3884040, 2768256, 1488155, 218045, -837798, -1532199, -1967790, -2448974, -2946046, -3135170, -2842844, -2129848, -1240874, -448977, 127664, 568823, 1119363, 1893313, 2565266, 2787063, 2696572, 2681059, 2798302, 2756950, 2368935, 1710241, 977561, 435561, 162718, 19014, -70733, -186643, -312043, -255930, 86743, 568807, 841397, 724731, 468167, 371240, 486247, 791216, 1351585, 2230116, 3281633, 4259187, 4991434, 5368641, 5453396, 5469199, 5559455, 5685878]
13730E685878K9192j62790l07763j85513K53283P70883J114775J124664O51316
13721H973925k99584j436362k326232k506421j902091r71468k51283Q9658K94445
13712c35413P55409J552789K189188K172880J570119Q46954K92077k04155p98644
13703H041204j307191j275834p94648m14253l05336l27882m54069p17833r13562
13694A530596o80626l3193N77319Q87687J065535J174030R81112M21036j76916
13685E746580m18005l77342m68629q56229j206805j128801q65439q74955r12389
13676a362014n28097J1400L45759N99728Q63433R57748Q18949N14805J25872n5172
13666B292411K04574N94185N92215J23826m03537o21357o13748o58122p03560
$$ y = [5685878, 5715070, 5552280, 5244517, 5059004, 5312287, 6083170, 7197945, 8322609, 8973925, 8674341, 7237979, 4911747, 2405326, 503235, -468233, -719516, -629858, -335413, 419996, 1972785, 4161973, 6334853, 7904972, 8751926, 9044003, 8839848, 8041204, 6734013, 5458179, 4663531, 4249278, 3943942, 3616060, 3161991, 2444158, 1530596, 849970, 816777, 1394096, 2281783, 3347318, 4521348, 5502460, 5923496, 5746580, 5328575, 4951233, 4482604, 3626375, 2419570, 1290769, 425330, -449625, -1362014, -1890111, -1878711, -1532952, -933224, -69791, 887957, 1706906, 2221711, 2347583, 2292411, 2496985, 3091170, 3683385, 3807211, 3403674, 2782317, 2168569, 1510447, 806887]
13657H06887m90968j26154J59776K51883J39468N980L6605Q3990p5633p7422M14135
13646A128547J012280J226207R81759L89415l84340r56072r95467p00501m19742
13637A282086j52554P1223J51516J32444P3131p1938k62427l07008p1562K46455
13627A091366J25883o04884j365962j474714r72682l38276J10050M97634J052250
13618a879335J521795J384025N08990o20522j307264j271744p16682k0645M18366
13609a983016N55069N43231M01055L17699N70932R83362J315033J553315J474307
13600E730987Q88559M9633p58038j407742j675449j420047q94151m68254k62033
13591b16535l58642p11416r45343r56370q42482n93610l96501n09692q43610j069756
$$ y = [806887, 315919, 189765, 349541, 601424, 740892, 746872, 783477, 867467, 791834, 714412, 1128547, 2140827, 3367034, 4348793, 4738208, 4353868, 3397796, 2402329, 1701828, 1282086, 1129532, 1200755, 1352271, 1484715, 1557846, 1485908, 1223481, 916473, 844911, 1091366, 1217249, 612365, -753597, -2228311, -3200993, -3539269, -3429219, -2931585, -1879335, -357540, 1026485, 1535475, 914953, -392311, -1664055, -2380737, -2401382, -1983016, -1427947, -884716, -483661, -165962, 404970, 1388332, 2703365, 4256680, 5730987, 6619546, 6669179, 5911141, 4503399, 2827950, 1407903, 513752, 45498, -216535, -575177, -1286593, -2231936, -3188306, -4030788, -4624398, -5020899, -5530591, -6374201, -7443957]
13581g443957r40671m48230J66825N65820O13619N09300M93952N13953L89475
13572e579914K52210K99788L74726K82269J86051K74529M16383O28220R26890
13563a938848J092908J135249J019100O42829K46059J79201M76888P92259R18068
13554D563713P72642L34141j08025l22506k69533m3898R6579M2043K3028J76850
13544E265034K12887j12734p51660j390704j568032j242341o97520j25153J72810
13535b37413K7495j24803J77672P56160J143496J180069Q78664K80963l16585
13526C765718n41098l47957l6708Q8184m0733m17339r06365j272028j315570q30463
13516a854359J8457N85333M78558J827l68407o02863q32241r43776p63705j80551
$$ y = [-7443957, -8384628, -8832858, -8666033, -8100213, -7486594, -6977294, -6483342, -5969389, -5579914, -5327704, -5027916, -4653190, -4370921, -4184870, -3910341, -3493958, -2865738, -1938848, -845940, 289309, 1308409, 1951238, 2197297, 2376498, 2853386, 3645645, 4563713, 5336355, 5670496, 5562471, 5239965, 4970432, 4926534, 5023113, 5065156, 5088184, 5265034, 5477921, 5365187, 4613527, 3222823, 1654791, 412450, -285070, -410223, -237413, -209918, -334721, -157049, 599111, 1742607, 2922676, 3801340, 4082303, 3765718, 3224620, 2876663, 2839955, 2928139, 2887406, 2470067, 1563702, 291674, -1023896, -1854359, -1835902, -1250569, -772011, -770184, -1138591, -1741454, -2573695, -3517471, -4281176, -4461727]
13506d461727N39739R07856Q57904P75976Q62294P84620K45488k52890p1236N28111
13496G16135P89273L61746m70208j084052j089101o87569k92341k25696n04495
13487b486308p42354n04731J19954N78634P60644Q45158P97389N71512J34866
13478G4764m02508o83683m65515m4481J67907J07141j52003n51385q60447q00986
13468c611196k33141O84849J406221J401385O73724k05933o15573m91082k11412
13459a202158l9389J41553L13949K79666L20675O37771P83516M99630J30069O1930
13449A927212M68430J091232J402314J297730Q93895K83708m05442j101949j616722
13440D240408j570053r67429l76115k51772m70675o33386n86304n91868q32434
$$ y = [-4461727, -3921988, -3014132, -2156228, -1380252, -517958, 266662, 512150, 259260, 188024, 716135, 1505408, 1867154, 1396946, 312894, -776207, -1463776, -1756117, -1981813, -2486308, -3228662, -3733393, -3613439, -3034805, -2274161, -1429003, -631614, -60102, 74764, -327744, -1011427, -1476942, -1521423, -1353516, -1246375, -1398378, -1949763, -2810210, -3611196, -3844337, -3159488, -1753267, -351882, 321842, 115909, -499664, -990746, -1202158, -1241547, -1099994, -786045, -506379, -185704, 452067, 1235583, 1735213, 1865282, 1927212, 2395642, 3486874, 4889188, 6186918, 7080813, 7364521, 6959079, 5857130, 4240408, 2670355, 1702926, 1326811, 1075039, 604364, -29022, -615326, -1207194, -2039628]
13431b039628j008987q92265n15029P0776P34556J091607Q37191K84892o9960
13422a506847n1535M18070J271757K059996K319448J969738J110121j87576j508019
13413E895153k186367k019337j463672q83068j84624M43259O35196L68744r8886
13404E06398m24008m24954l01204l59007m96766m78428l68286l78100m09525l77599
13394c511479l46851k95858l57538p19998j125893j091956o07548m6231M07169
13385g696183P43098R71655J112689R60826M43590j27474n72375r04325j065178
13376f133677r41564m93322J14587P09648J184974J420276J560838J866746K153325
13367A441831K032891J446236P35553K74059N4165m8505r631M3242p2256k16250
$$ y = [-2039628, -3048615, -3940880, -4455909, -4385133, -3650577, -2558970, -1721779, -1436887, -1506847, -1558382, -1140312, 131445, 2191441, 4510889, 6480627, 7590748, 7403172, 5895153, 3708786, 1689449, 225777, -657291, -841915, -398656, 236540, 605284, 506398, 82390, -342564, -643768, -1002775, -1499541, -1977969, -2346255, -2724355, -3133880, -3511479, -3858330, -4154188, -4511726, -5231724, -6357617, -7449573, -8057121, -8103352, -7696183, -6953085, -5981430, -4868741, -3907915, -3464325, -3591799, -4164174, -5068499, -6133677, -7075241, -7568563, -7453976, -6744328, -5559354, -4139078, -2578240, -711494, 1441831, 3474722, 4920958, 5656511, 5930570, 5984735, 5936230, 5926599, 5969841, 5897585, 5681335]
13357E681335j91430j7857J04591K7082j27092k67823m60898o98696q72161q07211
13347B369840n83277o70950j142514j514056j477158j145839n65229K80897J081113
13338c367173J382013J072381N66460L12312J99534j3475j88057m9793L54938
13329B69140O86424P93791P59803N08850m5267o69057r88085r16647o21237j30529
13319c52814L89155O00649M81001K15013j03960m63433p99924r22123o58849j56724
13309a772009J83777Q2265k79035n08472l87969N7012O78967J394796J988369
13300A437701K258596K163199J628743O98457l69107j178544j514403j504525
13292C620117j380752j323710j412336j513318j416209r25780K0463R57667J336005
$$ y = [5681335, 5489905, 5472048, 5576639, 5603721, 5476629, 5208806, 4747908, 4049212, 3177051, 2369840, 1786563, 1115613, -26901, -1540957, -3018115, -4163954, -4729183, -4448286, -3367173, -1985160, -912779, -346319, -34007, 165527, 152052, -36005, -85798, 269140, 955564, 1749355, 2509158, 3018008, 2972741, 2303684, 1315599, 398952, -222285, -352814, 36341, 636990, 1117991, 1333004, 1229044, 765611, -34313, -956436, -1615285, -1772009, -1588232, -1505967, -1785002, -2293474, -2681443, -2624431, -1945464, -550668, 1437701, 3696297, 5859496, 7488239, 8186696, 7817589, 6639045, 5124642, 3620117, 2239365, 915655, -496681, -2009999, -3426208, -4351988, -4331525, -3373858, -2037853]
13283b037853J230353R16943N35183L55130M23671L08952j60402o73707r92143
13274i3873j039203q14452m86913l93060n89697o31291l49063r9664r5606m7458
13264d640280L48553Q48195J145636J191722J039838P79759M38408m2263n56208
13255E53360q83487j044357j084387r50907o05592m5936N68374R45296J018363
13246a529273R87188R32519Q32220P12925M86363K21121K14874N14736Q40120
13237D212793J030844J170009J091384N93919M1667j05412J17115L02170J07088
13228H561577n39115j211637j299607p74175k39322m7737M3239P4499l07069j178470
13218C082183j976326k114429j619540p02754L78844J104452J228179R39606M86609
$$ y = [-2037853, -807500, 109443, 644626, 999756, 1423427, 1732379, 1571977, 898270, -93873, -1133076, -1947528, -2434441, -2827501, -3417198, -4048489, -4397552, -4497216, -4592822, -4640280, -4291727, -3443532, -2297896, -1106174, -66336, 713423, 1151831, 1109568, 553360, -330127, -1374484, -2458871, -3409778, -4015370, -4061306, -3492932, -2547636, -1529273, -542085, 390434, 1222654, 1935579, 2421942, 2643063, 2857937, 3372673, 4212793, 5243637, 6413646, 7505030, 8098949, 8140616, 8035204, 8152319, 8454489, 8561577, 8022462, 6810825, 5511218, 4737043, 4497721, 4449984, 4493223, 4567722, 4260653, 3082183, 1105857, -1008572, -2628112, -3330866, -2952022, -1847570, -619391, 320215, 806824]
13209H06824K55309L92775L94043j04869p33150j036762q73094l30209K94786
13200i34347P55361J044307J253147J182196O30195q7343m15197k54210m8147
13191C125962j30047l37986k78208N0217J63349m7500j41567K9998K36196L04972
13181B975386J10344k73625o46177p83730n67161m18083o54263q68520p12799
13172a838628l86299j56900M5605L70324P09118P80320O11077O90683J115264
13163A940564J339341J038546N17372J82058K0964k00712n51073p83855n56754
13154B946451R8189N72575M94812L8739n74946j155811j492059j532366j389088
13145a993504j090291p09370m76695m05936k39050J01477M58605P11694P74630
$$ y = [806824, 1062133, 1454908, 1848951, 1744082, 1010932, -25830, -898924, -1229133, -934347, -178986, 865321, 2118468, 3300664, 3930859, 3843516, 3428319, 3174109, 3125962, 2995915, 2657929, 2379721, 2429938, 2593287, 2545787, 2404220, 2434218, 2670414, 2975386, 3085730, 2812105, 2165928, 1382198, 815037, 396954, -257309, -1125829, -1838628, -2224927, -2381827, -2336222, -1965898, -1256780, -476460, 134617, 825300, 1940564, 3279905, 4318451, 4835823, 5017881, 5038845, 4838133, 4287060, 3503205, 2946451, 3044640, 3617215, 4112027, 4150766, 3575820, 2420009, 927950, -604416, -1993504, -3083795, -3793165, -4269860, -4675796, -4914846, -4813369, -4354764, -3643070, -2868440]
13136b868440N30698J20645j30288j09142J42759N91589J030883J244697J350537
13127A903938J402154J105270M65209K4402J7636J26085O1090r2558j73859k70399
13117D568968m15956n91365r28010j337979j388407j140970j087938j254637j289902
13108d866196r82814m73434K9354M08341N46658M39201K13730P2205J48866L86579
13098d077510O58625Q82695J042355R26589M04387j69064l59534q8325L21811
13089d57971N11126M37468L00264L70386O92655R32578P85241M30323L09320M47355
13079D758745L28419k80519p64092o72886n22716p19329r14210p16498k27601
13070B69313K28536M89049O06857O56574O86622P31979P35056O15898M62541K54518
$$ y = [-2868440, -2337742, -2217097, -2347385, -2456527, -2313768, -1722179, -691296, 553401, 1903938, 3306092, 4411362, 4876571, 4900973, 4918609, 5044694, 5105784, 5013226, 4839367, 4568968, 4153012, 3561647, 2633637, 1295658, -92749, -1233719, -2321657, -3576294, -4866196, -5849010, -6322444, -6293090, -5884749, -5338091, -4898890, -4685160, -4612955, -4464089, -4077510, -3418885, -2536190, -1493835, -567246, -162859, -331923, -691457, -779782, -457971, 53155, 490623, 790887, 1161273, 1853928, 2786506, 3571747, 4002070, 4311390, 4758745, 5087164, 4806645, 4042553, 3369667, 2846951, 2127622, 1213412, 496914, 269313, 497849, 986898, 1593755, 2250329, 2936951, 3668930, 4403986, 5019884, 5482425, 5736943]
13060E736943j55954n19627n39713m57314o42883r96831j220162j279773j155240
13051a230554o41928L20970J400083K110654K385211K375667K099414J536279
13043A0355796P51678m1368o59578j117318j418571j391108j036375o62330m50026
13034D330800l38582k81163k02315K800L01576N28984O55145O38830M05188L0800
13024F072063k30826k94397n30493j212135j834025j713569r83581l38944k77407
13015a343314p45873j284435j499723j359130r62374k17901O78164J226163J178234
13006d330189P07527M41365P47645J217148J412899J351781J117881P66432M61438
12997C893927K76485M3979k96007n14685m48239k19857q6194j40861k82652m75931
$$ y = [5736943, 5580989, 5061362, 4521649, 4064335, 3421452, 2424621, 1204459, -75314, -1230554, -1872482, -1551512, -151429, 1959225, 4344436, 6720103, 8819517, 10355796, 11107474, 11066106, 10406528, 9289210, 7870639, 6479531, 5443156, 4780826, 4330800, 3992218, 3711055, 3508740, 3511540, 3813116, 4342100, 4997245, 5636075, 6041263, 6072063, 5841237, 5546840, 5016347, 3804212, 1970187, 256618, -726963, -1065907, -1343314, -2089187, -3373622, -4873345, -6232475, -7194849, -7412750, -6734586, -5508423, -4330189, -3622662, -3181297, -2433652, -1216504, 196395, 1548176, 2666057, 3432489, 3893927, 4170412, 4214391, 3918384, 3403699, 2955460, 2735603, 2649409, 2508548, 2225896, 1749965]
12987A749965o01392o68805o65409n17737l74541k82656k61929l27932l81225
12978b331661m26984m02680o7824N98894J253293J575015J561112J372252J056248
12969D187665O06247M0915m20419n48920m73217m59635n47040o98102j068590
12960F18904j526743j777125j638344r82405j9451R77208J807322K260847K303233
12951B023446K112826J930329J701895J229950N11160k22744n18216l72706k10127
12942H185813j67835k02759m08227p71733j098536j145562q08403l38244o9262
12933C175252m8856p6493p1299j68961l07204k12462J37263N96514Q85449P65007
12923D674210K79577m48761j269509j897513k075370j725792r81906l14175j27744
$$ y = [1749965, 1148573, 479768, -185641, -703378, -1077919, -1360575, -1622504, -1950436, -2331661, -2758645, -3161325, -3229149, -2630255, -1376962, 198053, 1759165, 3131417, 4187665, 4793912, 4834827, 4414408, 3865488, 3392271, 2932636, 2385596, 1687494, 618904, -907839, -2684964, -4323308, -5305713, -5325164, -4347956, -2540634, -279787, 2023446, 4136272, 6066601, 7768496, 8998446, 9509606, 9286862, 8768646, 8395940, 8185813, 8017978, 7815219, 7406992, 6635259, 5536723, 4391161, 3582758, 3244514, 3175252, 3126396, 3049903, 2978604, 2809643, 2502439, 2289977, 2427240, 3023754, 3909203, 4674210, 4953787, 4505026, 3235517, 1338004, -737366, -2463158, -3445064, -3759239, -3886983]
12914c886983l79667p81636q28266k33523O39586J285241J591581J733323J686356
12905H26012J232283M00464m08263p37841n11911J7916M21099M18432K14930J08421
12895A981542M8455r9534l21122l94446K5687P91281J290987J222712P49187J81229
12885E475978l02657o72535p48856l20310M72244J109149J100897M23250m23547
12876F113613p74972l48455N02551J129744J158931P34714J33028n51903j052319
12867G044932r71543l76821J95157K86704j54441q74374j255595p36719L64842
12858C522142J132868J015098J59266o94649r11266p11098o43403p36438p18385
12849A414135n91150n13915n27565o68300q94272j064450p93940J33960J125592
$$ y = [-3886983, -4266650, -5048286, -5876552, -6110075, -5470489, -4185248, -2593667, -860344, 826012, 2058295, 2458759, 2050496, 1312655, 800744, 818660, 1239759, 1658191, 1873121, 1981542, 2029997, 1930463, 1609341, 1214895, 1240582, 2031863, 3322850, 4545562, 5294749, 5475978, 5173321, 4500786, 3751930, 3431620, 3903864, 5013013, 6113910, 6537160, 6113613, 5338641, 4990186, 5492737, 6622481, 7781412, 8516126, 8649154, 8097251, 7044932, 6073389, 5696568, 5891725, 6178429, 6023988, 5149614, 3894019, 3157300, 3522142, 4655010, 5670108, 5829374, 5134725, 4223459, 3512361, 2868958, 2132520, 1414135, 822985, 309070, -218495, -886795, -1781067, -2845517, -3639457, -3505497, -2379905]
12840b379905J590880J723784J743912J508236R39970J75572o27020j419920k215388
12831A040121k689853k351748j332689k31997N14682Q38787R12028R10037Q87022
12822a503610P72271M58486j29883q96071j458638j502547j172696p90549l64699
12813f587936J56838O44201J158288J748895K117409J976100J389483O83616Q0873
12804C367767l68835o71553r04852j110314r94926k36846Q21297J481459J453553
12795B836750J093338P05867J04018o69218j213696j299897r69729l08608N55926
12786H34751J431135J993838J896255J118871K18596l86316p57060q97490p86425
12777D666155n50774m26638o33770j016580j220241j170953j053589j032304j077904
$$ y = [-2379905, -789025, 934759, 2678671, 4186907, 5126877, 5302449, 4675429, 3255509, 1040121, -1649732, -4001480, -5334169, -5566166, -5051484, -4212697, -3300669, -2390632, -1503610, -731339, -272853, -402736, -1298807, -2757445, -4259992, -5432688, -6223237, -6587936, -6431098, -5786897, -4628609, -2879714, -762305, 1213795, 2603278, 3286894, 3367767, 2998932, 2327379, 1422527, 312213, -682713, -919559, -98262, 1383197, 2836750, 3930088, 4635955, 4739973, 4070755, 2857059, 1557162, 587433, 278825, 834751, 2265886, 4259724, 6155979, 7274850, 7493446, 7107130, 6350070, 5452580, 4666155, 4115381, 3688743, 3054973, 2038393, 818152, -352801, -1406390, -2438694, -3516598]
12768c516598j110980r45303l28461N50404J113718J184711J268537J706236K177770
12759B100034K263233J825088J032795L13753m3459J8484K78635K57989k33991
12750G812561q69438j167664j077560q97667o41181J2090J067576J824235J563089
12741G626041M11595q49289j578202j524731q95899l10248l55491j040929j635702
12732a52855j482779p81860j69703R2549J63581K34817L74145N17216M89734K32804
12722d82351K2298j6431p8853k93796m97577n09687l89681k97629k60718j38506
12712b942931J73862O87838J052651Q36717K50936j06976j38360k11146m34078
12703h31487n48400n95709p81531r98036j061185j095776j164468r16590k83717
$$ y = [-3516598, -4627578, -5572881, -5901342, -5350938, -4237220, -3052509, -1783972, -77736, 2100034, 4363267, 6188355, 7221150, 7534903, 7491444, 7509928, 7788563, 8046552, 7812561, 6943123, 5775459, 4697899, 3800232, 3159051, 3171141, 4238717, 6062952, 7626041, 8037636, 7188347, 5610145, 4085414, 3189515, 2879267, 2523776, 1482847, -152855, -1635634, -2417494, -2587197, -2494648, -2331067, -2096250, -1722105, -1204889, -715155, -482351, -460053, -476484, -555337, -849133, -1346710, -1856397, -2246078, -2543707, -2804425, -2942931, -2769069, -2081231, -1028580, -191863, 59073, -47903, -186263, -397409, -831487, -1379887, -1975596, -2757127, -3755163, -4816348, -5912124, -7076592, -7993182, -8276899]
12694h276899L90195Q56286R78997P57056M43757K24746n0651n35522j017486
12685f229521j092391p87155n43652k85121K21526N08646J36167o60205j384684
12676a0116390j671910j298802l28965P86145J398015J329096J043870J007057
12668g851884J215291J288455J000568N15316J37123o1018k71488m71412n27054
12659e026103n92741p38905q02295o98391o82310r36103j178524j030766n67065
12650a2253203j70208N165O5373J02100P9440N6452K39110N76699P59679O72451
12640i866942N05239N54720P35149P78795O70604O35636Q93002J186048J139595
12631b768154R54470Q06348M91296r73k84357j52709J38593K11406k18404j043658
$$ y = [-8276899, -7886704, -7030418, -6051421, -5294365, -4850608, -4625862, -4676513, -5212035, -6229521, -7321912, -8109067, -8652719, -8937840, -8716314, -8207668, -8071501, -8731706, -10116390, -11788300, -13087102, -13416067, -12629922, -11231907, -9902811, -8858941, -7851884, -6636593, -5348138, -4347570, -3832254, -3695131, -3756149, -4027637, -4499049, -5026103, -5618844, -6357749, -7160044, -7858435, -8540745, -9476848, -10655372, -11686138, -12253203, -12423411, -12418246, -12352873, -12250773, -12171333, -12114881, -11875771, -11299072, -10539393, -9866942, -9361703, -8806983, -8071834, -7293039, -6622435, -5986799, -5093797, -3907749, -2768154, -1813684, -1007336, -516040, -517013, -801370, -954079, -815486, -604080, -822484, -1866142]
12621a866142j759676j986366j544886n32858N56966J180885J211428R96354Q40533
12612b903762Q70722J064022J133416R71369P83373N73924K86909J06538M3563
12603B930074j26505m36616p37661q02102n38911j83233J65424N97007R87049
12594A854526J045784N81361j47379o02386o61812n41289k79248j392N8493J0118
12584A316776J09912K65253J67045j55164m63076o34267n28284k40599j13591
12575b75995l25078o83207q69216n71704m831K87192L76469O00891R54677J159099
12565F48297J048947P75523N51083L26212j6309l78589o55776q15925p45976l64912
12555C72575L8481K71021O68515J276119J478665R84004K15602l49162o38674
$$ y = [-1866142, -3625818, -5612184, -7157070, -7689928, -7132962, -5952077, -4740649, -3744295, -2903762, -2033040, -969018, 164398, 1135767, 1919140, 2493064, 2779973, 2886511, 2930074, 2803569, 2366953, 1629292, 827190, 288279, 105046, 270470, 867477, 1854526, 2900310, 3481671, 3334292, 2731906, 2070094, 1528805, 1249557, 1248165, 1306658, 1316776, 1426688, 1691941, 1858986, 1703822, 1240746, 606479, 78195, -162404, -275995, -601073, -1284280, -2153496, -2725200, -2730031, -2442839, -2066370, -1465479, -510802, 648297, 1697244, 2472767, 3023850, 3350062, 3333753, 2955164, 2299388, 1483463, 737487, 372575, 411056, 682077, 1350592, 2626711, 4105376, 5089380, 5304982, 4955820, 4317146]
12546D317146p44002o90060p49880j032136j150095q49468j54725P35466J470436
12537A152682J763381J648948J334628Q93318K16415m85615q08318o96129l57880
12528D661430j27516j17937l8289L44322P38822O70081J55212k27426j39476J33478
12518F052701K02784o9448n59821r31990r55869o68501k52958m7650k34920n55656
12508A978672p90577p50442k59144L44784N60650M84643L76519J80687k04350
12499A921442o71931q96093o70034k02588K59389P73167J369211J686015J303948
12490D872526K96369q71009j626403j727608j413996r18581l01828M55500J276982
12481D1952J774397J546618P16328j23924n62391n97116n04799n03674m96867
$$ y = [4317146, 3573144, 2883084, 2133204, 1101068, -49027, -898495, -1053220, -317754, 1152682, 2916063, 4565011, 5899639, 6792957, 7009372, 6523757, 5715439, 5019310, 4661430, 4533914, 4415977, 4377688, 4722010, 5460832, 6130913, 6286125, 6058699, 5919223, 6052701, 6255485, 6186037, 5626216, 4694226, 3738357, 3069856, 2816898, 2769248, 2534328, 1978672, 1188095, 437653, 178509, 523293, 1083943, 1568586, 1945105, 2125792, 1921442, 1249511, 353418, -316616, -519204, -259815, 513352, 1882563, 3568578, 4872526, 5168895, 4297886, 2671483, 943875, -470121, -1388702, -1690530, -1235030, 41952, 1816349, 3362967, 4079295, 3955371, 3392980, 2795864, 2291065, 1787391, 1290524]
12472A290524k87914M1263J69645q9055n61724r44173j095880r13496l78411J33788
12462b635433J78492n1726L5871N23984J021673J315485J375242J124537P18484
12453C606609M37596J27309l66665o65449m29637N3642L46775M09818N67209J025934
12443E113141J520185J492735Q60682K23749J9630J60831J64086m10168j412729
12434G732142k257206k590530k557187k314718j834258j214212n59603J3598M09867
12425e172107M78541K27381j0988J3906L46956P25894P77799N42510L36787J29740
12415a603581k00998m27388l74058l13488m72234o98988p08794l99855N3464M46737
12405d699183P52984R36040R97077J023414R77734Q55276P40498N74889K04809
$$ y = [1290524, 1002610, 1043873, 1213518, 1124463, 562739, -381434, -1477314, -2390810, -2769221, -2635433, -2456941, -2508667, -2472796, -1948812, -927139, 388346, 1763588, 2888125, 3606609, 4044205, 4171514, 3804849, 3139400, 2709763, 2763405, 3110180, 3519998, 4087207, 5113141, 6633326, 8126061, 8986743, 9210492, 9230122, 9390953, 9555039, 9144871, 7732142, 5474936, 2884406, 327219, -1987499, -3821757, -5035969, -5595572, -5581974, -5172107, -4693566, -4466185, -4477173, -4463267, -4116311, -3390417, -2612618, -2070108, -1733321, -1603581, -1804579, -2231967, -2606025, -2919513, -3391747, -4090735, -4799529, -5199384, -5145920, -4699183, -3946199, -3010159, -2013082, -989668, -11934, 843342, 1583840, 2158729, 2363538]
$$ [...]
##END NTUPLES=NMR SPECTRUM
##END=
