##TITLE=31P ikalashn
LR-723-R4-RM1
1.10.2024
##JCAMPDX= 6.0         $$ Bruker NMR JCAMP-DX V2.0
##DATA TYPE= NMR SPECTRUM
##DATA CLASS= NTUPLES
##ORIGIN= UXNMR, Bruker Analytische Messtechnik GmbH
##OWNER= root
$$ TOPSPIN		Version 1.3
$$ 2024-10-01 10:29:30.484 +0400  Irina@DPX200
$$ Compression mode = diff/dup
##.OBSERVE FREQUENCY= 81.01967998063
##.OBSERVE NUCLEUS= ^31P
##.ACQUISITION MODE= SIMULTANEOUS
##.ACQUISITION SCHEME= undefined
##.AVERAGES= 16
##.DIGITISER RES= 17
##SPECTROMETER/DATA SYSTEM= spect
##.PULSE SEQUENCE= zgpg
##.SOLVENT NAME= CDCl3
##.SHIFT REFERENCE= INTERNAL, CDCl3, 1, 298.5841
##AUDIT TRAIL= $$ (NUMBER, WHEN, WHO, WHERE, WHAT)
$$ ##TITLE= Audit trail, TOPSPIN		Version 1.3
$$ ##JCAMPDX= 5.01
$$ ##ORIGIN= Bruker BioSpin GmbH
$$ ##OWNER= Irina
$$ $$ F:/spectra/data/iren/nmr/P31dec/1/pdata/1/auditp.txt
$$ ##AUDIT TRAIL=  $$ (NUMBER, WHEN, WHO, WHERE, VERSION, WHAT)
(   1,<2024-10-01 10:27:36.703 +0400>,<Irina>,<DPX200>,<TOPSPIN 1.3>,
      <acquisition in progress>)
(   2,<2024-10-01 10:28:06.796 +0400>,<Irina>,<DPX200>,<TOPSPIN 1.3>,
      <Start of raw data processing
       efp BC_mod = 2 LB = 8 FT_mod = 6 PKNL = 1 PHC0 = 273.7188 PHC1 = 58.61041 SI = 32K 
       data hash MD5: 32K
       2E CB 3F CC 5D B7 02 5B E5 DF 8F FE 63 DC 96 F2>)
(   3,<2024-10-01 10:28:08.812 +0400>,<Irina>,<DPX200>,<TOPSPIN 1.3>,
      <apk 
       data hash MD5: 32K
       1A D7 28 5F 97 BC B8 56 42 D9 49 50 07 18 07 2C>)
(   4,<2024-10-01 10:28:16.812 +0400>,<Irina>,<DPX200>,<TOPSPIN 1.3>,
      <pk fgphup PHC0 = 1.4 PHC1 = 0 
       data hash MD5: 32K
       EB AF A2 3A CA 9E 4F 23 54 44 35 97 66 03 D3 77>)
(   5,<2024-10-01 10:28:18.750 +0400>,<Irina>,<DPX200>,<TOPSPIN 1.3>,
      <abs n ABSG = 5 
       data hash MD5: 32K
       98 40 15 CD 72 CD 2B 61 6E EE FD F5 CC 9C 9D B9>)
$$ ##END=
$$ 
$$ $$ hash MD5
$$ $$ EA 41 FD DA 15 EE 10 B7 E5 18 8B 94 A1 E7 89 BE
##$RELAX= 
##$RELAX= 
##$RELAX= 
##$RELAX= 
##$RELAX= 
##$RELAX= 
##$RELAX= 
##$RELAX= 
##$RELAX= 
##$RELAX= 
##$RELAX= 
$$ Bruker specific parameters
$$ --------------------------
##$DU= <F:/spectra>
##$EXPNO= 1
##$NAME= <P31dec>
##$PROCNO= 1
##$TYPE= <nmr>
##$USER= <iren>
##$AMP= (0..31)
100 100 100 100 100 100 100 100 100 100 100 100 100 100 100 100 100 100 
100 100 100 100 100 100 100 100 100 100 100 100 100 100 
##$ANAVPT= -1
##$AQSEQ= 0
##$AQ_mod= 1
##$AUNM= <au_zg>
##$AUTOPOS= <>
##$BF1= 81.014009
##$BF2= 200.13
##$BF3= 200.13
##$BF4= 200.13
##$BF5= 200.13
##$BF6= 200.13
##$BF7= 200.13
##$BF8= 200.13
##$BYTORDA= 1
##$CFDGTYP= 0
##$CFRGTYP= 5
##$CHEMSTR= <none>
##$CNST= (0..63)
1 1 145 1 1 1 1 1 1 1 1 1 1 1 1 1 1 1 1 1 1 1 1 1 1 1 1 1 1 1 1 1 1 1 
1 1 1 1 1 1 1 1 1 1 1 1 1 1 1 1 1 1 1 1 1 1 1 1 1 1 1 1 1 1 
##$CPDPRG= <waltz16>
##$CPDPRG1= <>
##$CPDPRG2= <waltz16>
##$CPDPRG3= <>
##$CPDPRG4= <mlev>
##$CPDPRG5= <mlev>
##$CPDPRG6= <mlev>
##$CPDPRG7= <mlev>
##$CPDPRG8= <mlev>
##$CPDPRGB= <>
##$CPDPRGT= <>
##$D= (0..63)
$$ [...]
##$SW_h= 37037.037037037
##$TD= 32768
##$TD0= 1
##$TE= 300
##$TE2= 300
##$TE3= 300
##$TEG= 300
##$TL= (0..7)
0 120 53 12 22 120 120 120 
##$TP= (0..7)
150 150 150 150 150 150 150 150 
##$TP07= 0
##$TPNAME0= <>
##$TPNAME1= <>
##$TPNAME2= <>
##$TPNAME3= <>
##$TPNAME4= <>
##$TPNAME5= <>
##$TPNAME6= <>
##$TPNAME7= <>
##$TPOAL= (0..7)
0.5 0.5 0.5 0.5 0.5 0.5 0.5 0.5 
##$TPOFFS= (0..7)
0 0 0 0 0 0 0 0 
##$TUNHIN= 0
##$TUNHOUT= 0
##$TUNXOUT= 0
##$USERA1= <user>
##$USERA2= <user>
##$USERA3= <user>
##$USERA4= <user>
##$USERA5= <user>
##$V9= 5
##$VALIST= <valist>
##$VCLIST= <CCCCCCCCCCCCCCC>
##$VD= 0
##$VDLIST= <DDDDDDDDDDDDDDD>
##$VPLIST= <PPPPPPPPPPPPPPP>
##$VTLIST= <TTTTTTTTTTTTTTT>
##$WBST= 1024
##$WBSW= 4
##$XGAIN= (0..3)
0 0 0 0 
##$XL= 0
##$YL= 0
##$YMAX_a= 7056
##$YMIN_a= -7004
##$ZGOPTNS= <>
##$ZL1= 120
##$ZL2= 120
##$ZL3= 120
##$ZL4= 120
##$ABSF1= 298.5841
##$ABSF2= -158.5842
##$ABSG= 5
##$ABSL= 5
##$ALPHA= 0
##$AQORDER= 0
##$ASSFAC= 0
##$ASSFACI= 0
##$ASSFACX= 0
##$ASSWID= 0
##$AUNMP= <proc_1d>
##$AXLEFT= 0
##$AXRIGHT= 0
##$AXTYPE= 0
##$AXUNIT= <>
##$AZFE= 0.1
##$AZFW= 0.5
##$BCFW= 0
##$BC_mod= 2
##$BYTORDP= 0
##$COROFFS= 0
##$CY= 12.5935478210449
##$DATMOD= 1
##$DC= 0
##$DFILT= <>
##$DTYPP= 0
##$F1P= 47.1127640792319
##$F2P= -24.0371245302204
##$FCOR= 0.5
##$FTSIZE= 32768
##$FT_mod= 6
##$GAMMA= 0
##$GB= 0
##$INTBC= 1
##$INTSCL= 7.269226e-011
##$ISEN= 30
##$LB= 8
##$LEV0= 0
##$LPBIN= 0
##$MAXI= 12.09355
##$MC2= 0
##$MEAN= 0
##$ME_mod= 0
##$MI= 0.7550151
##$NCOEF= 0
##$NC_proc= -7
##$NLEV= 6
##$NOISF1= 298.5841
##$NOISF2= 270.0111
##$NSP= 0
##$NTH_PI= 0
##$NZP= 0
##$OFFSET= 298.5841
##$PC= 1.4
##$PHC0= 289.2224
##$PHC1= -1.91008
##$PH_mod= 1
##$PKNL= yes
##$PPARMOD= 0
##$PPDIAG= 0
##$PPIPTYP= 0
##$PPMPNUM= 100
##$PPRESOL= 1
##$PSCAL= 0
##$PSIGN= 0
##$REVERSE= no
##$SF= 81.014009
##$SI= 32768
##$SIGF1= 270.0111
##$SIGF2= -158.5842
##$SINO= 77.54984
##$SIOLD= 32768
##$SREGLST= <31P.CDCl3>
##$SSB= 0
##$STSI= 32768
##$STSR= 0
##$SW_p= 37037.037037037
##$SYMM= 0
##$S_DEV= 0
##$TDeff= 32768
##$TDoff= 0
##$TI= <>
##$TILT= no
##$TM1= 0
##$TM2= 0
##$TOPLEV= 0
##$USERP1= <user>
##$USERP2= <user>
##$USERP3= <user>
##$USERP4= <user>
##$USERP5= <user>
##$WDW= 1
##$XDIM= 32768
##$YMAX_p= 385186158
##$YMIN_p= -684276
$$ End of Bruker specific parameters
$$ ---------------------------------
##NTUPLES= NMR SPECTRUM
##VAR_NAME=  FREQUENCY,     SPECTRUM/REAL,   SPECTRUM/IMAG
##SYMBOL=    X,             R,               I
##VAR_TYPE=  INDEPENDENT,   DEPENDENT,       DEPENDENT
##VAR_FORM=  AFFN,          ASDF,            ASDF
##VAR_DIM=   32768,         32768,           32768
##UNITS=     HZ,            ARBITRARY UNITS, ARBITRARY UNITS
##FACTOR=    1.13031516577767, 1,            1
##FIRST=     37037.037037037, -74445,        -94071
##LAST=      0,             98865,           119563
##MIN=       0,             -684276,         0
##MAX=       37037.037037037, 385186158,     0
$$ Real data points
##PAGE= N=1
##DATA TABLE= (X++(R..R)), XYDATA
$$ [...]
16868g4141R728J1903J6077J6914Q963n745j9739k3301j3898Q39J3763K3081K6300
16855i256K1603J0682k557j4808k4820l0549l0508k5157j5932n433J452J772k909
16842a26420j0459j8606k2649j8394q063K648J1362J9966K4973J8573L502p421
16830a30988o663K195J2220J9554K3927K5109K4842K7307L3798M0792M3955M3359
16818A59407M1125L5069K1120M48j8695k8687k9439k3790j5630j0564j2395j7312
16806A00657j8230j4321p849o90M479P705J1866J5517J4825J2153J0781Q953N627
16793A51473K543R75p08l055n020j0225k0418k6752k0234o987P2k911q596q882
16779D1275k751N411R534O892j450j2149j9701k0777j6542j1116p291n758o087
$$ plain form
16868 -74141 -64413 -52510 -36433 -19519 -10556 -16301 -36040 -59341 -73239 -72400 -58637 -35556 -9256
16855 -9256 12347 23029 20472 5664 -19156 -49705 -80213 -105370 -121302 -126735 -125283 -123511 -126420
16842 -126420 -136879 -155485 -178134 -196528 -204591 -201943 -190581 -170615 -145642 -127069 -123567 -130988
16830 -130988 -137651 -135456 -123236 -103682 -79755 -54646 -29804 -2497 31301 72093 116048 159407
16818 159407 200532 235601 256721 257169 238474 209787 180348 156558 140928 130364 117969 100657
16806 100657 82427 68106 60257 59567 64046 71751 83617 99134 113959 126112 136893 145846 151473
16793 151473 154016 154991 154283 151228 146208 135983 115565 88813 68579 61592 61664 58753 50157 41275
16779 41275 38524 43935 53469 60361 58911 46762 27061 6284 -10258 -21374 -28665 -34423 -40510
16766d0510o560o413m968p93N165R976J3242J6551J8573J6864J0833J767p820
16753B5907j6484k4347k9693k9231k0738n527J1548K4975K9849K4501J3942N209
16741I911Q14j846o184j3815k1428k0612r599L813J2789J7374K0854K1351J6842
16728C0264J1630R581J1021J2872J0747M317k806q775j4465j7944j6641j4240
16716A5561j4161j2376l509J0499J8550J3140l67j2513j8144j6802j2853r264
16704d2239l737M060Q955P143R81o548j3419j7181j6548q491P406K3113L0295
16691b6210K7854J8568O606l571p426j217R439J3829J0378M187k654j0340j5065
16678B4378j2459m256L786P378O571L470j484q057j4338j7459j5457j1221r598
$$ plain form
16766 -40510 -47070 -53483 -58451 -59244 -54079 -44103 -30861 -14310 4263 21127 31960 33727 25907
16753 25907 9423 -14924 -44617 -73848 -94586 -100113 -88565 -63590 -33741 -9240 4702 9911
16741 9911 10725 8879 2695 -11120 -32548 -53160 -62759 -58946 -46157 -28783 -7929 13422 30264
16728 30264 41894 51475 62496 75368 86115 90432 87626 78851 64386 46442 29801 15561
16716 15561 1400 -10976 -14485 -3986 14564 27704 27337 14824 -3320 -20122 -32975 -42239
16704 -42239 -45976 -41916 -32961 -25818 -24837 -31385 -44804 -61985 -78533 -87024 -79618 -56505 -26210
16691 -26210 1644 20212 26818 23247 15821 14604 24043 37872 48250 52437 49783 39443 24378
16678 24378 11919 7663 11449 18827 25398 28868 27384 19327 4989 -12470 -27927 -39148 -48746
16665d8746j0091r383q677r732p744J325R424P127k300j0332j3578j4821j3960
16652a31488p547J765J0090J8300K5966K9600K7220K0249J1917O462M332L863
16640B0729O962J0704R438M857M29l094m882n552p011r509j1087r442k542Q745
16626H745J7385J7091J0761M657K249L580O395P962P553N311K6p187j4362j8978
16612E1188j8282j2446n914l648n460p114o143n419p496j0904j3856j5825j4790
16599g6109q437J807J3265K2728K5011J7465M499n743r870j0497j0249p218j4
16586d3362O430P423N632O521J0533J2301O976l293j3523k0091j8534q244M750
16573d6481J2762J2972J0194J2112J9383K4581K3787K0265J4444N158l674p144
$$ plain form
16665 -48746 -58837 -68220 -76897 -86629 -94373 -93048 -83624 -76497 -78797 -89129 -102707 -117528 -131488
16652 -131488 -139035 -137270 -127180 -108880 -82914 -53314 -26094 -5845 6072 12534 16866 20729
16640 20729 27691 38395 47833 52690 53119 50025 45143 39591 32580 23071 11984 2542 0 8745
16626 8745 26130 43221 53982 58639 60888 64468 70863 78825 86378 91689 91715 84528 70166 51188
16612 51188 32906 20460 14546 10898 5438 -1676 -7819 -13238 -20734 -31638 -45494 -61319 -76109
16599 -76109 -84546 -82739 -69474 -46746 -21735 -4270 229 -5514 -15384 -25881 -36130 -43348 -43362
16586 -43362 -36932 -29509 -23877 -17356 -6823 5478 12454 9161 -4362 -24453 -42987 -51231 -46481
16573 -46481 -33719 -20747 -10553 1559 20942 45523 69310 89575 104019 109177 105503 98359
16561I8359l974J108K594k97n308j0074j2109r554n663n494r234j1404q528k197
16547A8225M883R419R661O683L690K403L7n495j1534j4353j4756j2895o764L358
16533g438J4624K2670K2431J4838P665M378J36q397j4798j3594j0199j0656j2306
16520I354r645l341K088K677j128m380k779L052N080K68k225J245M794M265l66
16505H959l451O4N560P244O383O489P655P593M870r71q175j2053r776l388K872
16490A9875N639M203K203M358J0204J2303N624l540o437j080Q988J7628J9769
16477I9737J5073O652j413n699n200k063r16l992j0226j7268k1688k0904j5106
16464A6987o157J915L917m504k4507m9789o4505n5997l2013j0096K348R955J8697
$$ plain form
16561 98359 94385 95493 98087 97790 92482 82408 70299 60745 55082 49588 40354 28950 20422 18225
16547 18225 23108 32527 42188 48871 52561 54964 55001 49506 37972 23619 8863 -4032 -10796 -7438
16533 -7438 7186 29856 52287 67125 74790 79168 79304 70907 56109 42515 32316 21660 9354
16520 9354 -291 -3632 -1544 1133 5 -4375 -7154 -4102 978 1246 -979 266 5060 9325 8959
16505 8959 5508 5572 11132 18376 24759 31248 38903 46496 51366 50395 42220 30167 20391 17003 19875
16490 19875 25514 29717 31920 36278 46482 58785 64409 60869 54432 53352 62340 79968 99737
16477 99737 114810 121462 120049 114350 109150 107087 106171 102179 91953 74685 52997 32093 16987
16464 16987 10830 12745 16662 12158 -12349 -62138 -126643 -182640 -214653 -224749 -222401 -212446 -193749
16451a93749L2019M6984N3476M9999M5701M3439L6011J8731k278j7457k2793k0022
16439G0061j2753n818l262k586k58J218r94k394K671J2844K0829J9868J0143j830
16425A07739j3543k6231l5453l7320l3814k6294j6845r714m695J479J0768J9945
16413f3978K2448J8027J3825J2879Q946L43o270p403n918n880q310r950q528m072
16399d3841M569J5270J9584J2556p25j1229j4548j1488k212J3741L5289N9526
16387G6492P9512R0871R1738O8924J7573l7735p0614p7277o8147n2877l4765j6618
16375F7077l665K353L208O41k519n519q030m878O211J6749K0145J9826K1005K2251
16361A54855J8714J1860N802k67o853j0896j2349j2817j1297p270l423n468j3632
$$ plain form
16451 -193749 -161730 -114746 -61270 -11271 34430 77869 113880 132611 130333 112876 90083 70061
16439 70061 57308 51490 48228 45642 45384 46602 45608 43214 45885 58729 79558 99426 109569 107739
16425 107739 94196 67965 32512 -4808 -38622 -64916 -81761 -91475 -96170 -94691 -83923 -63978
16413 -63978 -41530 -23503 -9678 3201 12147 12490 6220 -1183 -7101 -12981 -21291 -31241 -39769 -43841
16399 -43841 -39272 -24002 -4418 8138 7413 -3816 -18364 -29852 -32064 -18323 16966 76492
16387 76492 156004 246875 338613 407537 425110 387375 316761 239484 171337 118460 83695 67077
16375 67077 63412 65765 68973 69614 67095 61576 53546 48668 54879 71628 91773 111599 132604 154855
16361 154855 173569 185429 191231 190964 184111 173215 160866 148049 136752 129482 126059 120591 106959
16348A06959j8853j5260n458N138J0215N869n415j6375j9379j1696q01L347J523
16335C9814J442M494O528P953J2701J9198J9495J1996L288l410j1011k2256l4056
16322E6176l9061l2868j8089l275L052m1o301r587j3475k5679l9072l4129J237
16309a61112N0036P4867O6823M4122K1395N497j228Q85P789J2897J1589N238J463
16296A40261N966J6884K8271L6735M1951M4427M5707M6121M3780L7646L1090K8424
16284E47263L1731L8165M2063M0893L6541L3494L1674J9408k3169j07637k17652
16273D72774l00119l00711k28673j41407p6643l7281j4141j587N065J2232K3099
16262e87392L3855L7047L2186K7634K9761L5344L4483K3596J1828O471N636N296
$$ plain form
16348 106959 88106 72846 67388 72526 82741 88610 83195 66820 47441 35745 34944 38291 39814
16335 39814 41256 45750 52278 60231 72932 92130 111625 123621 126909 123499 112488 90232 56176
16322 56176 17115 -15753 -33842 -37117 -34065 -34106 -40407 -49994 -63469 -89148 -128220 -162349 -161112
16309 -161112 -111076 -36209 30614 74736 96131 101628 100400 101285 109074 121971 133560 138798 140261
16296 140261 146227 163111 191382 228117 270068 314495 360202 406323 450103 487749 518839 547263
16284 547263 578994 617159 659222 700115 736656 770150 801824 821232 798063 690426 472774
16273 472774 172655 -128056 -356729 -498136 -574779 -612060 -626201 -627788 -622723 -610491 -587392
16262 -587392 -553537 -516490 -484304 -456670 -426909 -391565 -357082 -333486 -321658 -315187 -309551 -304255
16250c04255M671M464K633j763n635o545m065J642J0183J8850K1337J5976Q024
16237b34483J771r30Q45N493R511R301N072J681K691O949J0180J0169Q379N620
16223a57751L704P544J7255K5818K6931K1805J4571L670q394j3391r541k543P79
16210f9543j976r445j7473k0111j6019q773j664K702L443K841L447N736P911P272
16196a11652L150k609p116q165m664M435J7226K6754K8389K4567K0008J7068J3360
16183B0751N548l541r714j4053j7101j8049j6362j0323j015Q180J5269J8096J5688
16170f626Q419k225j2493j9852k4052k3436j6973r325n365l846j195L977Q982
16157a04010J0781Q021J167l704k191P98J424K740O889J1962J5255J4901R222
$$ plain form
16250 -304255 -299584 -295120 -292487 -294250 -299885 -306430 -310495 -308853 -298670 -279820 -258483 -242507 -234483
16237 -234483 -232712 -233642 -232797 -227304 -217793 -208492 -203420 -201739 -199048 -192099 -181919 -171750 -163371 -157751
16223 -157751 -154047 -146503 -129248 -103430 -76499 -54694 -40123 -36453 -44847 -58238 -67779 -70322 -69543
16210 -69543 -71519 -80964 -98437 -118548 -134567 -143340 -145004 -142302 -138859 -136018 -132571 -126835 -118924 -111652
16196 -111652 -108502 -111111 -118227 -126392 -131056 -126621 -109395 -82641 -54252 -29685 -9677 7391 20751
16183 20751 26299 22758 13044 -1009 -18110 -36159 -52521 -62844 -63859 -55679 -40410 -22314 -6626
16170 -6626 1793 -432 -12925 -32777 -56829 -80265 -97238 -106563 -111928 -115774 -116969 -112992 -104010
16157 -104010 -93229 -85208 -84041 -87745 -89936 -89138 -87714 -84974 -78085 -66123 -50868 -35967 -26745
16144b6745j24o945p742n521n625q722j1152j2175j3990j8783k5534k8867k4988
16131a96913j5916m862O614J6801K4458K8261K7841K4116J9386J6815J6077J4773
16119b2549J1382O919N163P540R113L366q545j8432k0572j5245n796L068P812
16106c6776P497K037o190j2836j6928j9767j9888j5678r784p062q215p092K71
16093a50411J0349J9093K1961J6353P467O11l568m812l926l880n117l993J389
16080i8484P258Q546N537J544q94j200j360l057l847j572J503M771Q319P962k87
16065f5261j3486k3036k2689j4783m874M666J0040R075N852M059J762l743j0625
16052a23043j3909j0749l541L940J1036J7122J9899J8423J3060N963Q62k011m574
$$ plain form
16144 -26745 -26869 -33814 -41556 -47077 -52702 -61424 -72576 -84751 -98741 -117524 -143058 -171925 -196913
16131 -196913 -212829 -217691 -211077 -194276 -169818 -141557 -113716 -89600 -70214 -53399 -37322 -22549
16119 -22549 -11167 -4248 915 8455 17568 20934 12389 -6043 -26615 -41860 -47656 -44588 -36776
16106 -36776 -29279 -27242 -33432 -46268 -63196 -82963 -102851 -118529 -128313 -135375 -143590 -150682 -150411
16093 -150411 -140062 -120969 -99008 -82655 -75188 -74577 -78145 -82957 -86883 -90763 -95880 -99873 -98484
16080 -98484 -91226 -82680 -77143 -75599 -76493 -77693 -79053 -82110 -85957 -87529 -86026 -81255 -72936 -64974 -65261
16065 -65261 -78747 -101783 -124472 -139255 -144129 -139463 -129423 -120348 -114496 -110437 -108675 -112418 -123043
16052 -123043 -136952 -147701 -151242 -147302 -136266 -119144 -99245 -80822 -67762 -61799 -60937 -62948 -67522
16039f7522n662m106n48L054L280q49o412j0529r841l972K812P136R580J2151
16025g1428J3826J2101P360M267M026J994m248j1603j5147j3714r112m38R831
16012g2285J6507K0915K4692K4966K2805K1726K1806J7736O619p083j9853l0839
16000D7712l7361l5338k3499n351J2715K2679J9731P766l321o918m573j383J133
15987f008L682M408L767N369P737Q921Q028J094j1060k1488k6759k5596j6714
15974f4619m153O027J1402J2326R441N185K557J862K980O443R933R010M139k60
15960A2273k460m209p833j2297j3337p833K989J1719J2925J0674J0671J0154L146
15947B6582q701j7438j8049j4967j3708j3586j2355q641j238R882K0590K4246
$$ plain form
16039 -67522 -73184 -77290 -77838 -74784 -71504 -72353 -78765 -89294 -99135 -103107 -100295 -93159 -83579 -71428
16025 -71428 -57602 -45501 -38141 -33874 -29848 -27854 -32102 -43705 -58852 -72566 -81678 -82116 -72285
16012 -72285 -55778 -34863 -10171 14795 37600 59326 81132 98868 105487 98404 78551 47712
16000 47712 10351 -24987 -48486 -53837 -41122 -18443 1288 9054 5733 -1185 -5758 -7141 -6008
15987 -6008 -2326 2082 5849 11218 18955 27876 35904 36998 25938 4450 -22309 -47905 -64619
15974 -64619 -68772 -62745 -51343 -39017 -29576 -24391 -21834 -19972 -16992 -10549 -616 8394 12533 12273
15960 12273 9813 5604 -2229 -14526 -27863 -35696 -32707 -20988 -8063 2611 13282 23436 26582
15947 26582 17881 443 -17606 -32573 -46281 -59867 -72222 -80863 -82101 -72219 -51629 -27383
15935b7383K0321J2436J602q761j1182k981Q310J4117J2794O531k001j0689j6161
15922c047j7867j8133j4597r151r489j3551j2173m571L015P306O786K954J283
15909h1235K793L177R62J335P128J3383J5990J6701J7955J8778J5946J0094L205
15896D6212l887p278n534j470L283N855K953l768j0925j6840j9795j9770j8680
15883d9644j6179j1094n584l56O475J2761J4189R207N69p426j1331r076q93Q955
15869e9427J3735J1164L965k954m134K43O672J3898J9979K2794K2292J7564O818
15856G2609q926k2813k8930k8514k6174k4597k0761j0586J7K344r68m604q545
15843a10448r730p294n884n159j663M671J0816J2433Q890L942j126m491k074K451
$$ plain form
15935 -27383 -7062 5374 6976 -1785 -12967 -15948 -7638 6479 19273 25804 23803 13114 -3047
15922 -3047 -20914 -39047 -53644 -62795 -72284 -85835 -98008 -102579 -99564 -92258 -85472 -82518 -81235
15909 -81235 -78442 -75265 -74303 -72968 -65840 -52457 -36467 -19766 -1811 16967 32913 43007 46212
15896 46212 42325 35047 29513 28043 31326 37181 40134 36366 25441 8601 -11194 -30964 -49644
15883 -49644 -65823 -76917 -82501 -82857 -76382 -63621 -49432 -40225 -39656 -47082 -58413 -67489 -68382 -59427
15869 -59427 -45692 -34528 -30563 -33517 -37651 -37408 -30736 -16838 3141 25935 48227 65791 72609
15856 72609 63683 40870 11940 -16574 -42748 -67345 -88106 -98692 -98675 -96331 -97299 -101903 -110448
15843 -110448 -120178 -127472 -133356 -138515 -140178 -135507 -124691 -112258 -103368 -99426 -100552 -105043 -107117 -104666
15829a04666J575l694o848o597o065m071L212J4155K3459K7918K6669J8370M143
15816a2440j0155j6513j2040l852j031k354O12J0816K1504K5896K4231K0384J7399
15803F2457J5098J2302Q540M595J932j963r431j7735k4057k7492k6085j8859q422
15790b9120K832J2351J3668M817o390j1766j1254j0420j2557j4952j3802j0415
15778h7008p556m514m4M156O769P813O424L430J005j88N09K378M006M987L746
15763e4087Q40O25K379J549l020q568q991j952O148Q615O299L595J824k17L52
15748d4609N435J1288J4131J2361N416l071p361n056K155R455J3518J4943J3948
15735D2553R599N254N388O637M813N68m614q957j1390j2804j3753j4714j6703
$$ plain form
15829 -104666 -103091 -106785 -113633 -120230 -126295 -130366 -127154 -112999 -89540 -61622 -34953 -16583 -12440
15816 -12440 -22595 -39108 -51148 -55000 -56031 -58385 -57773 -46957 -25453 443 24674 45058 62457
15803 62457 77555 89857 98397 102992 104924 102961 93530 75795 51738 24246 -1839 -20698 -29120
15790 -29120 -26288 -13937 -269 4548 -1842 -13608 -24862 -35282 -47839 -62791 -76593 -87008
15778 -87008 -94564 -99078 -99122 -94966 -88197 -80384 -73960 -70530 -69525 -69713 -69204 -66826 -62820 -57833 -54087
15763 -54087 -53247 -52622 -50243 -48694 -51714 -60282 -69273 -71225 -65077 -56462 -50163 -46568 -44744 -44961 -44609
15748 -44609 -39174 -27886 -13755 -1394 4022 951 -6410 -11466 -9311 144 13662 28605 42553
15735 42553 52152 57406 62794 69431 74244 74812 70198 61241 49851 37047 23294 8580 -8123
15722h123j9507k2683k6188k7433k3019j5247j0884j3130j8204k0130j7519j2989
15710b35056o925J626R902J4868J7052J8521K0115K1696K1720J8281J2333P337
15698g8530O085R013J3932J7871J8287J2510K264o199j1745j6057j7563j3845
15686f3977n633J961M848N166O506Q805J1711J4508J5239J2558O609k208j3651
15673B442k4581k8873k5260j9645j6281j0897J606J8155L0428L1929K3809J2774
15661d394M023q06j989j93L624O356L371k389m043l268m913q372j0610j2754j5676
15646e2033j5746j2871r968o005K483J4713K3967K5185K0756J4788J0089Q316
15634B3674Q547P720L685j389m874p131r846j3726j7420j8886j8525j8472j5571
$$ plain form
15722 -8123 -27630 -50313 -76501 -103934 -126953 -142200 -153084 -166214 -184418 -204548 -222067 -235056
15710 -235056 -241981 -240355 -230453 -215585 -198533 -180012 -159897 -138201 -116481 -98200 -85867 -78530
15698 -78530 -72445 -63432 -49500 -31629 -13342 -832 1432 -4767 -16512 -32569 -50132 -63977
15686 -63977 -69610 -67649 -62801 -57635 -51129 -42324 -30613 -16105 -866 11692 18301 16093 2442
15673 2442 -22139 -51012 -76272 -95917 -112198 -123095 -121489 -103334 -72906 -40977 -17168 -4394
15661 -4394 -371 -1177 -3166 -3359 265 6621 9992 7603 3560 292 -4621 -12993 -23603 -36357 -52033
15646 -52033 -67779 -80650 -90618 -96623 -94140 -79427 -55460 -30275 -9519 5269 15358 23674
15634 23674 32221 39941 43626 42237 37363 30232 20386 6660 -10760 -29646 -48171 -66643 -82214
15621h2214m447R331J4307R853N437Q739J7107K1115J6580Q334K886Q58l39j908
15607B5639n487j1265j4090j0558n268l132n377j1337j6026j1527J026J1016J3256
15594d3130R551L873J232J785K292R65j655l694k483K506P975J0775R198L424
15580B614l057n914n651o173q515j0546r798o734m265n022p000p019n790m555
15566h7425l121j251M95l26m129p957q628n011j002l371j3181k2462k3738j7601
15552a98708q755R87R879J3126J0972R363J0826J4787K0642K7053L5570N1038
15540c220P4881R8376J12018J13821J01261P2627L4948j727k9673m6665n5157
15529D71490n5197m6947l4845k4923j8701j2020l505K084K684O76k167n308r694
$$ plain form
15621 -82214 -86661 -77330 -63023 -53170 -47733 -38994 -21887 -772 15808 24142 27028 27886 27547 25639
15607 25639 20152 8887 -5203 -15761 -21029 -24161 -29538 -40875 -56901 -68428 -67402 -56386 -43130
15594 -43130 -33579 -29706 -28474 -26689 -24397 -23432 -25087 -28781 -31264 -28758 -20783 -10008 -810 2614
15580 2614 -443 -6357 -12008 -18181 -26696 -37242 -47040 -53774 -58039 -63061 -70061 -77080 -82870 -87425
15566 -87425 -90546 -91797 -91302 -91628 -95757 -103714 -112342 -117353 -118355 -121726 -134907 -157369 -181107 -198708
15552 -198708 -207463 -206476 -196597 -183471 -172499 -163136 -152310 -137523 -116881 -89828 -54258 -3220
15540 -3220 71661 170037 282055 395876 497137 569764 604712 602985 573312 526647 471490
15529 471490 416293 369346 334501 309578 290877 278857 275352 277436 280120 280796 278629 273321 263627
15516B63627j6087k1419k3043k3492k4791k5256k1954j5943r351k460K372J264
15504H3467m699r988j1912j2303j2750j1484p141j212L889N895K595m694j0657
15491I006j1059n550J945M174m83o249r036o942K67O770L606q328j7419j6180
15477e5478p998k157l621r222j2206q444j818J898L518O959J3714K0168K0067
15464c4620J3026N992M488O654O663K877M07Q72l6r50M543J5399K3809K3548J5750
15449H8422P792M303K912J746J993J231j349k49N094Q529P518M878K861k66n339
15434A30076p921n068m91L90k466m687n868r296j5434k1942k6739k9173k7077
15421b5696j8898q839l555o259j2231j3780r724l205J382K907M355P636J3988
$$ plain form
15516 263627 247540 226121 203078 179586 154795 129539 107585 91642 82291 79831 82203 83467
15504 83467 78768 68780 56868 44565 31815 20331 13190 11978 15867 21762 24357 19663 9006
15491 9006 -2053 -7603 -5658 -1484 -1967 -8216 -17252 -24194 -23927 -17157 -13551 -21879 -39298 -55478
15477 -55478 -63476 -65633 -69254 -78476 -90682 -99126 -100944 -99046 -95528 -88569 -74855 -54687 -34620
15464 -34620 -21594 -15602 -11114 -4460 2203 5080 5487 6359 6323 5373 9916 25315 49124 72672 88422
15449 88422 96214 100517 103429 105175 107168 108399 107050 106801 111895 120424 127942 132820 135681 135415 130076
15434 130076 122155 117087 116596 116986 114520 109833 103965 94669 79235 57293 30554 1381 -25696
15421 -25696 -44594 -53433 -56988 -63247 -75478 -89258 -98982 -102187 -100805 -97898 -93543 -85907 -71919
15408g1919K2715K9204L0343K7482K1446J2265R63j0464j7778j8276j3939o574
15396E468K095P084M257m477j3223j7089j3369l618N370Q357O460L237J57j413
15382a0704o83O5k81r01k943n390n765m245k643j401O6k44j449J283P989J3208
15366a4038J2179N965J881O885J7997K6142K7782K3313J2693M37m959N16J1691
15353A28484J7434J3317O780N796R276J1696R707L728j167n10K157L078N420R833
15339B25029J1619N623q629k4478l2687l0369k2465j4535q032j996L140L597o09
15326A05208l716m477o955j1185j3245j1696p765l50J1055J9395J4034l059j6143
15313G1101j6294j0404p909q729p948m992k513j588l861r581j1671l620R568J8992
$$ plain form
15408 -71919 -49204 -20000 10343 37825 59271 71536 72499 62035 44257 25981 12042 5468
15396 5468 7563 14647 18904 14427 1204 -15885 -29254 -32872 -27502 -19145 -12685 -9448 -9291 -10704
15382 -10704 -11387 -11322 -11603 -12504 -15447 -20837 -26602 -30847 -33490 -34891 -34825 -35069 -36518 -35235 -27246 -14038
15366 -14038 -1859 4106 5987 12872 30869 57011 84793 108106 120799 121236 116277 116793 128484
15353 128484 145918 159235 166015 171811 181087 192783 202490 206218 205051 204541 206698 209776 215196 225029
15339 225029 236648 242271 233642 209164 176477 146108 123643 109108 101076 99080 102220 105817 105208
15326 105208 101492 97015 90060 78875 65630 53934 46169 45819 56874 76269 90303 87244 71101
15313 71101 54807 44403 36494 27765 19817 14825 12312 10724 6863 -2718 -14389 -18009 -8441 10551
15299A0551K2922K1957J5147N520o30p89L422R477J5179K0208K3019J8395O979
15286A71357l458n881K7O832P296J923l230m643o948j6604l2669m7395n4927n2426
15272d0746l9067j9313j25J4651K4434K7249K0247Q268n49o197r979p281L424
15259b4984J7255K8206K9200J7295J358q079j2139j6656k2171k6109k4744j7808
15247e9376r169j425M444P420O038P7o621r437q680p042k450O737J6945K5547
15233c6992K9738K6924J8718P475n123j5458k0524k1597k1494j8740r331L769
15221f2635J2369J4454J4275J6861K5211L6728M3282L8717K4940P163j1561k7041
15209A32763l3121k9894k5036k3066k0246j2930l696L720P158O216M108M382M466
$$ plain form
15299 10551 33473 55430 70577 76097 75467 74678 78100 87577 102756 122964 145983 164378 171357
15286 171357 167899 162018 162045 168877 176173 178096 174866 170223 163275 146671 114002 66607 11680 -40746
15272 -40746 -79813 -99126 -99251 -84600 -60166 -32917 -12670 -4402 -4951 -11148 -21127 -28408 -24984
15259 -24984 -7729 20477 49677 66972 68330 60251 48112 31456 9285 -16824 -41568 -59376
15247 -59376 -68545 -69970 -65526 -58106 -52068 -51991 -58612 -68049 -76729 -83771 -86221 -79484 -62539 -36992
15233 -36992 -7254 19670 38388 45863 40740 25282 4758 -16839 -38333 -57073 -66404 -62635
15221 -62635 -50266 -35812 -21537 -4676 20535 57263 100545 139262 164202 171365 159804 132763
15209 132763 99642 69748 44712 21646 1400 -11530 -15226 -11506 -4348 1868 5976 10358 14824
15196A4824J318j607j434l19j54r56j806k300m703j0999j8884k5755l1039l1651
15182a15465k4085j1392j267L708O570R649J0281L773r893k2861k6361k0096p001
15169b04440J0748K6406L4075L4851L0776K4275J8238J4547J3600J1402M570n056
15157A3992j4996k3510k6461k0218p582N366J4998K0459K3031K1448J5808J0291
15145C2626P287O864O354L077j551m256n870q917j0525o188K456R114J0281J0026
15131E0778J5212K5742L2998K8977J5309N25j1134j8007j8368j5267j2817j2365
15119H1583j3771j6648j9199j8690j3687o396k495l180n060o987q819q391o148
15106d7888n022m376j726L982J1796J7097J5940R658L243J601M173P014R592J1663
$$ plain form
15196 14824 16142 14535 13101 12782 12628 11672 9866 7566 2863 -8136 -27020 -52775 -83814 -115465
15182 -115465 -139550 -150942 -152209 -148501 -141931 -132282 -122001 -118228 -128121 -150982 -177343 -197439 -204440
15169 -204440 -193692 -167286 -133211 -98360 -67584 -43309 -25071 -10524 3076 14478 19048 13992
15157 13992 -1004 -24514 -50975 -71193 -78775 -73409 -58411 -37952 -14921 6527 22335 32626
15145 32626 39913 46777 53131 56208 54657 50401 44531 35614 25089 18901 21357 30471 40752 50778
15131 50778 65990 91732 124730 153707 169016 169541 158407 140400 122032 106765 93948 81583
15119 81583 67812 51164 31965 13275 -412 -6808 -9303 -12483 -17543 -24530 -33349 -41740 -47888
15106 -47888 -52910 -57286 -59012 -55030 -43234 -26137 -10197 -539 2704 4305 8478 15492 25084 36747
15092C6747J0711O757P64p609j5287j8990j7829j4685j3500j2225p392j429K264
15079e1703M814Q622J1159Q776L441q89k961m372p851j2672j4240j1606q605m919
15065h3006J800Q831J2404J4802J8452K0350J8731J4060O006k320p194j1750j7531
15052f365k0016j5389l546J1930K5566L3999L5655L1904K7223K2702J5786L634
15040A63083j2254k4505k5979j7107n377J356J569k491q661j4315j6784j6324
15028B2211j3639q052k13R122J8191K2015J5930L063p141r869q882r716j1252
15015B1768j2589j7464k4086k5185j9393j2037o663j543M363R181J2735J6074
15003e4839J7019J3614Q385P420J4378K5371L3144L2690K2238N006j1065j8099
$$ plain form
15092 36747 47458 54215 54979 47370 32083 13093 -4736 -19421 -32921 -45146 -52538 -53967 -51703
15079 -51703 -46889 -38267 -27108 -18332 -14891 -15780 -18741 -23113 -30964 -43636 -57876 -69482 -78087 -83006
15065 -83006 -81206 -72375 -59971 -45169 -26717 -6367 12364 26424 32430 30110 22916 11166 -6365
15052 -6365 -26381 -41770 -45316 -33386 -7820 26179 61834 93738 120961 143663 159449 163083
15040 163083 150829 126324 100345 83238 77861 79217 80786 78295 69634 55319 38535 22211
15028 22211 8572 520 307 9429 27620 49635 65565 68628 61487 51618 42736 33020 21768
15015 21768 9179 -8285 -32371 -57556 -76949 -88986 -95649 -97192 -92829 -83648 -70913 -54839
15003 -54839 -37820 -24206 -15821 -8401 5977 31348 64492 97182 119420 124426 113361 95262
14991I5262j3101j885N600O408N302N902P167R310J3014J4733J2695J0208O978
14978A77593qj0871k3851l5003l8619l3516k5978k1708j9377j4699q006j177O120
14965d9100J1930J2833P749k149j2229j4505o773L993J1499J4495J2414N422k969
14952g390q094q343o323m133j380J175J326j303m354m641m515q552j6158k2053
14938i4738k0399j1265K38Q961J3159J4948J4070J0187P808Q452J0248J0039L299
14925b4993o767j0120l481N768R311N980q59o532p990o128k866k89J117J710J075
14910d5064O33K363M783O199J0191J7731K2348K1260J7855J2053J010j1195j8928
14897D1239k1295j9485j6676j5104j0403r96O334O379J957p51P25J836J08j313
$$ plain form
14991 95262 82161 80276 85876 92284 97586 103488 110655 119965 132979 147712 160407 170615 177593
14978 177593 177585 166714 142863 107860 69241 35725 9747 -11961 -31338 -46037 -54043 -55220 -49100
14965 -49100 -37170 -24337 -16588 -18737 -30966 -45471 -52244 -48251 -36752 -22257 -9843 -4421 -7390
14952 -7390 -15484 -23827 -30150 -34283 -35663 -34488 -33162 -34465 -38819 -43460 -47975 -56527 -72685 -94738
14938 -94738 -115137 -126402 -126164 -117203 -104044 -89096 -75026 -64839 -57031 -48579 -38331 -28292 -24993
14925 -24993 -31760 -41880 -45361 -39593 -30282 -24302 -25161 -31693 -39683 -45811 -48677 -48966 -47849 -46139 -45064
14910 -45064 -44431 -42068 -37285 -31086 -20895 -3164 19184 40444 58299 70352 71362 60167 41239
14897 41239 19944 459 -16217 -31321 -41724 -42720 -36386 -30007 -28050 -28801 -28076 -26240 -26132 -27445
14883b7445k357m265l654J186N581O149K186n124r187o142m49M317O829M843m7
14868b7579k555q91K293N213N679O06p850j1592o637K918J0918J0619J849p148
14854b4157j2796j8684k6205l4413m2426m1439j9211J5715L7589L8450K7412J3127
14842h7038j242j2630j7007j4242o970J317P518J2063J6674J9546J8556J4594
14830d8861R605M170j121n292q202r577q474l164L402L474n351j6961k1496j4461
14816a22309j628P796R358N090j308o066o987o510q458j4101k2478l4011m8776
14803b50388o2679p3272q1904q5649p4863m6150r371K2201M2794N4074N8916N7016
14791d49275M9389M0666L3248K6498J9800J5057J0982M482p42l47L073M403L561
$$ plain form
14883 -27445 -29802 -34067 -37721 -36535 -30954 -24805 -22619 -27743 -36930 -43072 -43521 -39204 -32375 -27532 -27579
14868 -27579 -30134 -31025 -28732 -23519 -17840 -17234 -25084 -36676 -43313 -40395 -29477 -18858 -17009 -24157
14854 -24157 -36953 -55637 -81842 -116255 -158681 -200120 -219331 -203616 -166027 -127577 -100165 -87038
14842 -87038 -88280 -100910 -117917 -132159 -139129 -137812 -130294 -118231 -101557 -82011 -63455 -48861
14830 -48861 -39256 -35086 -36207 -41499 -49701 -59278 -67752 -70916 -67514 -64040 -69391 -86352 -107848 -122309
14816 -122309 -123937 -116141 -106783 -101693 -103001 -109067 -116054 -122564 -131022 -145123 -167601 -201612 -250388
14803 -250388 -313067 -386339 -468243 -553892 -628755 -674905 -684276 -662075 -619281 -565207 -506291 -449275
14791 -449275 -399886 -359220 -325972 -299474 -279674 -264617 -253635 -249153 -249895 -250242 -247169 -242766 -239205
14778b39205L292M666O584P154O944O457M959L565K743K645M207P530J1666J5551
14764a51242J7712J7499J6460J7041J9911K2439K2197J9135J1752m5r118o883
14752c142N752J7001J6651O784l209p899p232l624o53m99k586p912j5992k2413
14738b8973k6104k5526j9486j2323q141n749k230L089P617P689M553K608K236
14725a00740K695N275Q910R763N361k124o798o113l89R820K1145K7770K8157K4788
14711B7520J7273N715n525j1700j3833j7204k2525k4710k0933j4462q489j478
14699i0351O823J3327J5614J3451R997P888N028N94N8N026Q296O921M531K540
14685I743j675p376r314q033p993p330l000K238M721L744N98j255N78L055K927
$$ plain form
14778 -239205 -235913 -231247 -224663 -217509 -210565 -204108 -199149 -195584 -192841 -190196 -185989 -178459 -166793 -151242
14764 -151242 -133530 -116031 -99571 -82530 -62619 -40180 -17983 1152 12904 12859 3741 -3142
14752 -3142 2610 19611 36262 43046 39837 31938 24706 21082 20429 19930 17344 9432 -6560 -28973
14738 -28973 -55077 -80603 -100089 -112412 -120553 -126302 -128532 -125443 -117826 -110137 -105584 -102976 -100740
14725 -100740 -98045 -92770 -83860 -74097 -68736 -70860 -77658 -83771 -84160 -74340 -53195 -25425 2732 27520
14711 27520 44793 50508 44983 33283 19450 2246 -20279 -44989 -65922 -80384 -88873 -90351
14699 -90351 -83528 -70201 -54587 -41136 -31139 -23251 -18223 -17629 -17571 -12545 -4249 2672 7203 9743
14685 9743 8068 692 -8622 -16655 -24648 -31978 -34978 -32740 -28019 -24275 -23677 -24932 -24354 -21299 -18372
14670a8372J084n28k935p220j0399j1070j0621r728q844r427j0497r467n689q82
14656a14595K229J795j601l802k912j211M88M075P614O040N02l817m932m933m283
14641a19343m34N301O749J157n698n511J993Q982R837P299N617N298M518J947
14627g2288J185N774J3701K2678L0195L0125J8580R55j3657k1179k3251k2836
14615c0018j9083j1688l934L820J1583J7273K2765K8051K6137J5703M722r31k130
14602F2270r66j685q332j7715k2614j9195p848N875J2853R797K693j846l011k999
14588G277p04L143L060j724p171r426q122o740m432K204J0996J5297J1453K025
14574A7136n986o724n75Q097J5382J6034P787n874j7955k2188j8756j4069j2505
$$ plain form
14670 -18372 -17288 -17816 -20751 -27971 -38370 -49440 -60061 -69789 -78633 -88060 -98557 -108024 -113713 -114595
14656 -114595 -112366 -110571 -112172 -115974 -118886 -120097 -119609 -115534 -107920 -101880 -101378 -105195 -110127 -115060 -119343
14641 -119343 -119777 -114476 -107727 -106570 -112268 -117779 -115786 -106804 -96967 -89668 -84051 -78753 -74235 -72288
14627 -72288 -71103 -65329 -51628 -28950 1245 31370 49950 50905 37248 16069 -7182 -30018
14615 -30018 -49101 -60789 -64723 -60903 -49320 -32047 -9282 18769 44906 60609 65331 64400 62270
14602 62270 61304 59619 51287 33572 10958 -8237 -16085 -10210 2643 12440 15133 13287 10276 7277
14588 7277 6573 9716 12776 11052 3881 -5545 -13667 -20407 -24839 -22635 -11639 3658 15111 17136
14574 17136 11150 4426 3851 11948 27330 43364 51151 45277 27322 5134 -13622 -27691 -40196
14561d0196j2591j2449j2715j3126j0707m310L142R153J3117J5000J4564J2672
14549c8446J1488J0328P378K803l601j1370j7176j7617j3695r102q072j1254j2190
14536a10526o435L842J5373K5431L2301L3259K6348J5689Q273Q060J3700J7373
14524H2688J2519J409p514p154J62L603k258j0839j5946j8637j9551j7387j3583
14511a2488r724m985K6L062K756j583r631j6637j7520j3130p500l715k039q55
14497i3963Q74L815O530P986Q607P791N156K810K718L919M430K897r96o395j1200
14482e5021j1751o031L021R662J1608J3288J8420K3040K4000K3212K1076J6756
14470I1280Q901k740j4003j9891j9106j2913k647Q017J2660J0206N675M242Q581
$$ plain form
14561 -40196 -52787 -65236 -77951 -91077 -101784 -106094 -102952 -93799 -80682 -65682 -51118 -38446
14549 -38446 -26958 -16630 -9252 -6449 -10050 -21420 -38596 -56213 -69908 -79010 -87082 -98336 -110526
14536 -110526 -116961 -113119 -97746 -72315 -40014 -6755 19593 35282 43555 51615 65315 82688
14524 82688 95207 96616 89102 81948 82110 85713 83455 72616 56670 38033 18482 1095 -12488
14511 -12488 -22212 -27197 -27171 -24109 -21353 -22936 -32567 -49204 -66724 -79854 -87354 -91069 -93108 -93963
14497 -93963 -93089 -89274 -82744 -74758 -66151 -58360 -53204 -50394 -47676 -43757 -39327 -36430 -37426 -43821 -55021
14482 -55021 -66772 -72803 -69782 -60120 -48512 -35224 -16804 6236 30236 53448 74524 91280
14470 91280 100181 97441 83438 63547 44441 31528 28881 36898 49558 59764 65439 69681 78262
14457G8262J3972J4306J0640M201p132k0802k7710k3967j8175j7181j8293j8353
14445c0232j5762j0864p189m620N30O860J1427J2787Q598M42m525m608l719j405
14431d2280M634J0626J0782P227N358M196J487j776m653o230n770m415l671k807
14417b7292k55L047N299O284P489Q656P246J234o371j0755j1187q620l382J643
14403b6964K694Q65q07k993n782o655n988n298k906J554O009R025R428Q210R118
14388a0490J0969R762P971Q060P814N736M9q117j3307j3574j0287m814p90J235
14374i783N517J2295J8095K1262K0506J6048J0026L734j921m558m546l505k877
14361H0293o258j2569j6091j4719p629L519J1020J0009L452l128n058k116N6k234
$$ plain form
14457 78262 92234 106540 117180 121381 114249 93447 65737 41770 23595 6414 -11879 -30232
14445 -30232 -45994 -56858 -64047 -68667 -68137 -61277 -49850 -37063 -28465 -28023 -32548 -37156 -40875 -42280
14431 -42280 -37646 -27020 -16238 -9011 -3653 543 2030 254 -4399 -10629 -16399 -20814 -24485 -27292
14417 -27292 -27547 -24500 -19201 -12917 -5428 3228 10474 11708 5337 -5418 -16605 -25225 -28607 -26964
14403 -26964 -24270 -23405 -24212 -27205 -32987 -39642 -45630 -50928 -53834 -52280 -46271 -37246 -27818 -19608 -10490
14388 -10490 479 10241 18212 26272 34086 39822 39871 31754 18447 4873 -5414 -10228 -11018 -9783
14374 -9783 -4266 8029 26124 47386 67892 83940 93966 97700 95779 91221 86675 83170 80293
14361 80293 74035 61466 45375 30656 23027 26546 37566 47575 51027 47899 42841 40725 40781 38547
14347C8547n982n613J18N898P165N066K567j90n623j2578j4784r896l175Q71L094
14332E485L567K516M321J2340K4423L5049L8402L0608J2122r433k2827k3855j8424
14319I4294j4231j1740p358m753r143j8036k3924k1974j2955j47J2740K3085K8767
14306C4625K8400K2513J3175N554L024L813M481M064M571M533l17p959j1425q105
14292A00947l055n84j973n639o773l709j31L4l029n030l494k92K416L802K088
14277G5578k033k992K97K711J753j70R55O901J4524J8649J6577Q857R59J21P221
14262A49908J6822K3331K6733L0827L3021K8966K1892J6756J3713J1297J2503
14251C85769K1366L5502N2546P1246Q4680Q6060P8200O8729O0915N2650M0440
$$ plain form
14347 38547 32565 26952 27070 32968 40133 45199 47766 47576 41953 29375 14591 4695 1520 2391 5485
14332 5485 9052 11568 15889 28229 52652 87701 126103 156711 168833 159400 136573 112718 94294
14319 94294 80063 68323 60965 56212 47069 29033 5109 -16865 -29820 -29967 -17227 5858 34625
14306 34625 63025 85538 98713 104267 107291 111104 115585 119649 124220 128753 128436 120477 109052 100947
14292 100947 97892 97308 95335 89696 82923 79214 79083 79117 76088 71058 67564 67272 69688 73490 75578
14277 75578 73545 70553 70850 73561 75314 75144 76099 83000 97524 116173 132750 141607 142566 142687 149908
14262 149908 166730 190061 216794 247621 280642 309608 331500 348256 361969 373266 385769
14251 385769 407135 442637 495183 566429 651109 737169 815369 884098 945013 997663 1038103
14240A038103K2223l31k4360m7928o7691p9254p8804o8407n5436m6450m5594n0420
14228D95651n3568n3622n3440n3337n1151m4126l4138k6430k1341j4987p521k716
14216G9274o33Q98P15l066q988j1835p559J797J0013J2779J0240O240N092P222
14202A02189R026O824L411L653P373J0796J0933O237j156p049r217n534O214K4325
14188A68025M2878N4537N2309L3534N681j4677j8707j4297p925j202J220j978
14176B99398o578q407q297q494o067J585J1732K0787K7085L0816L1471K5345J1184
14163D21560o171k0752l0674l8048m3477m2895l4154k1443j1882q736r386j0355
14151A43587j0943j1938j2587j0220n954l672n117q152q345n604l306l419o450
$$ plain form
14240 1038103 1060326 1059995 1035635 987707 920016 840762 761958 693551 638115 591665 546071 495651
14228 495651 442083 388461 335021 281684 230533 186407 152269 125839 104498 89511 81990 79274
14216 79274 78641 79539 80254 77188 68200 56365 48806 50603 60616 73395 83635 89875 94967 102189
14202 102189 111215 118039 121450 125103 132476 143272 154205 160442 159286 152237 143020 137486 143700 168025
14188 168025 210903 265440 317749 351283 356964 342287 323580 309283 301358 300156 301376 299398
14176 299398 292820 284413 276116 267622 261555 263140 274872 295659 322744 353560 385031 410376 421560
14163 421560 415389 394637 363963 325915 282438 239543 205389 183946 172064 163328 153942 143587
14151 143587 132644 120706 108119 97899 91945 88273 83156 75004 66659 61055 57749 54330 47880
14138D7880r639q730j532Q407J3101P554o290k3547l5752l5351k3621j0644n446
14125h3610o626p936o590m380m070k487K997R386J6152K4914L2155L2828K6910
14112B9643J7587Q648J695n971j3334j5618j4118j3132j2297r175m243J11K205
14099b7999J447J756O343J0110Q311L301j954n946q493j0675j2279j0787n111
14086e1976J329O646J1923J6581J8124J4349L208j4361k9981l8062m0777l9056
14074a42053l3350k6249j7699p434J152L075l698j6929l1538m1506m1396k7151
14062c84776J162L4882N9494O6702N9825M7247L6360L0124K9468L1397K9631K4392
14050F5908K0349J7107J1754M479l532j2159j8890j9343j4153p720K68J0584J7510
$$ plain form
14138 47880 38241 29511 27979 36386 49487 57041 50751 27204 -8548 -43899 -67520 -78164 -83610
14125 -83610 -90236 -98172 -104762 -109142 -113212 -115699 -112702 -103316 -87164 -62250 -30095 2733 29643
14112 29643 47230 55878 57573 51602 38268 22650 8532 -4600 -16897 -26072 -30315 -30204 -27999
14099 -27999 -26552 -24796 -18453 -8343 -32 3269 1315 -4631 -13124 -23799 -36078 -46865 -51976
14086 -51976 -50647 -44001 -32078 -15497 2627 16976 20184 5823 -24158 -62220 -102997 -142053
14074 -142053 -175403 -201652 -219351 -226785 -225633 -222558 -226256 -243185 -274723 -316229 -357625 -384776
14062 -384776 -383614 -348732 -289238 -222536 -162711 -115464 -79104 -48980 -19512 11885 41516 65908
14050 65908 86257 103364 115118 119597 116065 103906 85016 65673 51520 43800 44068 54652 72162
14037G2162J3821P25j3382k2047k4255k2645j9290j4667j0112o642m743l719k661
14024e7455j335l11n06j841j861o50k259o340r572r744o335p91L712L981J102
14009i0205r40P64N371P825O504P617J4146K0077J9412J3936R851Q053L922k059
13995B4274n079l172L606J2652K0373K6346L0082K8803K2151J3901N568n83q89
13982A78033K430N335Q604J3605J9111K4052L0011L7656M5376N2456N6891N2313
13970E25873L4367R854q026j0779j52J5009K7260L2641K8947J8598N915o959j8029
13957F54519k5734l1731l7988m2829m3951m0914l6567l5010l7932l9741l3994
13946B48128k3588j3819m983N145J4958K1078K3917K3217J6418L916q136j3097
$$ plain form
14037 72162 85983 86708 73326 51279 27024 4379 -14911 -29578 -39690 -46332 -51075 -54794 -57455
14024 -57455 -58790 -59101 -59607 -61448 -63309 -63959 -66218 -72558 -82130 -91874 -98209 -99000 -95288 -91307 -90205
14009 -90205 -91145 -90381 -85010 -77185 -70681 -63064 -48918 -28841 -9429 4507 14358 22411 26333 24274
13995 24274 19195 16023 19629 32281 52654 79000 109082 137885 160036 173937 179505 178922 178033
13982 178033 180463 185798 194402 208007 227118 251170 281181 318837 364213 416669 473560 525873
13970 525873 560240 570094 562068 551289 551137 566146 593406 626047 654994 673592 679507 672548 654519
13957 654519 628785 597054 559066 516237 472286 431372 394805 359795 321863 282122 248128
13946 248128 224540 210721 205738 210883 225841 246919 270836 294053 310471 314387 306251 293154
13934B93154j1024m812J390L608o55r964j6677j6055j2264j0251j1062j3441j4645
13921A77302j3062j0215p070j371O766J3293J5504J3051Q068L824J417N67K373
13908B10447N753R540J5064K0494K2860K1875J6200Q612N812R623J6678K7985
13896C90943M6856P0133R0332J03756J10324J13188J18258J24990J23390J05283
13886A397453P3708M0031J4053J77l909o813j2408j8241k5213l3069l5868l1401
13874A358500k5646k5436l2972m6175o3131p9763r2761j01898j04160r6881q3213
13863F06464o9042n7347m5684l3416k5109k3771k5211k3853j8906j3180r710j0832
13851B50403j6189k2356k5872k6239k4598k1619j5981o888L573J2158J6398J3879
$$ plain form
13934 293154 282130 277318 278708 282316 281661 271697 255020 238965 226701 216450 205388 191947 177302
13921 177302 164240 154025 146955 145584 152350 165643 181147 194198 202266 206090 207507 208074 210447
13908 210447 216200 225740 240804 261298 284158 306033 322233 330845 336657 346280 362958 390943
13896 390943 437799 507932 598264 702020 812344 925532 1043790 1168780 1292170 1397453
13886 1397453 1471161 1511192 1525245 1525422 1521513 1514700 1502292 1484051 1458838 1425769 1389901 1358500
13874 1358500 1332854 1307418 1274446 1228271 1165140 1085377 992616 890718 786558 689677 606464
13863 606464 537422 480075 434391 400975 375866 352095 326884 303031 284125 270945 261235 250403
13851 250403 234214 211858 185986 159747 135149 113530 97549 90661 94234 106392 122790 136669
13839A36669M630m441o377m712m457n014p504j4642k1457k0720j4324j1347j4206
13826A2098j4345o850J567M703K322m295j3230j9572k0326j6431q830J897J3057
13813f8235K4661L6544M6445N2383N3039M9503M6969M9624N4642N7202N7562N6679
13801E17018N3086M9924N1670N4004M6962K7976O738q190j8730k8136l4420l6896
13789F81006l8148l7145k9280j8500j4952j9796k5700k6806j9706p631J204J396
13777D45942n520j1475r252j49P100N966O48m91K173L610K293k113p173q982o873
13762D15704k256L134P978J1494J0187n81j4266j8300j2252l541K639L804m30
13749D03314r165k0673l1208l6111l4238k7325j7320o541K741R425J4810K1816
$$ plain form
13839 136669 141299 136858 130481 125769 121312 116298 108794 94152 72695 51975 37651 26304 12098
13826 12098 -2247 -9097 -7530 -2827 -505 -4800 -18030 -37602 -57928 -74359 -83189 -81292 -68235
13813 -68235 -43574 -7030 39415 91798 144837 194340 241309 290933 345575 402777 460339 517018
13801 517018 570104 620028 671698 725702 772664 800640 807378 799188 780458 752322 717902 681006
13789 681006 642858 605713 576433 557933 542981 523185 497485 470679 450973 443342 444546 445942
13777 445942 440422 428947 419695 419546 426646 432612 433260 432769 434942 438552 440845 438732 431559 422577 415704
13762 415704 413448 416582 424560 436054 446241 445660 431394 413094 400842 397301 399940 403744 403314
13749 403314 394149 373476 342268 306157 271919 244594 227274 220733 223474 232899 247709 269525
13737B69525L0718L8649M3928M4908M1136L6634L6150L9070L8008K7272J0866
13726F56864l741j2811j4846r179L305J8460L0741L5960L4395L0149K6344K3649
13714H19290K2114K1755J9731J3257M258l512q282j1353j4758j7177j6156j2684
13702H16483q653m569k039k103l220m087j341Q995K1308K3733J2393o644k3548
13689H26708k8839k1831j2197n395jK505R6m392q880j2899j5634j7584j9510k1761
13675F60386k5989k9902k7711j7688m659N337R710R603O019n37n827m363L172
13662E77551J3349K2102K6675K7313K6558K8091L1508L2212K9290K5892K6457
13651H66998L3608M3337M8452M7388M2193L2701K0708J3165J1214R765P043O515
$$ plain form
13737 269525 300243 338892 382820 427728 468864 505498 541648 580718 618726 645998 656864
13726 656864 653123 640312 625466 616287 619592 638052 668793 704753 739148 769297 795641 819290
13714 819290 841404 863159 882890 896147 900405 896893 888611 877258 862500 845323 829167 816483
13702 816483 807830 803261 801222 799119 795899 791812 790471 799466 820774 844507 856900 850256 826708
13689 826708 797869 776038 763841 758446 758445 760950 761046 756654 747774 734875 719241 701657 682147 660386
13675 660386 634397 604495 576784 559096 554437 559774 569484 579087 585106 584569 578742 574379 577551
13662 577551 590900 613002 639677 666990 693548 721639 753147 785359 814649 840541 866998
13651 866998 900606 943943 992395 1039783 1081976 1114677 1135385 1148550 1159764 1169529 1176572 1183087
13639A183087R489J4622K1409K7789K9979K8087K5090K3250K0034J4064J0229
13628A407129J2636J7182J8480J8099K3744L6226M7826N2109M5314K8647Q766
13617A716158r497k2670k8105k8101k7370k6569k4916k1981j5261n240J132J684
13605A509264J834N305J0974J9468L1328M3660N5520O8356P8427P9405P0307N8035
13593B031883M6881L4135J8715P036L601O084Q993P492J585l703n663n225n306
13580B146508o487o515l581j056l875j1452j7901k1607k7228l9310n6166o9643
13568A881687p2192o5528n6850n1785n1515n3342n4063n4457n2985m7076l9817
13557A282077l8031m3300n1889n6185m9912l6386k2117p079J0454K8871M3716
$$ plain form
13639 1183087 1192576 1207198 1228607 1256396 1286375 1314462 1339552 1362802 1382836 1396900 1407129
13628 1407129 1419765 1436947 1455427 1473526 1497270 1533496 1581322 1633431 1678745 1707392 1716158
13617 1716158 1706661 1683991 1655886 1627785 1600415 1573846 1548930 1526949 1511688 1506448 1507580 1509264
13605 1509264 1511098 1516403 1527377 1546845 1578173 1621833 1677353 1745709 1824136 1903541 1973848 2031883
13593 2031883 2078764 2112899 2131614 2138650 2142251 2148335 2157328 2164820 2166405 2162702 2157039 2151814 2146508
13580 2146508 2140021 2133506 2129925 2128869 2124994 2113542 2095641 2074034 2046806 2007496 1951330 1881687
13568 1881687 1809495 1743967 1687117 1635332 1583817 1530475 1476412 1421955 1368970 1321894 1282077
13557 1282077 1244046 1200746 1148857 1092672 1042760 1006374 984257 977178 987632 1016503 1060219
13546A060219N0445M5053K9485R775r886k7488m1009m6489m3569l7651l2783k9310
13534I26792k4557j7472r332j133O679J1765J4182J7708K3795L3632M9634O8785
13522A100478Q6705J04734J26075J48594J66617J74661J71281J60772J50108J43685
13512B533710J40279J33928J23600J13138J04623R5856Q4491O9759N1516L0615
13502C481515O566k4178n9830r2358j14417j21944j15154j00976q7154p3673n4919
13491B643478k7500R747N7807J16047J84101K64619L58276M62877N75932O86839
13481E332223P47946O48707K96691j99637n79935p27353p10745o24455n21229
13472C662213m25662l49600k93038k49398k13803j83831j57201j28815r6810p0060
$$ plain form
13546 1060219 1110664 1155717 1185202 1194977 1185091 1157603 1116594 1070105 1026536 988885 956102 926792
13534 926792 902235 884763 875431 874298 880977 892742 906924 924632 948427 982059 1031693 1100478
13522 1100478 1187183 1291917 1417992 1566586 1733203 1907864 2079145 2239917 2390025 2533710
13512 2533710 2673989 2807917 2931517 3044655 3149278 3245134 3329625 3399384 3450900 3481515
13502 3481515 3488081 3463903 3404073 3311715 3197298 3075354 2960200 2859224 2772070 2698397 2643478
13491 2643478 2615978 2625725 2683532 2799579 2983680 3248299 3606575 4069452 4645384 5332223
13481 5332223 6080169 6728876 7025567 6825930 6245995 5518642 4807897 4183442 3662213
13472 3662213 3236551 2886951 2593913 2344515 2130712 1946881 1789680 1660865 1564055 1493995
13462A493995n4124m2114l0167k2399k1346k3703k5576k6490k5835k3884k3970
13451A174387k5649k6591k6247k3833j8991j4043j1232j1557j2908j3359j3650
13440I76327j4380j1085R23J8921L6183N2727O9685Q1487Q2538P5124O6842O3683
13428A498975O4096O3538O0541N6021M9280L9742K6526J2355L071J274K275L955
13416A881649Q580J5607K2084K5339K1637J2695M848K603L600M627N616P890Q847
13403B025622P630Q936J9789L9843O4424R1354J23578J65424K17605K69635L03607
13392C337447K90181J98012L7000j17130j98500k07029j77315j37686r9901o1674
13382B863405k3580Q021K7951M0111M9685N9172O8150P7634Q7599R8354J06496
$$ plain form
13462 1493995 1439871 1397757 1367590 1345191 1323845 1300142 1274566 1248076 1222241 1198357 1174387
13451 1174387 1148738 1122147 1095900 1072067 1053076 1039033 1027801 1016244 1003336 989977 976327
13440 976327 961947 950862 951785 970706 1006889 1059616 1129301 1210788 1293326 1368450 1435292 1498975
13428 1498975 1563071 1626609 1687150 1743171 1792451 1832193 1858719 1871074 1874145 1875419 1877694 1881649
13416 1881649 1890229 1905836 1927920 1953259 1974896 1987591 1992439 1995042 1998642 2003269 2008885 2016775 2025622
13403 2025622 2033252 2042188 2061977 2101820 2166244 2257598 2381176 2546600 2764205 3033840 3337447
13392 3337447 3627628 3825640 3862640 3745510 3547010 3339981 3162666 3024980 2925079 2863405
13382 2863405 2839825 2847846 2875797 2915908 2965593 3024765 3092915 3170549 3258148 3356502 3462998
13371C462998J11576J18127J32593J54675J79075J97972K11542K23862K41287
13362E033707K62172K81004K96420L16113L44226L79297M13691M46263M82004
13353H254897N27282N82039O49242P28600Q20444R22573J036722J168196J331813
13344A6021808J538781J799157K117263K503609K980174L588032M372217N388478
13336D0309519O707383Q441582J0737798J3784001J7793147K2984927K9483830
13329A50242187L7173065M5360913N1943261N2002006L8544113R920613k2262998
13322C62923160m2941999m8885467m5839032l9477057l2696377k6567968k1391452
13315A05123808j7170667j3786793j1097040q967303p286175n954980m897981
$$ plain form
13371 3462998 3574574 3692701 3825294 3979969 4159044 4357016 4568558 4792420 5033707
13362 5033707 5295879 5576883 5873303 6189416 6533642 6912939 7326630 7772893 8254897
13353 8254897 8782179 9364218 10013460 10742060 11562504 12485077 13521799 14689995 16021808
13344 16021808 17560589 19359746 21477009 23980618 26960792 30548824 34921041 40309519
13336 40309519 47016902 55458484 66196282 79980283 97773430 120758357 150242187
13329 150242187 187415252 232776165 284719426 336721432 375265545 385186158 362923160
13322 362923160 319981161 271095694 225256662 185779605 153083228 126515260 105123808
13315 105123808 87953141 74166348 63069308 54102005 46815830 40860850 35962869
13308C5962869m064630l421971k929635k539343k209568j923212j673389j455761
13300A5745360j264328j098256r58591q44738p50258o71184o04726n50644n11017
13291H491618m90139m78762m58851m22605l78219l33770k97434k76114k64611
13282E091113k48657k24244j96704j72209j53919j40902j28220j17084j12768
13273C596406j15100j15742j06415q7111o7303n2251l9043k1501N180M3413R1747
13262C132280J45255J95089K26179K11545J20019l9105j91550k72350k84439k60807
13252B982116k22648j78665j35620j00700p6665n8238l9130k0945p068L489J1690
13241B157616J8067K3121K6593K7515K4868J9382J3429Q524L437k063n877q518
$$ plain form
13308 35962869 31898239 28476268 25546633 23007290 20797722 18874510 17201121 15745360
13300 15745360 14481032 13382776 12424185 11579447 10829189 10158005 9553279 9002635 8491618
13291 8491618 8001479 7522717 7063866 6641261 6263042 5929272 5631838 5355724 5091113
13282 5091113 4842456 4618212 4421508 4249299 4095380 3954478 3826258 3709174 3596406
13273 3596406 3481306 3365564 3259149 3172038 3104735 3052484 3013441 2991940 2997120 3040533 3132280
13262 3132280 3277535 3472624 3698803 3910348 4030367 3991262 3799712 3527362 3242923 2982116
13252 2982116 2759468 2580803 2445183 2344483 2267818 2209580 2170450 2149505 2142437 2145926 2157616
13241 2157616 2175683 2198804 2225397 2252912 2277780 2297162 2310591 2319115 2322552 2320489 2314612 2306094
13229B306094r704p714l450j318n509j7387l7859o5333r0237j02168r8226q3138
13217A784051o4031m8450m1798m2617m5251m5953m2942l6140k4346r242L007P843
13205A394131Q455R321J0601J1215Q913J392o141o478O1O595J1239J6707K3775
13192A489786K9433L0625K6863K1890J8582J5865J3186J2702J4746J8076J9797
13181A711551J8583J6229J5211J7205K2580K7377K8913K7534K3924K1494K5435
13170A956036L4030M0977M4134M5777M7143N1043N7991O3726O7074P1033P4705
13159B553669P8140Q4422R5281J09942J24434J32927J37619J44141J52126J52317
13149C765018J36423J05187O8685L7623J7079P657P307Q675K904j3246l5564o0352
$$ plain form
13229 2306094 2296390 2288676 2285226 2283908 2278399 2261012 2223153 2157820 2067583 1965415 1867189 1784051
13217 1784051 1720020 1671570 1629772 1587155 1541904 1495951 1453009 1416869 1392523 1383281 1386288 1394131
13205 1394131 1402586 1411907 1422508 1433723 1442636 1444028 1437887 1431409 1431470 1438065 1449304 1466011 1489786
13192 1489786 1519219 1549844 1576707 1598597 1617179 1633044 1646230 1658932 1673678 1691754 1711551
13181 1711551 1730134 1746363 1761574 1778779 1801359 1828736 1857649 1885183 1909107 1930601 1956036
13170 1956036 1990066 2031043 2075177 2120954 2168097 2219140 2277131 2340857 2407931 2478964 2553669
13159 2553669 2631809 2716231 2811512 2921454 3045888 3178815 3316434 3460575 3612701 3765018
13149 3765018 3901441 4006628 4075313 4112936 4130015 4137672 4144979 4153654 4156558 4143312 4107748 4047396
13137D047396q4098j03737j21392j41250j61694j76722j82675j79113j65421j43395
13127B587899j16086q6052n6517l0393n038J7722K9619L1690L4577M2358N1456
13116B501235N5833N3713M7641M1908L8306L2567J9503J142j8055l4508m3007
13105B696278m2037m0565m2557m4590m7501n2647n6925n8052n5846n2133m8590
13094B154835m4668l9585l7324m1397m7488m9964m9850m7745m2159l6017l3300
13083A685338l2739l4879m1639n1313o0027o7855p3646p2841o6811o1389n7801
13072A064398n5698n4283n3161n1614m8920m4172l6360k6722j6683m683Q323J8857
13060F99282K5177K7676K6015K0033Q310j0711l2560m7325n0734m7985m4189l7014
$$ plain form
13137 4047396 3963298 3859561 3738169 3596919 3435225 3258503 3075828 2896715 2731294 2587899
13127 2587899 2471813 2385761 2329244 2298851 2293813 2311535 2341154 2372844 2407421 2449779 2501235
13116 2501235 2557068 2610781 2658422 2700330 2738636 2771203 2790706 2791848 2773793 2739285 2696278
13105 2696278 2654241 2613676 2571119 2526529 2479028 2426381 2369456 2311404 2255558 2203425 2154835
13094 2154835 2110167 2070582 2033258 1991861 1944373 1894409 1844559 1796814 1754655 1718638 1685338
13083 1685338 1652599 1617720 1576081 1524768 1464741 1396886 1323240 1250399 1183588 1122199 1064398
13072 1064398 1008700 954417 901256 849642 800722 756550 720190 693468 676785 672102 680425 699282
13060 699282 724459 752135 778150 798183 806493 795782 763222 715897 665163 617178 572989 535975
13048E35975k5609j5658j2823j6435j8904j4311m919M535J0605R103j895j7905
13036D31759l0230l3355k9999k3641j4883o473l691o787j3612k0972k1419j2364
13024B14333j43Q777J1923R724N894Q152J7577K5114K4889K1066J8337J6071J3397
13011C95111R272L303p98j586M78N248R087O794k906j7163l0038l4799k8849j5927
12997B97227n642l840o473r905j2487j3364j6691k4325l0051k4551p932Q852J8813
12984A69631K2494K3604K4346K2698J7228J1262P232L879K285J332m277j3689
12972B88025j9752j7891j1767o689n210q202j1527j0916o923k099R07L20j490
12959A86786J084Q300J2194N899p035j6589k0423k1109j9084j4831r302l392J153
$$ plain form
13048 535975 510366 494708 481885 465450 446546 432235 427316 431851 442456 451559 449664 431759
13036 431759 401529 368174 338175 314534 299651 293178 289487 282700 269088 248116 226697 214333
13024 214333 214190 222967 234890 244614 250508 258660 276237 301351 326240 347306 365643 381714 395111
13011 395111 404383 407686 406888 405302 405780 411028 420115 426909 424003 406840 376802 342003 313154 297227
12997 297227 291585 287745 281272 271367 258880 245516 228825 204500 174449 149898 141966 150818 169631
12984 169631 192125 215729 240075 262773 280001 291263 298495 302374 304659 305991 301714 288025
12972 288025 268273 250382 238615 231926 226716 218514 206987 196071 189148 187049 187956 188276 186786
12959 186786 187870 196170 208364 214263 207228 190639 170216 149107 130023 115192 105890 102498 103651
12946A03651L011J163k067k767L56M992P990J0055J4056J9270K4646K9305L0260
12933B43921K5847J8526J1099N387L882Q633J6282K3407L2027M5691O4852Q7929
12921E87483J11532J33145J53353J75515J96748K00360J64527P8631l7653j39767
12911A623874j96995k08156j89869j62478j39881j22676j03705q1068o1087m8898
12901C09061m1823l2668k1214j3293j1046j0507o718R45Q535J3700J5944J4548
12889B25464R730L670k636r325j4444j6849j6968j6214j7765k0743k0477j4196
12877H9247n339J708O847J1159J5075J8278J8664J3310L582m706r172j1179j1408
12864A36066p311K325J6669L5234N3905O5865P2343P6618P3387N6900L1399O971
$$ plain form
12946 103651 106662 107825 105758 102991 103347 108339 116329 126384 140440 159710 184356 213661 243921
12933 243921 269768 288294 299393 304780 308662 317295 333577 356984 389011 434702 499554 587483
12921 587483 699015 832160 985513 1161028 1357776 1558136 1722663 1801294 1763641 1623874
12911 1623874 1426879 1218723 1028854 866376 726495 603819 500114 419046 357959 309061
12901 309061 267238 234570 213356 200063 189017 178510 171792 172737 181272 194972 210916 225464
12889 225464 235194 238864 236228 226903 212459 195610 178642 162428 144663 123920 103443 89247
12877 89247 83908 85616 92463 103622 118697 136975 155639 168949 172531 167825 158653 147474 136066
12864 136066 128755 131080 147749 182983 236888 302753 375096 451714 525101 582001 613400 620371
12852F20371j0760k2528k9433l0363k3966j5370j5163k6979m2500n2689n6495
12841B94125n8451n9755n7220m8872l7389k5748j4259l998N263J4705K1755K4514
12829E4670K3293J6472K484j3553k1537j5591j086J2627K1063K3216J8031P085
12817A27174m120j0828j3434j2748j1475j3183j6343j4781o235K839P712J0033
12805D4611J0921J1468J3173J5046J6373J9022K2663K4370K4478K6641L1486L4704
12793B94956K9967J7697N169k405l563K101J3590K9450M8845O9675Q5876R0484
12781F81842Q4072P3639O5134O1908O2460O4341O6680O8075O8674O7843O3212
12770A427880N4634M3576L3202K6770K4720K2550P393k9335p9164j23360j47423
$$ plain form
12852 620371 609611 587083 557650 527287 503321 487951 472788 445809 403309 350620 294125
12841 294125 235674 175919 118699 69827 32438 6690 -7569 -11567 -6304 8401 30156 54670
12829 54670 77963 94435 96919 83366 61829 46238 45152 57779 78842 102058 120089 127174
12817 127174 123054 112226 98792 86044 74569 61386 45043 30262 24027 26866 34578 44611
12805 44611 55532 67000 80173 95219 111592 130614 153277 177647 202125 228766 260252 294956
12793 294956 324923 342620 347789 345384 341821 343922 357512 386962 435807 505482 591358 681842
12781 681842 765914 839553 904687 966595 1029055 1093396 1160076 1228151 1296825 1364668 1427880
12770 1427880 1482514 1526090 1559292 1586062 1610782 1633332 1640725 1611390 1532226 1408866 1261443
12759A261443j50752j42566j30862j18669j06221r2154p5895n8589m3303l2276
12749C10156k3515j7203j7856k5052l2395l4702l0694k2394j3016l779M849J0074
12737A04473R654N240J213m72l469r994j6665j9990j9603j6182q777J00N059M891
12723C5478L797O131J1375J7034K2885K9076L3320L2367K6316J9212J4257P691
12711B58939l686j5575k2909k5563k6754k8270k7813k2654j2944j153R986K0850
12699A02454L3435M7006N7124O1250O1973O1249N7928N0052L7440K1945L320k2453
12687E72723n3319p8245q7230p9491o1788m2290k7874k3161k6481l0963l0226
12676C1655k3249j1613K038J2117J3759Q061N22m444p315q692o502m77O212J1921
$$ plain form
12759 1261443 1110691 968125 837263 718594 612373 520219 444324 385735 342432 310156
12749 310156 286641 269438 251582 226530 194135 159433 128739 106345 93329 89550 94399 104473
12737 104473 114127 119367 120580 120108 116639 106645 89980 69990 50387 34205 25428 25528 30587 35478
12723 35478 39275 45406 56781 73815 96700 125776 159096 191463 217779 236991 251248 258939
12711 258939 255253 239678 216769 191206 164452 136182 108369 85715 72771 71618 81604 102454
12699 102454 135889 182895 240019 301269 363242 424491 482419 532471 569911 591856 595176 572723
12687 572723 519404 441159 353929 274438 212650 170360 142486 119325 92844 61881 31655
12676 31655 8406 -3207 -1169 10948 24707 32768 33290 28846 21531 12839 6337 5860 12072 23993
12662B3993J5606J5212Q957j250r526j2027q998m712o133j4152k2280k4633j8756
12649e8699p184K638P408J0464J3434J4004J0207J705o678r096n196Q42N181O651
12635a4319O052O339J1518K1638K8939K4985J2378M87o086q664j0120j1567j0213
12622E1367o348k904K634J2314J9405J7913R904J914k979o173r288j1790j4087
12609F1882j6965j8138j5898j1023m634J456M099K184M02K509O636J1575J6867
12596D0952J7238P386j1184l2456n0990o4675p6742q5760q3210o5739l8596r067
12584d52843J6986L6381M9692N6665N5899M9192M0479L1792K1702J2430P810N460
12572f8355Q22o160j1358j0556l957M929J1580J4571J5558J3920R131N095M349
$$ plain form
12662 23993 39599 54811 63768 62518 52992 40965 31967 27255 21122 6970 -15310 -39943 -58699
12649 -58699 -65883 -63245 -55837 -45373 -31939 -17935 -7728 -6023 -12701 -21797 -26993 -26151 -20970 -14319
12635 -14319 -8267 -1928 9590 31228 60167 85152 97530 98017 91931 83267 73147 61580 51367
12622 51367 45019 42115 44749 57063 76468 94381 104285 106199 103220 97047 87759 75969 61882
12609 61882 44917 26779 10881 -142 -4776 -3320 779 2963 3365 5874 12510 24085 40952
12596 40952 58190 65576 54392 21936 -29054 -93729 -170471 -256231 -339441 -405180 -443776 -452843
12584 -452843 -435857 -399476 -349784 -293119 -237220 -188028 -147549 -115757 -94055 -81625 -73815 -68355
12572 -68355 -67533 -73693 -85051 -95607 -99564 -94635 -83055 -68484 -52926 -39006 -29875 -24780 -20431
12559b0431N353P562J0596J2868J1265L903m187p041m026J58J621K263N059J1314
12545C6277J9754K2726J6962R729L984k855q532j0094q920o484j902K406J99r091
12531F4159j8056k0381j5440o768N98K849p6m351o391n822n477o581n981l40J0296
12516a7762K1961L1230L6830L7247L3177K6815J9218J0963K679l541p551r993
12504A81273j0111o819O17P321P018J479l726n807k725N296J2482J2609Q361Q824
12490B16092K0176L8978N3868N7803N1844L9439K6365J5481M319q340k2906l9023
12478D54096n1998n6466n2921m5889l6960k5576j2333K107J5497K2077J9411J0979
12466B42024K340j466j863l302l614J063R499J7019K1221K3697K5806K6625K4785
$$ plain form
12559 -20431 -15078 -7516 3080 15948 27213 31116 26929 19888 15862 16020 17641 19904 24963 36277
12545 36277 56031 78757 95719 105448 109432 106577 98045 87951 79031 72547 70645 73051 73250 64159
12531 64159 46103 25722 10282 3514 4112 6961 6885 2534 -3857 -9679 -15156 -21737 -27718 -28058 -17762
12516 -17762 4199 35429 72259 109506 142683 169498 188716 199679 202358 198817 191266 181273
12504 181273 171162 164343 164960 172281 179299 180778 177052 171245 168520 173816 186298 198907 207268 216092
12490 216092 236268 275246 329114 386917 438761 478200 504565 520046 524365 516025 493119 454096
12478 454096 402098 345632 292711 246822 209862 184286 171953 174060 189557 211634 231045 242024
12466 242024 244364 242898 241035 237733 234119 235182 244681 261700 282921 306618 332424 359049 383834
12453C83834K1912K3567L1892M2286N3701P0708R5720J27284J62539K00387K42119
12442A455949K93590L63458M58132N75388O97379P86805P80984O03668K33528
12433F248881k15044n57535p07807p05728o28116n27494m29475l46741k82473
12424A848468k32039j89870j54181j24397r7804p4158n3999l2832o594K2022M5660
12413I50276N5919N1360L7160J8354j210k0291l8331n2124n7856n6213n3318n3570
12401G80156n6265n7912n5825m9555l9488k6339j5474j3209j9809k9986l8817
12390C77477m4207m2183l1600k0082j3536r308k903N012J1006J3968J4875J5376
12378B73895J5904J4390J0244M383m463j6579k6769l0881l0468k7169k1282j2528
$$ plain form
12453 383834 405746 429313 461205 503491 557192 627900 723620 850904 1013443 1213830 1455949
12442 1455949 1749539 2112997 2571129 3146517 3843896 4630701 5411685 6015353 6248881
12433 6248881 6033837 5476302 4768495 4062767 3434651 2907157 2477682 2130941 1848468
12424 1848468 1616429 1426559 1272378 1147981 1050177 976019 922020 889188 882594 904616 950276
12413 950276 1006195 1057555 1094715 1113069 1111859 1091568 1053237 1001113 943257 887044 833726 780156
12401 780156 723891 665979 610154 560599 521111 494772 479298 466089 446280 416294 377477
12390 377477 333270 291087 259487 239405 225869 216561 213658 218670 229676 243644 258519 273895
12378 273895 289799 304189 314433 318816 314353 297774 271005 240124 209656 182487 161205 148677
12366A48677k856K257J097j822l379l925l062q74J686M345O829N985K577K392
12352A59927O440R736P600L32o977j2522j6615j7756j4130o774M81M432N550P415
12338A27139J1256J5359J8501J8309J2909O714N782Q719P664k600j7957k9480
12326A82315l3098l1081k8619k6605j8965k925J4768K5929L3259M1752M6598M3061
12314B46389L5555L1558L5155M5858O1096P6642R1500J10269J36952J70151K00352
12303A241477K05957J55628L9933q9931j70667j93901j82313j55999j28407j06720
12293F15057r0301p3350n1918l0577j8375j7388k1570k6183l1067l5991l9082
12282A79255l9559l6038k8334j8406q049o12K017J246j497o100j2301j7550j7184
$$ plain form
12366 148677 145821 148078 149175 147353 143974 140049 136987 136113 137799 142144 148973 154958 157535 159927
12352 159927 166367 176103 183703 184035 177058 164536 147921 130165 116035 109261 109742 114174 119724 127139
12338 127139 138395 153754 172255 190564 203473 210187 215969 224688 232352 229752 211795 182315
12326 182315 149217 118136 89517 62912 43947 41022 55790 81719 114978 156730 203328 246389
12314 246389 281944 313502 348657 394515 455611 532253 623753 734022 870974 1041125 1241477
12303 1241477 1447434 1603062 1642995 1553064 1382397 1188496 1006183 850184 721777 615057
12293 615057 524756 451406 399488 368911 350536 333148 311578 285395 254328 218337 179255
12282 179255 139696 103658 75324 56918 48869 48257 50274 51520 50023 43923 31622 14072 -3112
12269c112r819j160K454K294K772M052O384J0521J3869J2776P115J28j871L584
12255D9987J0898J3397R162J474l970m988l463j667l090r144j4731j4349q222
12242B1294J19O867R073P517P135R341J2361J5935J9540K1285J9696J6125J1692
12229A77980M374n961j2592j1594n673q1k37q007j8986k3929j6931k279J0880
12216H6964J5824J1670L981j212l283l736Q7R797J8435J6375M940n832j2863j8819
12202A22328k0224j3745n881l063m555p072q928j1986j6783j8661j4375o238O69
12189h514J569k547p578j2812j6454j3620j939J2581K1229K3032J9268Q374o472
12176A6117j7868k1347j9195j8843k2220k3149j7420o893M110J3794K1171K2675
$$ plain form
12269 -3112 -12931 -14091 -11637 -9343 -6571 -2519 3865 14386 28255 41031 48146 48274 46403 49987
12255 49987 60885 74282 83444 84918 80948 75960 72497 70830 67740 58596 43865 29516 21294
12242 21294 21413 28280 37353 44870 52005 61346 73707 89642 109182 130467 150163 166288 177980
12229 177980 182354 176393 163801 152207 146534 146453 146216 138209 119223 95294 78363 76084 86964
12216 86964 102788 114458 118439 117227 113944 110208 110295 120092 138527 154902 159842 154010 141147 122328
12202 122328 102104 88359 82478 79415 74860 67788 58860 46874 30091 11430 -2945 -9183 -8514
12189 -8514 -6945 -9492 -17070 -29882 -46336 -59956 -61895 -49314 -28085 -5053 14215 22589 16117
12176 16117 -1751 -23098 -42293 -61136 -83356 -106505 -123925 -130818 -126708 -112914 -91743 -69068
12164f9068J8059J0568K321l126j568M594P620N874N069Q972J6147K1867K0520
12151D7849J2624N043K958N763R414J1236J0290P082K645k300n385o877j0162
12138I0180j3310j1217m192L858R149J0189R192J0156J4184J7865J6920J1300
12126A64274M398J062K968N110J944o219j2245j0222m334r89L43J469j88o460
12112A40911j3891j8103k0348k3270k6633k7632k3757j6160j1407j2834j3510
12101f6634p964j989j980o641r926n474M933J2619J2071O910N204Q260J3040J6785
12087b0786J6620J2348P602N392K327m991j0698r573m592M92L860O628J0910J4687
12073C0226J5235J3203J1251Q285O30j3202k7601l2439k4433j0654Q0L631K599
$$ plain form
12164 -69068 -51009 -40441 -38120 -41246 -42814 -38220 -30600 -24726 -19657 -10685 5462 27329 47849
12151 47849 60473 65516 68474 74237 83651 94887 105177 112259 114904 112604 107219 100342 90180
12138 90180 76870 65653 61461 65319 74468 84657 93849 104005 118189 136054 152974 164274
12126 164274 168672 169734 172702 177812 179756 173537 161292 151070 146736 145747 146090 147559 147371 140911
12112 140911 127020 108917 88569 65299 38666 11034 -12723 -28883 -40290 -53124 -66634
12101 -66634 -74598 -76587 -78567 -85208 -95134 -100608 -95675 -83056 -70985 -64075 -58871 -50611 -37571 -20786
12087 -20786 -4166 8182 15784 21176 23503 18512 7814 -1759 -6351 -5859 -1999 4629 15539 30226
12073 30226 45461 58664 69915 78200 78830 65628 38027 5588 -18845 -29499 -29419 -25788 -23189
12060b3189K008K271J022k397n721n764j097P014J3852J5211J2417J0328J0798
12047C6753J2676J6670K2899K7901K7621K1986J2832P48j0504j5002j3026q784
12035A32770m614j190L137Q101J0791J0526O623n35q809j5148j6088j4768j6756
12022I4040j8741j4428o553j599Q89K991M567P023J0816J4136J4126R239L038
12009A19544l352j1032j4825j1117n178l705o998j2267j7823k0127j6189p008
11997a0077L854J3687J9239J7207P729n551j7492k1850j3663L39P806N513P73
11984G514J826Q516J5891K0135K1188K1884K5883L1289L2074K7762K1240J3837
11972B49039P897L107l831j1475j6287j8025j8391j6774j1549o339n111n516m237
$$ plain form
12060 -23189 -21181 -18910 -17888 -20285 -26006 -31770 -32867 -25853 -12001 3210 15627 25955 36753
12047 36753 49429 66099 88998 116899 144520 166506 179338 180086 169582 154580 141554 132770
12035 132770 128156 126966 130103 138204 148995 159521 166144 165609 156800 141652 125564 110796 94040
12022 94040 75299 60871 54318 52719 53608 56599 61166 68189 79005 93141 107267 116506 119544
12009 119544 116192 105160 90335 79218 74040 70335 63337 51070 33247 13120 -3069 -10077
11997 -10077 -6223 7464 26703 43910 51639 46088 28596 6746 -6917 -6578 1228 6741 7514
11984 7514 9340 17856 33747 53882 75070 96954 122837 154126 186200 213962 235202 249039
11972 249039 256936 260043 256212 244737 228450 210425 192034 175260 163711 157372 152261 146745 142508
11959A42508j943j765l156k894q55N1k740p483r342o646l321k139l998q913j6276
11944G1088k3793k7471k5520j9395j1694m597l00Q01m74l352m452M22J0084J8680
11930a9973K1118J6713R786O571R065J3299J6294J6095J1619M041l090o248o133
11917H9157p762j4803k5595l4218l4230k5756j6077j0167n658M39O974R613O965
11904f1118L380K005Q28j816m240m658l810l688m888m725l51Q500K0271K9760
11890b4550L2603L1141K9161K7593K7691K8917K8381K4456J8441J5407J7526K3010
11878B79777L0785L6538L5680L1776L2001L8988N1949P0039R5736J33695J83366
11867A020330K39390K99488L61126M05823L88196K55444J2325k38110l90694m34838
$$ plain form
11959 142508 140565 138800 135644 132750 131895 131946 129206 121723 112381 105735 102414 100275 96277 87364 71088
11944 71088 47295 19824 -5696 -25091 -36785 -41382 -41682 -40881 -41355 -44707 -49159 -48737 -38653 -19973
11930 -19973 1145 17858 27644 34215 43280 56579 72873 88968 100587 104628 101538 95290 89157
11917 89157 81395 66592 40997 6779 -27451 -53207 -69284 -79451 -85109 -84670 -77696 -68083 -61118
11904 -61118 -57738 -55733 -54905 -56721 -60961 -65619 -69429 -73117 -78005 -82730 -83081 -74581 -54310 -24550
11890 -24550 8053 39194 68355 95948 123639 152556 180937 205393 223834 239241 256767 279777
11878 279777 310562 347100 382780 414556 446557 485545 537494 607533 703269 836964 1020330
11867 1020330 1259720 1559208 1920334 2326157 2714353 2969797 2982122 2744012 2353318 1918480
11857A918480m14328l68736l21578k81771k45219k06550j62882j08826m6684O353
11847b31741L5965M4334M2421L8099L2676K6077K0732J7886J4951J1357J0233
11836F2990J2615J6096J6295J1085K546n253p234l651L89K894O040R355R528Q406
11822A42101R808J1932J1185P031K540K576P668J2014R871J173q562j3658j0963
11809A84716k284L638J802l084n963n777l753k863n466j0784j6263j9538k1209
11796I3172k1282j8957j5457j2212r116l603M279Q878M763p230j9754k5001k1454
11783d2974j3357m706M204J4057K0837K0599J5419Q296K341n35l435p230q351
11770E165n817J169J2507K3223K8564K7232K0488J1886O590O426N896K84n629
$$ plain form
11857 1918480 1504152 1135416 813838 532067 286848 80298 -82584 -191410 -238094 -231741
11847 -231741 -195776 -151442 -109021 -70922 -38246 -12169 8563 26449 41400 52757 62990
11836 62990 75605 91701 107996 119081 121627 116374 109140 105489 105878 108772 114812 124167 133695 142101
11822 142101 151909 163841 175026 182057 184597 187173 194841 206855 216726 217899 209337 195679 184716
11809 184716 182432 186070 187872 184788 178825 173048 169295 166432 160966 150182 133919 114381 93172
11796 93172 71890 52933 37476 25264 16148 12545 16824 25702 30465 23235 3481 -21520 -42974
11783 -42974 -56331 -61037 -56833 -42776 -21939 -1340 14079 22375 24716 24181 20746 13516 5165
11770 5165 -652 517 13024 36247 64811 92043 112531 124417 131007 137433 143329 143613 137984
11757A37984m416M096J3421J8276J8810J8446J9204J8378J0849j644j2582k1455
11745B19367k8483l0273k7371k4250k1881j6953q795j792J710M531R301J5049
11733I0160J7593J3017K735o691j0553q540k547N021J2251J7132J8414J8228J8343
11720A84563J7696J5052Q859n22r282j4532j7543j9443j7258j2551j0001q846
11708A16192p258m576k03K623o74n496l841L844J0818J3317J2814J1400R418P305
11694A65683O732Q106J0578J0514K391r838j5945j3655q272j886Q652K1548K7316
11681B11924K4029K1475K7147L9158N0963N5880N2068M3130L4260K9168K5821
11670F15023K0838J7182J7717K0816K4719K7009K7684L2749M6802O7219Q7580
$$ plain form
11757 137984 133568 137664 151085 169361 188171 206617 225821 244199 255048 253404 240822 219367
11745 219367 190884 160611 133240 108990 87109 70156 61361 59569 61279 65810 75111 90160
11733 90160 107753 120770 123505 116814 106261 97721 95174 100195 112446 129578 147992 166220 184563
11720 184563 202259 217311 226170 225648 216366 201834 184291 164848 147590 135039 125038 116192
11708 116192 108934 104358 104155 106778 106104 100608 96767 100611 111429 124746 137560 148960 158378 165683
11694 165683 172415 180521 191099 201613 204004 194166 178221 164566 156294 154408 163060 184608 211924
11681 211924 235953 257428 284575 323733 374696 430576 482644 525774 560034 589202 615023
11670 615023 635861 653043 670760 691576 716295 743304 770988 803737 850539 917758 1005338
11659A005338J04437J21981J48307J86310K32757K84693L41905M08818M96102
11650C330648O11403P54512R22202J097124J228219J227424R95077M92385j64865
11641A0494129p43052j077836j170473j110999r82774q36678o99991n84787m89317
11632B798222m06635l35008k77849k36139k04164j71664j33948r7525p0628n4567
11622H10095m6814m2381l7190l3518l5119l9544m3365m5172m2250l2135j7487
11611C95120o882l507m748r665j6706k3302k6662k4573j9029j5773j6691j8378
11599B09204j8212j6651j4833j0630j888O142P815N818L157r68o397j2528j8326
11586A31703k2162k3859k2643j7669p824N917J6660J9337J5974J2276J0285Q399
$$ plain form
11659 1005338 1109775 1231756 1380063 1566373 1799130 2083823 2425728 2834546 3330648
11650 3330648 3942051 4696563 5618765 6715889 7944108 9171532 10166609 10658994 10494129
11641 10494129 9751077 8673241 7502768 6391769 5408995 4572317 3872326 3287539 2798222
11632 2798222 2391587 2056579 1778730 1542591 1338427 1166763 1032815 935290 864662 810095
11622 810095 763281 720900 683710 650192 615073 575529 532164 486992 444742 412607 395120
11611 395120 388238 384731 379983 370318 353612 330310 303648 279075 260046 244273 227582 209204
11599 209204 190992 174341 159508 148878 146990 153132 160947 166765 169922 168954 162557 150029 131703
11586 131703 109541 85682 63039 45370 37546 43463 60123 79460 95434 107710 117995 126394
11574A26394O588O113N326J112m245n616n013q652j4916j5349q400m92K838J175
11560H6863k524n175n466n614q858j4235j5612p221Q207K0458K2313J5433P627
11547I6196M136N832J0874J3289Q488J23n355q068j3892k3496k9897k7251j8162
11534A2817q799R54J4206K9650M1486M4115L8445K8589J3658n001k0350k7596
11522A62174k6353j8268p427J862P138P096K592l419n937j819N867J2058J8741
11509A54305L0387M1942M3601L3627K0398J2543J1010J4530K5368M4431O3685
11498D95827P5366Q1454Q7032R7616J20883J56498J90771K08071J96165J44184
11488A853867N0924o2021j58396k13854k25948k06454j73173j39280j08434q0236
$$ plain form
11574 126394 132982 139095 144421 145533 141288 135672 130659 122007 107091 91742 83342 82850 85688 86863
11560 86863 84339 79164 73698 68084 59226 44991 29379 22158 30365 50823 73136 88569 96196
11547 96196 100332 106164 117038 130327 138815 138938 133583 125515 111623 88127 58230 30979 12817
11534 12817 4018 4972 19178 48828 90314 134429 172874 201463 215121 210120 189770 162174
11522 162174 135821 117553 110126 111988 119126 126222 128814 125395 119458 117639 123506 135564 154305
11509 154305 184692 226634 270235 303862 324260 336803 347813 362343 387711 432142 495827
11498 495827 571193 652647 739679 837295 958178 1114676 1305447 1513518 1709683 1853867
11488 1853867 1904791 1842770 1684374 1470520 1244572 1038118 864945 725665 617231 536995
11478E36995n5345l7670l0470l0657l1328k7827k0753j3358r596j0833j2271j0096
11466B46791p875j0199j6166k1813k1827j6171j1981j1675j0634n695J748Q631
11454A23134J0626N877l907j6520k7724l4550l5100k8261j7690p845J78O775J1146
11441a3861J1127N497l539j0727j1677p395l335k209k781m220o029o585l027N193
11427e3568J3403J7939J8213J4700Q828L348M16j227k039k099k121j029J553M688
11413B1005N301K323j210k955k073r84j603l54L096O893J0462J2036J0652Q381
11399G0970Q138Q079N107k40o465j2352j4921j1978n054J689L066m78l435n999
11385C6127j0981j5598j6228j2945p798n09J0631K2789K8450K3978J5065J0405
$$ plain form
11478 536995 481650 443980 413510 382853 351525 323698 302945 289587 279991 269158 256887 246791
11466 246791 238916 228717 212551 190738 168911 152740 140759 129084 118450 112755 114503 123134
11454 123134 133760 139637 135730 119210 91486 56936 21836 -6425 -24115 -31960 -31782 -25007 -13861
11441 -13861 -2734 2763 -776 -11503 -23180 -30575 -33910 -36119 -38900 -43120 -49149 -55734 -58761 -53568
11427 -53568 -40165 -22226 -4013 10687 19515 22863 23279 22052 20013 17914 15793 14764 16317 21005
11413 21005 26306 28629 27419 24464 22391 21407 19804 19450 22546 29439 39901 51937 62589 70970
11399 70970 79108 87187 92294 92054 85589 73237 58316 46338 41284 42973 46039 45561 42126 36127
11385 36127 25146 9548 -6680 -19625 -27423 -27932 -17301 5488 33938 57916 72981 83386
11373H3386J1371J4101J6781J9084K0010J7253Q885j704r175j3491j6226j5651
11361A34624r882j764L002M002K121k214o040p545o743m934n823j2268k1305k7586
11347C7645k7720k0543q206M270J0970R780N275L424N649J0174J6116K1341K2909
11334I1084K2886K4203K5395K4949K3593K1420J9678K1114K5594K9429L1530L3534
11322C94409L5436L2941K0510R41j4462k0580k3170k4975k1598j1760R68J3474
11310C82134K1138K0229J3598N029o624k1195l3091l6455l1510k3696j5233p101
11298B67223k484l705j0206j7654k1890k3593k5182k6799k6500k3506k0077j8993
11286D6634j9341j6619j0663n598j917K081P471J4001J7314J3732R090J1800J9292
$$ plain form
11373 83386 94757 108858 125639 144723 164733 181986 190871 189167 179992 166501 150275 134624
11361 134624 124742 122978 125980 129982 132103 129889 123849 116304 109561 104627 98804 86536 65231 37645
11347 37645 9925 -10618 -18824 -14554 -3584 6196 11471 14895 20544 30718 46834 68175 91084
11334 91084 113970 138173 163568 188517 212110 233530 253208 274322 299916 329345 360875 394409
11322 394409 429845 462786 483296 484237 469775 449195 426025 401050 379452 367692 368660 382134
11310 382134 403272 423501 437099 442128 435504 414309 381218 344763 313253 289557 274324 267223
11298 267223 264739 261034 250828 233174 211284 187691 162509 135710 109210 85704 65627 46634
11286 46634 27293 10674 11 -5587 -7504 -5423 2048 16049 33363 47095 56185 67985 87277
11273H7277K1335J3684L815o78j348k087k162O82L462K046k050n491n268P55Q992
11258A22964J3324J1230M853j901n743l907J704N439L241n843j8910k9006k8542
11245F8903j6922k315P102R638Q311O838Q260J2077J3895J1807Q464O904O500
11232A49462L998k737j0554j1523l989L838O253Q635J6758K8165L8387M6746N7997
11219C31436P8453J07603J37710J56048J45563R4086J2324o6389j15451j31100
11209G50283j23920j06491q5751o5259m9023m1256m0406l9755l6155l0986k5964
11198A05317k1209j4749p622m185m818o470q287r611p272j185J165l928q846p777
11184E23l845Q35N765P496L072n237j1371j2054r432p633p016m340P49N568Q296
$$ plain form
11273 87277 108612 122296 126111 125433 124085 121998 119836 120518 123980 126026 123976 118485 113217 113972 122964
11258 122964 136288 147518 152371 150470 144727 140820 142524 147963 151204 145361 126451 97445 68903
11245 68903 51981 49666 56768 66406 74717 81555 89815 101892 115787 127594 136058 142962 149462
11232 149462 153460 150723 140169 128646 124657 128495 134748 143383 160141 188306 226693 273439 331436
11219 331436 409889 517492 655202 811250 956813 1050899 1063223 996834 881383 750283
11209 750283 626363 519872 434121 368862 319839 278583 238177 198422 162267 131281 105317
11198 105317 84108 69359 61737 57552 52734 46264 37977 28366 21094 19909 21074 17146 8300 523
11184 523 -3322 -2487 3278 10774 13846 8609 -2762 -14816 -24248 -31881 -38897 -43237 -42488 -36920 -28624
11169b8624Q013M534o16l633n98N755O865j281j5467k7286k8703k1659j3929r823
11155a26452p120q43Q902J5209J3466O207j773o623n256K107J0954J7214K0106
11142e3902K2021K4463K4732J9780J2789P856M638J062n30M391J2630J8879K1067
11129A19876J8415J2551P319O108Q798J4023J9750K5005L1758M0076M6486N0197
11117D00362N3474N3501M3707J8147k4677p5999j16940j32373j24599j05403q1942
11106i2742n7321l4617j7362n917L730J4546K4965L1165K9950K3413J9307J8031
11094d2852J3249O704M572P327J0173Q203K004k433l81N931R984Q314J314p892
11080B4217j4326j4226q316r39M118O049L717m317j4735k2632k5491k2909j5901
$$ plain form
11169 -28624 -20611 -16077 -16693 -20326 -20924 -15169 -8304 -9585 -25052 -52338 -81041 -102700 -116629 -126452
11155 -126452 -133572 -134415 -125513 -110304 -96838 -90631 -92404 -99027 -104283 -102176 -91222 -74008 -53902
11142 -53902 -31881 -7418 17314 37094 49883 57739 62377 63439 62909 67300 79930 98809 119876
11129 119876 138291 150842 158161 164269 173067 187090 206840 231845 263603 303679 350165 400362
11117 400362 453836 507337 551044 569191 544514 468515 351575 219202 94603 -10800 -92742
11106 -92742 -150063 -184680 -202042 -207959 -204229 -189683 -164718 -133553 -103603 -80190 -60883 -42852
11094 -42852 -29603 -22899 -18327 -11000 -827 7376 9380 6947 6566 12497 22481 30795 32109 24217
11080 24217 9891 -4335 -12651 -13590 -9472 -3423 294 -4023 -18758 -41390 -66881 -89790 -105691
11067a05691o359J291K784j050m761m277q70P7n127j3550j6455r133K361R235
11053a51525R751Q775Q166N893J107n517j0633j0127k805O894J2085P676n801
11040a26061j8755k4223k5011k1764j2990m520k122n57P492J7771J9843J2974
11028a77923O060L197K559L571O564R751J1302J2339J4072J7074J9873K0454K0050
11015c1057K1305K3869K1343R482m845j3172j6900j9169j7781j2592p203m797
11003e1517o928j0931j0425l900L564Q271J1224J4740J8310J8779J3193J437j2412
10990f595k3687k7950k3181j3930q186q386j0285q883j643P401J0384Q994J2014
10977i3933K0011K5720K4055J5517L697o287j1321j1892q178j223K825O66l232
$$ plain form
11067 -105691 -112050 -110759 -107975 -109025 -113786 -118063 -118933 -118856 -123983 -137533 -153988 -163121 -160760 -151525
11053 -151525 -141774 -132999 -124833 -118940 -117833 -123350 -133983 -144110 -146915 -140021 -127936 -120260 -126061
11040 -126061 -144816 -169039 -194050 -215814 -228804 -233324 -235446 -236003 -228511 -210740 -190897 -177923
11028 -177923 -171863 -168666 -166107 -162536 -155972 -146221 -134919 -122580 -108508 -91434 -71561 -51107 -31057
11015 -31057 -9752 14117 35460 44942 40097 26925 10025 -9144 -26925 -39517 -46720 -51517
11003 -51517 -58445 -69376 -79801 -83701 -80137 -71866 -60642 -45902 -27592 -8813 4380 5817 -6595
10990 -6595 -30282 -58232 -81413 -95343 -103529 -111915 -122200 -131083 -132726 -125325 -114941 -105947 -93933
10977 -93933 -73922 -48202 -24147 -8630 -4933 -11220 -22541 -34433 -42611 -43834 -41009 -40343 -43575
10964d3575k700K894P944P964K856o593j7308k2657j8373q667J59P555J4497J6674
10950e9330R177l692j2038j2633r602q086q399q824q727r480j1313j1234p671
10937a61852k591o50n18K192O410R510J0099R945J0268P047N09q79P605K0754
10923h2151K7872K3236J0464m146j6457k4185k6001k3094j9603j7368j3895r153
10911a74481q735j3083j4981r375L218J7691K9305L5104L2008K1783R972O99m365
10898g5240m038K155J1836K0405K2538J5203K015q531j1108q498o460q377j2696
10885f0796j4467j1573o796l511k619l461m623m684l002q73j696o217q540l278
10871a36136P168J4764J4959J2983J6011K1262K0207J2067M440K845O319J1372
$$ plain form
10964 -43575 -46275 -43381 -35437 -27473 -24617 -31210 -48518 -71175 -89548 -98215 -98056 -90501 -76004 -59330
10950 -59330 -50153 -53845 -65883 -78516 -88118 -96204 -104603 -113427 -122154 -131634 -142947 -154181 -161852
10937 -161852 -164443 -165093 -165611 -163419 -157009 -147499 -137400 -127455 -117187 -110140 -109631 -110510 -102905 -82151
10923 -82151 -54279 -31043 -20579 -24725 -41182 -65367 -91368 -114462 -134065 -151433 -165328 -174481
10911 -174481 -183216 -196299 -211280 -220655 -217437 -199746 -170441 -135337 -103329 -81546 -71574 -70875 -75240
10898 -75240 -79278 -77123 -65287 -44882 -22344 -7141 -5126 -13657 -24765 -33263 -39723 -48100 -60796
10885 -60796 -75263 -86836 -93632 -97143 -99762 -103223 -107846 -112530 -115532 -116405 -118101 -124318 -132858 -136136
10871 -136136 -128968 -114204 -99245 -86262 -70251 -48989 -28782 -16715 -12275 -9430 -3111 8261
10859H261J4430J4006J0730P995J0940J9381K6734K7647K3929K1200J8920J2132
10847B16305k517k3100m2625n4298n5013m6895l6966l0597k6086j8029o202N160
10835a20863J2678J5974J5582R606k1o554o725l601k646n216p805q659q106n502
10821a21858L15Q000J3739J4390J0030M443J826L503O753Q436P161N401P265J1837
10807a8759J3751J0165M285M77K10J662M525R904J3489Q678l017j4726k1419k0655
10793a1430j4202o912k593j737l435q148j3046j3210q972k266N069R833J1433
10780e9616J1857J1091Q873O561N621M143j049o658q135l492N898J3949J4922
10767C965P718j937o854n283n05L418O016Q033Q298N340J251j267l905p321r410
$$ plain form
10859 8261 22691 36697 47427 55422 66362 85743 112477 140124 164053 185253 204173 216305
10847 216305 213788 190688 148063 93765 38752 -8143 -45109 -75706 -101792 -119821 -126023 -120863
10835 -120863 -108185 -92211 -76629 -67023 -67044 -73598 -80323 -83924 -86570 -91786 -99591 -108250 -116356 -121858
10821 -121858 -121543 -113543 -99804 -85414 -75384 -70941 -69115 -65612 -58859 -50423 -43262 -37861 -30596 -18759
10807 -18759 -5008 5157 9442 9919 10129 11791 16316 26220 39709 48387 45370 30644 9225 -11430
10793 -11430 -25632 -32544 -35137 -36874 -40309 -48457 -61503 -74713 -83685 -85951 -80882 -71049 -59616
10780 -59616 -47759 -36668 -27795 -21234 -15613 -11470 -12519 -19177 -27312 -30804 -24906 -10957 3965
10767 3965 11683 9746 2892 -2391 -2896 522 6538 14571 22869 28209 29460 28193 24288 16967 7557
10752G557q539n469k741k561m836n310m72P276J2343J3557J2187Q011M321M526
10738C9850O048M697j073q094j1888j3106j3344j2589j0364o955m997n785o825
10725d4425o401m826o26L437J141o282j2941j5092j3936j3001j2947j0749l748
10712a40396M607Q909R294J0625J4114J6395J3394M213n828j1055j0774n831l60
10699i2693K789O211J0064J1518J1479J1412R843N446j533p327p992n095k384
10686d8262k676o531j0743j2360j1150j0124j1930j1950o343O8K492K506K754
10673a24249L421J968k638o670o457k645K326P833J0870Q371L421j741o799p893
10659a20882n78J1973J9418J6946J0857Q256R197J1888J6393J9543J6199P023
$$ plain form
10752 7557 -982 -6451 -9192 -11753 -16589 -21899 -22371 -15095 -2752 10805 22992 31003 35324 39850
10738 39850 45898 50595 49522 41428 29540 16434 3090 -9499 -19863 -26818 -31815 -37600 -44425
10725 -44425 -50826 -55652 -56278 -52841 -51700 -57982 -70923 -86015 -99951 -112952 -125899 -136648 -140396
10712 -140396 -135789 -126880 -117586 -106961 -92847 -76452 -63058 -58845 -64673 -75728 -86502 -92333 -92693
10699 -92693 -89904 -83693 -73629 -62111 -50632 -39220 -29377 -23931 -25464 -32791 -40783 -45878 -48262
10686 -48262 -50938 -57469 -68212 -80572 -91722 -101846 -113776 -125726 -132069 -132001 -129509 -127003 -124249
10673 -124249 -120828 -118860 -121498 -128168 -134625 -137270 -134944 -127111 -116241 -107870 -104449 -106190 -112989 -120882
10659 -120882 -121460 -109487 -90069 -73123 -62266 -54010 -44813 -32925 -16532 3011 19210 26233
10647B6233q35k516n70p18m311p074o677o386p064m658n76k315j1514k1914k6757
10632g7652k3959j8355j8452k4874k9235k7625k2701j4901m545N803J5857K6098
10620b14541L1400K6594J5941Q106O600Q501J1031J4272J7124J7361J6220J3735
10608b7656N861n542j1590p200J130K922m038j3854k0994k5231k5576j7852l854
10595a53474P843J2199R575K545o098j3362j5176j0660l195K239L103P93k009
10582a65677o680j2696j1205J013J5096K2665K2211J7461J4209J4340J5074J2896
10570f1293P152O20m906j0574j6227j9124j7619j3189o860R11P201Q423K847p657
10556a30295j7462j9782j4094q502n689K304J8435L4679M1987L7100K2588P504
$$ plain form
10647 26233 25398 22882 22312 21594 17283 10209 3532 -2854 -9918 -14576 -15152 -17467 -28981 -50895 -77652
10632 -77652 -101611 -119966 -138418 -163292 -192527 -220152 -242853 -257754 -262299 -256496 -240639 -214541
10620 -214541 -183141 -156547 -140606 -132500 -125900 -117399 -106368 -92096 -74972 -57611 -41391 -27656
10608 -27656 -21795 -27337 -38927 -46127 -44997 -42075 -46113 -59967 -80961 -106192 -131768 -149620 -153474
10595 -153474 -145631 -133432 -123857 -121312 -127410 -140772 -155948 -166608 -169803 -167564 -164461 -163668 -165677
10582 -165677 -172357 -185053 -196258 -195245 -180149 -157484 -135273 -117812 -103603 -89263 -74189 -61293
10570 -61293 -54141 -53521 -58427 -69001 -85228 -104352 -121971 -135160 -142020 -141109 -133908 -125485 -122638 -130295
10556 -130295 -147757 -167539 -181633 -190135 -195824 -193520 -175085 -140406 -98419 -61319 -38731 -31227
10544c1227J96p11o33l016q042j2961j4965j3600r668m518m48J221N54j134k231
10529a01183j709K112Q782J6005K1639K3155J9536J1283Q81p492j0329p801n268
10516c0389n895p510q569q312n943k689K659J0485J5600J4953J1133O378K32n903
10502a3770p154j163O766P976m91j2900k0631k3420k6587k8958k4657j4616o670
10489a66275m565m351k895k623l933l863q76L824O689N515J696k065l734m452
10475a81908m832m271m181m019k410l48L93j861n963o667k300L617Q841J2985
10461a92924J4161J2139R427O831K967k529r118j4809j5001p655L526J3010J6435
10448a63540J1928L920J74J261K399J793Q21m99j154K768J0894J5790J1402M37
$$ plain form
10544 -31227 -31031 -31742 -32375 -35391 -43433 -56394 -71359 -84959 -94627 -99145 -99593 -98372 -97818 -98952 -101183
10529 -101183 -102892 -100780 -91998 -75993 -54354 -31199 -11663 -380 501 -6991 -17320 -25121 -30389
10516 -30389 -36284 -43794 -52363 -60675 -66618 -69307 -66648 -56163 -40563 -25610 -14477 -8099 -7867 -13770
10502 -13770 -20924 -22087 -15321 -7345 -7836 -20736 -41367 -64787 -91374 -120332 -144989 -159605 -166275
10489 -166275 -170840 -175191 -178086 -180709 -184642 -188505 -189381 -185557 -178868 -173353 -171657 -173722 -177456 -181908
10475 -181908 -186740 -191011 -195192 -199211 -201621 -201969 -201576 -203437 -209400 -216067 -218367 -214750 -205909 -192924
10461 -192924 -178763 -166624 -157197 -150366 -147399 -149928 -159046 -173855 -188856 -196511 -192985 -179975 -163540
10448 -163540 -151612 -147692 -147518 -146257 -143858 -142065 -141244 -141743 -142897 -140129 -129235 -113445 -102043 -101606
10434a01606q617j0050p004p170j0681j1159n398L439Q826P789K593l024o518
10421a48580q284q029n216l487n708q348q401p095m549j753k915o767o537l003
10407b28672k506o272j0367j1204j0689j3686j8687j7717p514L798P601M939j144
10394c12120q845j6214k1320k2038k0373j8719j7513j8244k2857l3345m4982m8510
10382f05080m1522k5478L713N0133J14682J97350K81312L18120K72318J72410
10372G37958P3817P260k4979l5869m0607m6381n0483m7957l8228k7185k0682j8001
10360D68663j5804j4383j2834q725m452n701j4740k4589k6729k1745j6804j8626
10348B83531k8486l8838l8388k7031j3802n653m878r346j3577j4032j2554j0801
$$ plain form
10434 -101606 -110223 -120273 -127277 -134447 -145128 -156287 -161685 -158246 -149420 -141631 -139038 -142062 -148580
10421 -148580 -156864 -164893 -170109 -173596 -179304 -187652 -196053 -203148 -207697 -209450 -212365 -219132 -225669 -228672
10407 -228672 -231178 -237450 -247817 -259021 -269710 -283396 -302083 -319800 -327314 -323516 -315915 -310976 -312120
10394 -312120 -320965 -337179 -358499 -380537 -400910 -419629 -437142 -455386 -478243 -511588 -556570 -605080
10382 -605080 -646602 -672080 -668367 -618234 -503552 -306202 -24890 293230 565548 737958
10372 737958 811775 819035 794056 758187 717580 671199 620716 572759 534531 507346 486664 468663
10360 468663 452859 438476 425642 416917 412465 406764 392024 367435 340706 318961 302157 283531
10348 283531 255045 216207 177819 150788 136986 131333 126455 117109 103532 89500 76946 66145
10336F6145q893p931r513j4021j6752j3968p633k70Q500J7557K3085K4137K1869
10323H2312J5300N442r91k311l601p861j3975j9616k3029k2877k0093j7755j4159
10310d3214o350J461N169P222J0487J2828J1113P822Q151J1951J4957J5477J4325
10297G1399J3290J2855J0334L726m297q891r395p299m389k793l331m844n607o894
10283E3864r699j2486j3727j3259j1030q272r047j4297j6072q660L163J4027K3272
10270b2223L1614L9772M7066M7942L4561J3489j744q017r215q505o412l298j012
10257A54018k775r802j6780j6476j0359o674r099j4154j4415n859N215J1456J3541
10244G7837J4514J4623J2427P226P52k600m42J438k346p150o736k916k884q988
$$ plain form
10336 66145 57252 49321 39808 25787 9035 -4933 -12566 -12836 -4336 13221 36306 60443 82312
10323 82312 97612 103054 102063 99752 96151 88290 74315 54699 31670 8793 -11300 -29055 -43214
10310 -43214 -49564 -48103 -42934 -35712 -25225 -12397 -1284 6538 14689 26640 41597 57074 71399
10297 71399 84689 97544 107878 111604 107307 98416 89021 81722 77333 74540 71209 66365 60758 53864
10283 53864 44165 31679 17952 4693 -6337 -14609 -23656 -37953 -54025 -62685 -59522 -45495 -22223
10270 -22223 9391 49163 96229 144171 178732 192221 190477 182460 173245 164740 158328 155030 154018
10257 154018 151243 141441 124661 108185 97826 91152 82053 67899 53484 47625 52840 64296 77837
10244 77837 92351 106974 119401 126627 127379 124779 124337 125775 123429 116279 109543 106627 103743 94755
10230I4755j2815o371N124J3048J5120J1312N307K299J414J173K342K974J676
10217A37358R14L532R514J4319J3394N630m931j1998j3197j1308j0125r603q607
10204A14892p905q288r094r614j2338j7925k3327k7477k9008k5140j7410r966
10192h2600m869j14O469J3226J7032J6628J2249L580p798j9149l0448l9899m1885
10179a57578l3026j5861J817J4663K2742K5011K0847J4139J0209R236O033j67
10167h1935l447k03N119M649m78j783M157J3118J9418K1804K1697J6323N763j317
10153B2885O43Q670J4035J0599K402m566j0001j4386j7151j8382j7248j4099j3130
10140d9729j3612j0154k898N069J1208J3779J3729J5069J7301J5308J0225O368
$$ plain form
10230 94755 81940 75569 80693 93741 108861 120173 125480 127779 129193 130366 132708 135682 137358
10217 137358 138272 141804 151318 165637 179031 184661 179730 167732 154535 143227 133102 123499 114892
10204 114892 106987 98699 89605 79991 67653 49728 26401 -1076 -30084 -55224 -72634 -82600
10192 -82600 -87469 -87583 -81114 -67888 -50856 -34228 -21979 -18399 -26197 -45346 -75794 -115693 -157578
10179 -157578 -190604 -206465 -204648 -189985 -167243 -142232 -121385 -107246 -97037 -87801 -81768 -81935
10167 -81935 -85382 -85585 -80466 -75817 -76295 -78078 -73921 -60803 -41385 -19581 2116 18439 24202 22885
10153 22885 23528 32198 46233 56832 59234 54668 44667 30281 13130 -5252 -22500 -36599 -49729
10140 -49729 -63341 -73495 -76393 -71324 -60116 -46337 -32608 -17539 -238 15070 25295 31663
10128C1663M925N021K680m644j1786j2512r407o939m739l812m903l424M296J2420
10114a161J3653J0314O221l30q413j3557j3637j1398j0524r280m927J237O957
10101c4845J1483J3295J1020P241O301R484J3380J4995J3588R099M080K645N771
10088H7537J0784J3393R913l27j2794j8873j6348j2535j2183j3666j3433j0863
10076A0605r394j0495j2884j4938j6706j9075j9559j6066r190M86J1175J7442
10064h8599J4617N578l913j1235j6851k2768k7660k4649j2124K827J4649K0054
10052a50074J7282J1431P999L926m323j1310j0100j711Q665J7419K2767K3887
10040f4142J9372J1569N847K619J170L651J0916J9234K2703J6971L490r233j2454
$$ plain form
10128 31663 36588 41609 44289 39645 27859 15347 5940 -999 -5738 -9550 -14453 -17877 -13581 -1161
10114 -1161 12492 22806 29027 28697 20284 6727 -6910 -18308 -28832 -38112 -43039 -41802 -34845
10101 -34845 -23362 -10067 953 8194 14495 23979 37359 52354 65942 75041 79121 81766 87537
10088 87537 98321 111714 121627 121300 108506 89633 73285 60750 48567 34901 21468 10605
10076 10605 1211 -9284 -22168 -37106 -53812 -72887 -92446 -108512 -117702 -117216 -106041 -88599
10064 -88599 -73982 -68404 -72317 -83552 -100403 -123171 -150831 -175480 -187604 -184777 -170128 -150074
10052 -150074 -132792 -121361 -113362 -109436 -113759 -125069 -135169 -136880 -128215 -110796 -88029 -64142
10040 -64142 -44770 -33201 -27354 -24735 -23565 -19914 -8998 10236 32939 49910 53400 44167 31713
10027C1713p816j726M218Q353O400j166p906p888k81R254J0785K117p951j3009
10013B5097j2180o500L43N262P128M462m040j2697j5483j4136r371j877L845M978
9999b5169M314M719N774M365p12n385p151n220O16M848K458l704p297o530m043
9984c8117k537m418q705j0808q460k729N851J4655J8206J5242R212L994Q07k041
9970i848k778K591J2297K0160K2959K1788J7644J1685O499Q65q008j4898j4943
9957F6013j2734j2346j1436q109n122n189n749k938K069M595K385k774q922j4238
9943a4495j4126o101M579J2709J8154J9076J0547o586k4385l4356l3241k5177
9931i3402j3090K150J7668L0907L8847L8107K8415J3885Qr928j5332j5346q399
$$ plain form
10027 31713 23897 22171 26389 34742 41142 39976 32070 24182 23901 33155 43940 46057 38106 25097
10013 25097 12917 6417 6760 12022 19150 23612 19572 6875 -8608 -22744 -32115 -33992 -30147 -25169
9999 -25169 -20855 -16136 -10362 -5997 -6709 -12094 -19245 -24465 -23849 -19001 -16543 -20247 -27544 -34074 -38117
9984 -38117 -40654 -45072 -53777 -64585 -73045 -75774 -69923 -55268 -37062 -21820 -12608 -8614 -7807 -9848
9970 -9848 -12626 -10035 2262 22422 45381 67169 84813 96498 102997 103862 95854 80956 66013
9957 66013 53279 40933 29497 21388 16266 11077 5328 2390 4459 9054 11439 8665 -257 -14495
9943 -14495 -28621 -34722 -30143 -17434 720 19796 30343 23757 -628 -34984 -68225 -93402
9931 -93402 -106492 -104342 -86674 -55767 -16920 21187 49602 63487 63495 53567 38235 22889 14490
9918A4490L535J4735K0093J8151J2912J1158J5034J9890J9657J2845K335p818
9906A57017j4740j6753j5401j5933k1199k6178k3291j5146p931l47P510J0422
9894A8030O890K176J098K396L984O772J0037R117K958l774p772j0850j4517j7348
9880I197j6507j0110n06O955J0156J0892R729O432J920k382l740N40R095J5468
9866D7139J3255N004k709r378j6278j9063j4714q302m921m339n416m745K519J5347
9852f601K6259K7793K0759J2327O612K887N16j335l549m151k488k354n350p678
$$ plain form
9918 14490 18025 32760 52853 71004 83916 95074 110108 129998 149655 162500 164835 157017
9906 157017 142277 125524 110123 94190 72991 46813 23522 8376 445 98 7608 18030
9894 18030 24920 27096 28194 30590 34574 41346 51383 60500 63458 59684 51912 41062 26545 9197
9880 9197 -7310 -17420 -17926 -10971 -815 10077 19806 26238 28158 25776 22036 22576 31671 47139
9866 47139 60394 65398 62689 53311 37033 17970 3256 -5046 -9967 -14306 -19722 -24467 -21948 -6601
9852 -6601 19658 47451 68210 80537 87149 90036 90552 89217 85668 81517 79029 76675 71325 63647
$$ [...]
##END NTUPLES=NMR SPECTRUM
##END=
