##TITLE=1H ikalashn
LR-793-RB-O-C1
18.12.2024
##JCAMPDX= 6.0         $$ Bruker NMR JCAMP-DX V2.0
##DATA TYPE= NMR FID
##DATA CLASS= NTUPLES
##ORIGIN= UXNMR, Bruker Analytische Messtechnik GmbH
##OWNER= root
$$ TOPSPIN		Version 1.3
$$ 2024-12-18 10:29:46.265 +0400  Irina@DPX200
$$ Compression mode = diff/dup
##.OBSERVE FREQUENCY= 200.131300845
##.OBSERVE NUCLEUS= ^1H
##.DELAY= (6, 6)
##.ACQUISITION MODE= SIMULTANEOUS
##.ACQUISITION SCHEME= undefined
##.AVERAGES= 128
##.DIGITISER RES= 18
##SPECTROMETER/DATA SYSTEM= spect
##.PULSE SEQUENCE= zg
##.SOLVENT NAME= CDCl3
##.SHIFT REFERENCE= INTERNAL, CDCl3, 1, 17.49637
##AUDIT TRAIL= $$ (NUMBER, WHEN, WHO, WHERE, WHAT)
$$ ##TITLE= Audit trail, TOPSPIN		Version 1.3
$$ ##JCAMPDX= 5.01
$$ ##ORIGIN= Bruker BioSpin GmbH
$$ ##OWNER= Irina
$$ $$ F:/spectra/data/iren/nmr/1H/4/audita.txt
$$ ##AUDIT TRAIL=  $$ (NUMBER, WHEN, WHO, WHERE, VERSION, WHAT)
(   1,<2024-12-18 10:29:06.484 +0400>,<Irina>,<DPX200>,<TOPSPIN 1.3>,
      <created by zg
	started at 2024-12-18 10:20:43.375 +0400,
	POWCHK disabled, PULCHK disabled
       configuration hash MD5:
       BE 6D 3F 07 2A EA 11 49 91 17 2B D3 AF B3 58 0D
       data hash MD5: 16K
       D4 2D 8F EA 9D BE 55 07 BE 8B 3A D5 FB 37 DB 4C>)
$$ ##END=
$$ 
$$ $$ hash MD5
$$ $$ D2 59 80 E2 D4 19 A6 86 CE 78 B4 C6 27 EE 87 EE
##$RELAX= 
##$RELAX= 
##$RELAX= 
##$RELAX= 
##$RELAX= 
##$RELAX= 
##$RELAX= 
##$RELAX= 
##$RELAX= 
$$ Bruker specific parameters
$$ --------------------------
##$DU= <F:/spectra>
##$EXPNO= 4
##$NAME= <1H>
##$PROCNO= 1
##$TYPE= <nmr>
##$USER= <iren>
##$AMP= (0..31)
100 100 100 100 100 100 100 100 100 100 100 100 100 100 100 100 100 100 
100 100 100 100 100 100 100 100 100 100 100 100 100 100 
##$ANAVPT= -1
##$AQSEQ= 0
##$AQ_mod= 1
##$AUNM= <au_zg>
##$AUTOPOS= <>
##$BF1= 200.13
##$BF2= 200.13
##$BF3= 200.13
##$BF4= 200.13
##$BF5= 200.13
##$BF6= 200.13
##$BF7= 200.13
##$BF8= 200.13
##$BYTORDA= 1
##$CFDGTYP= 0
##$CFRGTYP= 5
##$CHEMSTR= <none>
##$CNST= (0..63)
1 1 145 1 1 1 1 1 1 1 1 1 1 1 1 1 1 1 1 1 1 1 1 1 1 1 1 1 1 1 1 1 1 1 
1 1 1 1 1 1 1 1 1 1 1 1 1 1 1 1 1 1 1 1 1 1 1 1 1 1 1 1 1 1 
##$CPDPRG= <>
##$CPDPRG1= <>
##$CPDPRG2= <>
##$CPDPRG3= <>
##$CPDPRG4= <mlev>
##$CPDPRG5= <mlev>
##$CPDPRG6= <mlev>
##$CPDPRG7= <mlev>
##$CPDPRG8= <mlev>
##$CPDPRGB= <>
##$CPDPRGT= <>
##$D= (0..63)
0 2 0 0 0 0 0 0 0 0.06 0 0.03 0 0 0 0 0.0002 0 0 0 0 0 0 0 0 0 0 0 0 0 
0 0 0 0 0 0 0 0 0 0 0 0 0 0 0 0 0 0 0 0 0 0 0 0 0 0 0 0 0 0 0 0 0 0 
##$DATE= 1734503344
##$DBL= (0..7)
120 120 120 120 120 120 120 120 
##$DBP= (0..7)
150 150 150 150 150 150 150 150 
##$DBP07= 0
##$DBPNAM0= <>
##$DBPNAM1= <>
##$DBPNAM2= <>
##$DBPNAM3= <>
##$DBPNAM4= <>
##$DBPNAM5= <>
##$DBPNAM6= <>
##$DBPNAM7= <>
##$DBPOAL= (0..7)
0.5 0.5 0.5 0.5 0.5 0.5 0.5 0.5 
##$DBPOFFS= (0..7)
0 0 0 0 0 0 0 0 
##$DE= 6
##$DECBNUC= <off>
##$DECIM= 32
##$DECNUC= <off>
##$DECSTAT= 4
##$DIGMOD= 1
##$DIGTYP= 9
##$DL= (0..7)
0 120 120 120 120 120 120 120 
##$DP= (0..7)
150 150 150 150 150 150 150 150 
##$DP07= 0
$$ [...]
##$SW= 21.9926040160658
##$SWIBOX= (0..15)
0 0 2 0 0 0 0 0 0 0 0 0 0 0 0 0 
##$SW_h= 4401.40845070422
##$TD= 16384
##$TD0= 1
##$TE= 300
##$TE2= 300
##$TE3= 300
##$TEG= 300
##$TL= (0..7)
0 120 120 120 120 120 120 120 
##$TP= (0..7)
150 150 150 150 150 150 150 150 
##$TP07= 0
##$TPNAME0= <>
##$TPNAME1= <>
##$TPNAME2= <>
##$TPNAME3= <>
##$TPNAME4= <>
##$TPNAME5= <>
##$TPNAME6= <>
##$TPNAME7= <>
##$TPOAL= (0..7)
0.5 0.5 0.5 0.5 0.5 0.5 0.5 0.5 
##$TPOFFS= (0..7)
0 0 0 0 0 0 0 0 
##$TUNHIN= 0
##$TUNHOUT= 0
##$TUNXOUT= 0
##$USERA1= <user>
##$USERA2= <user>
##$USERA3= <user>
##$USERA4= <user>
##$USERA5= <user>
##$V9= 5
##$VALIST= <valist>
##$VCLIST= <CCCCCCCCCCCCCCC>
##$VD= 0
##$VDLIST= <DDDDDDDDDDDDDDD>
##$VPLIST= <PPPPPPPPPPPPPPP>
##$VTLIST= <TTTTTTTTTTTTTTT>
##$WBST= 1024
##$WBSW= 25
##$XGAIN= (0..3)
0 0 0 0 
##$XL= 0
##$YL= 0
##$YMAX_a= 1373590
##$YMIN_a= -1313320
##$ZGOPTNS= <>
##$ZL1= 120
##$ZL2= 120
##$ZL3= 120
##$ZL4= 120
##$ABSF1= 10
##$ABSF2= 0
##$ABSG= 5
##$ABSL= 3
##$ALPHA= 0
##$AQORDER= 0
##$ASSFAC= 0
##$ASSFACI= 0
##$ASSFACX= 0
##$ASSWID= 0
##$AUNMP= <proc_1d>
##$AXLEFT= 0
##$AXRIGHT= 0
##$AXTYPE= 0
##$AXUNIT= <>
##$AZFE= 0.1
##$AZFW= 0.1
##$BCFW= 1
##$BC_mod= 2
##$BYTORDP= 1
##$COROFFS= 0
##$CY= 7568.61572265625
##$DATMOD= 1
##$DC= 2
##$DFILT= <>
##$DTYPP= 0
##$F1P= 17.9538593292236
##$F2P= -4.03888763876832
##$FCOR= 0.5
##$FTSIZE= 32768
##$FT_mod= 4
##$GAMMA= 1
##$GB= 1
##$INTBC= 1
##$INTSCL= 1
##$ISEN= 128
##$LB= 0.02
##$LEV0= 0
##$LPBIN= 0
##$MAXI= 945.577
##$MC2= 0
##$MEAN= 0
##$ME_mod= 0
##$MI= -402.1523
##$NCOEF= 0
##$NC_proc= 0
##$NLEV= 6
##$NOISF1= 8.587773
##$NOISF2= 6.764455
##$NSP= 1
##$NTH_PI= 0
##$NZP= 0
##$OFFSET= 17.49637
##$PC= 1
##$PHC0= 97.45427
##$PHC1= -4.289141
##$PH_mod= 0
##$PKNL= yes
##$PPARMOD= 0
##$PPDIAG= 0
##$PPIPTYP= 0
##$PPMPNUM= 100
##$PPRESOL= 1
##$PSCAL= 0
##$PSIGN= 0
##$REVERSE= no
##$SF= 200.13
##$SI= 32768
##$SIGF1= 18.5376
##$SIGF2= -6.396296
##$SINO= 400
##$SIOLD= 32768
##$SREGLST= <1H.CDCl3>
##$SSB= 3
##$STSI= 0
##$STSR= 0
##$SW_p= 4401.40845070422
##$SYMM= 0
##$S_DEV= 0
##$TDeff= 0
##$TDoff= 0
##$TI= <>
##$TILT= no
##$TM1= 0
##$TM2= 0
##$TOPLEV= 0
##$USERP1= <user>
##$USERP2= <user>
##$USERP3= <user>
##$USERP4= <user>
##$USERP5= <user>
##$WDW= 1
##$XDIM= 8192
##$YMAX_p= 0
##$YMIN_p= 0
$$ End of Bruker specific parameters
$$ ---------------------------------
##NTUPLES= NMR FID
##VAR_NAME=  TIME,          FID/REAL,        FID/IMAG
##SYMBOL=    X,             R,               I
##VAR_TYPE=  INDEPENDENT,   DEPENDENT,       DEPENDENT
##VAR_FORM=  AFFN,          ASDF,            ASDF
##VAR_DIM=   8192,          8192,            8192
##UNITS=     SECONDS,       ARBITRARY UNITS, ARBITRARY UNITS
##FACTOR=    0.0002272,     1,               1
##FIRST=     0,             0,               0
##LAST=      1.8609952,     268,             20
##MIN=       0,             -1313320,        -1313320
##MAX=       1.8609952,     1373590,         1373590
$$ Real data points
##PAGE= N=1
##DATA TABLE= (X++(R..R)), XYDATA
$$ [...]
$$ plain form
1809 -70 -76 -263 82 77 213 139 90 -172 197 79 149 254 212 -52 -96 63 25 110 78 -120 127 -185 -38 -4 -299
1834 -299 114 -27 -45 -22 133 129 138 81 73 266 63 204 199 -153 -87 186 248 45 -116 78 41 -43 39 -208 -53
1859 -53 -301 -204 -93 43 -146 44 -33 24 286 91 -39 5 -209 111 290 50 245 -24 -41 129 11 31
1881 31 -8 76 109 46 -11 -208 189 95 157 64 -104 -167 -40 16 42 244 -28 130 42 68 274 -101 -31 211 72
1906 72 -34 203 181 170 -64 88 -18 -168 -47 -95 -110 -8 -298 -125 -242 60 101 -89 105 -152 302 128
1928 128 171 163 94 48 -24 173 118 263 42 141 -85 44 -21 -246 9 -109 -15 -116 324 -45 160 43 103 144
1952 144 116 81 135 123 -61 -47 88 -91 276 -26 8 -35 -92 -37 92 -134 11 -176 -47 -22 -35 -139 6 -68
1976 -68 -205 50 -63 244 321 229 -53 123 124 201 166 36 -143 -68 215 301 -130 20 180 -60 -262 -34 -216
$$ packed form
1809g0oj87L45nJ36p4m9k62L69j18P0J05m2k64m4J59l8Q5l2j98K47l12J47L4k95
1834b99M13j41j8K3J55mRn7qJ93k03J41nl52O6K73O2k03j61J94l7q4Q2k47J55
1859e3k48R7J11J36j89J90p7N7K62j95j30M4k14L20J79k40J95k69j7J70j18K0
1881C1l9Q4L3o3n7j97L97r4O2r3j68o3J27N6K6K02k72J58q8K6K06l75P0K42j39
1906G2j06K37k2j1k34J52j06j50J21m8j5J02k90J73j17L02M1j90J94k57M54j74
1928A28M3qo9m6p2J97n5J45k21R9k26J29o5k25K55j18R4j01M40l69K05j17O0M1
1952A44k8l5N4j2j84J4J35j79L67l02L4m3n7N5J29k26J45j87J29K5j3j04J45p4
1976f8j37K55j13L07P7r2k82J76JP7l5j30j79P5K83Q6m31J50J60k40k02K28j82
$$ plain form
1999 -216 -223 -140 -183 -97 92 74 265 3 180 14 -15 5 319 111 73 180 214 -152 96 5 -109 6 -14 -223
2023 -223 -58 68 69 13 102 -158 -403 95 179 -97 108 47 -143 160 175 57 -57 277 246 79 -6 160 150
2046 150 -58 -69 107 42 -170 -100 -151 -9 -9 57 64 103 225 51 218 -136 11 156 -33 172 116 152 -57 98
2070 98 40 97 -34 -3 -141 39 14 -36 93 -24 -199 46 164 -190 106 93 -62 26 177 -54 -124 -113 262
2093 262 412 179 -133 -246 81 -57 205 151 300 103 -251 -33 -219 68 376 137 -55 -148 -197 -83 112
2114 112 209 -72 -91 -65 221 108 -15 -100 211 -65 -146 106 -461 190 -258 -7 -90 -58 135 -164 39 -49 -52
2137 -52 31 -65 -143 -165 154 86 -53 33 385 175 73 184 119 136 78 -279 90 142 -129 -97 -27 5 48 -194 -205
2162 -205 148 4 -153 -26 -117 41 -116 3 434 117 -58 -144 103 -318 35 -13 -183 217 56 -90 -87 -71
$$ packed form
1999b16pQ3m3Q6J89j8J91k62J77j66k9K0L14k08l8J07L4l66K48r1j14J15k0k09
2023b23J65J26Jn6Q9k60k45M98Q4k76K05o1j90L03J5j18j14L34l1j67q5J66j0
2046A50k08j1J76o5k12P0n1J42%O6PL9J22j74J67l54J47J45j89K05n6L6k09J55
2070I8n8N7j31L1j38J80k5n0J29j17j75K45J18l54K96j3j55Q8J51k31p0J1L75
2093B62J50k33l12j13L27j38K62n4J49j97l54K18j86K87L08k39j92r3m9J14J95
2114A12R7k81j9K6K86j13j23q5L11k76q1K52n67O51m48K51q3L2J93k99K03q8l
2137e2Q3r6p8k2L19o8j39Q6L52k10j02J11o5J7n8l57L69N2k71L2P0L2M3k42j1
2162b05L53j44j57J27r1J58j57J19M31l17j75q6K47m21L53m8j70M00j61j46LJ6
$$ plain form
2184 -71 122 -36 -1 38 -26 -10 43 -48 124 5 230 -113 72 196 56 140 96 190 178 10 -286 80 267 -55
2208 -55 40 161 212 2 -219 -75 -78 -85 -62 -10 61 198 42 -105 80 -9 -71 192 -27 -48 64 282 238 153 139
2233 139 135 -7 -129 77 -106 -51 53 37 55 104 207 -264 -179 -78 102 190 -83 -81 244 22 36 -135 152 92
2257 92 15 -247 18 306 207 -201 -326 -177 -198 -73 -348 201 -194 -189 -227 119 42 -212 -114 -50 201 -290 -94
2280 -94 -90 91 142 -12 -50 132 85 -86 -39 204 -40 -173 -38 50 -89 -179 160 -72 179 -258 -192 60 -42
2303 -42 -21 -87 107 88 255 119 -180 281 94 25 281 195 21 -310 -55 199 176 45 20 6 -10 -152 -233 70
2327 70 -32 -232 -5 5 28 -65 38 0 55 8 -5 106 165 -127 95 53 -94 127 33 33 -57 -52 17 38 64 8 141
2354 141 71 -79 49 28 320 75 67 -215 238 -103 56 75 255 -136 91 -84 94 88 -94 -117 157 -35 -3
$$ packed form
2184g1J93j58L5L9o4J6N3r1J72j19K25l43J85J24j40Q4m4R4j2j68k96L66J87l22
2208e5R5J21N1k10k21J44lpK3N2P1J37j56j47J85q9o2K63k19k1J12K18m4q5j4
2233A39mj42j22K06j83N5J04j6J8M9J03m71Q5J01J80Q8k73KL25k22J4j71K87o0
2257I2p7k62K65K88r9m08j25J49k1J25k75N49l95Nl8L46p7k54R8O4K51m91J96
2280i4MJ81N1j54l8J82m7j71M7K43k44j33J35Q8j39r0L39k32K51m37O6K52j02
2303d2K1o6J94j9J67j36k99M61j87o9K56q6j74l31K55K54k3j31k5j4j6j42q1L03
2327G0j02k00K27J0K3r3J03l8N5m7j3J11N9k92K22m2j47K21r4%r0NO9K1K6n6J33
2354A41p0j50J28k1K92k45qk82M53l41J59J9J80l91K27j75J78oj82k3K74j92L2
$$ plain form
2377 -3 -44 50 -275 -206 -93 18 -29 204 252 169 -33 15 85 174 218 84 -3 248 75 -91 233 204 -11 52 146
2402 146 -200 89 77 -45 102 27 -82 -47 161 124 -29 75 71 -165 -150 -30 28 157 -13 146 28 82 45
2425 45 -56 85 -96 254 42 -50 18 -113 218 -148 -53 137 53 2 -139 112 193 -119 -72 -41 65 61 89 152
2449 152 -31 81 76 -92 -168 -25 140 14 88 0 -134 151 125 130 191 -122 412 205 90 118 247 14 -63 -1
2473 -1 128 109 -167 -60 -80 -19 281 50 -25 74 84 -87 1 82 33 84 -350 -71 -238 -11 -26 158 91 95 -25
2498 -25 157 -170 -24 157 -75 -98 22 8 -4 183 7 32 239 -125 135 106 -239 166 95 -1 2 -7 0 60 -39
2523 -39 1 110 85 104 189 168 -46 -17 25 225 89 10 55 149 -122 0 -120 88 -208 -79 -32 -181 48 -210
2547 -210 -42 -42 264 -43 281 9 118 -113 -81 68 -7 75 85 -78 160 219 -100 -21 -31 44 -228 -106 59
$$ packed form
2377cm1R4l25O9J13J11m7K33M8q3k02M8P0Q9M4j34q7K51j73j66L24k9k15O3R4
2402A46l46K89j2j22J47p5j09L5K08l7j53J04mk36J5J20N8J29j70J59j18N4l7
2425D5j01J41j81L50k12r2O8j31L31l66R5J90q4n1j41K51Q1l12M7L1J06mK8O3
2449A52j83J12nj68p6J43J65j26P4q8j34K85k6NO1l13N34k07j15K8J29k33p7O2
2473aJ29j9k76J07k0O1L00k31p5R9J0j71Q8Q1m9N1m34K79j67K27j5J84o7Mj20
2498b5J82l27J46J81k32k3J20j4j2J87j76K5K07l64K60k9l45M05p1r6LrPO0r9
2523c9M0J09k5J9Q5k1k14K9M2K00j36p9M5R4k71J22j20K08k96J29M7j49K29k58
2547b10J68%L06l07L24k72J09k31L2J49p5Q2J0j63K38N9l19P9j0P5k72J22J65
$$ plain form
2570 59 -114 -29 195 -25 225 31 -175 115 1 -125 -116 246 -9 -91 9 116 -18 78 165 128 347 -98 -40
2593 -40 -141 -208 -96 50 -218 109 -31 -133 76 -114 -59 272 133 -162 169 145 66 -40 158 -52 -2 -107
2615 -107 -51 -42 139 -187 -89 131 14 -55 190 -65 -18 63 -97 -34 -12 -84 -28 121 -147 35 161 198 -17 71
2639 71 -23 -47 82 -16 -56 49 -164 15 -138 -21 -171 -164 -34 -301 -109 -354 0 -29 180 -142 206 391 32
2662 32 165 40 62 94 141 -80 87 285 38 9 -144 -174 -10 22 251 -136 -108 70 92 -100 73 -104 166
2685 166 49 -161 -150 -5 57 176 57 -139 -46 105 -35 219 -38 75 -52 -54 -14 -58 -185 50 -208 -157 -107
2708 -107 106 26 5 1 -12 41 -165 212 -12 59 16 97 -209 -111 274 -76 -246 81 148 19 11 -60 7 -65 -40 -117
2734 -117 -247 -63 62 -27 -8 -62 128 182 -121 80 215 165 -23 -144 57 107 253 -14 18 135 -92 -225
$$ packed form
2570E9j73Q5K24k20K50j94k06K90j14j26RL62k55q2J00J07j34R6Q7l7K19m45N8
2593d0j01o7J12J46k68L27j40j02K09j90N5L31j39k95L31k4p9j06J98k10N0j05
2615a07N6RJ81l26R8K20j17o9K45k55M7Q1j60O3K2p2N6J49k68J82J26L7k15Q8
2639G1r4k4J29r8m0J05k13J79j53J17j50PJ30k67J92k45L54k9K09l22L48J85l59
2662C2J33j25K2L2M7k21J67J98k47k9j53l0J64L2K29l87K8J78K2j92J73j77K70
2685A66j17k10J1J45O2J19j19j96R3J51j40K54k57J13j27kM0m4j27K35k58N1N0
2708a07K13q0k1mj3N3k06L77k24P1m3Q1l06R8L85l50j70L27O7j29qp1O7p2K5p7
2734a17j30J84J25q9J9n4J90N4l03K01J35n0j88j21K01N0J46k67L2J17k27j33
$$ plain form
2756 -225 137 60 -115 -112 156 200 -191 43 -167 0 -64 102 -27 109 81 191 122 104 7 188 -45 88 -112
2779 -112 190 101 229 51 -26 43 -167 196 -111 154 -125 240 35 -164 -13 -26 144 -431 103 -285 21
2800 21 -210 5 84 36 150 -268 -56 -155 129 185 44 188 -49 27 8 194 54 108 122 104 -35 -97 110 -3
2824 -3 14 199 81 88 67 99 -193 210 81 196 226 39 112 22 70 275 93 90 73 -337 -157 60 -234 250 -80
2849 -80 -23 -334 -130 47 77 181 -9 -195 8 52 -102 38 22 99 62 123 -23 -189 132 96 30 124 -48 93
2873 93 -26 -74 250 7 -164 -118 52 30 125 59 -51 50 -237 -194 96 204 -49 288 152 52 -122 145
2895 145 -95 -205 -12 6 94 -50 -133 -114 -3 -33 224 -243 36 150 -52 -53 -289 41 -37 197 -91 -6 269
2918 269 -53 155 20 31 180 80 -25 135 25 298 1 41 -112 -101 79 68 42 161 -172 -18 150 -87
$$ packed form
2756b25L62p7j75LK68M4l91K34k10J67o4J66j29J36k8J10o9j8r7J81k33J33k00
2779a12L02q9J28j78p7O9k10L63l07K65k79L65k05j99J51j3J70n75N34l88L06
2800B1k31K15P9m8J14m18K12r9K84N6j41J44k37P6j9J86j40N4J4j8j39o2K07j13
2824cJ7J85j18Pk1L2k92M03j29J15L0j87P3r0M8K05j82lj7m10J80K17k94M84l30
2849h0N7l11K04J77L0J04j90j86K03M4j54J40j6P7l7O1j46j66L21l6o6R4j72J41
2873I3j19m8L24k43j71M6J70k2R5o6j10J01k87M3K90J08k53L37j36j00j74K67
2895A45k40j10J93J8Q8j44q3J9J11l0K57m67K79J14k02jk36L30p8K34k88Q5K75
2918B69l22K08j35J1J49j00j05J60j10K73k97M0j53J1J80j1k6J19l33J54J68k37
$$ plain form
2940 -87 90 -85 -7 -73 -196 1 -7 -76 -193 80 -207 -234 217 -159 -110 -137 -40 -13 103 -24 106 157 -161 -50
2964 -50 18 137 -67 -60 36 -1 102 -217 -36 124 153 142 176 -46 -22 -71 116 -87 94 -53 150 72 40 41 106
2989 106 -77 149 190 -47 180 -30 -49 -20 13 -58 91 190 -393 295 225 -145 35 36 28 165 -176 104 -10 46
3013 46 62 17 -36 -36 94 -147 -48 182 -122 2 60 -80 148 -104 218 99 -124 61 115 44 20 226 -154 -266
3037 -266 -114 336 -129 36 -25 -79 124 9 -5 12 -162 -140 47 -167 -234 34 181 29 190 -91 18 -27
3059 -27 -41 -68 -124 -142 -275 10 -38 -88 -58 -160 136 -71 -38 157 35 -51 221 233 157 -73 136 61 6 212 86
3084 86 98 -39 -89 -39 72 -17 62 250 169 -160 288 176 204 98 106 -38 73 203 -150 26 -185 76 -117
3107 -117 42 -10 112 191 228 86 -32 86 108 -47 79 262 170 244 1 64 -87 163 -109 -168 82 19 -92
$$ packed form
2940h7J77j75P8o6j23J97qo9j17K73k87k7M51l76M9k7R7K7J16j27J30N1l18J11
2964e0O8J19k04PR6l7J03l19J81J60K9j1L4k22K4m9J87k03J81j47K03p8l2JO5
2989A06j83K26M1k37K27k10j9K9L3p1J49R9n83O88p0l70J80JqJ37l41K80j14N6
3013D6J6m5n3%J30k41R9K30l04J24N8j40K28k52L22j19k23J85N4p1k4K06l80j12
3037b66J52M50m65J65o1n4K03j15j4J7j74K2J87k14o7K68J47j52J61k81J09m5
3059b7j4k7n6j8j33K85m8n0L0j02K96k07L3J95j22q6K72J2p6k30K09p5n5K06j26
3084H6J2j37n0N0J11q9P9J88q1l29M48j12K8j06Qj44J11J30l53J76k11K61j93
3107a17J59n2J22P9L7j42j18J18K2j55J26J83r2P4k43O3j51K50k72n9K50o3j11
$$ plain form
3130 -92 81 181 -99 85 113 53 -116 181 -6 75 -161 5 140 182 -306 82 -47 -88 -160 -308 32 6 -100
3153 -100 -137 8 59 -145 -73 26 84 6 -37 -17 74 71 0 -63 -132 146 230 17 236 219 71 65 -144 -285 128 174
3179 174 -49 205 -64 315 71 -191 211 -34 3 277 30 -128 114 200 -108 -43 -268 84 -13 -166 155
3200 155 42 -52 -71 159 39 147 -225 -259 72 -33 -41 52 -61 -100 -64 34 113 121 197 -27 -113 2 330 36 -104
3225 -104 39 132 -135 -64 175 -181 121 162 -56 200 1 -234 242 -41 -117 11 46 167 139 154 122 -31 -27
3248 -27 -171 13 64 67 -279 -241 -118 -41 -8 -49 -50 -257 -189 -89 90 195 -2 -47 -109 109 -106 -126 -229 -28 81
3273 81 116 235 -37 -110 17 179 53 -225 -65 -152 -89 -73 -150 -54 -34 -43 4 52 -133 -153 20 94 -48 -101 -155 58
3299 58 224 -111 116 -93 -152 -259 -227 -164 -81 -224 255 134 150 27 -51 21 -23 95 -19 246 100 -50 38
$$ packed form
3130i2J73J00k80J84K8o0j69K97j87Q1k36J66J35M2m88L88j29m1p2j48L40k6j06
3153a00l7J45N1k04P2R9N8p8m3K0R1lp1o3o9K78Q4k13K19j7j48ok09j41M13M6
3179A74k23K54k69L79k44k62M02k45L7K74k47j58K42Q6l08O5k25L52r7j53L21
3200A55j13r4j9K30j20J08l72l4L31j05qR3j13l9L6R8P9QP6k24q6J15L28k94j40
3225a04J43R3k67P1K39l56L02M1k18K56j99k35M76k83p6J28L5J21k8J5l2j53M
3248b7j44J84N1Ll46L8J23P7L3m1jk07O8J00J79J05j97m5o2K18k15k0j03K01J09
3273H1L5J19k72p3J27J62j26k78J60q7O3J6p7R6K0rM7M8j85k0J73P4j42n3n4K13
3299E8J66l35K27k09n9j07L2O3Q3j43M79j21J6j23p8P2m4J18j14K65j46j50Q8
$$ plain form
3322 38 14 112 -300 38 0 -103 22 53 29 217 -197 -82 44 -161 -274 -18 -84 -37 34 175 110 -121 -121 217
3346 217 84 -31 -17 23 48 86 -3 -54 -53 40 151 138 -242 163 41 -114 -273 82 191 -52 4 -81 -60 -27 -32
3371 -32 -39 -32 22 108 126 167 22 65 188 30 -103 -6 -83 9 -35 -153 49 251 -116 173 -53 -138 3 -274 247
3396 247 -22 -44 7 99 53 223 -80 -78 56 115 -103 -8 -26 -28 -122 -26 -143 -35 280 -157 129 -131 49 38 -172
3421 -172 -173 40 90 -124 228 192 -112 143 192 -78 -177 104 18 44 80 106 147 251 -46 70 110 -335 -42 -144
3445 -144 -23 252 163 -84 223 144 -196 125 22 372 83 36 -138 294 246 -117 172 193 113 82 254 141
3467 141 19 117 135 58 -17 -77 -184 8 43 242 137 40 50 20 -23 35 231 -138 -9 102 -77 100 -69 179
3491 179 -163 179 -20 152 -16 72 -40 2 -68 25 -129 54 -110 -34 -112 -80 -9 -273 -63 79 -15 50 -78
$$ packed form
3322C8k4R8m12L38l8j03J25L1k4J88m14J15J26k05j13K56o6M7P1J41o5k31%L38
3346B17j33j15J4M0K5L8q9n1JR3J11j3l80M05j22j55j59L55J09k43N6q5K1L3n
3371c2pPN4Q6J8M1j45M3J23j58j33R7p7R2m4j18K02K02l67K89k26q5J41k77N21
3396B47k69k2N1R2m6J70l03KJ34N9k18R5j8kr4R6j17J08L15m37K86k60J80j1k10
3421a72jK13N0k14L52l6l04K55M9k70r9K81q6K6L6K6M1J04k97J16M0m45K93j02
3445a44J21K75q9k47L07p9l40L21j03L50k89m7j74M32m8l63K89K1q0l1J72j13
3467A41j22R8J8p7p5o0j07J92L5J99j05r7J0l0m3N8J96l69J29J11j79J77j69K48
3491A79l42L42j99J72j68Q8j12M2p0R3j54J83j64P6p8L2P1k64K10J42r4O5j28
$$ plain form
3514 -78 -55 29 108 118 -202 148 -2 99 141 26 272 -60 52 143 42 85 -33 -98 -210 -166 -24 -5 56 8
3538 8 -197 294 -89 -152 9 3 141 250 75 163 -69 -268 94 256 44 89 -54 -285 178 169 150 82 60 211
3562 211 -7 -206 151 100 -122 57 -100 58 -10 167 77 -95 76 -142 27 155 82 15 -78 -299 -63 -34
3584 -34 85 109 82 20 171 -17 144 97 -78 23 206 -227 198 -195 -297 -287 -13 -107 -139 -175 261 -31 -21
3607 -21 -22 -69 189 35 -287 -195 88 -308 17 -52 -61 -67 -134 -42 219 161 28 21 86 -195 55 75 141 243 137 -139
3633 -139 83 -58 -65 221 -71 12 15 -112 68 11 62 64 94 -54 -131 -69 -59 85 139 50 -146 -67 -247 -18 149
3658 149 60 48 -25 -4 64 99 174 13 -142 -252 141 121 -42 -44 -42 176 207 113 165 132 73 103 -91 -88 -18 96 272
3685 272 103 -306 -92 81 -68 109 193 -51 -60 -143 -92 -38 -143 1 -345 12 -32 -44 -100 -47 -101 63 92 70
$$ packed form
3514g8K3Q4P9J0l20L50j50J01M2j15K46l32J12R1j01M3j18o5j12M4J42J9O1m8
3538Hk05M91l83o3J61oJ38J09j75Q8k32j99L62J62k12M5j43k31M63rj9o8k2J51
3562B11k18j99L57n1k22J79j57J58o8J77r0j72J71k18J69J28p3o7r3k21K36K9
3584c4J19K4k7o2J51j88J61m7j75J01J83m33M25l93j02J0K74r4l2l6M36k92J0
3607b1jm7K58j54l22R2K83l96L25o9roo7R2K61n8j33pO5k81K50K0O6J02j06k76
3633a39K22j41pK86k92Q3Lj27J80n7N1KL0j48p7O2J0J44N4q9j96P9j80K29J67
3658A49q9j2p3K1O8L5P5j61j55j10L93k0j63kKK18L1r4N2l3n9L0j94LP0J14J76
3685B72j69m09K14J73j49J77Q4k44rq3N1N4j05J44l46L57m4j2n6N3n4J64K9k2
$$ plain form
3709 70 -1 52 -19 -149 109 -32 90 -98 50 -210 54 110 83 -97 -21 -45 243 243 211 -66 76 -84 123 192
3733 192 89 297 -154 156 -75 181 51 268 58 -19 -7 264 -133 -40 -44 -236 82 -350 -175 101 232 -2
3755 -2 255 48 1 167 31 -114 -112 25 -50 -96 -84 377 -169 -108 -205 167 31 295 201 36 36 -15 106 21 -154
3780 -154 -88 280 138 -149 65 -35 -20 236 117 25 -160 70 -145 64 -40 -103 -120 193 -136 143 -13 -36
3802 -36 -43 47 67 101 67 -74 -314 109 -293 -118 -229 -78 -111 -88 77 -150 -119 -23 198 71 -229 115 31 127
3826 127 -135 42 126 77 -95 -11 -6 140 140 -84 42 141 180 -24 205 -40 82 -19 -30 56 80 66 -8 -234 -179
3851 -179 -174 -60 -6 -207 -223 104 263 -55 -163 125 -62 -67 -375 -29 -64 -310 30 -28 5 102 120 203 -162 18
3875 18 -238 -55 -226 17 114 92 -59 -39 -361 9 245 -72 75 -318 85 -56 39 91 28 330 -85 -65 -112
$$ packed form
3709G0p1N3p1j30K58j41J22j88J48k60K64N6k7j80P6k4K88%l2k77J42j60K07O9
3733A92j03K08m51L10k31K56j30K17k10p7J2K71l97R3mj92L18m32J75K76J31k34
3755bK57k07m7J66j36j45KJ37p5m6J2M61n46O1r7L72j36K64r4j65%n1J21q5j75
3780a54O6L68j42k87K14j00J5K56j19r2j85K30k15K09j04o3j7L13l29K79j56k3
3802c6pR0K0L4l4j41k40M23m02J75j11J51l3K3J65k27L1R6K21j27l00L44q4R6
3826A27k62J77Q4m9j72Q4NJ46%k24J26R9L9k04K29k45J22j01j1Q6K4j4p4k26N5
3851a79NJ14N4k01j6L27J59l18j08K88j87nl08L46l5k46L40n8L3R7J8Q3l65J80
3875A8k56J83j71K43R7k2j51K0l22L70K36l17J47l93M03j41R5N2o3L02m15K0m7
$$ plain form
3898 -112 -33 50 -34 -33 241 -218 -62 205 230 100 237 -260 -50 -165 -124 -134 105 -217 -250 -68 143 -81 -160
3921 -160 -223 9 22 78 -116 -191 0 32 69 48 128 99 257 189 279 54 -40 33 -112 -41 94 110 121 310 59
3946 59 41 82 -20 81 141 210 -142 19 131 64 -116 66 -53 106 -123 55 -250 247 -21 36 -254 -173 193
3969 193 40 -144 75 70 -53 107 110 106 -28 -114 67 230 -105 -135 181 -63 38 96 -196 11 -62 92 -174
3992 -174 61 220 44 -206 -3 -351 55 -159 -76 18 113 79 -121 -81 -61 0 254 -2 2 49 190 176 -140 -128
4016 -128 45 10 -197 63 -203 -103 -12 90 -66 4 54 81 163 89 10 -73 171 127 173 103 211 145 105 71 -78
4041 -78 107 45 170 -102 -192 -86 302 -154 151 -112 91 235 64 93 -171 -58 8 -23 69 4 -97 -116 145
4064 145 242 -42 -25 218 -105 107 43 9 215 -164 -116 -271 -61 40 -126 188 -38 -235 -38 67 163 206
$$ packed form
3898a12P9Q3q4JK74m59J56K67K5j30J37m97K10j15M1j0K39l22l3J82K11k24p9
3921a60o3K32J3N6j94p5J91L2L7k1Q0k9J58o8R0k25r4P3j45P1J35J6J1J89k51
3946E9j8M1j02J01O0O9l52J61J12o7j80J82j19J59k29J78l05M97k68N7k90Q1L66
3969A93j53j84K19nj23J60Lmj34q6J81J63l35l0L16k44J01N8k92K07p3J54k66
3992a74K35J59j76k50K03l48M06k14Q3R4R5l4k00M0K0O1K54k56MM7J41j4l16J2
4016a28J73l5k07K60k66J00R1J02j56P0N0K7Q2p4p9q3K44m4M6p0J08o6m0l4j49
4041g8J85o2J25k72r0J06L88m56L05k63K03J44j71K9k64J13O6l1R2o5j01j9K61
4064A45R7k84J7K43l23K12o4l4K06l79M8j55K10J01j66L14k26j97J97J05R6M3
$$ plain form
4086 206 114 -170 84 -38 184 -172 43 351 76 108 206 24 45 42 -177 150 -180 86 69 -189 157 -28
4108 -28 -124 -48 59 15 -159 196 6 -47 71 186 100 9 67 44 -129 37 89 7 -35 -335 17 -160 -50 -73
4132 -73 43 -32 73 -192 -7 -40 20 -233 -102 31 67 28 63 197 99 -177 -284 207 -14 -188 61 -3 14
4155 14 -10 101 132 308 260 -154 -30 25 114 -122 -212 -48 -96 -266 -95 43 229 -358 -97 201 6 -71 -55
4178 -55 -276 31 -71 86 -65 212 101 112 90 42 57 -78 -135 -8 -2 125 -110 -181 61 40 91 292 -59 -101
4202 -101 -50 152 213 128 -67 -150 132 -174 -63 84 -5 -167 -318 7 -41 -363 -77 30 -65 -119 21 -44 19
4225 19 -122 -113 -29 -32 135 47 39 -110 -121 68 -71 -16 -78 66 14 54 -164 89 40 48 -6 -77 288 163 183 -83 99
4252 99 106 46 -189 -133 -57 -167 -69 8 -102 -82 -27 -77 96 193 117 20 -101 196 -83 258 -101 179 -71 48 -73
$$ packed form
4086B06r2k84K54j22K22l56K15L08k75L2R8j82K1lk19L27l30K66j7k58L46j85
4108b8r6P6J07m4j74L55j90n3J18J15q6r1N8k3j73J66N2q2m2l00L52j77J10k3
4132g3J16p5J05k65J85l3O0k53J31J33L6l9L5J34r8k76j07M91k21j74K49o4J7
4155A4k4J11L1J76m8m14J24N5Q9k36r0J64m8j70J71J38J86n87K61K98j95p7J6
4178e5k21L07j02J57j51K77j11J1k2m8J5j35n7J27OJ27k35p1K42k1N1K01l51m2
4202a01N1K02O1q5j95q3K82l06J11J47q9j62j51L25m8l22K86J07r5n4J40o5O3
4225A9j41RQ4lJ67q8qj49j1J89j39N5o2J44n2M0k18K53m9Qn4p1L65j25K0k66J82
4252I9Po0k35N6P6j10R8P7j10K0N5n0J73R7p6r7j21K97k79L41l59K80k50J19j21
$$ plain form
4277 -73 -70 -92 -9 -162 53 -4 2 -156 -75 -108 -266 98 1 85 21 -145 53 -52 117 189 130 -191 -305 80 387
4302 387 289 -182 -45 108 233 18 -109 -125 -182 -48 260 -124 162 -68 -293 56 -114 -107 3 -58 -31 248
4324 248 -303 -34 35 -161 108 -84 88 -27 -121 104 149 172 302 -194 467 -108 -74 143 167 137 367 90
4346 90 11 87 -10 107 154 118 -109 -146 170 31 184 158 102 41 -190 366 -77 141 -126 160 68 -41 49 -15
4370 -15 -62 -16 276 -62 208 -109 9 -56 59 -135 -103 20 -109 -2 -232 288 50 -264 137 -169 121 -117
4392 -117 0 28 -80 14 -56 -143 -4 52 128 -67 -213 247 5 -107 -144 -75 241 51 98 117 -81 -6 -99 221
4416 221 -92 -248 64 -186 -260 14 -172 142 -112 -101 -106 -67 -30 84 -32 45 107 -140 -172 6 261 67 81
4439 81 -73 -227 192 -201 4 282 -30 144 -195 56 212 -53 73 355 96 55 -34 -291 166 -140 58
$$ packed form
4277g3Lk2Q3j53K15n7Oj58Q1l3j58L64r7Q4o4j66J98j05J69P2n9l21j14L85L07
4302C87r8m71J37J53J25k15j27j6n7J34L08l84K86k30k25L49j70PJ10o1K7K79
4324B48n51K69O9j96K69j92J72j15r4K25M5K3J30m96O61n75L4K17K4l0K30k77
4346I0p9P6r7J17M7l6k27l7L16j39J53k6n6o1k31N56m43K18k67K86r2j09R0o4
4370a5m7M6K92l38K70l17J18o5J15j94L2J23j29J07k30N20k38l14M01l06K90k38
4392a17J17K8j08R4p0q7J39N6P6j95j46M60k42j12l7O9L16j90M7J9j98P5r3L20
4416B21l13j56L12k50p4K74j86L14k54J1nL9L7J14j16P7O2k47l2J78K55j94J4
4439H1j54j54M19l93K05K78l12J74l39K51J56k65J26K82k59m1q9k57M57l06J98
$$ plain form
4460 58 32 174 -239 -88 73 84 -46 -66 -306 -56 -85 -121 -179 158 -35 -5 32 4 -31 -60 125 -102 -11 115
4484 115 -51 -87 39 63 -186 -237 52 -89 -35 -150 121 256 40 102 36 285 248 0 -51 -156 180 38 -34
4507 -34 -160 52 324 50 -46 126 -163 -126 184 -171 37 -302 153 105 -38 155 -115 203 -27 -240 4
4528 4 -14 102 62 -36 -207 -45 -170 -156 25 132 -120 110 104 -260 -36 49 93 60 -173 -32 41 62 296 30
4552 30 -210 243 200 152 -21 -28 -83 -202 -83 -96 39 -275 -37 225 225 -74 112 108 -51 167 -61 281 -101 -65
4576 -65 31 -6 -184 -106 5 -69 285 -9 29 225 30 -83 -5 -47 17 104 -74 78 59 -134 -29 82 -7 -182
4600 -182 205 -162 -255 -182 -44 -79 219 138 51 -6 -127 -11 -131 93 20 95 -82 -38 218 -36 54 -169 -184 193
4624 193 -131 -58 -63 -25 126 -40 261 -214 240 -93 -31 46 17 -98 49 144 -197 -201 -57 5 -151 17 -39 16
$$ packed form
4460E8k6J42m13J51J61J1j30k0k40K50k9l6n8L37j93L0L7k8l5k9J85k27R1J26
4484A15j66l6J26K4k49n1K89j41N4j15K71J35k16O2o6K49l7k48n1j05L36j42p2
4507c4j26K12K72k74r6J72k89L7L10l55K08l39M55m8j43J93k70L18k30k13K44
4528Dj8J16m0r8j71J62j25J4J81J07k52K30ol64K24Q5M4l3k33J41P3K1K34k66
4552C0k40M53m3m8j73pn5j19J19j3J35l14K38K62%k99J86mj59K18k28L42l82L6
4576f5R6l7j78P8J11p4L54k94L8J96j95j13P8m2O4Q7j78J52j9j93J05J11q9j75
4600a82L87l67r3P3J38l5K98q1q7n7j21J16j20K24p3P5j77M4K56k54R0k23j5L77
4624A93l24P3nL8J51j66L01m75M54l33O2P7k9j15J47R5l41mJ44O2j56J68n6N5
$$ plain form
4648 16 85 65 -18 16 -66 -127 -133 79 190 -307 101 88 -9 148 186 22 321 -105 -133 -7 -3 -178 -267 73 -83
4673 -83 27 -44 38 -167 -34 11 21 -68 41 46 178 68 126 63 6 21 92 48 111 174 -9 79 -72 6 -39 -153
4699 -153 23 52 -14 21 -59 63 -6 -116 -19 184 -145 131 72 -106 -49 196 132 202 8 -52 339 16 -24 140
4723 140 12 275 92 81 128 -217 76 22 -111 -76 -192 -60 -111 -36 -71 -10 -26 166 -142 -238 -78 11 -3 -37
4747 -37 -95 187 177 99 -48 -18 87 162 -10 97 77 102 68 -15 -143 -83 -98 -88 241 -62 113 -48 -46 271 44
4772 44 -15 55 309 -6 72 -87 28 211 -69 -52 93 184 -193 -49 18 -246 86 -95 -52 111 -27 -44 61
4795 61 119 -4 78 -41 -118 26 74 3 -89 -238 -156 -95 86 125 122 -72 112 98 18 -189 -225 -33 101 197 -150
4820 -150 191 0 -64 165 26 71 67 61 -74 286 -42 -97 -206 -87 117 -124 -70 68 -183 -108 307 18 -79
$$ packed form
4648A6O9k0q3L4q2o1oK12J11m97M08j3r7J57L8j64K99m26k8J26Mj75q9L40j56
4673h3J10p1Q2k05J33M5J0q9J09NJ32j10N8o3n7J5P1m4O3O3j83Q8j51P8m5j14
4699a53J76K9o6L5q0J22o9j10R7K03l29K76n9j78N7K45o4P0j94o0L91l23m0J64
4723A40j28K63j83j1M7l45K93n4j33L5j16J32n1P5l5O1j6J92l08r6J60Q9j4l4
4747c7n8K82j0p8j47L0J05P5j72J07k0K5l4q3j28O0j5J0L29l03J75j61KL17k27
4772D4n9P0K54l15P8j59J15J83k80J7J45R1l77J44O7k64L32j81M3J63j38j7J05
4795F1N8j23Q2j19p7J44M8p1r2j49Q2O1J81L9lj94J84j4q0k07l6J92J34R6l47
4820a50L41j91o4K29j39M5moj35L60l28n5j09J19K04k41N4J38k51P5M15k89r7
$$ plain form
4843 -79 28 -103 -80 236 170 -139 51 57 -119 58 54 -12 144 -166 -30 145 1 62 -96 -104 -31 -37 59 70 -273
4868 -273 -128 -42 20 -5 73 186 134 109 -47 -57 -145 14 149 91 80 242 -88 92 -114 126 82 -102 175 -249
4892 -249 46 -51 199 -24 -121 -52 61 186 -65 52 -173 54 103 186 34 112 180 69 262 130 -132 73
4914 73 -103 -222 -133 -65 -83 -14 31 -64 -12 119 -150 193 55 229 -74 -113 154 -207 -50 -21 -65 -93 -13 62 -26
4939 -26 -154 -2 172 6 -68 161 -7 166 216 -101 -30 -127 -13 -9 70 -200 -40 180 135 98 148 203 -33 189
4963 189 387 -52 33 257 31 23 -10 120 270 -131 150 -233 -73 18 -253 11 79 74 40 -103 -141 -43 134 -137
4987 -137 49 -23 -144 225 -102 -65 -265 -179 -175 -119 -171 29 -51 152 -4 107 -120 -9 35 140 315 112 175
5010 175 195 -77 227 15 87 -14 -117 331 -37 83 -21 405 -137 -137 -11 8 -159 -41 130 109 82 -140
$$ packed form
4843g9J07j31K3L16o6l09J90Oj76J77mo6J56l10J36J75j44O1j58qP3oR6J1l43
4868b73J45Q6O2k5P8J13n2k5j56j0q8J59J35n8j1J62l30J80k06K40m4j84K77m24
4892b49K95r7K50k23r7O9J13J25k51J17k25K27M9Q3j52P8O8j11J93j32k62K05
4914G3j76j19Q9O8j8O9M5r5N2J31k69L43j38J74l03l9K67l61J57K9m4k8Q0P5q8
4939b6j28J52J74j66p4K29j68J73N0l17P1r7J14MP9k70J60K20m5l7N0N5k36K22
4963A89J98m39Q5K24k26ql3J30J50m01K81l83J60R1k71K64O8nl4j43l8R8J77k71
4987a37J86p2j21L69l27L7k00Q6MN6n2K00q0K03j56J11k27J11M4J05J75k03O3
5010A75K0k72L04k12P2j01j03M48l68J20j04M26n42%J26J9j67J18J71k1k7k22
$$ plain form
5032 -140 217 53 266 16 140 10 3 -47 250 13 47 -130 152 186 92 61 -9 32 43 49 -200 -44 -60 -11 4
5057 4 272 124 139 211 152 -30 116 168 135 164 150 211 191 -185 -151 112 -61 -62 124 -189 72 6 139 -4 -6 -322
5083 -322 -15 -220 16 -87 -41 116 -234 -175 -189 85 102 30 -115 76 -101 -87 -186 135 80 90 -76 93 -211
5106 -211 -133 -89 151 1 -28 -108 -60 -32 -237 -76 -55 115 24 130 -12 192 360 145 24 24 -139 -9 265
5129 265 -64 35 191 -71 229 162 8 121 -167 -15 -184 80 15 92 -26 8 148 50 -16 28 -48 -34 -81 30
5153 30 66 -117 110 -56 85 85 175 -87 -212 -52 127 177 -29 94 139 -12 -35 -187 -45 343 358 105 -167
5176 -167 120 86 62 91 -185 -99 -20 65 251 -51 17 -24 -133 -200 20 29 -50 89 8 180 -83 152 127 184 -296
5201 -296 -89 -43 -123 -226 -130 -69 160 303 -13 -92 -101 184 35 -90 144 -86 -11 -192 209 170 153 201 -230 -48
$$ packed form
5032a40L57j64K13k50J24j30pn0K97k37L4j77K82L4r4l1p0M1J1Ok49J56j6M9J5
5057DK68j48J5P2n9j82J46N2l3K9j4O1k0l76L4K63j73jJ86l13K61o6J33j43kl16
5083c22L07k05K36j03M6J57l50N9j4K74J7p2j45J91j77J4r9L21n5J0j66J69l04
5106b11P8M4K40j50k9q0M8K8k05J61K1J70r1J06j42K04J68k15j21%j63J30K74
5129B65l29R9J56k62L00o7j54J13k88J52j69K64o5P7j18L4J40r8o6M4p6J4m7J11
5153C0L6j83K27j66J41%R0k62j25J60J79N0k06J23M5j51k3j52J42L88J5k53k72
5176a67K87l4k4K9k76Q6P9Q5J86l02O8m1j09o7K20Rp9J39q1J72k63K35k5N7m80
5201b96K07M6q0j03R6O1K29J43l16p9rK85j49j25K34k30P5j81M01l9j7M8m31J82
$$ plain form
5225 -48 -155 306 -93 18 154 -228 -61 -118 147 96 133 113 -114 276 -39 -88 29 -96 -192 -13 -93 -97 278
5248 278 80 38 212 34 -56 69 218 -230 87 71 183 97 17 144 214 -111 -3 79 148 73 42 -27 139 -70
5272 -70 -134 111 -24 -154 -2 -19 -182 21 -67 5 -80 125 330 -48 -78 49 -33 -167 -68 240 -196 -143 -11
5295 -11 -73 -219 90 -54 -29 16 -50 -47 -19 -40 -37 211 -142 -14 -48 -77 13 10 210 54 -73 10 -15 -49 -14 159 -230
5322 -230 17 59 -66 -170 365 89 -64 36 -213 68 -144 43 162 -99 223 -180 5 126 76 55 94
5343 94 -29 44 -10 -41 -167 -257 -11 163 -1 192 -54 84 113 -132 -36 -43 -62 -15 268 51 -119 170 129 -120
5367 -120 27 260 -178 -86 236 176 64 -133 -27 -261 -36 204 102 -125 157 19 -73 89 37 133 32 175
5389 175 -36 0 -107 239 -12 269 -83 71 -197 75 -104 -76 -104 -30 30 246 10 -155 -43 -77 -249 -71
$$ packed form
5225d8j07M61l99J11J36l82J67n7K65n1L7k0k27L90l15m9J17j25r6J79q0mL75
5248B78j98m2J74j78r0J25J49m48L17j6J12q6q0J27P0l25J08Q2O9p5l1o9J66k09
5272g0o4K45j35j30J52j7j63K03q8P2q5K05K05l78l0J27q2j34R9L08m36N3J32
5295a1o2j46L09j44K5M5o6LK8k1LK48l53J28l4k9R0lK00j56j27Q3k5l4L5J73l89
5322b30K47M2j25j04N35k76j53J00k49K81k12J87J19k61L22m03J85J21n0k1L9
5343I4j23P3n4l1j26r0K46J74j64J93k46J38K9k45R6pj9M7K83k17j70K89m1k49
5367a20J47K33m38R2L22o0j12j97J06k34K25K40j02k27K82j38r2J62n2R6j01J43
5389A75k11L6j07L46k51K81l52J54k68K72j79K8k8P4O0K16k36j65J12l4j72J78
$$ plain form
5411 -71 -33 -166 -75 28 -124 181 -54 -176 108 105 -45 122 46 -266 172 -6 88 -15 111 58 -203 118 7
5434 7 169 -206 2 -87 -27 47 -135 105 10 156 198 247 -112 -6 -223 193 157 -138 -90 127 -23 -60 27 -221
5458 -221 141 148 -137 66 187 43 94 -11 -135 197 -105 57 -23 183 105 10 178 25 125 80 31 -17 -40
5481 -40 23 60 89 81 -60 -118 79 237 85 -74 -284 -61 262 254 11 -70 -23 -396 -88 -63 -4 24 47 -221 50
5506 50 -8 69 -132 70 115 -305 -29 -73 -188 -70 5 -330 4 -4 -363 122 -67 -18 182 115 114 160 -4 -144
5530 -144 -115 124 92 -159 -48 -158 137 30 -64 -103 21 166 177 -67 -143 -86 31 139 -71 -168 25 56 91
5553 91 -18 123 -276 35 -67 -103 -60 -193 -218 -181 4 43 -41 -214 -135 -346 22 -11 69 -92 -139 20 -117 -143
5577 -143 30 41 90 95 3 -97 64 84 -154 185 -29 38 -365 123 -177 -533 203 76 277 186 405 268 198
$$ packed form
5411g1L8j33R1J03j52L05k35j22K84lj50J67p6l12M38j78R4j03J26n3k61L21j11
5434GJ62l75K08q9O0P4j82K40r5J46M2M9l59J06k17M16l6k95M8K17j50l7Q7k48
5458b21L62Pk85K03J21j44N1j05j24L32l02J62q0K06p8r5J68j53J00m5m9m8k3
5481d0O3L7K9qj41n8J97J58j52j59k10K23L23qk43q1M7l73L08K5N9K8K3k68K71
5506E0n8P7k01K02M5m20K76m4j15J18P5l35L34ql59M85j89M9K00o7jM6j64j40
5530a44K9K39l2k51J11j10K95j07r4l9J24J45J1k44p6N7J17J08k10r7J93L1L5
5553I1j09J41l99L11j02l6M3j33k5L7J85L9q4j73P9k11L68l3Q0j61m7J59j37k6
5577a43J73J1M9Nr2j00J61K0k38L39k14O7m03M88l00l56P36j27K01r1K19j37p0
$$ plain form
5600 198 -223 -60 143 51 150 221 66 -122 19 82 -293 -49 -58 -211 -50 -160 83 84 -75 79 107 -104 -90
5623 -90 -162 -25 21 294 50 -176 49 27 205 158 184 153 -181 -183 167 52 155 223 256 138 69 -52 68 -48
5647 -48 -189 179 57 -74 -27 -44 -98 -191 -107 -58 10 238 -12 -189 67 44 131 -20 -186 86 -25 -84 -229 192
5671 192 -146 -97 0 -59 132 14 113 109 357 172 160 280 -21 169 245 38 -50 -66 181 52 -3 -164 60 -232
5695 -232 -49 219 101 8 -29 134 39 191 -30 73 136 38 76 124 -127 -48 -98 107 30 175 10 -405 -58
5718 -58 120 -304 -147 56 273 -170 -160 391 -301 84 54 -53 39 -22 -39 85 -39 -102 15 -148 32 -136
5740 -136 -276 371 -79 251 116 -163 -102 -94 287 -35 -45 -2 302 144 -40 -8 -14 303 30 -17 -89 -10 -77 45
5764 45 -153 -170 8 -83 -37 -153 29 36 116 72 68 -77 -18 144 149 171 6 10 167 -230 66 260 -41 222 -189
$$ packed form
5600A98m21J63K03r2R9P1j55j88J41O3l75K44rj53J61j10K43Jj59J54K8k11J4
5623i0p2J37M6K73k44k26K25k2J78m7K6l1l34kL50j15J03O8L3j18o9j21J20j16
5647d8j41L68j22j31M7j7n4r3Q4M9O8K28k50j77K56k3Q7j51j66K72j11n9j45M21
5671A92l38M9R7n9J91j18R9mK48j85j2J20l01J90P6k07q8j6K47j29n5j61K24k92
5695b32J83K68j18r3l7J63r5J52k21J03O3r8L8M8k51P9n0K05p7J45j65m15L47
5718e8J78m24J57K03K17m43J0N51o92L85l0j07R2o1j7J24j24o3J17j63J80j68
5740a36j40O47m50L30j35k79O1QL81l22j0M3L04j58j84L2oL17k73m7p2P9o7J22
5764D5j98j7J78r1M6j16J82PQ0m4mj45N9J62NK2j65MJ57l97K96J94l01K63m11
$$ plain form
5789 -189 127 18 -162 -87 -163 -162 -99 21 -38 72 102 24 -107 -94 134 45 49 -15 -221 27 -84 132 -169 121
5813 121 -65 -171 87 61 -75 -41 279 -20 -56 95 153 78 113 97 141 12 76 73 -144 38 -23 -119 132 95 -142
5838 -142 245 7 -34 17 176 -48 11 41 -105 88 -79 79 -36 127 194 375 -9 54 93 27 -232 284 23
5861 23 -13 19 -17 221 -4 -20 37 -37 39 86 73 222 -196 177 147 -160 70 -141 66 130 37 56 55 -80 165
5886 165 259 -200 -109 99 169 123 48 -7 8 81 -80 310 -190 112 14 -177 -39 -108 41 -81 -84 -67 93 -178
5910 -178 110 -127 -14 48 30 6 -49 58 68 -22 28 -171 -44 96 -9 -130 -68 103 39 218 135 -190 29
5933 29 262 30 -53 -22 121 -93 -67 59 15 302 132 71 -27 -55 239 -56 -193 -56 -34 7 -42 -62 43 -146
5957 -146 10 -240 -2 -158 38 -224 189 72 8 -45 -8 129 208 -39 38 12 -84 76 -72 206 -133 248
$$ packed form
5789a89L16j09j80P5p6JO3J20n9J10L0p8j31J3K28q9Mo4k06K48j11K16l01K90
5813A21j86j06K58k6j36L4L20k99l6J51N8p5L5j6M4j29O4lk17J82o1r6K51l7k37
5838a42L87k38m1N1J59k24N9L0j46J93j67J58j15J63O7J81l84O3L9o6k59N16k61
5861B3l6L2l6K38k25j6N7p4P6M7j3J49m18L73l0l07K30k11K07O4r3J9jj35K45
5886A65R4m59R1K08P0m6p5n5J5P3j61L90n00L02r8j91J38o9J49j22lJ7J60k71
5910a78K88k37J13O2j8k4n5J07J0r0N0j99J27J40j05j21O2J71o4J79q3l25K19
5933B9K33k32q3L1J43k14K6J26m4K87j70o1r8k8K94k95j37J37K2M1m9k0J05j89
5957a46J56k50K38j56J96k62M13j17o4n3L7J37P9k47P7k6r6J60j48K78l39L81
$$ plain form
5979 248 -194 113 86 83 86 34 -110 156 -235 118 -54 -38 -1 -106 125 98 -112 209 120 -193 -125 -69 -264 164
6003 164 145 89 -48 256 -95 -89 -52 -111 96 -21 -221 288 -19 101 -198 -159 50 -10 94 -138 -160 136 14
6026 14 -30 41 -136 -118 -18 110 158 127 277 62 13 -106 -65 264 173 -175 336 120 315 176 201 49 8 -59
6050 -59 -52 58 106 -9 -284 -135 223 229 22 198 54 237 64 -90 98 -288 168 -233 9 182 176 -44 12
6073 12 302 180 387 24 38 -97 74 55 6 30 -192 29 361 121 -21 -50 -99 94 84 49 220 11 45
6096 45 103 54 86 48 273 32 -11 116 130 16 3 -70 218 -103 102 130 -402 -197 158 8 298 86 -89
6119 -89 101 -122 -30 -63 -89 -16 -146 -258 -72 -83 266 275 -124 -285 225 100 -23 -147 -105 341 63 -14 -38 -146
6143 -146 125 -44 -38 216 56 20 249 -153 -71 51 8 3 -185 190 58 -8 233 -41 -188 -46 -36 -185 -91
$$ packed form
5979B48m42L07k7lLn2j44K66l91L53j72J6L7j05K31k7k10L21q9l13O8N6j95M28
6003A64j9n6j37L04l51OL7n9K07j17k00N09l07J20k99L9K09o0J04k32k2K96j22
6026A4m4P1j77J8J00J28M8l1J50k15m9j19M1L29r1l48N11k16J95j39K5j52m1o7
6050e9PJ10M8j15k75J49L58Ok07J76j44J83j73j54J88l86M56m01K42J73ok20N6
6073A2K90j22K07l63J4j35J71j9m9K4k22K21L32k40j42k9m9J93j0l5J71k09L4
6096D5N8m9L2l8K25k41m3J27J4j14j3p3K88l21K05K8n32K05L55j50K90k12j75
6119h9J90k23R2l3k6P3j30j12J86j1L49Rl99j61N10j25j23j24M2M46k78p7k4j08
6143a46K71j69OK54j60l6K29m02Q2J22m3nj88L75j32o6K41k74j47J42J0j49R4
$$ plain form
6166 -91 -51 -99 -80 -229 26 -31 174 34 -5 -206 131 205 45 1 137 74 102 138 126 153 -29 6 134 270 43
6191 43 94 -14 115 18 -107 -51 -114 100 138 53 160 219 -111 -130 -23 -2 66 208 -154 32 61 -121 -253 54
6215 54 156 68 -77 -74 -274 -95 -166 -94 -157 155 27 -57 -215 -143 217 200 239 -32 67 -19 302 76 -35 48 -103
6240 -103 179 -21 -131 -40 75 -123 -100 22 -133 51 103 2 -104 -3 -51 -74 58 -53 -82 -9 -194 -102 -18
6263 -18 66 145 -35 11 5 -53 -274 -66 2 148 -237 -222 28 -131 62 -17 -190 27 80 -160 5 -51 -33 29 285
6288 285 123 296 138 142 6 -61 -144 144 35 -137 -54 127 18 186 -39 -126 149 50 98 -92 -46 196 -27
6311 -27 20 -70 39 -5 131 64 3 -83 59 -20 38 189 -31 -141 -44 59 -7 -110 -91 -5 148 183 20 -104 167
6336 167 -50 415 -42 126 -233 76 -123 106 170 -164 235 120 -7 -184 38 17 -58 59 -91 142 321
$$ packed form
6166i1M0m8J9j49K55n7K05j40l9k01L37P4j60m4J36o3K8L6j2K7j82L5J28J36k27
6191D3N1j08J29r7j25N6o3K14L8q5J07N9l30j9J07K1O8J42l62J86K9j82j32L07
6215E4J02q8j45Lk00J79p1P2o3L12j28q4j58P2L60j7L9k71R9q6L21k26j11Q3j51
6240a03K82k00j10R1J15j98K3J22j55J84N2j01j06J01m8k3J32j11k9P3j85R2Q4
6263a8Q4P9j80M6on8k21K08O8J46l85J5K50j59J93p9j73K17N3k40J65n6J8O2K56
6288B85j62J73j58Mj36o7q3K88j09j72Q3J81j09J68k25q7K75r9M8j90M6K42k23
6311b7M7r0J09m4J36o7o1q6J42p9N8J51k20j10R7J03o6j03J9Q6J53L5j63j24K71
6336A67k17M65m57J68l59L09j99K29O4l34L99j15j27j77K22k1p5J17j50K33J79
$$ plain form
6357 321 -141 -17 220 125 -90 -34 -133 -122 65 -277 142 180 106 253 48 -249 -149 -43 -168 108 -65 237
6379 237 17 132 113 -136 -360 106 58 -9 44 2 -224 53 -127 -5 33 107 -28 138 227 159 227 76 -120
6402 -120 -177 23 243 21 84 -118 91 -149 187 -76 22 285 -160 -16 117 -244 -120 239 -99 98 17
6423 17 41 -27 234 143 -86 71 -209 120 42 -62 -67 230 191 139 -195 188 -76 -119 41 -88 236 -127 -134 -133 273
6448 273 60 111 -88 -24 219 -106 10 126 -12 66 -55 97 119 51 -182 -248 194 -141 146 158 -82 16 -280
6471 -280 82 39 -400 88 16 -71 -222 -253 36 -143 -250 -78 70 51 -72 75 -91 -218 -80 -117 -48 221
6493 221 -60 -43 -36 -111 86 150 -107 241 -38 120 118 -172 6 195 22 273 -25 -107 -201 12 235 -78 94
6516 94 60 -109 -21 -114 -111 68 -33 214 -71 -95 -121 50 274 -33 -41 -214 239 63 313 35 107 -109 2 -14
$$ packed form
6357C21m62J24K37r5k15N6r9J1J87l42M19L8p4J47k05k97J00J06j25K76j73L02
6379B37k20J15j9k49k24M66m8o7N3m2k26K77j80J22L8P4j35J66Q9o8O8j51j96
6402a20n7K00K20k22O3k02K09k40L36k63R8K63m45J44J33l61J24L59l38J97q1
6423A7K4o8K61r1k29J57k80L29p8j04nK97l9n2l34L83k64m3J60j29L24l63pJM06
6448B73k13N1j99O4K43l25J16J16j38P8j21J52K2o8k33o6M42l35K87J2k40R8k96
6471b80L62m3m39M88p2q7j51l1K89j79j07J72J48j9j23J47j66j27J38l7O9K69
6493B21k81J7Pp5J97O4k57L48k79J58kk90J78J89j73K51k98q2r4K13K23l13J72
6516I4l4j69Q8r3LJ79j01K47k85k4k6J71K24l07qj73M53j76K50k78P2k16J11j6
$$ plain form
6540 -14 -195 -89 469 111 -64 117 118 -98 35 -21 0 147 -194 -128 -67 -96 9 -91 -15 51 50 -101 17 73
6564 73 -108 -23 102 127 -55 139 6 -6 78 120 107 49 134 98 -54 20 342 -77 -69 -100 105 -12 92 6 -304
6589 -304 16 36 19 0 -86 -63 24 20 101 194 -21 198 -38 41 218 -16 143 75 70 -69 158 -15 329 99 100
6614 100 307 57 -13 2 -45 -25 -3 -105 91 -35 -57 -12 74 117 -54 14 123 56 280 37 223 70 -7 11
6638 11 -151 129 69 229 136 43 309 -6 -23 -215 -43 4 60 89 78 316 354 139 34 46 -62 6 -117 -104
6662 -104 -11 95 18 -37 74 177 12 -12 46 73 38 49 108 201 -84 73 -64 208 21 34 -20 -43 13 -15 -38
6687 -38 -62 -233 -19 113 -80 120 -5 -134 201 139 -169 -64 -23 119 176 -100 -154 139 -61 -8 20 222 -35
6710 -35 92 7 61 -43 -114 177 140 31 -17 14 120 294 145 -146 116 153 79 155 -156 15 70 -42 -24 -49
$$ packed form
6540a4j81J06N58l58j75J81Jk16J33n6K1J47l41O6O1k9J05j00P6O6jj51J18N6
6564G3j81Q5J25K5j82J94j33j2Q4M2j3n8Q5l6j52P4L22m19Ql1K05j17J04q6l10
6589c04L20K0j7j9q6K3Q7mQ1R3k15K19k36P9J77k34J59o8nj39K27j73L44k30J
6614A00K07k50p0J5m7K0K2j02J96j26k2M5Q6M3j71O8J09o7K24k43J86j53p7J8
6638A1j62K80o0J60r3r3K66l15j7j92J72M7N6K9j1K38L8k15j05J2j08O8j23J3
6662a04R3J06p7n5J11J03j65k4N8K7l5J1N9R3k85J57j37K72j87J3n4k3N6k8k3
6687c8k4j71K14J32j93K00j25j29L35o2l08J05M1J42N7k76n4K93k00N3K8K02k57
6710c5J27q5N4j04p1K91l7j09m8L1J06J74j49k91K62L7p4P6l11J71N5j12J8k5
$$ plain form
6734 -49 -78 99 -192 -26 -87 129 -146 36 83 34 -73 70 -64 -51 -126 76 123 254 247 278 -121 180 -100 -64
6758 -64 -87 54 227 -104 -39 -85 211 37 304 -3 -218 -14 77 49 403 -123 -52 -117 -46 9 -22 379 -66 213
6782 213 133 148 -37 -266 76 63 -141 -113 100 -144 -182 -112 194 -10 -6 38 -100 -98 125 165 93 202 216 -158 -29
6807 -29 7 104 89 67 195 242 61 118 -93 137 58 -140 361 204 84 25 -68 134 -29 -269 41 101 18 -85
6831 -85 -110 252 -143 -97 75 -28 -49 -47 182 21 -27 75 -77 36 36 43 -58 93 12 77 -27 -92 -315 -4 139
6856 139 -151 177 175 183 122 33 168 257 69 -234 -93 17 90 -151 143 -218 -270 -178 15 -147 229 -1 87 23
6880 23 113 -95 -133 228 65 111 105 81 -282 173 73 5 74 207 -81 14 -122 -34 25 219 306 179 -174 123
6904 123 -22 -100 113 -38 130 30 -262 -140 128 80 216 -211 30 131 -108 222 -200 -156 5 -74 -13 11
$$ packed form
6734d9k9J77k91J66o1K16k75J82M7m9j07J43j34J3p5K02M7J31pL1l99L01k80L6
6758f4k3J41J73l31O5m6K96j74K67l07k15K04R1k8L54n26P1o5P1N5l1M01m45K79
6782B13q0J5j85k29L42j3k04K8K13k44l8P0L06k04MM4j38KK23M0p2J09J4l74J29
6807b9L6R7j5k2J28M7j81N7k11K30p9j98N01j57j20n9r3K02j63k40L10O0q3j03
6831h5k5L62l95M6J72j03k1KK29j61m8J02j52J13%Pj01J51q1O5j04o5k23L11J43
6856A39k90L28kQo1q9J35Q9j88l03J41J10P3k41K94l61n2R2J93j62L76k30Q8o4
6880B3R0k08l8L61j63M6ok4l63M55j00o8O9J33k88R5j36Q8N9J94Q7j27l53K97
6904A23j45p8K13j51J68j00k92J22K68m8J36m27K41J01k39L30m22M4J61p9O1K4
$$ plain form
6926 11 -185 -143 -44 169 -35 183 -89 -115 -29 -289 281 171 -84 -42 73 100 -137 -78 -129 -127 11 38 -149 -127
6950 -127 -107 -16 51 25 167 7 168 188 2 -158 -44 12 -261 0 -87 -139 5 198 168 -89 -112 28 291
6973 291 -31 63 158 -124 -221 -46 19 -152 -268 226 47 -90 -173 21 64 68 47 143 23 201 170 -44 254 68
6997 68 -100 -102 -13 94 31 116 101 -190 96 144 179 64 -112 46 21 14 205 141 -64 63 156 130 88 -70 96
7022 96 -174 43 -39 102 149 55 158 -97 -106 26 148 174 -38 -107 6 -130 -100 -336 4 -11 253 -309 -79
7045 -79 -21 -349 -147 -36 40 -194 11 -156 -95 -192 -73 217 148 -75 29 191 -17 49 171 155 142 -67 -66 38
7069 38 28 130 62 134 61 25 19 22 -218 196 -78 -99 -84 50 127 -211 4 -55 208 53 104 143 91 31 57 8 94
7096 94 -4 -13 -70 -44 13 77 205 -140 -66 -30 195 113 -290 84 -31 -216 -110 27 -45 108 115 -114 -69 -164 -37
$$ packed form
6926A1j96M2R9K13k04K18k72k6Q6k60N70j10k55M2J15K7k37N9n1KJ38K7j87K2
6950a27K0R1O7k6J42j60J61K0j86j60J14N6k73K61q7n2J44J93l0k57k3J40K63
6973B91l22R4R5k82r7J75O5j71j16M94j79j37q3J94M3Mk1R6j20J78l1k14K98j86
6997F8j68kQ9J07o3Q5j5k91K86M8L5j15j76J58k5pJ91o4k05J27R3k6m2j58J66
7022I6k70K17q2J41M7r4J03k55rJ32J22K6k12o9J13j36L0k36L40j5K64n62K30
7045g9N8l28K02J11P6k34K05j67O1r7J19K90o9k23J04J62k08O6J22j6j3k09JJ04
7069C8j0J02o8P2p3l6oLk40M14k74k1J5J34P7l38K15n9K63j55N1L9n2o0K6m9Q6
7096I4r8rn7K6N7O4J28l45P4L6K25q2m03L74j15j85J06J37p2J53Pk29M5r5J27
$$ plain form
7121 -37 71 120 -67 52 -164 -39 21 47 -289 220 12 76 -19 241 -116 2 62 129 -27 147 151 59 -42 -72
7145 -72 -56 60 34 -32 196 -87 137 -237 -33 -16 112 11 -282 -256 202 -50 -39 -41 366 15 16 -105 -85 131
7169 131 -216 -192 45 -24 62 145 -155 -106 -70 76 -42 36 -156 -58 248 213 238 -42 102 -68 -221 -231 -181 71
7193 71 -69 233 73 -325 139 -189 60 144 -167 -256 -99 -42 152 176 -204 -81 26 215 -29 -113 -27 125
7215 125 -54 80 97 -112 -1 17 -62 -294 -2 194 43 -11 -76 -47 10 -195 145 61 -95 6 84 317 -343
7238 -343 71 183 -96 -11 53 -24 -167 296 -21 292 80 -127 -233 -71 -21 115 90 -91 -177 -123 13 153
7260 153 -83 47 -34 -139 151 95 190 150 -51 196 -294 -115 179 213 -5 -259 -42 13 54 -80 -89 -17 -17 -138
7284 -138 63 -83 -246 112 -401 -69 56 29 -31 -71 -49 -141 34 167 84 211 76 138 -259 35 92 -57 -60
$$ packed form
7121c7J08M9j87J19k16J25O0K6l36N09k08O4r5K60l57J18O0O7j56J74Mr2j01l0
7145g2J6J16k6o6K28k83K24l74K04J7J28j01k93K6M58k52J1kM07l51Jj21K0K16
7169A31l47K4K37o9Q6Q3l00M9L6J46j18P8j92R8L06l5K5k80J44j70j53j0N0K52
7193G1j40L02j60l98M64l28K49Q4l11q9J57N7J94K4l80J23J07J89k44q4Q6J52
7215A25j79J34J7k09J11J8p9k32K92J96j51n4o5K9N7k05L40q4j56J01P8K33o60
7238c43M14J12k79Q5O4p7j43M63l17L13k12k07j06J62N0J36k5j81q6N4J36J40
7260A53k36J30q1j05K90n6R5m0k01K47m90J79K94L4k18k54K17N5M1j34rP2%j21
7284a38K01j46j63L58n13L32J25k7o0m0K2r2J75J33q3J27j35O2l97K94N7j49l
$$ plain form
7307 -60 -74 -37 231 -17 -66 15 -192 270 63 -159 200 54 175 121 9 216 -47 -27 362 -32 65 -1 174
7330 174 -54 -40 80 -152 -44 59 150 -37 12 -100 66 -251 126 -38 39 -94 -215 -118 -47 -12 -262 49
7352 49 42 -59 59 -55 181 47 104 -194 72 -114 55 -344 -54 149 206 -204 -176 359 -36 -80 -85 188 -55
7375 -55 112 226 -101 103 -178 41 57 198 -63 181 -3 -104 -62 85 -307 -149 -12 -38 -10 106 35 -133
7397 -133 82 -115 -175 71 -60 58 98 112 -74 -70 119 69 -15 88 -132 -14 -119 167 280 210 48 -54 165
7420 165 29 -108 156 -162 29 -58 -48 -59 184 272 -46 118 -191 -148 5 287 -23 47 -137 76 107 -93
7442 -93 88 253 -203 -34 -125 102 77 37 146 -21 -209 -277 -126 -49 -55 -115 19 -87 132 -49 -10 -24 105 -48
7466 -48 -191 -5 33 64 91 -39 -43 285 -98 202 247 47 294 -94 -101 -21 92 -64 -247 -17 75 -134 -71 -210
$$ packed form
7307f0j4L7K68k48m9Q1k07M62k07k22L59j46J21n4j12K07k63K0L89l94R7o6J75
7330A74k28J4J20k32J08J03R1j87M9j12J66l17L77j64P7j33j21R7P1L5k50L11
7352D9pj01J18j14K36j34N7k98K66j86J69l99K90K03N7m10K8N35l95m4nK73k43
7375e5J67J14l27K04k81K19J6J41k61K44j84j01M2J47l92J58J37k6K8J16p1j68
7397a33K15j97o0K46j31J18M0J4j86MJ89n0q4J03k20J18j05K86J13p0j62j02K19
7420A65j36j37K64l18J91q7J0j1K43Q8l18J64l09M3J53K82l10P0j84K13L1k00
7442i3J81J65m56J69r1K27k5m0J09j67j88o8J51P7oo0J34j06K19j81L9j4J29j53
7466d8j43J86L8L1K7j30mL28l83L00M5k00K47l88pQ0J13j56j83K30R2k09O3j39
$$ plain form
7490 -210 -91 126 -188 12 50 -168 -244 -8 -124 90 -144 106 103 75 272 -302 38 113 -210 211 31 3
7512 3 -330 -35 -19 -19 101 223 41 -55 -39 151 -1 26 -16 69 -11 -82 -109 -127 426 189 -63 7 89 96 25 -109
7538 -109 -89 -54 -75 -157 37 -133 -167 166 -183 53 49 -191 -282 77 160 127 70 -91 -121 -46 -145 -104 -164 12 -18 10
7564 10 -118 -60 -24 85 -83 10 352 38 58 -190 -49 251 -17 57 27 108 126 84 156 83 56 -78 -123 -107 -5
7589 -5 129 121 335 -57 -72 -107 -270 74 -50 -101 -64 74 -80 18 -87 41 -15 115 -45 -20 84 28 -55 194
7613 194 -202 72 -46 -205 238 -15 127 48 -17 24 -199 -41 240 -52 109 27 -47 114 -81 -95 215 36
7635 36 153 119 -51 -202 -28 -83 276 77 -119 17 -205 121 -95 -170 -305 178 16 -20 -224 5 328 52
7657 52 8 -150 -24 87 -146 10 -88 -69 -114 -149 -6 103 -75 -363 120 -38 -50 -13 328 25 -7 -76 -90 -272
$$ packed form
7490b10J19K17l14K00L8k18p6K36j16K14k34K50lk8J97n74L40P5l23M21j80k8
7512Cl33K95J6%J20J22j82r6J6J90j52K7m2Q5q0p1k7j8N53k37k52P0Q2Pp1j34
7538a09K0L5k1q2J94j70l4L33l49K36mk40r1L59Q3l3n7j61l0P5r9M1o0J76l0K8
7564A0j28N8L6J09j68R3L42l14K0k48J41L00k68P4l0Q1J8m2P2p3k7j34m5J6J02
7589eJ34qK14l92j5l5j63L44j24n1L7J38j54R8j05J28n6J30j60K5J04n6q3K49
7613A94l96K74j18j59M43k53J42p9o5M1k23J58K81k92J61q2p4J61j95j4L10j79
7635C6J17l4j70j51J74n5L59j99j96J36k22L26k16p5j35M83j62l6k04K29L23k76
7657E2m4j58J26J11k33J56r8J9m5l5J43J09j78k88M83j58j2L7L41l03l2o9j4j82
$$ plain form
7681 -272 -23 -20 50 -98 96 133 67 67 159 123 -144 -54 -167 306 -182 -23 -173 -72 -138 -46 -17 191 -282 88
7705 88 77 53 -42 -106 -34 7 -17 121 -163 -244 2 -23 107 50 -97 212 -88 246 -98 42 225 42 147 -63
7729 -63 230 -110 -6 -108 232 316 -303 -204 75 -50 326 105 124 222 109 186 78 52 -99 -129 166 58 58
7752 58 111 171 -238 -100 64 -29 0 -88 2 144 263 362 -97 -117 63 -280 22 -206 53 93 -99 212 168 194
7776 194 132 145 -104 227 104 -10 -21 77 -48 -47 -35 -97 82 -30 -64 169 2 156 112 -16 56 -275 48 -37
7800 -37 -268 69 123 69 -201 -158 -135 115 -41 16 87 92 -80 21 -149 -96 -153 152 237 211 27 -35 -366 47 -27
7825 -27 1 -79 -7 17 87 -42 -96 -5 -33 -30 -25 63 43 -157 -216 184 -80 169 66 -171 -185 -14 111 -17 63 -139
7851 -139 -125 -23 -326 196 32 175 -129 -66 103 79 14 30 77 -107 -50 9 192 105 -150 243 329 246 30 36
$$ packed form
7681b72K49LP0j48J94L7o6%R2l6k67R0j13M73m88J59j50J01o6R2K9K08m73L70
7705H8j1k4r5o4P2M1k4J38k84q1K46k5J30n7j47L09l00L34l44J40J83j83J05k10
7729f3K93l40J04j02L40Q4o19R9K79j25L76k21J9R8j13P7j08k6j51l0K95j08%
7752E8N3O0m09J38J64r3K9q8R0J42J19R9m59k0J80l43L02k28K59M0j92L11m4K6
7776A94o2J3k49L31j23j14j1R8j25JJ2o2J79j12l4K33j67J54m4j28P2l31L23q5
7800c7k31L37N4n4k70M3K3K50j56N7P1Nj72J01j70N3n7L05Q5k6j84o2l31M13p4
7825b7K8q0P2K4P0j29n4R1k8LNQ8k0k00n9M00k64K49j03k37j4J71J25j28Q0k02
7851a39J4J02l03N22j64J43l04O3J69k4o5J6M7j84N7N9J83q7k55L93Q6q3k16O
$$ plain form
7875 36 209 149 -104 -256 -122 41 76 117 215 57 -119 235 -250 169 89 8 91 92 -22 -13 53 159 289 61
7899 61 166 15 -285 -17 -50 -72 94 -13 122 -111 -183 104 -151 -27 228 -243 -88 -41 -65 207 29 133
7921 133 -103 49 47 130 48 108 173 89 -96 -21 -157 31 -40 -60 -1 109 50 3 177 -16 145 -35 -218 106
7945 106 -11 100 -63 216 -28 80 -225 76 8 -115 -88 30 120 -172 -26 -150 12 174 18 -52 177
7966 177 -47 124 2 165 43 -52 23 330 -4 297 167 -45 -52 43 -129 -133 28 280 60 177 -190 -146 119
7989 119 -98 284 203 17 8 -119 74 63 -55 76 -192 -53 197 -171 112 -77 -69 -135 -80 78 36 252 -194
8012 -194 -2 49 -28 3 72 -193 148 -94 19 43 110 37 103 135 74 13 400 89 -57 29 -8 131 -312 -96
8036 -96 342 164 -124 -16 -50 52 -101 94 -15 72 -254 -8 139 -143 -4 133 -82 153 83 58 15 -116
$$ packed form
7875C6J73o0k53j52J34J63L5M1R8j58j76L54m85M19q0q1Q3Jj14RO6J06J30k28
7899F1J05j51l00K68l3k2J66j07J35k33p2K87k55J24K55m71J55M7k4K72j78J04
7921A33k36J52kQ3q2O0O5q4j85P5j36J88p1k0N9J10n9m7J74j93J61j80j83L24
7945A06j17J11j63K79k44J08l05L01o8j23K7J18R0k92J46j24J62J62j56p0K29
7966A77k24J71j22J63j22r5P5L07l34L01j30k12pR5j72mJ61K52k20J17l67M4K65
7989A19k17L82q1j86rj27J93j1j18J31k68J39K50l68K83j89Qo6N5J58m2K16m46
8012a94J92N1p7L1O9k65L41k42J13K4O7p3O6L2o1o1L87l11j46Q6l7J39m43K16
8036i6M38j78k88J08l4J02j53J95j09Q7l26K46J47k82J39J37k15K35p0k5m3j31
$$ plain form
8058 -116 -11 143 70 -182 -93 209 256 142 134 -16 8 -131 173 96 -325 2 163 44 -123 327 147 -262
8080 -262 271 8 51 -133 164 216 -200 221 152 70 -51 -92 7 80 121 -46 38 106 -43 -128 1 51 -1 98 -83
8105 -83 25 -62 -407 -202 170 -2 195 14 -35 -146 193 111 39 22 47 153 -93 74 151 -79 59 -118 -20
8128 -20 254 54 73 252 48 191 307 -150 77 -64 62 60 184 138 129 -293 159 148 26 72 -139 -68 -30 -172
8152 -172 -61 194 175 -51 19 192 -214 -111 -2 -102 -213 -345 -156 57 -34 -128 110 -151 -36 12 -147 -147
8174 -147 1 102 -197 -134 109 308 -88 -66 -72 102 11 42 133 272 172 -18 268
$$ packed form
8058a16J05J54p3k52Q9L02M7j14qj50K4j39L04p7m21L27J61j19j67M50j80m09
8080b62N33k63M3j84K97N2m16M21o9q2j21m1R9P3M1j67Q4O8j49q5J29N0n2R9j81
8105h3J08q7l45K05L72j72J97j81m9j11L39q2p2j7K5J06k46J67P7k30J38j77R8
8128b0K74k00J9J79k04J43J16m57K27j41J26kJ24m6rm22M52j1j22M6k11P1L8j42
8152a72J11K55j9k26P0J73m06J03J09j00j11j32J89K13r1r4K38k61J15M8j59%
8174a47J48J01k99O3K43J99l96K2oJ74r1L1R1J39j00j90K86
8191B68
$$ Imaginary data points
##PAGE= N=2
##DATA TABLE= (X++(I..I)), XYDATA
$$ plain form
0 0 0 0 0 0 0 0 0 0 0 0 0 0 0 0 0 128 -128 128 -128 128 -128 256 -256 256 -384 384 -512 606 -640 768 -896
31 -896 1024 -1152 1280 -1409 1662 -1793 2048 -2304 2560 -2817 3150 -3460 3844 -4251 4722 -5211
47 -5211 5740 -6333 6971 -7665 8448 -9313 10290 -11362 12592 -13980 15566 -17426
59 -17426 19615 -22257 25498 -29583 34943 -42296 53051 -70420 103101 -186550 885610
70 885610 1361841 -392928 -1000393 -1121148 -841585 -502329 480093 1261367 1249561 406166
80 406166 -359455 -924881 -1178386 -960865 -57474 830941 1143188 852500 358289 -344549
90 -344549 -1012748 -1147637 -506410 317225 826790 979917 836418 190192 -695804 -1122101
100 -1122101 -779841 -170147 309898 712384 967992 653415 -182031 -862708 -936210 -628287
$$ packed form
0@%%%%%%%%%%%%%%%J28k56K56k56K56k56L84n12N12o40P68q96J118j246J408j664
31h96J920k176K432k689L071l455L841m352M864n377N967o610P304q095Q973r933
47e211J0951j2073J3304j4636J6113j7761J9603k1652K3954k6572K9546l2992
59a7426L7041m1872M7755n5081O4526p7239R5347j23471J73521k89651J072160
70H85610M76231j754769o07465j20755K79563L39256R82422P81274j1806q43395
80D06166p65621n65426k53505K17521R03391Q88415L12247k90688m94211p02838
90c44549o68199j34889O41227Q23635N09565J53127j43499o46226q85996m26297
100a122101L42260O09694M80045M02486K55608l14577q35446o80677p3502L07923
$$ plain form
110 -628287 -184992 406659 935168 900882 271139 -396204 -709976 -746762 -529314 55889
120 55889 741469 953750 576286 44085 -366257 -700940 -817299 -421324 300991 746050
130 746050 671317 353526 -17162 -481028 -833145 -679442 -70837 481522 671782 599374
140 599374 337887 -147592 -634297 -724900 -373619 86477 430088 634417 586899 171490
150 171490 -380863 -653056 -541581 -251555 100878 483334 673144 433514 -79296 -464977
160 -464977 -561509 -461257 -190120 246228 603577 581688 227857 -154410 -404989 -518502
170 -518502 -410914 -27628 406529 568048 411105 117205 -202693 -487131 -554477 -281980
180 -281980 143662 419418 458350 336896 68825 -300411 -532503 -420218 -75765 231948
$$ packed form
110f28287M43295N91651N28509l4286o29743o67343l13772l6786K17448N85203
120E5889O85580K12281l77464n32201m10342l34683j16359L95975P22315M45059
130G46050p4733l17791l70688m63866l52117J53703O08605N52359J90260p2408
140E99374k61487m85479m86705r0603L51281M60096L43611K04329m7518m15409
150A71490n52353k72193J11475K90026L52433L82456J89810k39630n12810l85681
160d64977r6532J00252K71137M36348L57349k1889l53831l82267k50579j13513
170e18502J07588L83286M34157J61519j56943k93900l19898k84438o7346K72497
180b81980M25642K75756L8932j21454k68071l69236k32092J12285L44453L07713
$$ plain form
190 231948 401291 442050 289148 -69618 -410355 -478916 -289591 -21472 234089 426676
200 426676 415281 135627 -222066 -407527 -376462 -217816 33100 320590 457081 310188
210 310188 1120 -251992 -364607 -339575 -150960 157739 391594 385439 186854 -55276
220 -55276 -265766 -385702 -313719 -45914 238160 355429 289254 114565 -117425 -328042
230 -328042 -373183 -198977 67889 267049 338517 275213 73762 -186719 -338908 -285978 -95749
241 -95749 113014 272630 323028 203091 -43381 -258379 -321278 -236146 -62628 145881 299716
252 299716 288029 108170 -113104 -253378 -277062 -183864 10142 219566 310616 228593 46331
263 46331 -134611 -252723 -257206 -120795 92097 247726 263563 158875 -7846 -181146 -280568
$$ packed form
190B31948J69343M0759j52902l58766l40737o8561J89325K68119K55561J92587
200D26676j1395k79654l57693j85461L1065J58646K50916K87490J36491j46893
210C10188l09068k53112j12615K5032J88615L08699K33855o155j98585k42130
220e5276k10490j19936P1983K67805K84074J17269o6175j74689k31990k10617
230c28042m5141J74206K66866J99160P1468o3304k01451k60481j52189N2930J90229
241i5749K08763J59616N0398j19937k46472k14998o2899Q5132J73518K08509J53835
252B99716j1687j79859k21274j40274k3684R3198J94006K09424R1050q2023j82262
263D6331j80942j18112m483J36411K12892J55629J5837j04688j66721j73300r9422
$$ plain form
274 -280568 -232854 -58885 129551 232396 221910 111654 -61082 -214752 -253957 -153863
284 -153863 17877 171727 247384 211908 71077 -107453 -223065 -216177 -104172 52235 184320
295 184320 226893 149681 -6890 -156361 -226067 -190375 -65642 92653 204373 205853 100751
306 100751 -47779 -167436 -206755 -145177 -6800 137646 209631 175497 60421 -78945 -178856
317 -178856 -187800 -98544 41114 155942 190690 132831 9510 -122111 -193910 -167174 -60106
328 -60106 68785 159811 172025 97380 -29916 -141455 -175601 -119501 -8193 105727 171795
339 171795 156233 61607 -64225 -152836 -160488 -89241 22040 120967 159769 117421 15032
350 15032 -93963 -154466 -138570 -54982 55043 137213 148932 85619 -19370 -111818 -147444
$$ packed form
274b80568M7714J73969J88436J02845j0486j10256j72736j53670l9205J00094
284a53863J71740J53850P5657l5476j40831j78530j15612O888J12005J56407J32085
295A84320M2573p7212j56571j49471o9706L5692J24733J58295J11720J480j05102
306A00751j48530j19657l9319O1578J38377J44446P1985l4134j15076j39366r9911
317a78856q944Q9256J39658J14828L4748n7859j23321j31621p1799K6736J07068
328f0106J28891R1026J2214p4645j27296j11539l4146N6100J11308J13920O6068
339A71795j5562r4626j25832q8611p652P1247J11281R8927L8802m2348j02389
350A5032j08995o0503J5896Q3588J10025Q2170J1719o3313j04989r2448l5626
$$ plain form
361 -147444 -110188 -19562 79979 138894 128341 53948 -46471 -122127 -134138 -78326 15849 101042
373 101042 135082 101920 19296 -71458 -126340 -119672 -53826 38777 111041 124629 74336 -11382
385 -11382 -88003 -119837 -94671 -22650 61677 115198 109612 47644 -35992 -99862 -113335 -71255
397 -71255 5566 79453 112628 89838 23447 -52866 -100368 -97731 -45753 30487 90672 104110
409 104110 65409 -5113 -71937 -103631 -85113 -25708 45645 91854 90390 43775 -24794 -79835
421 -79835 -94658 -61894 3032 65587 94526 77314 24211 -39579 -82740 -84353 -42729 21350
433 21350 73187 86665 57275 344 -56857 -85571 -72729 -24374 34822 74167 75808 38972
445 38972 -17811 -66244 -80723 -54571 -1085 52237 78869 67718 24653 -28936 -66661 -69576
$$ packed form
361a47444L7256R0626R9541N8915j0553p4393j00419p5656j2011N5812R4175Q5193
373A01042L4040l3162q2624r0754n4882O668O5846R2603P2264J3588n0293q5718
385a1382p6621l1834K5166P2021Q4327N3521n586o1968q3636o3870j3473M2080
397g1255P6821P3887L3175k2790o6391p6313m7502K637N1978P6240O0185J3438
409A04110l8701p0522o6824l1694J8518N9405P1353M6209j464m6615o8569n5041
421g9835j4823L2764O4926O2555K8939j7212n3103o3790m3161j613M1624O4079
433B1350N1837J3478k9390n6931n7201k8714J2842M8355N9196L9345J641l6836
445C8972n6783m8433j4479K6152N3486N3322K6632j1151m3065n3589l7725k915
$$ plain form
457 -69576 -37327 15057 59312 72628 50177 2270 -46840 -72796 -63212 -23662 25489 59713
469 59713 64123 36347 -11063 -53332 -67775 -47075 -2610 41735 64800 58194 24460 -21262
481 -21262 -55245 -59824 -33754 9368 47466 61954 45546 5610 -37142 -60445 -53704 -22855
493 -22855 17478 48436 55310 33024 -7051 -43874 -57278 -41982 -6383 31952 54584 50918
505 50918 22888 -15168 -44251 -50673 -31399 4554 38632 52962 39437 6664 -28700 -49174
517 -49174 -46863 -22119 12554 40410 47209 29627 -3397 -35016 -48252 -37359 -8342 24140
529 24140 44641 43487 21109 -11044 -36253 -42569 -27413 1730 30535 44872 35457 8187 -22220
542 -22220 -40248 -38761 -20149 7885 32531 40653 26469 -1431 -27841 -40218 -32482 -9081 18923
$$ packed form
457f9576L2249N2384M4255J3316k2451m7907m9110k5956R584L9550M9151L4224
469E9713M410k7776m7410m2269j4443K0700M4465M4345K3065o606l3734m5722
481b1262l3983m579K6070M3122L8098J4488j6408l9936m2752k3303O741L0849
493b2855M0333L0958O874k2286m0075l6823j3404J5296L5599L8335K2632l666
505E0918k8030l8056k9083o422J9274L5953L4078J4330j3525l2773l5364k0474
517d9174K311K4744L4673K7856O799j7582l3024l1619j3236J0893K9017L2482
529B4140K0501j154k2378l2153k5209o316J5156K9143K8805J4337r415k7270l0407
542b2220j8028J487J8612K8034K4646Q122j4184k7900k6410j2377P736K3401K8004
$$ plain form
555 18923 36963 36282 18109 -7391 -29067 -36957 -25516 14 26487 38242 30402 8427 -16015
568 -16015 -32493 -33146 -18044 6425 27277 34149 23654 579 -23492 -35444 -28990 -8925 13943
581 13943 29135 30288 17142 -5168 -25086 -31525 -21706 -388 20531 31466 27486 9602 -12198
594 -12198 -27028 -28066 -15643 4229 21846 28867 20881 2111 -17940 -29549 -25761 -9614 10526
607 10526 23752 24815 14029 -2876 -19366 -26803 -20550 -2674 16932 27020 23300 9760 -7692
620 -7692 -20503 -23754 -14083 2577 17289 23948 18658 3638 -14668 -25023 -21824 -9361 5904
633 5904 17934 21432 14067 -1474 -16522 -22434 -16954 -3517 12353 22353 21623 9531 -5774
646 -5774 -16670 -19089 -12749 207 14221 21574 16662 3077 -11602 -19729 -19073 -9818 3833 15210
$$ packed form
555A8923J8040o81j8173k5500k1676p890J1441K5530K6473J1755p840k1975k4442
568a6015j6478o53J5102K4469K0852O872j0495k3075k4071j1952O454K0065K2868
581A3943J5192J153j3146k2310j9918o439R819K1318K0919J0935l980j7884k1800
594a2198j4830j038J2423J9872J7617P021p986j8770k0051j1609L788J6147K0140
607A0526J3226J063j0786j6905j6490p437O253J7876J9606J0088l720j3540j7452
620g692j2811l251R671J6660J4712O659n290j5020j8306j0355L199J2463J5265
633E904J2030L498p365j5541j5048n912N480J3437J5870J0000p30j2092j5305
646e774j0896k419O340J2956J4014P353m912j3585j4679q127O56R255J3651J1377
$$ plain form
660 15210 18369 11789 -878 -13255 -19087 -15286 -3819 9494 18331 18308 9317 -3592 -13825 -16159
674 -16159 -10559 -30 11077 17539 15139 4319 -9044 -17404 -16213 -8169 2566 11628 15270 10671
688 10671 -59 -10713 -16249 -13584 -4302 7706 15554 15254 8003 -1939 -10197 -13697 -10376 -1225
702 -1225 9818 15179 12633 4199 -5930 -13061 -14210 -8321 1594 9946 12769 9164 1127 -8103 -13555
717 -13555 -12104 -4573 5483 11967 12485 7436 -1075 -8503 -11562 -8499 -1261 7337 12319 10890 4282
732 4282 -4535 -10162 -11462 -7017 960 7937 10434 7653 1143 -6089 -11008 -10711 -4525 3739 9835
747 9835 10488 6016 -328 -6566 -9210 -7310 -1313 5746 10056 9578 4587 -2849 -8258 -9270 -5286 162
763 162 5558 8703 7331 1842 -5426 -9251 -8489 -4160 1869 6904 8579 5584 -364 -5668 -8121 -6349
$$ packed form
660A5210L159o580j2667j2377n832L801J1467J3313Q837k3q991j2909j0233k334
674a6159N600J0529J1107O462k400j0820j3363q360J191Q044J0735R062L642m599
688A0671j0730j0654n536K665R282J2008P848l00p251r942q258l500L321R151
702a225J1043N361k546q434j0129p131j149N889R915Q352K823l605q037r230n452
717a3555J451P531J0056O484N18n049q511p428l059L063P238Q598M982j429o608
732D282q817n627j300M445P977O977K497k781o510p232m919K97O186Q264O096
747I835O53m472o344o238k644J900N997P059M310m78m991p436n409j012L984N448
763A62N396L145j372n489p268l825P62M329O029N035J675k995n948n304k453J772
$$ plain form
779 -6349 -1312 4272 8244 8555 4202 -1661 -6535 -7740 -5059 -256 4795 7300 5816 1704 -4087
794 -4087 -7828 -8046 -3930 1509 5702 6806 4763 360 -4591 -6799 -5518 -1362 3073 6716 7155 4280
810 4280 -1124 -5431 -6098 -3670 47 3756 6172 5603 1757 -3114 -6346 -6571 -3830 655 4344 5545
826 5545 3751 -391 -3390 -5336 -4996 -1591 2795 6027 6250 3064 -382 -3544 -4969 -3632 -91 3328
842 3328 5048 4578 1546 -2527 -5329 -5295 -2726 693 3331 4338 3310 469 -3097 -4858 -4173 -1731
858 -1731 1761 4622 5063 3147 -354 -3171 -3804 -2674 -279 2604 4617 4111 1423 -2064 -3995 -4823
874 -4823 -3216 -50 2742 3710 2552 -111 -2387 -3705 -3915 -1870 1292 3905 4076 2563 -39 -2428
890 -2428 -3435 -2660 -88 2572 3442 3219 1730 -840 -3409 -3972 -2107 225 2209 3000 2340 627 -2093
$$ packed form
779f349N037N584L972L11m353n863m874j205K681M803N051K505j484m112n791
794d087l741k18M116N439M193J104k043m403m951k208J281M156M435L643M39k875
810D280n404m307o67K428L717L709K416n69l846m871l232k25K741M485L689J201
826E545j794m142k999j946L40L405M386L232K23l186l446l162j425J337L541L419
842C328J720m70l032m073k802L4K569L419K638J007j028k841l566j761O85K442
858a731L492K861M41j916l501k817o33J130K395K883K013n06k688l487j931q28
874d823J607L166K792R68j158k663k276j318k10K045L162K613J71j513k602k389
890b428j007P75K572K660Q70k23j489k570k569n63J865K332J984P91o60j713k720
$$ plain form
907 -2093 -3504 -3328 -1392 896 2811 3680 2541 -252 -1977 -2610 -1883 -345 1726 2992 3145 1504
923 1504 -741 -2483 -3294 -2086 -175 1952 2566 1843 465 -1184 -2652 -3056 -1440 541 2065 2417
939 2417 1728 412 -1539 -2350 -2126 -82 1438 2539 2432 1782 -260 -2011 -2356 -1320 -10 1375 2154
956 2154 1946 477 -1376 -2163 -2505 -1106 -35 1354 2410 1618 -198 -1395 -1906 -1508 -473 970 2327
973 2327 2287 1325 -188 -1256 -1955 -1362 -213 1318 1715 1311 381 -930 -1969 -2171 -1407 100 1017 1521
991 1521 945 160 -1321 -1775 -1518 -331 940 1598 1757 1226 284 -1017 -1384 -906 -40 1021 1439 1214
1009 1214 455 -833 -1421 -1463 -1292 37 920 1591 1144 -192 -971 -1194 -1147 -534 561 1358 1447 1095 339
1028 339 -818 -1274 -780 -71 852 1464 893 214 -372 -1086 -1427 -1291 -142 642 809 630 -127 -770 -1443
$$ packed form
907b093j411J76J936K288J915Q69j139k793j725o33P27J538K071J266J53j641
923A504k245j742q11J208J911K127O14p23j378j649j468m04J616J981J524L52
939B417o89j316j951q11K24K044J520J101j07o50k042j751l45J036J310J385P79
956B154k08j469j853p87l42J399J071J389J056p92j816j197n11L98J035J443J357
973B327m0r62j513j068o99N93J149J531L97m04r30j311j039k02P64J507R17N04
991A521n76p85j481m54K57J187J271O58J59n31r42j301l67M78Q66J061M18k25
1009A214p59j288n88m2J71J329Q83O71m47j336p79k23M7O13J095P97Q9l52p56
1028C39j157m56M94P09R23O12n71o79n86p14l41J36J149P84J67j79p57o43o73
$$ plain form
1047 -1443 -1118 -248 534 963 1295 993 428 -451 -878 -541 65 727 950 1039 414 -263 -893 -1080 -801 -52
1067 -52 660 637 561 -33 -527 -1042 -947 -502 224 673 1033 599 276 -646 -726 -492 -165 870 1056 950 444
1088 444 -272 -986 -904 -537 51 321 582 225 332 -582 -904 -989 -420 241 411 743 640 -36 -312 -853 -356
1109 -356 25 448 800 642 552 -36 -298 -339 -394 -80 415 650 465 -71 -525 -669 -617 -541 -207 206 601 481
1131 481 -105 -270 -627 -398 -107 422 592 636 210 164 -460 -477 -456 -209 195 529 519 38 -54 -736 -794 -396
1153 -396 -70 228 412 304 57 -575 -674 -432 -41 332 705 522 425 360 111 -220 -445 -73 462 527 359
1174 359 219 -249 -513 -564 -329 -176 -190 364 273 -147 -209 -551 -437 -63 239 280 448 355 19 -82 -287 -318
1196 -318 -200 324 400 592 179 -313 -315 -341 -324 66 145 40 -28 -29 -417 -665 -443 -271 160 557 232 401 -102
$$ packed form
1047a443L25Q70P82M29L32l02n65q79m27L37O06O62K23Q9o25o77o30j87K79P49
1067e2P12k3p6n94m94n15R5M45P26M49L60m34l23r22q0K34L27J035J86j06n06
1088D44p16p14Q2L67N88K70K61l57J07r14l22q5N69O61J70L32j03o76k76n41M97
1109c56L81M23L52j58r0n88k62m1n5L14M95K35j85n36m54j44N2P6L34M13L95j20
1131D81n86j65l57K29K91N29J70M4m26m6o24j7K1K47M04L34j0m81r2o82n8L98
1153c96L26K98J84j08k47o32r9K42L91L73L73j83r7o5k49l31k25L72N35O5j68
1174C59j40m68k64n1K35J53j4N54r1m20o2l42J14L74L02M1J68r3l36j01k05l1
1196c18J18N24P6J92m13m92kk6J7L90P9j05o8jl88k48K22J72M31L97l25J69n03
$$ plain form
1219 -102 -140 -339 6 196 100 247 361 59 -162 -293 -629 -248 -16 -195 10 0 -154 -373 -514 -294 -434
1240 -434 24 69 312 346 -50 160 -182 -115 -193 303 604 361 136 -152 -383 -201 -374 -141 -28 2 174 -241
1262 -241 -91 -454 -528 -164 -41 130 218 185 64 116 12 -86 95 141 444 315 367 16 -221 -85 -257 -308 -178
1285 -178 -24 77 91 -288 -480 -367 -175 -488 297 86 -198 -230 60 13 -180 -176 340 295 228 -111 409 234
1307 234 -263 -172 12 171 340 84 -12 -65 -551 -65 -321 -121 120 44 139 213 -273 -295 -145 23 40 -24 271
1330 271 578 -38 -186 51 -73 -210 -39 69 281 -222 -85 60 -274 -243 -338 -107 -102 -83 -436 -105 -62 -383
1352 -383 71 -10 208 88 206 68 -83 -49 -135 85 144 45 254 327 -53 -258 -108 178 48 -127 -174 312
1374 312 -69 -166 -155 -241 -40 87 165 144 176 -114 60 59 99 88 33 320 156 63 -360 -15 -37 -309 -232 -80 -56
$$ packed form
1219a02l8j99L45J90r6J47J14l02k21j31l36L81K32j79K05j0j54k19j41K20j40
1240d34M58M5K43L4l96K10l42O7p8M96L01k43k25k88k31J82j73K33J13L0J72m15
1262b41J50l63p4L64J23J71Q8l3j21N2j04r8J81M6L03j29N2l51k37J36j72n1J30
1285a78J54J01J4l79j92J13J92l13P85k11k84l2K90m7j93MN16m5o7l39N20j75
1307B34m97R1J84J59J69k56r6n3m86M86k56K00K41p6R5P4m86k2J50J68J7o4K95
1330B71L07o16j48K37j24j37J71J08K12n03J37J45l34L1r5K31NJ9l53L31M3l21
1352c83M54q1K18j20J18j38j51L4q6K20N9r9K09P3l80k05J50K86j30j75m7M86
1374C12l81r7J1q6K01J27P8k1L2k90J74jM0j1n5K87j64r3m23L45k2k72P7J52K4
$$ plain form
1399 -56 -115 -248 -243 -277 -383 -15 62 136 197 30 145 -50 -190 202 117 75 75 263 162 68 -294 -120 126 133 -244
1424 -244 -271 77 -162 -249 -254 49 -301 -86 14 -15 197 -57 191 77 -13 -52 16 217 210 -3 -94 -18 -244 -386
1448 -386 -22 -59 -89 -33 -162 137 -425 -118 -325 -238 103 216 161 117 172 83 -299 260 206 157 289 382 296 27
1472 27 392 -59 -123 64 96 175 -93 -152 80 -28 -278 -391 4 -124 -117 -81 -18 190 162 141 -4 205 75 104
1496 104 222 -24 345 154 137 -231 -92 -3 -69 32 -118 -239 -153 -132 -82 -83 -7 -45 270 -400 38 -90 172
1519 172 33 144 224 14 -58 -12 118 -130 43 328 173 -128 94 86 -280 -220 -147 86 -206 -183 -62 -20 -86
1542 -86 -217 16 -77 -9 171 43 185 335 61 373 -90 -47 -51 46 -147 152 -55 -43 -103 -213 -247 -191 19 -202
1566 -202 -63 -77 -11 10 -28 10 138 83 -48 -169 110 139 192 -62 64 -90 206 1 164 -201 59 -106 -174
$$ packed form
1399e6n9j33Nl4j06L68P7P4O1j67J15j95j40L92q5m2%J88j01r4l62J74K46Pl77
1424b44k7L48k39q7nL03l50K15J00k9K12k54K48j14r0l9O8K01pk13r1P6k26j42
1448c86L64l7l0N6j29K99n62L07k07Q7L41J13n5m4N5q9l82N59n4m9J32R3q6k69
1472B7L65m51o4J87L2P9k68n9K32j08k50j13L95j28PL6O3K08k8k1j45K09j30K9
1496A04J18k46L69j91j7l68J39Q9o6J01j50j21Q6K1N0jP6l8L15o70M38j28K62
1519A72j39J11Q0k10p2M6J30k48J73K85j55l01K22ql66O0P3K33k92K3J21M2o6
1542h6j31K33r3O8J80j28J42J50k74L12m63M3mR7j93K99k07J2o0j10l4N6K10k21
1566b02J39j4O6K1l8L8J28n5j31j21K79K9N3k54J26j54K96k05J63l65K60j65o8
$$ plain form
1589 -174 14 170 -17 153 -141 -74 -256 -152 2 134 -26 56 -80 -151 -79 110 208 227 -104 20 56 -102
1611 -102 -33 268 -58 5 109 80 -170 -303 -171 -144 -218 -50 -24 27 39 130 -62 179 81 85 -78 51 18 232
1635 232 194 319 47 84 -17 -168 173 -181 -7 -130 -144 -282 -314 -80 -177 -482 -70 -64 322 -208 -90 98
1657 98 -243 -60 158 -34 -65 -161 -158 20 71 185 111 -172 -95 -265 142 1 -122 -67 22 270 24 162 100 168
1681 168 -202 -24 118 -25 -130 -127 375 93 90 142 1 -122 -45 -95 -5 -221 -71 -83 -24 -209 -102 -343 -17
1704 -17 -97 -216 -266 37 357 -154 -106 -208 31 115 284 37 157 137 -102 115 -23 -205 -45 28 -126 -125 -164
1727 -164 80 -47 -123 24 -53 -91 -28 -105 -46 170 -230 279 25 -223 84 167 382 84 -115 58 18 -181 55
1750 55 35 -110 -43 -475 -166 -219 -197 -246 -127 262 3 -363 -222 -57 -53 238 199 -156 78 -12 -259 140 27
$$ packed form
1589a74J88J56j87J70k94O7j82J04J54J32j60Q2j36p1P2J89R8J9l31J24L6j58
1611a02O9L01l26O3J04k9k50j33J32K7p4J68K6N1J2R1j92K41r8Mj63J29l3K14
1635B32l8J25k72L7j01j51L41l54J74j23j4j38l2K34r7l05M12OL86n30J18J88
1657I8l41J83K18j92l1r6LJ78N1J14p4k83P7j70M07j41j23N5Q9K48k46J38o2O8
1681A68l70J78J42j43j05LN02k82lN2j41j23P7n0R0k16J50j2N9j85J07k41L26
1704a7q0j19n0L03L20n11M8j02K39Q4J69k47J20k0k39K17j38j82J60P3j54Jl9
1727a64K44j27p6J47p7l8O3p7N9K16m00N09k54k48L07Q3K15k98j99J73m0j99K36
1750E5k0j45O7m32L09n3K2m9J19L89k59l66J41J65MK91l9l55K34r0k47L99j13
$$ plain form
1773 27 297 -111 303 -93 8 261 -142 44 -98 88 -263 27 -216 51 -281 -159 5 -148 142 91 -100
1794 -100 -13 56 36 -64 -119 -105 42 -13 -36 41 220 -129 20 134 -138 -286 -53 -97 90 -92 -4 -133 -111 238
1818 238 -317 -42 -121 82 180 220 -61 -64 114 259 -84 -100 243 -49 185 25 130 145 144 -90 -43 -326 -336 141
1842 141 264 -49 369 -22 -175 -8 -60 101 207 12 32 60 -197 91 -29 -25 84 -14 -203 -206 -51 39 -94
1865 -94 -121 3 -338 49 -202 -63 -128 -101 61 144 -41 201 193 216 170 87 116 200 164 -116 395 14 111 173 -18
1890 -18 -135 -114 119 -249 201 -25 -235 14 -106 -77 13 -165 -17 138 -44 31 -7 102 -197 -66 40 -126
1912 -126 58 73 148 155 -27 109 -86 -60 -130 -225 168 -89 -228 162 131 -149 94 -39 53 9 67 -186 210 -30
1936 -30 -19 165 30 55 -149 151 97 40 -122 -271 6 -28 -231 -44 -148 -151 -176 56 16 -86 90 71 139 137 77
$$ packed form
1773B7K70m08M14l96J01K53m03J86j42J86l51K90k43K67l32J22J64j53K90n1j91
1794a00Q7O9k0j00n5J4J47n5k3P7J79l49J49J14k72j48K33m4J87j82Q8j29K2L49
1818B38n55K75p9K03R8M0k81lJ78J45l43j6L43k92K34j60J05J5jk34M7k83j0M77
1842A41J23l13M18l91j53J67n2J61J06j95K0K8k57K88j20MJ09r8j89lJ55R0j33
1865i4k7J24l41L87k51J39o5K7J62Q3j85K42qK3m6q3K9Q4l6k80N11l81R7O2j91
1890a8j17K1K33l68M50k26k10K49j20K9R0j78J48J55j82P5l8J09k99J31J06j66
1912a26J84J5P5Pj82J36j95K6p0r5L93k57j39L90l1k80K43j33R2m4N8k53L96k40
1936c0J1J84j35K5k04L00n4n7j62j49K77l4k03J87j04lk5K32m0j02J76j9O8ko0
$$ plain form
1961 77 183 127 95 -2 113 65 -227 77 -115 109 -285 262 88 -135 -32 -113 -18 165 25 71 -72 29 30
1984 30 -228 -168 2 -93 69 -22 -35 30 146 219 18 -69 -115 210 201 -311 -77 -78 93 28 130 -159 -278 -190 63
2009 63 -130 -302 -210 -193 69 102 210 -36 129 -110 106 -3 -142 21 59 -22 160 81 -15 -114 83 89 -224 -40
2033 -40 110 107 -64 -176 -36 306 87 95 181 173 131 -40 72 46 57 83 202 189 -25 -21 129 -158 -67 5 -28 -222
2059 -222 -50 -11 -168 -110 79 -120 -157 144 0 72 9 79 -72 142 199 102 358 100 -92 15 -20 -30 -210
2082 -210 33 -174 -102 41 -64 47 64 -203 126 13 6 123 -38 -24 165 -63 299 91 253 70 82 -103
2104 -103 -55 242 -212 -129 -65 -66 -50 -80 -153 -311 -63 -314 -42 90 -95 258 -47 3 -40 113 -75 88 96 123
2128 123 328 13 20 262 -131 129 131 37 -61 -33 -155 -33 -226 98 -190 -38 -81 111 -30 -18 -7 -156 68
$$ packed form
1961G7J06n6l2r7J15m8k92L04j92K24l94N47j74k23J03q1R5J83j40M6j43J01J
1984C0k58O0J70r5J62r1j3O5J16P3k01q7m6L25rn12K34jJ71o5J02k89j19Q8K53
2009F3j93j72R2J7K62L3J08k46J65k39K16j09j39J63L8q1J82p9r6r9J97Ol13J84
2033d0J50lj71j12J40L42k19QQ6qm2j71J12k6J1K6J19j3k14MJ50k87R1P2l3j94
2059b22J72L9j57N8J89j99l7L01j44P2o3P0j51K14N7r7K56k58j92J07l5j0j80
2082b10K43k07P2J43j05J11J7k67L29j13pJ17j61J4J89k28L62k08J62j83J2j85
2104a03M8K97m54Q3O4jJ6l0p3j58K48k51K72J32j85L53l05N0m3J53j88J63QK7
2128A23K05l15PK42l93K60Kr4r8K8j22J22j93L24k88J52m3J92j41J2J1j49K24
$$ plain form
2151 68 -179 15 -2 74 130 74 165 -112 -279 -36 -62 -7 -8 60 -184 -58 51 180 -160 -95 204 16 -107 22
2175 22 -60 22 55 -114 61 276 265 82 -129 58 97 221 -47 -153 38 11 363 43 -255 217 -335 -125
2197 -125 -80 -41 1 -237 142 -40 -81 -44 181 -113 -183 74 111 55 50 -85 -128 -131 -102 -258 -81 -35 -133 -121 -94 71
2223 71 93 12 -211 20 15 -158 173 200 143 147 189 -111 236 76 38 -17 13 61 -114 -105 -49 17 63 -81 19 -130
2249 -130 17 75 -182 -5 -112 134 -79 162 147 -6 -181 -115 346 54 -176 156 -77 -151 -85 60 214 -71
2271 -71 -91 37 -213 -102 50 -234 -93 -81 195 158 -192 125 169 -132 67 248 160 139 -289 78 228 203 -199
2294 -199 227 -30 -123 52 -26 -144 -40 112 174 19 -279 177 74 -12 -75 -116 47 84 4 -290 -48 140 -140
2317 -140 210 102 47 5 -110 58 -111 -9 -203 103 4 -111 125 -189 -65 156 99 271 -36 30 149 52
$$ packed form
2151F8k47J94j7P6N6n6R1k77j67K43k6N5jO8k44J26J09J29l40O5K99j88j23J29
2175B2q2Q2L3j69J75K15j1j83k11J87L9J24k68j06J91k7L52l20k98M72n52K10
2197a25M5L9M2k38L79j82m1L7K25k94p0K57L7n6nj35m3lK9j56J77M6r8J2K7J65
2223G1K2q1k23K31nj73L31K7n7MM2l00L47j60l8n5L0M8j75RN6O6M6j44J00j49
2249a30J47N8k57J77j07K46k13K41j5j53j75O6M61k92k30L32k33p4O6J45J54k85
2271g1k0J28k50J11J52k84J41J2K76l7l50L17M4l01J99J81q8k1m28L67J50k5m02
2294a99M26k57r3J75p8j18J04J52O2j55k98M56j03q6o3m1J63L7q0k94K42J88k80
2317a40L50j08n5m2j15J68j69J02j94L06r9j15K36l14J24K21n7J72l07O6J19r7
$$ plain form
2339 52 -122 73 152 136 26 -134 83 85 118 96 154 -53 -50 70 -55 -221 77 53 85 -19 -40 39 50 -167 -98
2364 -98 1 116 118 31 244 -128 -101 28 -167 -112 -257 99 -147 -16 186 -241 91 -114 -202 -109 -359 44 -181
2387 -181 -254 114 -22 -166 -273 -12 -101 56 111 69 71 342 43 55 201 7 147 23 -227 -103 -157 -15 -221
2410 -221 18 -203 97 -273 71 20 107 -24 -272 145 28 -143 -28 151 -57 -62 255 -164 74 29 68 -89
2432 -89 90 -38 -19 18 70 222 -157 127 -84 35 -118 -51 152 -35 220 -43 205 -142 141 154 -38 -150
2454 -150 10 263 -9 348 303 -15 72 -50 -476 -57 -91 27 -93 -92 76 -152 -81 -88 -146 -132 -23 27 -329 -136
2478 -136 -121 -60 331 -92 -135 63 117 26 182 -166 75 -157 -131 -104 -358 -24 22 -98 23 128 276 64 44
2501 44 -70 42 283 298 175 235 82 -270 71 -2 193 -73 -82 -70 -161 67 141 -129 148 -160 -146 328 -85
$$ packed form
2339E2j74J95P9j6j10j60K17KL3k2N8k07LJ20j25j66K98k4L2j04k1P9J1k17O9
2364i8R9J15Kq7K13l72K7J29j95N5j45L56k46J31K02m27L32k05q8R3k50M03k25
2387a81p3L68j36j44j07K61q9J57N5m2KK71k99J2J46j94J40j24k50J24n4J42k06
2410b21K39k21L00l70L44n1Q7j31k48M17j17j71J15J79k08nL17m19K38m5L9j57
2432h9J79j28J9L7N2J52l79K84k11J19j53O7K03j87K55k63K48l47K83J3j92j12
2454a50J60K53k72L57m5l18Q7j22m26M19l4J18j20JJ68k28P1pn8J4J09N0l56J93
2478a36J5O1L91m23m3J98N4r1J56l48K41k32K6K7k54L34M6j20J21J05J48k12k0
2501D4j14J12K41J5j23O0j53l52L41p3J95k66rJ2r1K28P4k70K77l08J4M74m13
$$ plain form
2524 -85 -81 77 24 11 -38 186 -191 -99 39 -26 381 43 253 -50 91 -28 -60 164 23 221 191 31 72 129
2548 129 71 -72 -184 78 -80 97 -31 13 -135 156 -24 -11 60 -142 -322 78 59 -295 -6 47 -21 -25 -347
2571 -347 -116 -61 -38 -274 -70 -151 -116 -153 -83 35 -294 -132 -134 4 -30 -35 149 144 -147 -234 123 157 135 65 74 325
2597 325 -31 172 163 138 -121 108 -48 -79 -94 101 68 62 75 -72 -106 85 -116 32 257 220 254 112 -193 -5
2621 -5 -171 -121 283 124 -138 -140 6 26 -259 -205 -53 170 21 -60 123 -7 -53 145 136 55 155 145 -25 -89 -138
2646 -138 210 164 99 322 146 -10 -83 226 -141 104 -325 45 59 -197 229 -45 71 -129 26 107 -66 -15
2668 -15 -124 34 -105 12 -83 81 59 -99 270 -111 -130 -41 -210 120 -25 133 33 72 -37 49 106 71 -13
2691 -13 64 111 163 114 200 218 -11 133 -79 -219 -63 -19 23 135 -135 101 -52 -139 -208 -241 80 -104 183 -110
$$ packed form
2524h5MJ58n3j3m9K24l77R2J38o5M07l38K10l03J41j19l2K24j41J98l0j60M1N7
2548A29n8j43j12K62j58J77j28M4j48K91j80J3P1k02j80M00j9l54K89N3o8ml22
2571c47K31N5K3k36K04q1L5l7P0J18l29J62kJ38l4nJ84nk91q7L57L4k2p0RK51
2597C25l56K03rk5k59K29j56l1j5J95l3oJ3j47l4J91k01J48K25l7L4j42l05J88
2621ej66N0M04j59k62kJ46K0k85N4J52K23j49q1J83j30m6J98rq1J00j0j70o4m9
2646a38L48m6o5K23j76j56p3L09l67K45m29L70J4k56M26k74J16k00J55Q1j73N1
2668a5j09J58j39J17r5J64k2j58L69l81j9Q9j69L30j45J58j00L9j09Q6N7l5q4
2691a3P7M7N2m9Q6J8k29J44k12j40J56M4M2J12k70K36j53q7o9l3L21j84K87k93
$$ plain form
2715 -110 -171 -72 67 46 -179 22 -20 37 -75 40 109 103 -53 -30 168 -21 -97 178 161 -75 -72 165 -99 23
2739 23 -47 -63 -146 67 29 43 -180 75 -16 -151 126 135 -83 100 109 66 -44 85 182 -97 -323 -117 36 -56 283
2764 283 50 -161 -121 -119 -54 217 -222 -42 -90 24 84 -105 -8 -70 -142 152 -189 -78 -142 -21 205 -153 93
2787 93 84 -227 66 6 56 83 -6 -8 -37 61 31 192 -52 -8 -55 234 22 -43 206 10 90 254 -329 -101 14
2812 14 -94 -253 -166 -197 -22 94 187 -11 -175 138 289 -11 -168 56 -48 -61 -39 -172 325 -32 -128 10
2834 10 122 77 134 -74 -108 -11 -139 -70 -98 -96 87 -13 182 211 -210 83 59 -24 15 12 155 -70 -7 211 68
2859 68 26 63 216 31 157 163 1 60 -257 -132 59 111 -277 11 -79 -389 -39 -44 -7 -161 -95 115 48 9 -65
2884 -65 24 102 11 -53 -365 95 -79 -20 -40 -82 194 -38 -35 -177 19 201 46 30 -22 225 313 -109 -170 37 8
$$ packed form
2715a10o1R9J39k1k25K01m2N7j12J15O9oj56K3J98j89p6K75j7k36LK37k64J22
2739B3p0j6q3K13l8J4k23K55r1j35K77Rk18J83Rm3j10J29R7k79k26K06J53r2L39
2764B83k33k11M0KO5K71m39J80m8J14O0j89R7o2p2K94l41J11o4J21K26l58K46
2787I3rl11K93o0N0K7q9kk9R8l0J61k44M4m7K89k12o5K49j96Q0J64n83K28J15
2812A4j08j59Q7l1J75J16R3j98j64L13J51l00j57K24j04j3K2j33M97l57r6J38
2834A0J12m5N7k08l4R7j28O9k8KJ83j00J95K9m21K93k4q3L9lJ43k25O3K18j43
2859F8m2L7J53j85J26Oj62N9l17J25J91N2l88K88r0l10L50nL7j54O6K10o7l9p4
2884f5Q9P8r1o4l12M60j74N9k0m2K76k32Lj42J96J82j55j6n2K47Q8m22o1K07k9
$$ plain form
2909 8 25 85 88 -102 -25 -20 -116 37 32 -26 172 -16 10 134 -67 -35 -86 -72 -317 -65 -133 173 61 -194 -249 -43
2935 -43 11 68 -72 19 -158 226 77 -105 -61 42 123 -85 -4 -221 179 135 68 95 134 35 72 -84 391 87
2959 87 -110 254 -63 135 71 198 -10 244 9 221 294 88 -25 69 -64 -226 50 -248 -161 -72 64 -120
2981 -120 -36 176 -175 14 -83 -237 64 -5 103 104 125 84 -12 -319 -259 -227 -87 130 -88 -2 -139 -50 -9 179
3005 179 -231 24 303 -170 -20 358 31 76 3 121 -31 5 -87 1 102 64 135 241 -17 165 40 137 -47
3028 -47 65 -45 53 -39 -52 -218 129 49 -179 -93 139 -134 -120 79 -327 77 99 -135 -163 2 -19 152 48
3051 48 -27 387 19 329 152 -53 66 336 -199 30 13 181 -188 14 -193 138 175 -153 44 258 -132
3072 -132 -5 228 -62 -126 20 -194 46 116 300 236 201 118 96 219 -137 -114 -61 -61 -121 -89 169 -143 -24 -11
$$ packed form
2909HJ7O0Lj90P7Nr6J53nn8J98j88K6J24k01L2n1J4k45K52o8L06j12k55n5K06
2935d3N4N7j40R1j77L84j49j82M4J03Q1k08Q1k17M00m4o7K7L9r9L7j56M75l04
2959H7j97L64l17J98o4J27k08K54k35K12P3k06j13R4j33j62K76k98Q7Q9J36j84
2981a20Q4K12l51J89r7j54L01o9J08JK1m1r6l07O0L2J40K17k18Q6j37Q9M1J88
3005A79m10K55K79m73J50L78l27M5p3J18j52L6r2Q8J01l8P1J06k58J82j25R7j84
3028d7J12j10R8r2j3j66L47q0k28Q6K32k73J4J99m06M04K2k34k8J65k1J71j04
3051D8p5M14l68L10j77k05J19K70n35K29j7J68l69K02k07L31L7l28J97K14l90
3072a32J27K33k90o4J46k14K40P0J84o4l5q3k2J23l56K3N3%o0L2K58l12J19J3
$$ plain form
3096 -11 38 -75 -3 -289 160 -60 60 1 89 297 10 342 -21 68 -56 149 -63 297 62 171 33 7
3118 7 305 105 79 -193 21 -16 -48 262 -112 -234 126 -177 158 52 -124 92 136 -74 64 55 -9 -146 -38
3141 -38 167 -139 297 29 -3 117 149 -97 -98 280 75 39 -56 -152 95 207 -30 170 34 91 -99 218 4
3164 4 -4 256 277 100 -1 -82 -96 40 64 -41 -165 51 113 -30 -83 57 -223 1 -194 -69 116 48 -58 -36
3188 -36 157 -30 52 -173 -54 142 -165 -115 23 -85 -45 163 181 -79 42 247 33 109 60 56 -212 77 -103
3211 -103 37 -44 121 222 61 -2 -233 188 184 -65 136 -111 56 -115 -36 58 -174 -59 50 139 -94 -216
3233 -216 26 120 166 17 -67 62 -145 94 -127 -249 -87 25 -9 -73 64 -24 111 113 183 -33 50 38 -186 -232
3257 -232 -377 -172 40 17 192 -11 174 -61 78 306 50 -31 61 144 155 -37 -373 164 48 94 -234 12
$$ packed form
3096a1M9j13P2k86M49k20J20n9Q8K08k87L32l63Q9j24K05k12L60k35J09j38k6
3118GK98k00k6k72K14l7l2L10l74j22L60l03L35j06j76K16M4k10J38ro4j37J08
3141c8K05l06M36k68l2J20L2k46jL78k05l6r5r6K47J12k37K00j36N7j90L17k14
3164DqK60K1j77j01q1j4J36K4j05j24K16O2j43n3J40k80K24j95J25J85o8j06K2
3188c6J93j87Q2k25J19J96l07N0J38j08M0K08J8k60J21K05k14P6m9mk68K89j80
3211a03J40q1J65J01j61o3k31M21mk49K01k47J67j71P9R4k32J15J09Q9k33j22
3233b16K42R4M6j49q4J29k07K39k21j22J62J12l4o4J37q8J35KP0k16Q3j2k24m6
3257b32j45K05K12k3J75k03J85k35J39K28k56q1R2Q3J1j92l36N37j16M6l28K46
$$ plain form
3279 12 -204 -101 6 -19 225 68 -199 -303 -70 -158 -242 -254 -82 89 5 58 35 -144 -127 -98 146 -221 23
3302 23 -89 -44 -124 -58 -157 110 62 400 -35 82 -18 9 102 192 239 -36 -176 -110 129 111 -9 99 184 237 -162
3327 -162 -77 -106 15 49 125 -88 -145 -234 -110 -105 -268 153 -258 -139 29 -105 -155 -89 -330 140 266 -62 56
3350 56 75 -275 12 -184 -149 106 -179 -32 -94 175 160 -373 56 -11 79 -27 -81 -68 30 141 -43 128 97 -98
3374 -98 20 70 -167 -148 -144 -164 59 -32 73 -44 38 -172 -205 218 -27 -31 -78 -84 -349 -358 -190 -95 -30 -77 108 87 -19
3401 -19 6 114 -148 -294 27 36 35 290 -58 -250 -160 66 -140 19 -106 -104 94 261 -87 115 206 -167 112
3424 112 121 431 51 -69 97 223 5 129 -151 -1 -106 -93 27 172 -189 -96 99 -28 -151 -106 129 -158
3446 -158 -245 -18 -18 -75 149 -53 -223 30 154 -28 -82 254 8 -80 28 160 70 -96 -97 73 21 264 198 32
$$ packed form
3279A2k16J03J07k5K44j57k67j04K33q8q4j2J72J71q4N3k3j79J7K9K44l67K44
3302B3j12M5q0O6r9K67m8L38m35J17j00K7R3R0M7k75j40O6K39j8j20J08Q5N3l99
3327a62Q5k9J21L4P6k13n7q9J24Nj63M21m11J19J68j34n0O6k41M70J26l28J18
3350E6J9l50K87j96L5K55k85J47o2K69j5n33M29o7R0j06n4J3R8J11j84J71l1j95
3374i8J18N0k37J9Mk0K23r1J05j17Q2k10l3M23k45mm7ok65rJ68R5O5m7J85k1j06
3401a9K5J08k62j46L21RjK55l48j92R0K26k06J59j25KJ98J67l48K02R1l73K79
3424A12RL10l80j20J66J26k18J24k80J50j05J3J20J45l61R3J95j27j23M5K35k87
3446a58q7K27%n7K24k02j70K53J24j82n4L36k46q8J08J32r0j66jJ70n2K43o6j66
$$ plain form
3470 32 107 95 167 187 176 56 63 115 286 31 -26 57 57 2 -105 -67 167 -209 -23 -185 296 -101 -141 -156 69 -26
3496 -26 -74 -25 135 9 -40 -20 3 89 -128 112 128 -82 79 -90 -11 -24 50 84 16 102 41 36 -195 22 179 -8
3522 -8 29 -86 -93 -15 -146 -161 -3 168 -30 -124 -28 -27 20 -90 -180 -19 -98 -76 62 -121 -289 -13 145 79 -129
3547 -129 -68 -4 -140 -124 -126 241 137 111 -29 -214 145 -13 114 -102 -67 168 -115 334 124 119 -294 179 65
3570 65 -35 310 28 116 121 58 -100 192 -101 65 -163 -148 -82 -110 -51 -51 118 -35 -51 -147 55 40 -28 1 25 47
3596 47 -99 37 70 21 202 18 50 -175 -123 -98 -168 20 -179 5 113 169 74 143 -10 73 129 -267 -253 17
3620 17 -172 73 21 6 -33 -20 82 161 184 88 120 324 -11 137 -12 -19 123 11 124 193 -21 -75 119 -95
3644 -95 -133 98 -151 -70 139 -193 216 -149 -66 -18 -92 -165 42 70 77 10 2 -201 121 54 -95 -57 -221 188 202
$$ packed form
3470C2P5j2P2K0j1j20PN2J71k55n7Q3%n5j07L8K34l76J86j62M81l97m0j5K25r5
3496b6m8M9J60j26m9K0K3Q6k17K40J6k10J61j69P9j3P4L4o8Q6o1nk31K17J57j87
3522hL7j15pP8j31j5J58J71j98r4R6JM7j10r0J61p9K2J38j83j68K76J58o6k08
3547a29O1O4j36J6kL67j04k6j40j85L59j58J27k16L5K35k83M49k10nm13M73j14
3570F5j00L45k82Q8No3j58K92k93J66k28J5O6k8N9%J69j53j6r6K02j5o8K9K4K2
3596D7j46J36L3m9J81j84L2k25N2K5p0J88j99J84J08N6r5O9j53Q3N6l96J4K70
3620A7j89K45n2j5l9J3J02P9K3r6L2K04l35J48j49pJ42j12J13O9k14n4J94k14
3644i5l8K31k49Q1K09l32M09l65Q3M8p4p3K07K8Po7qk03L22o7j49L8j64M09J4
$$ plain form
3669 202 -83 101 -94 -160 -70 -97 33 -101 69 107 146 -110 10 64 45 174 28 -180 -39 51 137 -6 -159
3692 -159 -174 -45 -174 -323 -294 11 11 -146 -30 186 -151 26 -79 97 -57 97 -66 0 162 119 122 197 245
3715 245 -113 62 -47 238 296 134 -109 62 -16 17 160 -20 -46 -39 96 -167 84 263 -115 290 189 -63
3737 -63 -39 151 -107 -37 123 298 227 78 175 -190 -204 51 -16 -118 -53 -58 154 -54 -20 -83 -336 38 -56 -359
3761 -359 -56 168 68 106 58 84 59 -131 334 269 18 -76 196 52 52 79 270 -142 139 110 85 -131 149 24
3785 24 -135 86 73 54 -53 141 -112 130 -262 14 -18 -70 -159 -125 -53 47 39 -29 99 -293 41 94 -118 -38
3809 -38 -107 266 -29 312 -42 -90 72 162 -108 -107 -191 -125 -33 -41 -82 -74 51 -47 143 3 202 -84 -108 21 30 -26
3835 -26 219 -313 -4 85 -43 84 -149 -21 -3 -225 9 -16 -130 -254 82 -203 122 -141 -41 44 11 300
$$ packed form
3669B02k85J84j95o6R0k7J30j34J70L8L9k56J20N4j9J29j46k08J41R0Q6j43j53
3692a59j5J29j29j49K9L05%j57J16K16l37J77j05J76j54J54j63O6J62m3LP5M8
3715B45l58J75j09K85N8j62k43J71p8L3J43j80k6PJ35k63K51J79l78M05j01k52
3737f3K4J90k58P0J60J75p1j49R7l65j4K55o7j02O5nK12k08L4o3k53L74r4l03
3761c59L03K24j00L8m8K6k5j90M65o5k51r4K72j44%K7J91m12K81k9k5k16K80j25
3785B4j59K21j3j9j07J94k53K42l92K76l2n2q9L4P2J00qo8J28l92L34N3k12Q0
3809c8o9L73k95L41l54m8J62R0k70Jq4O6R2qm1QJ25r8J90j40J99k86k4J29Rn6
3835b6K45n32L09Q9j28J27k33J28J8k22K34k5j14j24L36k85L25k63J00Q5l3K89
$$ plain form
3857 300 107 -10 -128 201 206 -25 -270 195 40 -95 -109 -102 -168 -37 -232 184 -95 -6 41 224 57 155 40
3880 40 35 -139 70 -42 -117 -134 29 96 112 -8 -109 124 31 -150 -154 -104 -136 -104 -119 259 -85 -57 155 -192 16
3905 16 -111 106 -29 -6 -121 -29 -203 -51 54 -70 72 -155 39 198 338 89 140 66 -106 10 92 92 129
3928 129 -34 35 101 22 226 171 -40 27 -153 17 -2 -142 40 25 36 -44 -94 115 -64 -118 -309 137 -206 -46
3952 -46 -161 61 259 -47 -200 55 108 -311 157 100 147 169 -120 -46 22 -42 8 136 159 245 -53 -71 132 104
3976 104 106 10 49 -172 -33 71 117 46 120 -104 28 -78 -121 286 11 -19 207 283 -71 93 11 100 -176 -26
4000 -26 -34 -77 10 15 -3 28 -42 174 -121 50 99 115 -87 -83 27 -76 122 -26 182 -2 -114 24 21 197 75
4025 75 -130 -13 -106 -11 37 3 -49 -167 16 -77 27 153 -1 167 121 133 -28 120 77 162 54 -156 -135 -25
$$ packed form
3857C00j93j17j18L29Nk31k45M65j55j35j4Po6J31j95M16k79Q9M7J83j67R8j15
3880D0nj74K09j12p5j7J63O7J6j20j01K33r3j81mN0l2L2j5L78l44K8K12l47K08
3905A6j27K17j35K3j15R2j74J52J05j24J42k27J94J59J40k49N1p4j72J16Q2%L7
3928A29j63O9O6p9K04n5k11O7j80J70j9j40J82j5J1q0n0K09j79n4j91M46l43J60
3952d6j15K22J98l06j53K55N3m19M68n7M7K2k89P4O8o4N0J28K3Q6k98j8K03k8
3976A04Kr6L9k21J39J04M6p1P4k24J32j06m3M07k75l0K26P6l54J64q2Q9k76J50
4000b6qm3Q7Nj8L1p0K16k95J71M9J6k02MJ10j03J98j48K08j84j12J38lJ76j22
4025G5k05J17r3R5M8l4n2j18J83r3J04J26j54J68m6J2j61J48m3Q5j08k10K1J10
$$ plain form
4049 -25 -211 38 -51 -61 13 -367 10 -242 74 -135 -389 -18 52 179 -131 124 89 -26 -119 -95 165 -6 106
4072 106 9 -44 -206 -3 131 111 -40 212 46 -80 7 164 115 111 8 -305 272 84 -18 60 -170 -255 89
4095 89 -98 -74 174 -93 -2 26 -49 -32 -25 22 -108 107 -97 -50 -90 -162 -162 32 335 -180 47 95 -185 56 -170
4120 -170 134 67 -102 48 223 121 -150 -163 182 91 -19 219 256 35 -100 -10 -132 114 79 68 40 -17 112
4143 112 -4 -64 -98 227 -78 31 309 439 -7 -158 -200 -210 13 79 34 -19 -168 -68 173 107 -166 -171 29
4166 29 -121 -74 -56 193 197 -155 210 11 225 91 -371 230 19 316 82 -15 60 51 102 114 292 -34 59 14
4190 14 154 19 -67 73 -112 -93 -26 36 -20 46 27 -165 217 -150 -56 110 118 189 23 81 -188 93 185 -185 56
4215 56 -148 168 -96 196 166 -122 -65 -187 -20 -75 -89 69 -22 161 205 285 152 -77 -128 -133 -1 -11 -66 7 156
$$ packed form
4049b5j86K49q9j0P4l80L77k52L16k09k54L71P0J27l10K55l5j15r3K4K60j71J12
4072A06r7n3j62K03J34k0j51K52j66j26Q7J57m9mj03l13N77j88j02P8k30q5L44
4095H9j87K4K48k67R1K8p5J7PM7j30K15k04M7m0p2%J94L03n15K27M8k80K41k26
4120a70L04o7j69J50J75j02k71j3L45r1j10K38L7k21j35R0j22K46l5j1k8n7J29
4143A12j16o0l4L25l05J09K78J30m46j51m2j0K23O6m5n3j49J00K41o6k73nK00
4166B9j50M7J8K49Ml52L65j99K14j34m62O01k11K97k34r7P5rN1J2J78l26R3m5
4190A4J40j35q6J40j85J9O7O2n6O6j9j92L82l67R4J66QP1j66N8k69K81R2l70K41
4215E6k04L16k64K92l0k88N7j22J67n5j4J58r1J83M4Q0j33k29n1nJ32j0n5P3J49
$$ plain form
4240 156 99 242 -247 -8 -239 -119 192 31 250 -135 106 72 -122 57 -27 -189 37 -78 153 -132 120
4261 120 2 225 16 2 -43 -68 125 -3 -138 18 23 -78 113 47 58 -71 -2 -31 193 213 -167 138 73 12
4285 12 -10 79 91 98 -64 129 81 29 103 3 282 90 -107 97 -31 17 -89 -44 102 -225 5 -53 88 -146
4309 -146 113 31 -1 -232 199 30 -20 -40 -117 24 -137 -240 101 -48 183 -35 -109 36 79 -19 223 44 36
4332 36 92 102 99 49 29 190 138 230 -118 126 259 57 81 -19 -71 34 124 184 -84 -44 -69 -178 87 53 -60
4357 -60 209 -106 41 -85 -94 138 -14 4 -147 11 -124 48 -15 -209 119 145 -95 6 50 -59 -4 -165 -143
4380 -143 84 24 -152 -43 154 48 124 -16 -60 63 -7 -178 -55 173 3 45 303 -306 135 173 -68 320
4402 320 136 -156 -120 -305 -100 -165 69 12 -216 -234 -149 33 -27 -322 181 38 -201 51 197 29 -65 51
$$ packed form
4240A56n7J43m89K39k31J20L11j61K19l85K41l4j94J79q4j62K26j15K31k85K52
4261A20j18K23k09j4m5k5J93j28j35J56Nj01J91o6J1j29O9k9K24K0l80L05o5o1
4285A2k2Q9J2Pj62J93m8n2P4j00K79j92j97K04j28M8j06M5J46l27K30n8J41k34
4309a46K59q2l2k31M31j69n0k0p7J41j61j03L41j49K31k18p4J45M3r8K42j79q
4332C6N6J0ln0k0J61n2R2l48K44J33k02K4j00n2J05R0O0k68M0k5j09K65l4j13
4357f0K69l15J47j26rK32j52J8j51J58j35J72o3j94L28K6k40J01M4j09N5j61K2
4380a43K27o0j76J09J97j06P6j40m4J23p0j71J23K28j70M2K58o09M41L8k41L88
4402C20j84k92L6j85K05o5K34n7k28j8Q5J82o0k95N03j43k39K52J46j68r4J16
$$ plain form
4424 51 -11 -53 194 240 18 -208 -33 -35 -224 -49 16 136 -108 -69 21 26 -194 -91 53 -97 5 158 -31 165
4448 165 -105 183 56 7 11 -111 74 80 61 -72 -187 -21 -9 -114 -307 88 -157 -117 -72 -152 -71 50 54 -54
4472 -54 -384 -256 68 -276 -19 283 -135 -73 280 94 71 -51 17 -83 -141 -190 -11 34 153 5 -238 -32
4494 -32 173 -80 -139 31 -224 1 88 -102 74 -21 -161 -93 43 -79 -310 224 -111 -52 173 -89 18 -8
4516 -8 -69 70 -10 -221 59 -24 -371 -249 -83 112 95 -103 -92 109 72 141 -138 98 190 111 234 116 518 -52
4540 -52 135 -128 84 -104 325 119 -31 -221 17 -79 -39 5 -199 -145 33 96 -36 26 212 215 115 -164 -69
4563 -69 -96 224 106 58 -112 97 -13 130 79 -182 -113 -101 16 -266 -100 -160 -69 75 -1 -57 213 199 -11 -128
4587 -128 214 201 35 110 -18 79 149 130 169 20 -135 82 32 -180 159 50 -241 1 15 -62 192 -131 70
$$ packed form
4424E1o2m2K47M6k22k26J75kj89J75O5J20k44L9R0Nk20J03J44j50J02J53j89J96
4448A65k70K88j27m9Mj22J85Oj9j33j15J66J2j05j93L95k45M0M5q0Q1J21Mj08
4472e4l30J28L24l44K57L02m18O2L53j86k3j22O8j00n8m9J79M5J19j48k43K06
4494c2K05k53n9J70k55K25Q7j90J76r5j40O8J36j22k31N34l35N9K25k62J07k6
4516ho1J39q0k11K80q3l47J22J66J95j7j98J1K01l7O9k79K36R2p9J23j18M02n70
4540e2J87k63K12j88M29k06j50j90K38r6M0M4k04N4J78O3j32O2J86Lj00k79R5
4563f9k7L20j18m8j70K09j10J43n1k61O9J2J17k82J66o0R1J44p6n6K70j4k10j17
4587a28L42j3j66P5j28R7P0j9L9j49j55K17n0k12L39j09k91K42J4p7K54l23K01
$$ plain form
4610 70 -281 -47 -290 57 128 -57 -112 271 -150 -72 11 218 31 16 104 -155 197 -100 -166 -23 -56 -96 31
4633 31 76 86 -120 45 130 175 31 200 -64 5 322 274 127 150 -28 6 156 -42 -20 250 -154 12 -107
4656 -107 -95 59 -10 51 66 -15 -122 -34 145 -70 41 -241 -1 -6 -102 -183 60 -21 -199 -1 -29 -112 -294 -204 37
4681 37 -54 -27 162 -206 103 243 26 90 46 140 34 30 150 1 -79 119 128 40 -97 131 -45 129 173 -73
4705 -73 186 -170 -36 103 76 -57 -84 112 -77 -122 -186 -19 84 -117 276 243 -325 -33 -141 -69 -159 -23 10
4728 10 14 -196 262 96 178 -120 0 -62 -94 220 -120 -121 -98 120 -227 128 44 -13 -26 216 126 109 96 192 -215
4753 -215 -110 -11 264 -46 281 56 -107 306 107 138 -68 6 -230 49 29 -153 -45 -58 -24 -300 -61 104
4775 104 149 -52 -137 -101 -27 -197 -186 72 -276 -114 -211 -131 117 -181 -35 -176 -60 235 181 234 -47 74 -17
$$ packed form
4610G0l51K34k43L47P1j85n5L83m21P8Q3K07j87j5Q8k59L52k97o6J43l3m0J27
4633C1M5J0k06J65Q5M5j44J69k64O9L17m8j47K3j78L4J50j98K2K70m04J66j19
4656a07J2J54o9O1J5q1j07Q8J79k15J11k82K40nr6q1K43q1j78J98k8q3j82R0K41
4681C7r1K7J89l68L09J40k17O4m4R4j06mJ20j49q0J98Rq8j37K28j76J74M4k46
4705g3K59l56J34J39k7j33k7J96j89m5o4J67J03k01L93l3n68K92j08P2r0J36L3
4728A0Mk10M58j66Q2k98J20o2l2L14l40jK3K18l47L55q4n7j3K42r0j7j3R6m07
4753b15J05R9K75l10L27k25j63M13j99L1k06P4k36K79k0j82J08j3L4k76K39J65
4775A04M5k01q5L6P4j70J1K58l48J62r7Q0K48k98J46j41J16K95n4N3k81J21r1
$$ plain form
4798 -17 210 16 176 -136 -22 99 57 294 -108 -15 -88 207 62 26 157 278 115 84 55 -47 51 -285 -143
4821 -143 -115 100 -36 -152 109 165 193 -159 -52 -124 266 54 120 93 118 170 -9 234 159 -119 103 -6 -4 -108
4845 -108 -97 -31 106 262 153 179 42 -45 -86 308 -195 348 -36 -44 -124 129 298 -130 -5 238 112 39 -40
4868 -40 116 -142 -242 -176 -146 -136 75 -222 -129 7 165 75 141 -62 43 -105 -20 121 180 -284 -29 241 343
4891 343 140 -4 276 -106 209 -27 53 195 -103 -6 326 -84 -179 -105 -35 134 -40 166 -42 -130 11 55
4913 55 255 5 30 55 62 -103 34 -17 -62 -121 79 -45 40 -198 2 -80 -145 -158 -46 -79 -25 -30 89 -64 -76 137
4939 137 238 63 91 0 289 115 178 -39 -160 60 -80 -115 51 -144 -99 -187 216 41 -124 261 -149 71
4961 71 53 101 85 131 -52 -148 -79 -21 -205 233 -73 227 -182 -49 -63 -130 -188 107 -26 -54 -127 -72 262 -223 -150
$$ packed form
4798a7K27j94J60l12J14J21m2K37m02R3p3K95j45l6J31J21j63l1k9j02R8l36J42
4821a43K8K15j36j16K61N6K8l52J07p2L90k12O6k7K5N2j79K43p5k78K22j09Kj04
4845a08J1O6J37J56j09K6j37q7m1L94n03N43l84qq0K53J69m28J25K43j26p3p9
4868d0J56k58j00O6L0J0K11k97R3J36J58r0O6k03J05j48Q5J41N9m64K55K70J02
4891C43k03j44K80l82L15k36Q0J42k98R7L32m10r5P4P0J69j74K06k08q8J41M4
4913E5K00k50K5K5Pj65J37n1m5n9K00j24Q5k38K00q2o5j3J12l3N4nJ19j53j2K13
4939A37J01j75K8r1K89j74O3k17j21K20j40l5J66j95M5q8M03j75j65L85m10K20
4961G1j8M8j6M6j83r6O9N8j84M38l06L00m09J33j4o7n8K95j33k8p3N5L34m85P3
$$ plain form
4986 -150 20 -66 -102 148 69 141 162 -52 132 -63 13 250 276 -97 388 -115 328 -83 134 251 -136 -42 88
5009 88 -115 -153 327 -96 51 24 -195 -19 99 -70 5 -68 -23 22 -34 8 62 63 -13 -163 122 -52 -3 89 -74
5034 -74 -123 -172 322 -34 -48 110 -193 18 78 -21 64 -373 39 204 -61 -117 62 -122 8 72 67 135 -128 53
5058 53 104 72 16 -12 -51 44 -18 28 -1 47 -8 -203 -100 170 109 125 -85 -12 -52 -83 57 1 -39 33 29 -194 -36
5085 -36 13 119 -122 34 -61 179 31 11 27 184 97 48 12 5 34 314 8 -54 244 113 -12 88 -4 4 -66
5110 -66 282 -27 -114 -208 144 -12 -113 97 -182 105 238 97 -24 155 136 11 91 182 102 37 -137 -15 -58
5133 -58 -267 -234 -340 226 3 119 105 168 120 -118 -162 -153 53 58 78 -21 -182 -172 38 59 31 -28 -8 26 111 88 43
5160 43 185 -157 77 -61 161 75 12 94 -187 7 -96 -97 -103 -95 -98 -91 -73 -206 -52 20 -46 -72 -216 -83 -39 28 -13
$$ packed form
4986a50J70q6l6K50p9P2K1k14J84j95P6K37K6l73M85n03M43m11K17J17l87R4J30
5009H8k03l8M80m23J47k7k19J76J18j69P5p3M5M5n6M2N4Jp6j50K85j74M9R2j63
5034g4m9m9M94l56j4J58l03K11O0r9Q5m37M12J65k65n6J79j84J30O4nO8k63J81
5058E3N1l2n6k8l9R5o2M6k9M8n5j95J03K70o1J6k10P3m0l1J40n6m0P2mk23J58
5085c6M9J06k41J56r5K40j48k0J6J57q7m9l6pK9K80l06o2K98j31j25J00r2Qp0
5110f6L48l09q7r4L52j56j01K10k79K87J33j41j21J79j9j25Q0R1q0o5j74J22m3
5133e8k09L3j06N66k23J16j4O3m8k38m4RK06NK0r9j61J0K10K1k8n9K0L4Q5k3m5
5160D3J42l42K34j38K22q6o3Q2k81J94j03joQlPJ8j33J54P2o6k6j44J33M4O7m1
$$ plain form
5187 -13 -2 -11 131 112 -106 26 -148 1 -38 163 204 58 -23 36 -14 82 56 239 -156 193 137 -206 198 -285
5211 -285 29 71 177 -82 -215 107 -4 202 -10 -103 -58 106 -68 123 111 32 27 -262 -155 -63 70 101 -158
5234 -158 187 170 -60 130 -127 132 -122 7 -94 144 -6 93 181 103 61 -159 123 34 178 -66 222 -95
5256 -95 -2 147 11 -137 150 50 -136 106 263 76 281 -148 -39 6 152 121 -133 141 -100 355 -3
5277 -3 -285 -68 -76 145 -39 -147 -140 -77 11 -185 198 -322 -165 169 -102 -61 141 82 197 -24 177 163 36 -57
5301 -57 232 -10 -40 5 218 66 200 71 273 -106 129 -155 -55 180 123 103 -114 -102 -98 56 -25 -180 -49
5324 -49 57 -77 68 -17 84 133 -254 94 225 4 102 -190 -140 -121 234 172 152 36 131 75 181 171 -23 84
5348 84 71 100 -297 97 134 254 -49 -77 74 77 117 234 27 -285 -40 139 -27 -342 -6 130 -281 -172 -80
$$ packed form
5187a3J1rJ42j9k18J32j74J49l9K01M1j46q1N9n0R6k6J83l95L49n6l43M04m83
5211b85L14M2J06k59j33L22j11K06k12r3M5J64j74J91j2p9nk89J07R2J33L1k59
5234a58L45j7k30J90k57K59k54J29j01K38j50R9Q8p8m2k20K82q9J44k44K88l17
5256i5R3J49j36j48K87j00j86K42J57j87K05m29J09M5J46l1k54K74k41M55l58
5277ck82K17qK21j84j08PO3Q8j96L83n20J57L34k71M1K02n9J15k21K01j4j27r3
5301e7K89k42l0M5K13j52J34j29K02l79K35k84J00K35n7k0k17J2MJ54q1j55J31
5324d9J06j34J45q5J01M9l87L48J31k21R8k92N0J9L55o2k0j16R5n6J06j0j94J07
5348H4j3K9l97L94L7J20l03k8J51LM0J17k07l12K45J79j66l15L36J36m11J09R2
$$ plain form
5371 -80 46 62 143 -101 -10 158 -3 -21 -114 -73 -91 -156 -13 102 -4 -123 -55 79 -32 -197 293 129 207 -117
5395 -117 -148 -7 -152 -140 -16 16 -10 132 -6 275 150 24 5 38 6 196 146 99 -33 -88 -110 192 -34 108
5419 108 -82 -128 8 -18 -14 -31 156 120 112 -49 46 129 60 0 -14 106 -50 -160 -29 154 -170 -155 -36 43 27
5444 27 -1 63 -77 56 -143 -104 -43 154 -107 93 1 -83 -2 55 51 -51 -178 153 36 139 293 -60 293 -105
5468 -105 -59 13 236 398 150 38 10 -52 100 73 43 -44 -60 142 -293 89 -63 -103 -244 224 22 3 -78 0
5492 0 -42 5 -53 -70 -20 6 256 -312 360 -151 106 -132 -169 -74 334 84 -47 40 246 61 12 129 195 198 -70
5517 -70 70 -67 162 -69 198 -131 150 -31 -127 28 82 110 25 -69 181 227 -85 -213 121 141 -167 -313 -91
5540 -91 -60 -113 -46 56 -381 -158 -125 -165 -199 10 -208 -279 -80 335 -46 -277 -60 263 -62 -41 9 111 -96
$$ packed form
5371h0J26J6Q1k44R1J68j61j8r3M1j8o5J43J15j06j19O8J34j11j65M90j64P8l24
5395a17l1J41j45J2J24L2k6J42j38K81j25j26j9L3l2J90n0m7j32n5k2L02k26J42
5419A08j90m6J36k6Mj7J87l6qj61R5Q3o9o0j4J20j56j10J31J83l24J5J19P9j6
5444B7k8O4j40J33j99L9O1J97k61K00r2q4Q1N7mj02j27L31j17J03J54l53L53l98
5468a05M6P2K23J62k48j12k8o2J52k7l0q7j6K02m35L82j52m0j41M68k02j9q1P8
5492@m2M7n8j7N0K6K50n68O72n11K57k38l7R5M08k50j31Q7K06j85m9J17O6Lk68
5517g0J40j37K29k31K67l29K81j81r6J55N4K8q5r4K50M6l12j28L34K0l08j46K22
5540i1L1n3O7J02m37K23L3m0l4K09k18p1J99M15l81k31K17L23l25K1N0J02k07
$$ plain form
5563 -96 160 138 200 -9 -40 -103 337 202 160 57 55 -97 21 -64 -5 -266 42 142 -123 -120 -64 -106 -239 -118 -227
5588 -227 -308 -204 -254 -409 106 -82 -31 -169 108 118 -67 -413 27 -110 -501 335 219 -169 -28 70 -37 262
5610 262 8 -126 53 -82 48 83 -310 123 26 -212 15 69 -62 -95 -47 60 12 -63 -61 120 109 -66 -26 -494
5634 -494 72 -77 -193 -117 39 -129 -27 -200 152 -27 -25 47 18 205 48 -330 33 -170 -84 -135 -20 -76 19
5657 19 8 -61 27 138 -55 52 34 122 306 20 68 47 -128 254 154 44 144 -6 -76 -144 -3 6 -53 11 169
5682 169 -314 -47 52 -39 49 10 -49 3 49 -289 -432 -57 -38 121 -66 -15 -198 0 -229 237 197 162 45 255
5706 255 -169 -157 6 -92 68 262 11 52 97 11 57 76 189 -36 -90 -147 -15 29 132 -114 58 -115 87
5729 87 116 -133 -279 192 3 -158 -270 -2 -160 -13 147 -146 -84 -259 9 -16 201 -211 -47 -126 124 85
$$ packed form
5563i6K56k2O2k09l1o3M40j35m2j03kj52J18q5N9k61L08J00k65LN6m2j33J21j09
5588b27q1J04n0j55N15j88N1j38K77J0j85l46M40j37l91Q36j16l88J41R8j07K99
5610B62k54j34J79j35J30L5l93M33r7k38K27N4j31l3M8J07m8p5KJ81j1j75M0m68
5634d94N66j49j16P6J56j68J02j73L52j79KP2k9J87j57l78L63k03Q6n1J15n6R5
5657A9j1o9Q8J11j93J07j8Q8J84k86M8k1j75L82j00j10J00j50p0o8J41Rn9O4J58
5682A69m83K67R9r1Q8l9n9N2M6l38j43L75J9J59j87N1j83J98k29M66m0l5j17K10
5706B55m24J2J63r8J60J94k51M1M5q6M6J9J13k25n4n7J32M4J03k46J72j73K02
5729H7K9k49j46M71j89j61j12K68j58J47J60k93O2j75K68k5K17m12J64p9K50l9
$$ plain form
5751 85 74 -214 -223 176 -162 40 44 -62 -116 258 -14 84 254 63 101 -45 -24 13 -197 -114 204 -36 6 27 53
5776 53 82 101 63 -221 -5 -140 -41 -190 -216 -49 113 166 164 -99 22 -7 -114 -180 -80 130 -290 78 -114 -114
5800 -114 142 -115 0 8 6 -94 -380 -179 38 95 42 72 -8 -68 4 -95 175 -87 72 155 -151 218 125 -84
5824 -84 6 277 -61 -144 -29 -49 126 -70 -5 47 212 -66 -23 -27 40 3 -124 4 -293 43 -192 10 -36 -90
5848 -90 29 -32 -10 -272 -117 31 -20 -77 -117 114 160 26 306 -159 49 -23 161 -262 44 -50 280 148 21
5871 21 149 288 128 -57 -29 -142 -26 -154 -42 17 78 63 -52 4 -101 -88 -43 -295 -13 -181 -211 -67 69
5894 69 2 -66 -47 -60 -117 36 -16 68 131 -298 -236 -124 -118 268 261 106 -114 -35 -2 -103 -33 -86 357 3 144 -97
5920 -97 151 159 62 114 162 -7 193 7 28 -15 111 212 -33 302 107 193 -3 -146 -123 -98 63 -111 -305 -10
$$ packed form
5751H5j1k88rL99l38K02Mj06n4L74k72R8J70j91L8j46K1L7k10Q3L18k40M2K1K6
5776E3K9J9l8k84K16j35R9j49k6J67J62N3kk63J21k9j07o6J00K10m20L68j92%
5800a14K56k57J15Qkj00k86K01K17N7n3L0q0o0P2r9K70k62J59Q3l06L69r3k09
5824h4R0K71l38q3J15k0J75j96O5N2J65k78M3mO7l7j27J28k97L36k35K02m6n4
5848i0J19o1K2k62J55J48n1n7m0K31M6j34K80m65K08p2J84m23L06r4L30j32j27
5871B1J28J39j60j85K8j13J16j28J12N9O1j5j15N6j05J3M5k52K82j68l0J44J36
5894F9o7o8J9j3n7J53n2Q4O3m29O2J12OL86pj55k20P9L3j01P0n3M43l54J41k41
5920i7K48Qr7N2M8j69K00j86K1m3J26J01k45L35j95Q6j96j43K3K5J61j74j94K95
$$ plain form
5944 -10 -172 -29 99 165 -288 -262 183 -72 291 9 -55 211 449 -135 -81 50 57 -127 108 -68 192 -73
5966 -73 61 -176 -33 -42 -139 -196 50 30 272 -14 47 -171 -89 -68 52 -199 -98 -57 -80 183 205 -169 42 89
$$ packed form
5944a0j62J43J28O6m53K6M45k55L63k82o4K66K38n84N4J31Pj84K35j76K60k65
5966g3J34k37J43rr7n7K46k0K42k86O1k18Q2K1J20k51J01M1k3K63K2l74K11M7
$$ [...]
8191B0
##END NTUPLES=NMR FID
##END=
