##TITLE=1H ikalashn
LR-793-O-C1
12.12.2024
##JCAMPDX= 6.0         $$ Bruker NMR JCAMP-DX V2.0
##DATA TYPE= NMR FID
##DATA CLASS= NTUPLES
##ORIGIN= UXNMR, Bruker Analytische Messtechnik GmbH
##OWNER= root
$$ TOPSPIN		Version 1.3
$$ 2024-12-12 14:00:30.265 +0400  Irina@DPX200
$$ Compression mode = diff/dup
##.OBSERVE FREQUENCY= 200.131300845
##.OBSERVE NUCLEUS= ^1H
##.DELAY= (6, 6)
##.ACQUISITION MODE= SIMULTANEOUS
##.ACQUISITION SCHEME= undefined
##.AVERAGES= 16
##.DIGITISER RES= 18
##SPECTROMETER/DATA SYSTEM= spect
##.PULSE SEQUENCE= zg
##.SOLVENT NAME= CDCl3
##.SHIFT REFERENCE= INTERNAL, CDCl3, 1, 17.49637
##AUDIT TRAIL= $$ (NUMBER, WHEN, WHO, WHERE, WHAT)
$$ ##TITLE= Audit trail, TOPSPIN		Version 1.3
$$ ##JCAMPDX= 5.01
$$ ##ORIGIN= Bruker BioSpin GmbH
$$ ##OWNER= Irina
$$ $$ F:/spectra/data/iren/nmr/1H/4/audita.txt
$$ ##AUDIT TRAIL=  $$ (NUMBER, WHEN, WHO, WHERE, VERSION, WHAT)
(   1,<2024-12-12 14:00:09.609 +0400>,<Irina>,<DPX200>,<TOPSPIN 1.3>,
      <created by zg
	started at 2024-12-12 13:59:01.500 +0400,
	POWCHK disabled, PULCHK disabled
       terminated by command 'halt'
       configuration hash MD5:
       BE 6D 3F 07 2A EA 11 49 91 17 2B D3 AF B3 58 0D
       data hash MD5: 16K
       9C DD 72 1D 7B 2E 75 82 DE 95 F9 FA 4C DA 92 AB>)
$$ ##END=
$$ 
$$ $$ hash MD5
$$ $$ 9A 4C 9F D1 95 2B AD 9F BD 13 B6 2B EB 98 06 9C
##$RELAX= 
##$RELAX= 
##$RELAX= 
##$RELAX= 
##$RELAX= 
##$RELAX= 
##$RELAX= 
##$RELAX= 
##$RELAX= 
$$ Bruker specific parameters
$$ --------------------------
##$DU= <F:/spectra>
##$EXPNO= 4
##$NAME= <1H>
##$PROCNO= 1
##$TYPE= <nmr>
##$USER= <iren>
##$AMP= (0..31)
100 100 100 100 100 100 100 100 100 100 100 100 100 100 100 100 100 100 
100 100 100 100 100 100 100 100 100 100 100 100 100 100 
##$ANAVPT= -1
##$AQSEQ= 0
##$AQ_mod= 1
##$AUNM= <au_zg>
##$AUTOPOS= <>
##$BF1= 200.13
##$BF2= 200.13
##$BF3= 200.13
##$BF4= 200.13
##$BF5= 200.13
##$BF6= 200.13
##$BF7= 200.13
##$BF8= 200.13
##$BYTORDA= 1
##$CFDGTYP= 0
##$CFRGTYP= 5
##$CHEMSTR= <none>
##$CNST= (0..63)
1 1 145 1 1 1 1 1 1 1 1 1 1 1 1 1 1 1 1 1 1 1 1 1 1 1 1 1 1 1 1 1 1 1 
1 1 1 1 1 1 1 1 1 1 1 1 1 1 1 1 1 1 1 1 1 1 1 1 1 1 1 1 1 1 
##$CPDPRG= <>
##$CPDPRG1= <>
##$CPDPRG2= <>
##$CPDPRG3= <>
##$CPDPRG4= <mlev>
##$CPDPRG5= <mlev>
##$CPDPRG6= <mlev>
##$CPDPRG7= <mlev>
##$CPDPRG8= <mlev>
##$CPDPRGB= <>
##$CPDPRGT= <>
##$D= (0..63)
0 2 0 0 0 0 0 0 0 0.06 0 0.03 0 0 0 0 0.0002 0 0 0 0 0 0 0 0 0 0 0 0 0 
0 0 0 0 0 0 0 0 0 0 0 0 0 0 0 0 0 0 0 0 0 0 0 0 0 0 0 0 0 0 0 0 0 0 
##$DATE= 1733997606
##$DBL= (0..7)
120 120 120 120 120 120 120 120 
##$DBP= (0..7)
150 150 150 150 150 150 150 150 
##$DBP07= 0
##$DBPNAM0= <>
##$DBPNAM1= <>
##$DBPNAM2= <>
##$DBPNAM3= <>
##$DBPNAM4= <>
##$DBPNAM5= <>
##$DBPNAM6= <>
##$DBPNAM7= <>
##$DBPOAL= (0..7)
0.5 0.5 0.5 0.5 0.5 0.5 0.5 0.5 
##$DBPOFFS= (0..7)
0 0 0 0 0 0 0 0 
##$DE= 6
##$DECBNUC= <off>
##$DECIM= 32
##$DECNUC= <off>
##$DECSTAT= 4
##$DIGMOD= 1
##$DIGTYP= 9
##$DL= (0..7)
0 120 120 120 120 120 120 120 
##$DP= (0..7)
$$ [...]
##$SW= 21.9926040160658
##$SWIBOX= (0..15)
0 0 2 0 0 0 0 0 0 0 0 0 0 0 0 0 
##$SW_h= 4401.40845070422
##$TD= 16384
##$TD0= 1
##$TE= 300
##$TE2= 300
##$TE3= 300
##$TEG= 300
##$TL= (0..7)
0 120 120 120 120 120 120 120 
##$TP= (0..7)
150 150 150 150 150 150 150 150 
##$TP07= 0
##$TPNAME0= <>
##$TPNAME1= <>
##$TPNAME2= <>
##$TPNAME3= <>
##$TPNAME4= <>
##$TPNAME5= <>
##$TPNAME6= <>
##$TPNAME7= <>
##$TPOAL= (0..7)
0.5 0.5 0.5 0.5 0.5 0.5 0.5 0.5 
##$TPOFFS= (0..7)
0 0 0 0 0 0 0 0 
##$TUNHIN= 0
##$TUNHOUT= 0
##$TUNXOUT= 0
##$USERA1= <user>
##$USERA2= <user>
##$USERA3= <user>
##$USERA4= <user>
##$USERA5= <user>
##$V9= 5
##$VALIST= <valist>
##$VCLIST= <CCCCCCCCCCCCCCC>
##$VD= 0
##$VDLIST= <DDDDDDDDDDDDDDD>
##$VPLIST= <PPPPPPPPPPPPPPP>
##$VTLIST= <TTTTTTTTTTTTTTT>
##$WBST= 1024
##$WBSW= 25
##$XGAIN= (0..3)
0 0 0 0 
##$XL= 0
##$YL= 0
##$YMAX_a= 479891
##$YMIN_a= -758792
##$ZGOPTNS= <>
##$ZL1= 120
##$ZL2= 120
##$ZL3= 120
##$ZL4= 120
##$ABSF1= 10
##$ABSF2= 0
##$ABSG= 5
##$ABSL= 3
##$ALPHA= 0
##$AQORDER= 0
##$ASSFAC= 0
##$ASSFACI= 0
##$ASSFACX= 0
##$ASSWID= 0
##$AUNMP= <proc_1d>
##$AXLEFT= 0
##$AXRIGHT= 0
##$AXTYPE= 0
##$AXUNIT= <>
##$AZFE= 0.1
##$AZFW= 0.1
##$BCFW= 1
##$BC_mod= 2
##$BYTORDP= 1
##$COROFFS= 0
##$CY= 7568.61572265625
##$DATMOD= 1
##$DC= 2
##$DFILT= <>
##$DTYPP= 0
##$F1P= 17.9538593292236
##$F2P= -4.03888763876832
##$FCOR= 0.5
##$FTSIZE= 32768
##$FT_mod= 4
##$GAMMA= 1
##$GB= 1
##$INTBC= 1
##$INTSCL= 1
##$ISEN= 128
##$LB= 0.02
##$LEV0= 0
##$LPBIN= 0
##$MAXI= 945.577
##$MC2= 0
##$MEAN= 0
##$ME_mod= 0
##$MI= -402.1523
##$NCOEF= 0
##$NC_proc= 0
##$NLEV= 6
##$NOISF1= 8.587773
##$NOISF2= 6.764455
##$NSP= 1
##$NTH_PI= 0
##$NZP= 0
##$OFFSET= 17.49637
##$PC= 1
##$PHC0= -38.21683
##$PHC1= 10.91661
##$PH_mod= 0
##$PKNL= yes
##$PPARMOD= 0
##$PPDIAG= 0
##$PPIPTYP= 0
##$PPMPNUM= 100
##$PPRESOL= 1
##$PSCAL= 0
##$PSIGN= 0
##$REVERSE= no
##$SF= 200.13
##$SI= 32768
##$SIGF1= 18.5376
##$SIGF2= -6.396296
##$SINO= 400
##$SIOLD= 32768
##$SREGLST= <1H.CDCl3>
##$SSB= 3
##$STSI= 0
##$STSR= 0
##$SW_p= 4401.40845070422
##$SYMM= 0
##$S_DEV= 0
##$TDeff= 0
##$TDoff= 0
##$TI= <>
##$TILT= no
##$TM1= 0
##$TM2= 0
##$TOPLEV= 0
##$USERP1= <user>
##$USERP2= <user>
##$USERP3= <user>
##$USERP4= <user>
##$USERP5= <user>
##$WDW= 1
##$XDIM= 8192
##$YMAX_p= 0
##$YMIN_p= 0
$$ End of Bruker specific parameters
$$ ---------------------------------
##NTUPLES= NMR FID
##VAR_NAME=  TIME,          FID/REAL,        FID/IMAG
##SYMBOL=    X,             R,               I
##VAR_TYPE=  INDEPENDENT,   DEPENDENT,       DEPENDENT
##VAR_FORM=  AFFN,          ASDF,            ASDF
##VAR_DIM=   8192,          8192,            8192
##UNITS=     SECONDS,       ARBITRARY UNITS, ARBITRARY UNITS
##FACTOR=    0.0002272,     1,               1
##FIRST=     0,             0,               0
##LAST=      1.8609952,     142,             54
##MIN=       0,             -758792,         -758792
##MAX=       1.8609952,     479891,          479891
$$ Real data points
##PAGE= N=1
##DATA TABLE= (X++(R..R)), XYDATA
$$ [...]
$$ plain form
1615 -1300 -635 -306 -318 -750 -695 -316 570 942 715 -94 253 816 903 433 -225 -384 -28 93 339 -370 -1081
1636 -1081 -675 362 667 113 -427 -400 182 600 649 -76 -667 -332 158 654 96 -442 -610 -33 634 646
1656 646 -101 -244 124 511 269 -24 -510 -676 -304 302 159 -552 -589 -24 501 782 476 117 31 475 788
1677 788 567 -267 -904 -494 164 -35 -820 -904 -713 -136 531 173 -156 -237 276 913 970 112 -131 -18 440
1698 440 587 -164 -613 -694 -207 65 74 -297 -706 -201 218 399 -150 -407 -437 138 199 168 -293 -482 -215 205
1720 205 636 145 -57 -39 803 742 693 -290 -477 -122 -39 -55 -603 -1058 -1048 -508 46 2 -505 -388 219 821
1742 821 921 470 216 318 733 739 282 -150 -430 -195 99 42 -299 -795 -363 -37 202 71 -382 -256 101
1763 101 360 122 -237 -366 -90 227 286 57 -258 -39 313 510 634 265 -237 -40 403 359 -77 -626 -553
$$ packed form
1615a300O65L29j2m32N5L79Q86L72k27q09L47N63Q7m70o58j59L56J21K46p09p11
1636a081M06J037L05n54n40K7N82M18M9p25n91L35M90M96n58n38j68N77O67J2
1656F46p47j43L68L87k42k93m86j66L72O06j43p11l7N65N25K81l06l59q6M44L13
1677G88k21q34o37M10O58j99p85q4J91N77O67l58l29q1N13O37N7q58k43J13M58
1698D40J47p51m49q1M87K72Rl71m09N05M19J81n49k57l0N75O1l1m61j89K67M20
1720B05M31m91k02J8Q42o1m9r83j87L55Q3j6n48m55J0N40N54m4n07J17O07O02
1742H21J00m51k54J02M15Om57m32k80K35K94n7l41m96M32L26K39j31m53J26L57
1763A01K59k38l59j29K76L17N9k29l15K19L52J97J24l69n02J97M43m4m36n49P3
$$ plain form
1784 -553 -232 -28 -356 -628 -584 -207 308 273 365 153 223 435 798 272 -172 -72 109 89 -30 -506 -361 -304
1806 -304 -52 164 51 -144 -301 123 555 519 -200 -465 -206 196 42 23 -450 -207 -6 217 128 111 -7
1827 -7 160 355 681 94 -123 -203 116 -12 -61 -307 -424 76 377 252 -115 -183 -7 321 499 120 -213 -247
1849 -247 -116 256 149 -165 -516 -354 194 296 -110 -228 137 552 690 327 104 -70 -14 188 176 -155 -552
1870 -552 -611 -105 162 -66 -376 -422 -191 155 199 182 136 -54 168 447 328 -105 -170 3 197 276 -42 -164
1892 -164 -49 301 391 -65 -237 -222 -119 127 33 -217 -690 -356 -106 -118 47 -255 -297 134 636 537 108 55
1914 55 346 540 529 47 -257 -140 -121 -97 -82 -338 -664 -373 -222 -28 -157 -166 -72 355 389 172 -252 125 283
1937 283 296 264 161 -15 -211 103 370 42 -271 -339 18 122 40 -332 -373 -368 -46 -175 -275 -221 -246 -42 162
$$ packed form
1784e53L21K04l28k72M4L77N15l5R2k12P0K12L63n26m44J00J81k0j19m76J45N7
1806c04K52K16j13j95j57M24M32l6p19k65K59M02j54j9m73K43K01K23q9j7j18
1827gJ67J95L26n87k17q0L19j28m9k46j17N00L01j25l67o8J76L28J78l79l33l4
1849b47J31L72j07l14l51J62N48J02m06j18L65M15J38l63k23j74N6K02j2l31l97
1870e52n9N06K67k28l10m6K31L46M4j7m6j90K22K79j19m33o5J73J94P9l18j22
1892a64J15L50R0m56j72J5J03K46r4k50m73L34K50j2J65l02m2M31N02r9m29n3
1914E5K91J94j1m82l04J17J9K4J5k56l26K91J51J94j29rR4M27L4k17m24L77J58
1937B83J3l2j03j76j96L14K67l28l13o8L57J04q2l72m1NL22j29j00N4k5K04K04
$$ plain form
1960 162 265 -63 -2 169 366 444 129 124 -26 110 144 19 -409 -512 -118 -136 -175 -196 -415 -344 111 179 195 -18
1984 -18 -133 311 348 353 -62 -86 34 -30 154 -66 -103 -194 -61 136 261 52 -271 -207 170 -55 -215 -341 -216
2007 -216 -118 203 3 -131 -240 -110 267 184 158 92 43 45 204 104 -218 -448 -91 -195 233 -219 -334 -323 78
2030 78 234 18 86 58 165 89 229 183 -63 -263 136 164 29 -237 -251 10 231 -30 29 31 -73 -3 229 144
2054 144 -209 -254 31 166 60 -120 -105 -80 77 160 106 -244 -79 5 269 171 -63 -153 -140 -25 8 -102 38
2077 38 -223 -71 126 98 -2 -199 85 263 167 238 44 -113 -52 34 115 -334 -250 -117 -85 -91 54 -168 -75 148
2101 148 -11 -160 27 144 157 -39 140 -82 -92 3 1 184 -1 -145 47 150 33 124 -317 -98 -289 151
2123 151 -18 -145 -147 -86 -3 45 144 -26 12 149 308 152 278 -4 -9 153 -1 -40 -36 -206 -202 -215 58 -127 -69
$$ packed form
1960A62J03l28O1J71J97P8l15nj50J36L4j25m28j03L94j8l9k1k19P1M55O8J6k13
1984a8j15M44L7Nm15k4J20o4J84k20l7r1J33J97J25k09l23O4L77k25j60j26J25
2007b16R8L21k00j34j09J30L77q3k6o6m9KJ59j00l22k30L57j04M28m52j15J1M01
2030G8J56k16O8k8J07p6J40m6k46k00L99K8j35k66j4K61K21k61N9Kj04P0K32q5
2054A44l53m5K85J35j06j80J5K5J57Q3n4l50J65Q4K64r8k34r0J3J15L3j10J40
2077C8k61J52J97k8j00j97K84J78r6P1j94j57O1Q6Q1m49Q4J33L2oJ45k22R3K23
2101A48j59j49J87J17J3j96J79k22j0R5kJ83j85j44J92J03j17R1m41K19j91M40
2123A51j69j27kO1Q3M8R9j70L8J37J59j56J26k82nJ62j54l9Mj70Mj3K73j85N8
$$ plain form
2148 -69 -211 -35 189 12 -198 -52 120 409 151 71 -2 -11 54 -97 12 -6 -222 -58 44 -139 -164 -8 -199
2171 -199 -133 -13 -44 -116 -176 -24 21 62 -174 -23 128 103 252 19 86 -87 248 156 257 -191 -225 -210 -19 -89
2195 -89 -182 -104 -229 -8 30 -185 -120 -142 -4 74 32 -84 -69 29 -10 55 -105 -67 46 52 -61 152 -144 3 -67
2220 -67 -92 -34 -167 25 -16 33 7 -20 -342 60 -73 15 -69 144 58 -59 277 -42 25 -28 139 -45 1 -177
2244 -177 -51 6 -140 -32 50 61 -158 -185 18 68 48 44 -23 0 55 118 -14 41 27 -71 60 103 -87 -21 26 27 40
2271 40 -25 -164 -2 171 -73 -46 28 1 172 166 -57 21 -124 12 -26 -45 -29 -39 -68 -64 55 101 -76 42 -118
2296 -118 39 72 -37 48 -117 11 -65 25 113 101 18 6 81 -94 140 -137 -17 -56 -106 109 -121 -234 -94 -129
2320 -129 64 26 68 -83 -3 50 99 81 -139 113 -42 -1 13 -166 80 122 72 37 -63 90 100 151 82 -11 155
$$ packed form
2148f9j42J76K24j77k10J46J72K89k58q0p3rO5j51J09j8k16J64J02j83k5J56j91
2171a99O6J20l1p2o0J52M5M1k36J51J51k5J49k33O7j73L35r2J01m48l4J5J91p0
2195h9r3P8j25K21L8k15O5k2J38P8m2j16J5R8l9O5j60L8J13Oj13K13k96J47p0
2220f7k5N8j33J92m1M9k6k7l22M02j33Q8q4K13q6j17L36l19O7n3J67j84M6j78
2244a77J26N7j46J08Q2J1k19k7K03N0k0mo7K3N5O3j32N5j4r8J31M3j90O6M7JJ3
2271D0o5j39J62J73k44K7P4k7J71ok23P8j45J36l8j9J6j0k9MJ19M6j77J18j60
2296a18J57L3j09Q5j65J28p6R0Q8j2q3j2P5j75K34k77J20l9n0K15k30j13J40l5
2320a29J93l8M2j51Q0N3M9j8k20K52j55M1J4j79K46M2n0l5j00J53J0N1o9r3J66
$$ plain form
2345 155 10 -79 66 -82 -138 -67 -186 94 56 99 59 99 -64 79 -60 -103 -72 29 -9 -109 -64 -101 10 116
2369 116 -119 17 123 -141 184 -59 171 -15 -146 -50 -110 41 7 60 144 60 -94 -16 -87 6 58 84 14 9 138
2394 138 17 217 165 111 -119 -36 75 -131 -50 108 62 58 -36 67 92 -158 64 -15 18 92 13 263 -94 -119 81
2419 81 -59 -26 108 54 85 37 -59 38 -58 -18 15 -57 117 -100 42 -79 -50 -29 -40 -134 84 -41 -119 54 -82
2444 -82 93 -56 -67 -64 -182 54 33 -4 -3 -111 -86 38 -33 27 21 45 29 21 22 -205 152 -9 -51 -134 -83 -158 -47 -12
2472 -12 -68 100 -65 -178 -234 -140 -58 29 -18 -97 -57 10 57 98 -91 68 83 -50 64 41 -32 1 89 24 -34 77
2498 77 226 -14 14 -58 29 -31 14 -129 37 0 89 111 64 38 137 -81 4 -41 -55 77 170 247 -1 -19 -59 122
2524 122 -121 -79 152 -112 122 -122 -224 6 41 2 63 88 85 -34 -45 16 -10 48 -95 -124 -51 -158 35 16 71
$$ packed form
2345A55j45q9J45j48n6P1j19K80l8M3m0M0j63J43j39m3L1J01l8j00M5l7J11J06
2369A16k35J36J06k64L25k43K30j86j31R6o0J51l4N3Q4q4j54P8p1R3N2K6p0nJ29
2394A38j21K00n2n4k30Q3J11k06Q1J58m6mr4J03K5k50K22p9L3P4p9K50l57k5K00
2419H1j40L3J34n4L1m8r6R7r6M0L3p2J74k17J42j21K9K1j1r4K18j25p8J73j36
2444h2J75j49j1Lj18K36k1l7Jj08K5J24p1O0oK4j6qJk27L57j61m2q3N1p5J11L5
2472a2n6J68j65j13n6R4Q2Q7m7p9M0O7M7M1j89J59J5j33J14k3p3L3Q8o5n8J11
2498G7J49k40K8p2Q7o0M5j43J66l7Q9K2m7k6R9k18Q5m5j4J32R3P7k48j8m0J81
2524A22k43M2K31k64K34k44j02K30L5l9O1K5lj19j1O1k6N8j43k9P3j07J93j9N5
$$ plain form
2549 71 11 30 123 10 -107 77 12 106 106 95 -125 58 3 56 16 -85 36 50 19 1 -78 -2 5 20 81 54 -74
2576 -74 71 44 -22 -32 -147 90 -45 253 34 -78 5 142 269 23 207 -311 26 -186 41 -82 -185 -107
2598 -107 3 54 -57 -10 20 111 -1 27 -40 39 -189 -216 60 -130 -98 61 26 -65 -32 35 -40 28 205 -68 -5
2623 -5 114 1 -130 1 -66 -46 -14 -156 -119 16 9 -45 -18 101 -13 96 145 163 -168 73 84 239 -60 99
2647 99 52 -26 -20 1 -31 55 159 223 164 -91 -177 75 109 -46 81 -95 -108 -158 151 -54 -225 -14 -46 45 22 149
2673 149 -44 -68 10 109 -62 -31 -111 -209 -31 76 -153 -215 265 -115 -101 -79 -191 68 128 -44 165 -165 38
2696 38 -101 145 22 -188 51 39 0 42 162 34 -45 68 23 6 -181 -154 34 -50 -25 -143 -73 -10 -81 31
2720 31 -182 -110 50 34 47 -27 101 -114 -31 235 18 -46 -151 -19 100 -89 -47 -22 -134 14 82 -35 -77 -46
$$ packed form
2549G1o0J9R3j13j17J84o5R4%j1k20J83n5N3m0j01J21J4l1j8p9P6PJ5O1k7j28
2576g4J45k7o6j0j15K37j35K98k19j12Q3J37J27k46J84n18L37k12K27j23j03P8
2598a07J10N1j11M7L0R1j12K8o7P9k28k7K76j90L2J59l5r1L3O7p5O8J77k73O3
2623eJ19j13j31J31o7K0L2j42L7J35pn4K7J19j14J09M9J8l31K41J1J55k99J59
2647I9m7p8OK1l2Q6J04O4n9k55q6K52L4j55J27j76j3n0L09k05j71K11l2R1k3J27
2673A49j93k4P8R9j71L1q0r8J78J07k29o2M80l80J4K2j12K59O0j72K09l30K03
2696C8j39K46j23k10K39j2l9M2J20j28p9J13m5j7j87K7J88q4K5j18P0O3p1J12
2720C1k13P2J60j6J3p4J28k15Q3K66k17o4j05J32J19j89M2K5j12J48O8j17m2L1
$$ plain form
2744 -46 69 106 -56 242 129 -55 12 30 182 227 -47 -25 128 120 108 -80 30 -44 130 -31 -71 -29 -220 57
2768 57 67 -7 -252 -88 170 54 -135 -131 -38 120 -122 105 171 -3 91 -33 -29 132 -111 -42 -175 74 -1 8 -131
2793 -131 3 65 -40 9 -59 -59 -41 56 127 139 51 70 -26 -141 77 -29 -294 74 -14 -74 -171 -198 -150 151 -57 -181
2819 -181 28 9 46 -155 91 54 17 132 13 79 76 -156 48 -12 -91 -1 -227 -73 -153 -18 61 -72 -153 -78 -17
2844 -17 81 169 47 67 -100 129 79 4 20 55 33 -1 -98 26 -71 44 89 76 -166 -126 -134 83 -61 -66 -114 -86 -4
2871 -4 -124 109 44 8 -59 -125 200 144 -22 70 -16 87 64 198 -119 -119 117 48 -102 -149 -188 -115 -71 -117 13 77
2897 77 -102 203 -44 -113 -55 8 -35 -73 -150 120 -136 81 22 -112 82 52 59 -210 -18 -39 -68 -277 89 -4 -99
2922 -99 1 -11 -7 3 271 -25 -272 180 161 49 -95 31 -38 -224 97 31 -68 -76 -100 72 77 116 -50 -37 65
$$ packed form
2744d6J15L7j62K98j13j84O7J8J52M5k74K2J53qj2j88J10p4J74j61m0M2j91K77
2768E7J0p4k45J64K58j16j89MR3J58k42K27O6j74R4j24MJ61k43O9j33K49p5Rj39
2793a31J34O2j05M9o8%J8R7P1J2q8J9r6j15K18j06k65L68q8o0r7k7M8L01k08j24
2819a81K09j9L7k01K46l7l7J15j19O6lk32K04o0p9R0k26J54q0J35P9j33q1P5O1
2844a7R8Q8j22K0j67K29n0p5J6L5k2l4r7J24r7J15M5j3k42M0qK17j44nm8K8Q2
2871dj20K33o5l6o7o6L25n6j66R2q6J03k3J34l17%K36o9j50m7l9P3M4m6J30O4
2897G7j79L05k47o9N8O3m3l8p7K70k56K17n9j34J94l0Pk69J92k1k9k09L66r3r5
2922i9J00j2MJ0K68k96k47M52j9j12j44J26o9j86L21o6r9qk4J72NL9j66J3J02
$$ plain form
2947 65 24 77 -124 -16 -82 6 -42 74 -47 -115 3 108 88 -38 -214 -150 62 -204 -77 -44 -171 24 -16 115
2971 115 -106 -145 17 181 95 -52 77 -97 2 -132 16 -118 -59 -42 43 -110 -37 -56 -103 -118 -55 -35 127 64
2995 64 23 -64 17 183 55 -95 -50 -6 -34 41 -83 20 -182 140 81 8 -72 39 125 -63 160 30 -196 -2
3019 -2 -97 338 -19 122 50 -34 38 -116 9 -12 12 127 161 -137 -123 37 150 -154 -173 -93 -106 -104 -132 -89 -26 -45
3045 -45 36 109 -87 -84 34 96 55 133 -101 -211 191 38 -85 -14 48 -205 -61 33 80 -72 -101 -15 17 -2 73 -49
3071 -49 -78 130 146 53 -67 -126 7 120 27 -97 56 -70 -17 23 7 -191 -20 16 83 49 -28 -57 10 -7 43 -15
3097 -15 -216 129 -113 143 43 -11 -58 -55 49 268 80 -50 -58 -141 40 -21 -48 37 38 10 118 54 -8 11 -109 -28
3123 -28 29 -5 -140 100 152 99 55 -188 -78 -98 119 -38 136 113 -142 116 81 75 -23 -201 -75 -7 -87 23 -42
$$ packed form
2947F5m1N3k01J08o6Q8m8J16j21o8J18J05k0j26j76O4K12k66J27L3j27J95m0J31
2971A15k21l9J62J64q6j47J29j74R9j34J48j34N9J7Q5j53P3j9m7j5O3K0J62o3
2995F4m1q7Q1J66j28j50M5M4k8P5j24J03k02L22n9p3q0J11Q6j88K23j30k26J94
3019br5M35l57J41p2q4P2j54J25k1K4J15L4k98J4J60J13l04j9Q0j3Kk8M3O3j9
3045d5Q1P3j96LJ18O2m1P8k34j10M02j53j23P1O2k53J44R4M7j52k9Q6L2j9P5j22
3071d9k9K08J6r3j20n9J33J13r3j24J53j26N3M0j6j98J71L6O7l4p7k9O7j7N0n8
3097a5k01L45k42K56j00n4m7LJ04K19j88j30qq3J81o1k7Q5Jk8J08o4o2J9j20Q1
3123b8N7l4j35K40N2n3m4k43J10k0K17j57J74k3k55K58l5or8j78J26O8q0J10o5
$$ plain form
3148 -42 -6 116 64 22 -84 112 -33 -80 -8 -126 -20 1 215 35 -15 -78 8 24 44 127 -112 138 106 66 98
3173 98 -159 -74 -191 67 71 12 -129 -106 97 35 -32 145 87 78 39 11 47 -148 -91 19 -120 6 -84 -76 184 14
3199 14 -37 -79 -41 -14 135 35 -27 -114 -124 23 -7 134 -25 -125 -71 -94 -26 26 101 126 -10 125 123 -118 -113 -183 -4
3226 -4 -91 -346 -232 -33 107 -66 14 43 -66 -41 116 94 -30 0 -50 -199 36 -49 17 -98 -144 192 158 31
3250 31 -81 178 113 127 34 -98 39 -165 70 -210 59 -169 -156 -19 26 70 -132 -93 -72 41 182 19 60
3273 60 -13 142 26 -46 -140 -120 -44 -100 -19 -191 18 -111 225 -106 -148 -58 -32 67 -84 -226 -281 -25 -168 129
3297 129 -24 71 -31 -112 167 55 193 -84 125 52 -143 108 66 -126 -62 144 174 -88 76 -141 -45 145
3319 145 123 1 -82 -18 91 98 -73 -31 -126 87 89 2 102 158 51 0 -5 55 79 -59 -5 -71 -172 -97 53 -93
$$ packed form
3148d2L6J22n2m2j06J96j45m7P2j18J06K1K14j80n0o3Q6J6K0Q3k39K50l2m0L2
3173I8k57Q5j17K58Mn9j41K3K03o2o7J77n8rl9k8L6j95N7J10j39J26r0QK60j70
3199A4n1m2L8K7J49j00o2q7j0J47l0J41j59j00N4k3O8N2P5K5j36J35kk41Np0J79
3226dq7k55J14J99J40j73Q0K9j09K5J57k2j24L0n0j49K35q5O6j15m6L36l4j27
3250C1j12K59o5J4r3j32J37k04K35k80K69k28J3J37M5M4k02L9K1J13J41j63M1
3273F0p3J55j16p2r4K0P6n6Q1j72K09j29L36l31m2R0K6R9j51j42n5K56j43K97
3297A29j53R5j02q1K79j12J38k77K09p3j95K51m2j92O4K06L0k62J64k17R6J90
3319A45k2j22q3O4J09Pj71M2r5K13Kq7J00N6j07n1nO0K4j38N4o6j01P5J50j46
$$ plain form
3345 -93 187 1 -58 -80 -212 198 -43 -12 1 81 167 162 -34 -5 42 60 -20 160 97 -31 95 20 23 45 88 -113
3371 -113 -129 -151 174 -68 -67 -14 -53 39 48 -50 -35 61 30 182 117 32 -42 23 23 -69 -73 -53 -71 132 64 -94 -150 -79 8
3400 8 -72 -84 -119 -44 64 22 -45 -55 55 88 34 229 -31 -201 25 -46 -3 123 -82 -215 18 52 139 23 -124
3425 -124 -14 165 93 114 -34 52 22 13 41 -90 6 -10 68 -64 98 64 42 71 172 144 -100 38 -83 -16 -55
3450 -55 -38 -90 -77 -74 3 23 149 -90 70 316 82 111 50 25 71 22 -85 -189 -165 -169 11 12 -128 -281 -119 -29
3476 -29 150 -242 -72 -53 6 23 98 -152 -15 -35 -70 53 -92 -28 103 -16 27 104 -7 -108 8 242 78
3499 78 -13 -38 -197 85 -21 125 188 -42 -9 216 -25 15 -79 -125 26 247 -1 -129 -15 -72 -132 212 98
3522 98 91 -20 38 84 47 25 -162 114 114 103 -170 -115 18 120 2 10 45 -140 75 103 -70 -79 -11 -88 109 214
$$ packed form
3345i3K80j86n9k2j32M10k41L1J3Q0Q6nj96K9M7J8q0J80o3j28J26p5LK2M3k01
3371a13j6k2L25k42JN3l9R2Rr8J5R6l1J52o5q5p4O5%r2mK0j8K03o8j58n6P1Q7
3400Hq0j2l5P5J08m2o7j0J10L3n4J95k60j70K26p1M3J26k05j33K33L4Q7j16j47
3425a24J10J79p2K1j48Q6l0rK8j31R6j6P8j32J62l4k2K9J01k8k44J38j21O7l9
3450e5J7n2J3LP7K0J26k39J60K46k34K9o1k5M6m9j07j04K4mJ80Jj40j53J62R0
3476b9J79l92J70J9N9J7P5k50J37k0l5J23j45O4J31j19M3P7j11j01J16K34j64
3499G8r1k5j59K82j06J46O3k30L3K25k41M0r4m6J51K21k48j28J14n7o0L44j14
3522I8pj11N8M6l7k2j87K76%j1k73N5J33J02j18QL5j85K15K8j73rO8p7J97J05
$$ plain form
3548 214 -82 -151 -188 217 82 85 53 -111 62 278 29 192 40 -45 -67 -3 66 -77 -117 -107 61 -84 -28 -32 -14
3573 -14 -74 -57 6 110 -92 11 171 -104 -15 -167 122 111 -71 -127 46 -95 9 76 3 -193 -153 19 -60 -37
3597 -37 -167 4 107 90 -11 -53 124 111 52 99 132 124 63 -35 0 186 22 -104 -78 42 1 62 69 -128 -94 198
3623 198 -207 1 -56 17 -121 139 -106 129 37 80 57 86 128 -13 -41 35 -29 -9 77 -242 103 24 63 99 124
3648 124 106 -3 -155 38 -46 -39 161 157 -54 84 -18 22 -38 -47 54 3 -62 20 120 -41 134 66 -51 0 -49
3673 -49 67 -105 -144 156 84 -5 9 17 47 174 11 89 -32 -52 1 -47 -93 -114 -7 -127 68 72 -12 -69 -112 -77 74
3700 74 -133 46 93 -2 -3 126 -80 -39 119 24 58 7 -135 136 100 72 179 171 142 -114 115 99 120 -30 -227
3725 -227 96 -8 59 127 -292 83 -40 -71 63 24 25 18 -64 24 23 -195 -27 28 4 131 10 -90 89 66 95
$$ packed form
3548B14k96o9l7M05j35Ll2j64J73K16k49J63j52q5k2O4O9j43m0J0J68j45N6mJ8
3573a4o0J7O3J04k02J03J60k75Q9j52K89j1j82n6J73j41J04O7p3j96M0J72p9K3
3597c7j30J71J03j7j01m2J77j3n9M7L3qo1r8L5J86j64j26K6J20m1O1Pj97L4K92
3623A98m05K08n7P3j38K60k45K35r2M3k3K9M2j41k8P6o4K0Q6l19L45p9L9L6K5
3648A24j8j09j52J93q4PK00mk11J38j02M0o0rJ01n1o5Q2J00j61J75o8j17N1m9
3673d9J16j72l9L00p2q9J4QL0J27j63P8j21k0N3m8m6k1J07j20J95Mq4n7m3L5J51
3700G4k07J79M7r5jJ29k06M1J58r5L4n1j42K71l6k8J07qk9k56K29j6K1j50j97
3725b27L23j04O7O8m19L75j23l1J34l9Jpq2Q8jk18J68N5k4J27j21j00J79k3K9
$$ plain form
3750 95 -40 -139 -139 17 -184 -54 -106 -24 -18 145 -60 -32 -108 70 34 87 68 -60 -89 37 6 -57 -59 -14 -39 41 39 67
3778 67 -41 -16 67 275 38 -71 -95 -30 -105 95 -72 -43 69 -15 -66 -3 -16 136 75 51 31 108 69 -24 -76 -140
3804 -140 93 -183 -88 88 -10 -14 -235 106 37 87 174 -17 83 -91 58 88 97 -86 49 -100 96 -105 37
3827 37 123 -62 33 -129 -22 -242 15 -56 148 -75 4 -34 -142 8 -146 -76 -102 -24 -45 -58 85 153 -30 -144
3851 -144 -1 40 -31 -46 -10 -21 96 51 40 -134 74 52 -47 -92 -36 -31 39 -6 9 -171 19 -115 34 306 93
3876 93 48 65 -16 -49 23 -220 39 5 -13 63 49 26 -89 -8 77 -97 -162 -79 -85 -45 -69 -66 -20 -67 6 -128 33 126
3904 126 174 26 23 -131 -60 -61 -170 -178 24 -19 -76 92 -84 58 -70 88 -85 -90 -13 -221 -101 -139 -54 103 12
3929 12 7 -86 57 -36 -21 1 -21 98 23 19 237 -128 -287 67 -124 -121 69 28 -220 53 -147 -52 -171 31 -109
$$ packed form
3750I5j35r9%J56k01J30n2Q2OJ63k05K8p6J78l6N3j9j28k9J26l1o3kM5k5Q0kK8
3778F7j08K5Q3K08k37j09k4O5p5K00j67K9J12q4n1O3j3J52o1k4k0P7l9r3n2o4
3804a40K33k76R5J76r8mk21L41o9N0Q7j91J00j74J49L0Rj83J35j49J96k01J42
3827C7Q6j85R5j62J07k20K57p1K04k23P9l8j08J50j54P0k6P8k1j3J43O8j83j14
3851a44J43M1p1j5L6j1J17m5j1j74K08k2r9m5N6NP0m5J5j80J90j34J49K72k13
3876I3m5J7q1l3P2k43K59l4j8P6j4k3j15Q1Q5j74o5Q3oM0k4LM6m7P3j34J61R3
3904A26M8j48lj54P1jj09qK02m3n7J68j76J42j28J58j73nP7k08J20l8Q5J57r1
3929A2nr3J43r3J5K2k2J19p5mK18l65j59L54j91LJ90m1k48K73k00R5j19K02j40
$$ plain form
3954 -109 54 37 73 -82 -56 83 29 -110 -60 -120 70 173 5 1 290 -67 -95 12 35 71 -45 3 98 33 -68
3979 -68 -84 -3 -5 6 -55 191 -115 -66 13 -26 122 26 43 211 102 4 -131 -111 -136 -19 35 -162 -134 -96 21 -7
4005 -7 32 -40 -53 -79 58 54 -17 -95 48 133 15 -18 -37 34 77 -182 -22 112 -19 70 -103 218 97 -134 -49 -42
4031 -42 237 7 55 -9 0 -101 127 -71 148 31 172 88 81 113 -65 100 58 38 -56 -3 -95 -166 22 -60 -128 -140
4057 -140 31 96 -76 102 -59 106 -45 73 83 85 -150 185 57 48 3 -15 53 110 72 29 -130 -32 -28 24 109 -105
4083 -105 26 -79 -35 -149 26 -96 54 58 -4 38 115 -18 154 -17 153 -84 119 151 52 49 58 174 -121 -139
4107 -139 -112 88 59 36 10 141 -174 -94 -149 38 169 9 183 -12 -156 -77 185 148 41 -53 -161 -81 136
4130 136 86 139 -180 76 -18 117 72 -134 94 134 171 -128 98 -34 -7 3 -52 93 171 -56 140 136 -129 -139
$$ packed form
3954a09J63j7L6j55K6J39n4j39N0o0J90J03j68mK89l57k8J07K3L6j16M8R5o5j01
3979f8j6Q1kJ1o1K46l06M9P9l9J48r6J7J68j09r8j35K0k5J17N4j97K8L8J17k8
4005gL9p2j3k6J37mp1p8J43Q5j18l3j9P1M3k59J60J34j31Q9j73L21j21k31Q5P
4031d2K79k30M8o4Rj01K28j98K19j17J41q4pL2j78J65m2k0r4N3r2p1J88q2o8j2
4057a40J71O5j72J78j61J65j51J18J0Kk35L35j28rm5j8O8N7l8m3j59R8MN2Q5k14
4083a05J31j05M4j14J75j22J50Mo2M2P7j33J72j71J70k37K03L2r9lRJ16k95j8
4107a39K7K00k9k3k6J31l15Q0n5J87J31j60J74j95j44P9K62l7j07r4j08Q0K17
4130A36n0N3l19K56r4J35m5k06K28M0L7k99K26j32K7J0n5J45P8k27J96mk65j0
$$ plain form
4154 -139 -73 3 29 -35 29 6 -12 77 135 91 -139 19 32 40 144 109 -68 -92 -76 45 -7 -207 111 -66 -108 33
4180 33 7 -20 123 79 69 -28 -32 33 96 10 102 -35 -77 -11 140 -25 -31 -126 -213 -55 -68 -41 -56 129 -98 -65 156
4207 156 -32 -63 -151 165 43 61 102 69 -26 83 102 -222 -37 -15 55 32 -5 41 -126 98 64 118 16 -146 15
4232 15 76 -30 -88 -20 62 167 35 -213 77 84 317 66 157 43 -103 -40 -96 -41 -287 -17 -262 -96 -23 -175
4256 -175 -42 -96 -6 -107 119 -10 66 -34 148 105 77 -50 -54 -70 -174 12 129 16 -168 -21 -105 163 -166
4279 -166 -140 -7 -128 121 -10 4 -18 159 173 129 16 -8 -32 10 123 -44 42 -22 51 87 8 133 33 -58 -24
4304 -24 -32 -95 -129 19 44 -19 46 -53 -156 92 152 -74 -53 -112 31 51 14 73 -121 81 -79 161 -70 -111 -185 9
4330 9 165 43 0 -40 50 112 98 3 64 -279 -33 11 92 28 11 -102 93 50 39 4 -41 -100 107 80 -143 -67 -162
$$ packed form
4154a39O6P6K6o4O4k3j8Q9N8m4k30J58J3QJ04l5j77k4J6J21n2k00L18j77m2J41
4180C3k6k7J43m4j0r7mO5O3q6R2j37m2O6J51j65or5q7J58j3K7j5J85k27L3K21
4207A56j88l1q8L16j22J8M1l3r5J09J9l24J85K2P0k3l7M6j67K24l4N4j02j62J61
4232A5O1j06n8O8Q2J05j32k48K90PK33k51R1j14j46O3n6N5k46K70k45J66P3j52
4256a75J33n4R0j01K26j29P6j00J82m3k8j27mj6j04J86J17j13j84J47q4K68l29
4279a66K6J33j21K49j31J4k2J77J4m4j13k4k4M2J13j67Q6o4P3L6p9J25j00r1L4
4304b4qo3l4J48K5o3O5r9j03K48O0k26K1n9J43K0l7N9j94K02j60K40k31m1p4J94
4330IJ56j22m3m0R0O2j4r5O1l43K46M4Q1o4j7j13J95m3j1l5m5n9K07k7k23P6r5
$$ plain form
4357 -162 96 -14 45 -79 -152 19 209 89 24 -5 18 -12 39 10 -183 -76 -32 198 -129 76 -25 62 19 173
4381 173 -127 25 -105 205 232 -9 -48 32 -65 67 44 -93 -36 -35 37 128 27 22 17 2 116 -127 18 13 95 -61
4407 -61 -24 62 -56 60 -92 194 28 32 37 -105 -5 -110 -248 -144 160 2 167 12 31 -71 -48 15 3 35
4431 35 -29 51 51 53 309 94 -215 -122 -17 -85 -37 -41 178 43 -104 94 -28 -107 197 110 -17 66 -111 44 75
4456 75 238 5 154 -100 51 56 -20 -100 -57 -45 -36 -36 90 -53 -173 -207 -3 -14 20 -92 -41 -23 233 76 -42
4481 -42 119 117 55 98 -112 67 55 45 -40 -7 69 -75 122 -35 144 -6 -67 -17 -21 -29 -37 68 -138 -14 50 102 43
4508 43 -199 -38 72 -11 -34 12 -56 -47 20 -34 -37 46 13 113 120 17 -169 -306 -30 79 13 9 -89 -43 127 -4 140
4535 140 17 -21 121 116 -6 23 -61 43 -30 19 -9 9 -219 75 -53 -97 65 60 -132 47 27 -138 -137 110 17
$$ packed form
4357a62K58j10N9j24p3J71J90j20o5k9K3l0N1k9j93J07M4K30l27K05j01Q7m3J54
4381A73l00J52j30L10K7k41l9Q0r7J32k3j37N7JP2R1j01nnj5J14k43J45nQ2j56
4407f1L7Q6j18J16j52K86j66MNj42J00j05j38J04L04j58J65j55J9j02K3O3j2L2
4431C5o4Q0%KK56k15l09R3J05o8M8mK19j35j47J98j22p9L04q7j27Q3j77J55L1
4456G5J63k33J49k54J51Np6q0M3J2R%J26j43j20l4K04j1L4j12N1J8K56j57j18
4481d2J61ko2M3k10J79j2j0q5L3P6j44J97j57J79j50o1N0mqqJ05k06J24O4N2n9
4508D3k42J61J10q3k3M6o8RO7n4lQ3l3J00Pj03j86j37K76J09o6mr8M6J70j31J44
4535A40j23l8J42nj22K9q4J04p3M9k8J8k28K94j28m4J62nj92J79k0j65JK47r3
$$ plain form
4560 17 -66 5 -216 -132 -36 63 82 -85 -53 14 13 58 106 47 85 31 51 96 76 -184 230 65 21 -101 19 8 78
4587 78 -25 -270 -24 -35 59 181 -83 69 -218 -33 11 -107 46 -43 -81 66 101 -143 34 -119 -16 -35 112
4610 112 -67 -92 -35 98 71 175 9 -116 -43 139 86 -33 -1 46 49 -12 274 -3 104 41 -108 0 -153 102
4634 102 92 -39 183 -86 -5 -224 -88 92 -23 -87 29 58 97 115 -32 43 157 -6 128 213 -42 115 -169
4657 -169 134 -51 -85 -63 124 -101 -20 38 -173 28 -63 108 -30 -249 85 224 -96 -35 -5 -43 87 -18 50
4680 50 106 60 -32 -97 50 -98 -270 -57 -281 -95 -69 -137 210 -146 -68 170 69 49 -198 159 206 228 24 157
4704 157 26 30 26 3 -67 -51 -63 -138 -4 41 -82 -70 11 95 -66 -84 -69 -78 139 130 -71 -19 -9 -9 -80 0 73 -170 36
4733 36 50 14 -39 -77 3 173 -1 225 -13 -88 175 84 -244 -106 -82 -153 218 -42 -122 67 -42 -29 -60 98
$$ packed form
4560A7q3P1k21Q4R6R9J9j67L2O7jM5M8n9L8n4K0M5k0k60M14j65m4j22J20j1P0
4587G8j03k45K46j1R4J22k64J52k87J85M4j18J53q9l8J47L5k44J77j53J03j9J47
4610A12j79k5N7J33k7J04j66j25P3J82n3j19L2M7Lo1K86k77J07o3j49J08j53K55
4634A02j0j31K22k69Q1k19J36J80j15o4J16K9L9J8j47P5J14j63J34Q5k55J57k84
4657a69L03j85l4K2J87k25Q1N8k11K01r1J71j38k19L34J39l20O1L0l8J30j05O8
4680E0N6m6r2o5J47j48j72K13k24J86K6o8L47l56P8K38j01k0k47L57M7K2k04J33
4704A57j31Mmk3p0J6j2p5J34M5j23J2Q1Q4j61j8J5rK17rk01N2J0%p1Q0P3k43K06
4733C6J4l6n3l8Q0J70j74K26k38p5K63r1l28J38K4p1L71k60q0J89j09J3l1J58
$$ plain form
4757 98 40 50 72 -57 44 -51 -27 -24 26 -99 -22 -185 89 18 -54 188 -20 -36 -225 99 26 -66 -27 -123 -70 173
4783 173 185 71 -63 14 100 -100 166 -22 32 -8 220 39 -113 -74 153 -178 110 -163 2 -228 -40 -18
4805 -18 -31 182 -94 -73 -98 112 -87 -133 17 103 -21 168 18 -10 -69 88 -37 99 -21 143 131 -80 46
4828 46 -13 -31 -5 25 -4 19 -265 -67 -44 21 77 13 -61 -54 164 175 120 -90 -87 23 -26 98 -90 19 -30 155 104
4855 104 -190 -169 -73 -48 -114 160 1 -9 74 62 134 9 118 62 61 78 -87 279 -12 184 68 -12 -83 8 -156
4880 -156 -201 20 76 -216 -3 9 -47 88 12 -94 61 131 178 156 -24 35 -75 90 -32 149 103 77 113 4
4904 4 163 -323 16 32 29 40 -84 -24 -118 61 74 -65 -191 42 158 52 -58 81 -25 167 71 81 145 -68
4928 -68 -3 26 -96 -146 -169 -186 59 -105 5 127 5 68 183 -37 73 -72 4 121 141 0 149 -295 -132
$$ packed form
4757I8n8J0K2j29J01r5K4LN0j25P7j63K74p1p2K42k08j6j89L24p3r2L9r6N3K43
4783A73J2j14j34P7Q6k00K66j88N4m0K28j81j52L9K27l31K88k73J65k30J88K2
4805a8j3K13k76K1k5K10j99m6J50Q6j24J89j50k8n9J57j25J36j20J64j2k11J26
4828D6n9j8K6L0k9K3k84J98K3O5N6o4p4PK18J1n5k10LJ10m9J24j88J09m9J85n1
4855A04k94K1R6K5o6K74j59j0Q3j2P2j25J09n6jJ7j65L66k91J96j16q0p1R1j64
4880a56m5K21N6k92K13J2n6J35p6j06J55P0M7k2j80N9j10J65j22J81m6k6L6j09
4904DJ59m86L39J6lJ1j24O0r4J79J3j39j26K33J16j06j10J39j06J92r6J0O4k13
4928f8O5K9j22n0k3j7K45j64J10J22j22O3J15k20J10j45P6J17K0j41J49m44J63
$$ plain form
4951 -132 -32 -93 -187 -126 -73 -5 -26 -110 7 -11 45 23 -75 -12 -56 -18 -60 84 -104 -110 64 37 102 100 -142 -11 -6 17
4979 17 -18 -41 22 -117 91 -36 38 -18 -163 48 150 -65 -65 -46 79 32 46 116 93 -5 32 80 5 27 56 123 -41
5006 -41 -21 53 23 -3 -6 161 212 -79 -22 163 19 172 -7 -204 72 -207 -24 28 -42 11 -19 -43 -348 35 -11
5031 -11 -137 45 91 -12 -125 70 -27 -85 187 80 -83 38 33 35 90 -54 136 -13 -82 2 112 1 135 36
5055 36 160 -93 -170 -40 -14 295 81 -76 -89 97 106 7 149 -209 -59 138 -84 117 -42 17 -23 -136 -133 11
5079 11 -29 -140 -37 -85 232 29 -14 -79 128 168 -159 -107 44 104 183 80 -90 -14 -74 -92 297 -39 -2 -30 11
5104 11 -86 4 105 58 -54 -1 -60 112 -9 20 237 -137 103 -4 100 50 133 80 -71 29 -41 -20 217 -43
5128 -43 50 -114 94 31 -87 -85 -197 -37 -213 21 -92 -122 -16 -195 115 16 44 -43 62 9 -23 -76 4 -121
$$ packed form
4951a32J00o1r4O1N3O8k1q4J17j8N6k2r8O3m4L8m2J44j88oJ74k7O5kk42J31NK3
4979A7l5k3O3j39K08j27P4n6j45K11J02k15%J9J25m7J4P0k3r8L7M8p5K2K9O7j64
5006d1K0P4l0k6lJ67N1k91N7J85j44J53j79j97K76k79J83N2p0N3l0k4l05L83m6
5031a1j26J82M6j03j13J95r7n8K72j07j63J21nKN5j44J90j49o9Q4J10j11J34r9
5055C6J24k53p7J30K6L09k14j57j3J86Rr9J42l58J50J97k22K01j59N9m0j13LJ44
5079A1m0j11J03m8L17k03m3o5K07M0l27N2J51O0P9j03j70P6o0j8L89l36L7k8M1
5104A1r7R0J01m7j12N3n9J72j21K9K17l74K40j07J04n0Q3n3j51J00p0K1K37k60
5128d3R3j64K08o3j18Kj12J60j76K34j13l0J06j79L10r9K8q7J05n3l2n3Q0j25
$$ plain form
5152 -121 -83 22 73 -17 -116 -39 69 67 34 -55 145 -32 40 -96 63 -98 -57 -4 -33 -21 91 59 -177 -142 -118 -111
5178 -111 -118 50 101 -195 -8 -33 -110 -50 -126 129 98 -6 105 -62 102 -210 113 -57 144 26 -48 -11 -99 105
5202 105 -79 -72 -152 -32 197 120 17 96 -35 20 19 52 -115 -12 -12 10 118 -87 148 -148 -216 -39 -165 -61
5226 -61 184 -82 50 157 -92 112 108 94 189 128 58 -17 80 -59 -64 119 -20 -226 -21 77 44 -33 -66 18 -13 231
5252 231 20 -21 131 -55 40 64 -43 82 83 14 12 40 36 90 8 -106 44 11 -65 -67 65 -20 -31 -8 -143 -88 -84 97
5280 97 71 6 23 113 -21 109 -110 53 32 92 183 -79 92 14 102 -73 -110 -35 -17 7 42 -46 -87 75 101 65
5306 65 178 -51 -9 70 -64 58 -21 97 123 -61 -160 74 84 -55 -102 7 123 -154 -301 -15 -118 168 28
5329 28 -205 -170 126 171 60 -160 -160 28 7 182 86 94 88 -14 -138 94 -66 -70 120 -92 34 28 5 15 59 -55
$$ packed form
5152a21L8J05N1r0r9P7J08kl3q9K00j77P2j36J59j61M1N3k9J2J12l2k36L5K4P
5178a11pJ68N1k96J87k5p7O0p6K55l1j04J11j67J64l12L23j70K01j18p4L7q8K04
5202A05j84Pq0J20K29p7j03P9j31N5jL3j67J03%K2J08k05K35k96o8J77j26J04
5226f1K45k66J32J07k49K04mj4R5o1p0p5R7j39nJ83j39k06K05R8l3p7l3Q4l1K44
5252B31k11m1J52j86R5K4j07J25Jo9kK8mN4q2j14J50l3p6kJ32q5j1K3j35N5MJ81
5280I7k6o5J7R0j34J30k19J63k1O0R1k62J71p8Q8j75l7P5J8K4L5q8m1J62K6l6
5306F5J13k29M2P9j34J22p9J18K6j84r9K34J0j39m7J09J16k77j47K86j03K86j40
5329B8k33L5K96M5j11k20%J88k1J75r6Qoj02j24K32j60mJ90k12J26ok3J0M4j14
$$ plain form
5355 -55 106 -260 -21 -162 249 66 81 6 -34 98 -67 -59 41 -10 -41 -10 7 49 17 -33 -54 -39 -6 -74 182 -82
5381 -82 -30 199 -228 -130 -137 88 114 -82 -164 67 -19 42 -149 -155 88 77 -6 -48 -132 75 -208 47 -96 60 -77
5406 -77 -59 -12 83 203 -54 -110 -45 -78 -199 68 -57 -98 52 139 74 126 -125 -20 122 38 127 68 -123 -2 71
5431 71 -31 82 17 -45 -13 -2 -34 13 -217 -44 43 31 -126 -74 -9 52 93 35 -9 -83 -101 27 187 117 -174 93
5457 93 52 126 -39 -64 -169 -62 -151 -28 105 24 186 -58 122 -55 -31 109 -49 100 168 66 42 -156 54
5480 54 14 -29 76 -76 -35 -1 -98 -214 11 -204 47 169 -114 -169 -99 -43 -39 -136 -62 166 -34 -99 -56 108 -34
5505 -34 241 -67 185 143 43 -14 30 -105 -103 23 146 -125 14 128 1 -81 177 -4 54 -99 134 -179 79
5528 79 32 16 -163 -15 -25 -76 14 -75 46 -16 -203 8 82 -89 -95 -7 0 213 -72 -39 58 82 183 109 118 73 -229
$$ packed form
5355e5J61l66K39j41M11j83J5p5m0J32j65QJ00n1l1L1J7M2l2n0k1J5L3o8K56k64
5381h2N2K29m27R8pK25K6j96q2K31q6O1j91oK43j1q3m2q4K07k83K55j43J56j37
5406g7J8M7R5J20k57n6O5l3j21K67j25m1J50Q7o5N2k51J05J42q4Q9n9j91J21P3
5431G1j02J13o5o2L2J1l2M7k30J73Q7j2j57N2O5O1M1n8m4p4j8J28J60p0k91K67
5457I3m1P4j65k5j05J07q9J23J33q1J62k44J80j77K4J40j58J49O8j02k4j98K10
5480E4m0m3J05j52M1L4r7j16K25k15K51J22k83n5P0N6Mr7P4K28k00o5M3J64j42
5505c4K75l08K52m2j00n7M4j35KJ26J23k71J39J14j27q2K58j81N8j53K33l13K58
5528G9m7j6j79J48j0n1R0q9J21o2j87K11P4j71oQ8PK13k85L3R7K4J01p4Rm5l02
$$ plain form
5555 -229 70 12 -20 -57 16 -56 103 242 -113 31 0 99 61 56 -92 -224 -34 -42 -122 98 -81 -117 -8 103 -53
5580 -53 87 -150 -173 174 -59 35 -19 -149 65 17 -71 -106 -110 -86 -14 14 -223 -168 -126 20 -65 -129 31 -265 -83
5605 -83 -67 -41 -104 -42 -15 -122 75 -40 -15 -57 128 36 -82 132 -139 54 -41 -73 -59 8 90 8 -86 -210 -62
5630 -62 97 -11 -68 -205 -28 -56 -104 45 83 27 52 -128 -31 -45 142 31 28 9 -41 168 -4 71 -80 -5 48
5655 48 70 189 35 54 89 -99 -43 70 -125 4 -194 6 222 16 -57 -182 177 178 140 23 161 6 -131
5678 -131 27 -231 -141 -100 -76 -149 -14 108 39 21 76 -75 -76 -128 118 8 50 -192 70 93 -35 117 -37 -124
5702 -124 -94 82 -197 27 -38 1 -76 -60 -130 78 -51 -111 131 -207 -7 -71 -63 57 96 -36 -131 -211 190 -10
5726 -10 -22 -104 -51 -37 -52 134 -38 -87 86 23 177 34 77 66 9 -1 -108 -245 -56 3 -50 -53 -114 -6 33 -164
$$ packed form
5555b29K99n8l2l7P3p2J59J39l55J44l1R9l8nj48j32J90qq0K20j79l6J09J11j56
5580e3J40k37k3L47k33R4n4j30K14m8q8l5mK4P2K8k37N5M2J46q5o4J60k96J82
5605h3J6K6o3O2K7j07J97j15K5m2J85r2j18K14k71J93r5l2J4O7Q2q2r4j24J48
5630f2J59j08n7j37J77k8m8J49L8n6K5j80R7j4J87j11lj9n0K09j72P5j51P5N3
5655D8K2J19j54J9L5j88N6J13j95J29j98K00K16k06p3j25L59Jl8j17J38j55j37
5678a31J58k58R0M1K4p3J35J22o9j8N5j51jn2K46j10M2k42K62K3j28J52j54q7
5702a24L0J76k79K24o5L9p7J6p0K08j29o0K42l38K00o4QJ20L9j32r5q0M01k00
5726a0j2q2N3J4j5J86j72m9J73o3J54j43M3j1n7j0j07j37J89N9n3lo1J08L9j97
$$ plain form
5752 -164 75 75 -93 12 -31 -36 -270 31 -166 -82 27 52 80 33 -123 -149 154 24 -35 40 -80 -77 -1 -32 79
5777 79 -20 -135 -15 42 27 -103 -40 21 94 -194 -29 1 -65 -32 -136 -171 71 -56 -147 -24 2 -12 -156 -59 22
5802 22 24 -24 -174 97 34 -25 -92 -148 -94 262 -79 90 16 19 121 -144 130 36 156 -14 87 121 -51 -56 -8 -21
5828 -21 57 26 -11 36 -88 -81 63 112 139 155 -41 -8 -40 -23 -174 -60 30 -18 63 -170 -21 23 -21 139 -22 127
5854 127 118 -108 181 108 -51 93 196 186 184 40 -133 -23 168 187 52 -42 193 32 -104 15 56 -25 -10 89
5878 89 -33 49 -7 -15 90 -41 132 -60 -63 -37 66 225 -7 -178 53 114 47 2 74 30 -29 4 -108 -63 108
5903 108 -52 30 75 -28 -16 -97 33 -62 -111 -99 23 116 25 173 -22 -25 186 77 -56 93 -60 125 -7 100
5927 100 -138 -117 -67 -221 -95 86 46 -59 -79 -73 -29 -78 -26 100 6 46 60 69 58 -131 99 -118 -58 -14 -39 69
$$ packed form
5752a64K39%j68J05m3nk34L01j97Q4J09K5K8m7j56k6L03j30n9P5j20LP6l1J11
5777G9r9j15J20N7j5j30O3O1P3k88J65L0o6L3j04l5K42j27r1J23K6j4j44R7Q1
5802B2Km8j50K71o3n9o7n6N4L56l41J69p4LJ02k65K74r4J20j70J01L4j72nM8j3
5828b1P8l1l7M7j24PJ44M9K7J6j96L3l2J7j51J14R0m8Q1k33J49M4m4J60j61J49
5854A27rk26K89p3j59J44J03j0kj44j73J10J91J9j35r4K35j61j36J19M1q1J5R9
5878H9j22Q2n6qJ05j31J73j92lK6J03J59k32j71K31O1o7m5P2m4n9L3j12M5J71
5903A08j60Q2M5j03J2q1J30r5m9J2J22R3r1J48j95lK11j09j33J49j53J85j32J07
5927A00k38K1N0j54J26J81m0j05k0OM4m9N2J26r4M0J4Rj1j89K30k17O0M4k5J08
$$ plain form
5953 69 33 55 -17 -2 103 -55 -64 -63 -78 192 -28 -34 62 -81 25 -113 -3 -132 95 -64 -221 -48 15 85 60
5978 60 -83 -42 87 247 53 118 -99 -2 -21 30 223 -72 173 -60 -15 -38 -149 64 -18 73 38 90 -40 -82
6002 -82 85 -33 48 -17 70 84 7 -59 140 76 -76 -177 64 -105 -98 -54 -5 45 81 -5 85 8 -117 -27 104 -121
6028 -121 86 24 -2 196 53 -9 8 102 7 190 -77 14 133 20 -151 28 -45 -67 -72 -173 116 193 47 -174
6052 -174 158 -72 -92 -48 -38 94 37 -21 86 27 -73 179 -44 -70 0 63 -37 28 67 40 -33 -93 161 95 78
6077 78 179 -78 4 -18 -211 -28 27 113 -4 66 84 133 -118 -80 34 48 -21 171 -130 94 9 124 9 -171
6101 -171 -146 86 -145 -97 110 12 40 -153 14 95 -127 107 26 -95 7 8 -236 -94 -31 -29 -137 -234 -40 -75
6125 -75 -41 -4 28 61 -170 28 57 147 -129 243 172 -5 -26 61 6 -56 20 12 30 3 -240 -156 38 -19 26 -117 -29
$$ packed form
5953F9l6K2p2J5J05j58rJj5K70k20oR6j43J06j38J10j29K27j59j57J73O3P0k5
5978F0j43M1J29J60j94O5k17R7j9N1J93k95K45k33M5k3j11K13q2R1l5N2j30m2
6002h2J67j18Q1o5Q7J4p7o6J99o4j52j01K41j69PM4M9N0L6q6R0p7j25R0J31k25
6028a21K07o2k6J98j43o2J7R4r5J83k67R1J19j13j71J79p3k2nj01K89P7j46k21
6052a74L32k30k0M4J0J32n7n8J07n9j00K52k23k6P0O3j00O5L9k7p3o0K54o6j7
6077G8J01k57Q2k2j93J83N5Q6j17P0J8M9k51L8J14J4o9J92l01K24q5J15j15j80
6101a71K5K32k31M8K07r8K8j93J67Q1k22K34q1j21J02Jk44J42O3Kj08r7J94l5
6125g5L4L7L2L3k31J98K9R0k76L72p1j77k1Q7n5o2P6qJ8k7k43Q4J94n7M5j43Q8
$$ plain form
6152 -29 -3 -59 -88 -30 -110 -22 16 86 -141 131 91 -121 -88 58 124 73 195 80 39 -27 -22 -35 23 203 -19 -101 140
6179 140 -96 88 169 77 90 -57 59 133 84 -57 49 -118 -153 105 -32 -78 -113 -137 -17 4 -63 -79 55 -58
6203 -58 -55 -70 -151 33 -39 -102 22 80 -9 -39 -40 -66 29 90 -32 -155 -68 21 164 -48 -19 -103 -77 16 69 -25 -164 -52
6231 -52 83 88 159 -20 137 72 -62 99 -54 -77 72 -6 -69 -34 -291 49 22 49 71 -43 86 -47 91 -61
6255 -61 73 80 -23 41 80 -74 162 74 10 59 -35 91 -11 15 137 130 16 -63 16 -52 -5 -36 -62 131 137 -63 27
6282 27 -4 -187 6 -85 -61 -70 -7 -13 143 28 38 23 -206 105 31 -211 -26 -38 -10 -60 -7 -15 35 43 -147 -2 56
6309 56 159 -229 178 8 -104 -41 -81 -37 126 43 -57 16 25 -8 62 30 -138 -176 -15 46 -197 130 -92 -114 -53
6334 -53 -94 97 15 41 -130 -164 -39 29 66 89 144 -125 -37 -198 2 -88 69 -124 127 58 -122 94 -44 56
$$ packed form
6152b9K6n6k9N8q0Q8L8P0k27K72m0k12L3J46O6n1J22j15m1o6Nj3N8J80k22q2K41
6179A40k36J84Q1r2J3j47J16P4m9j41J06j67l5K58j37m6l5k4J20K1o7j6J34j13
6203e8Lj5q1J84p2o3J24N8q9l0jk6R5O1j22j23Q7Q9J43k12K9q4K6R3N3r4j39J12
6231e2J35NP1j79J57o5j34J61j53k3J49p8o3L5k57L40k7K7K2j14J29j33J38j52
6255f1J34Pj03O4L9j54K36q8o4M9r4J26j02K6J22pj14p9P9o8M7l1k6J93Ok00R0
6282B7l1j83J93r1K4rO3oJ56j15J0j5k29L11p4k42J85j2K8n0N3qN0Qj90J45N8
6309E6J03l88M07j70j12O3m0M4J63q3j00P3Rl3P0l2j68l8J61O1k43L27k22k2O1
6334e3m1J91q2K6j71l4J25O8L7K3N5k69Q8j61K00r0J57j93K51o9j80K16j38J00
$$ plain form
6358 56 -110 -150 86 -70 98 91 12 -57 -36 -102 54 -44 60 145 -63 74 131 -9 64 -55 137 94 -124 -111 161
6383 161 -141 -44 -76 -107 -42 73 65 -29 9 -142 -69 -131 128 -1 138 -17 -1 64 85 146 -155 129 -3 19 41
6408 41 106 58 -35 58 6 62 59 -38 -80 46 -136 -107 6 66 80 -9 67 0 -264 105 82 120 33 -116 -173 91 -31
6435 -31 -207 99 72 114 158 -94 -209 -4 -191 -51 -2 55 -72 -105 46 -15 112 31 107 -61 -188 -14 11 37
6459 37 -241 -11 96 42 -16 -56 -16 -23 -39 -266 -60 -33 3 -9 22 109 -139 -78 55 12 101 -59 -114 -4 -157 139
6485 139 145 -59 42 -125 -10 16 -41 -127 -85 9 222 -99 131 20 -88 -46 177 -26 -234 -111 19 77 -33
6508 -33 10 -265 52 133 8 6 61 99 -149 0 18 -12 -95 105 54 -19 -33 65 95 85 -130 -31 139 64 175 30
6534 30 37 -136 46 -137 -23 -20 77 -50 -70 -3 -216 -42 33 -62 85 -19 54 -134 13 304 -62 -27 44 -20 -30
$$ packed form
6358E6j66m0K36j56J68pp9o9K1o6J56r8J04Q5k08J37N7j40P3j19J92m3k18J3K72
6383A61l02R7l2l1O5J15qr4L8j51P3o2K59j29J39j55J6O5K1O1l01K84j32K2K2
6408D1O5m8r3R3n2N6lr7m2J26j82K9J13O0J4q9P6o7k64L69k3L8q7j49n7K64j22
6435c1j76L06k7M2M4k52j15K05j87J40M9N7j27l3J51o1J27q1P6j68j27J74K5K6
6459C7k78K30J07n4n8m0M0pj6k27K06K7L6j2L1Q7k48O1J33m3Q9j60n5J10j53K96
6485A39Ok04J01j67J15K6n7q6M2R4K13l21K30j11j08M2K23k03k08J23J30N8j10
6508c3M3k75L17Q1j25kN5L8k48J49J8l0q3K00n1p3j4R8L0j0k15R9J70p5J11j45
6534C0Pj73J82j83J14LR7j27k0O7k13J74P5r5J47j04P3j88J47K91l66L5P1o4j0
$$ plain form
6559 -30 -75 68 -71 -96 -29 -193 -77 222 26 -29 -108 -123 -103 235 -84 -115 89 69 2 -104 104 -17 -19 59 24
6584 24 -58 148 27 90 250 -3 5 -56 -81 79 44 -23 -19 -89 -72 -32 52 117 -142 -108 -74 139 -7 102 235 -123
6610 -123 46 -40 140 -135 134 215 10 54 -136 -109 0 -5 59 295 -44 118 -31 116 -39 -268 41 -57 39
6633 39 112 -9 -64 71 -44 100 101 178 111 10 144 -50 -43 -66 77 -76 72 100 29 -222 27 -7 -24 -142 120
6658 120 170 59 54 32 -67 93 -232 128 78 -62 3 -59 129 -126 177 -126 38 -30 -28 -82 -5 97 -152 -204 -65
6683 -65 -159 34 12 26 -136 1 -105 2 66 -140 54 -117 39 -16 21 -54 -124 -20 -51 -21 -55 104 -159 -93
6707 -93 77 -88 -24 5 52 107 -115 -152 -28 56 101 108 105 -57 -32 4 -35 22 0 23 35 104 -76 88 46 38 18 -19
6735 -19 61 113 135 -14 48 -148 -29 161 24 -54 93 156 -142 -88 143 127 54 109 -214 20 -3 43 161 -89
$$ packed form
6559c0m5J43j39k5O7j64J16K99j96n5p9j5K0L38l19l1K04k0o7j06K08j21kP8l5
6584B4q2K06j21O3J60k53Qo1k5J60l5o7Mp0J7M0Q4O5k59L4L4K13j46J09J33l58
6610a23J69q6J80k75K69Q1k05M4j90K7J09nO4K36l39J62j49J47j55k29L09r8R6
6633C9P3j21n5J35j15J44JP7o7j01J34j94Pk3J43j53J48K8p1k51K49l4j7j18K62
6658A20N0j11nk2r9J60l25L60n0j40O5o2J88k55L03l03J64o8Kn4P7J02k49n2J39
6683f5r4J93k2J4j62J37j06J07O4k06J94j71J56n5L7p5p0J04l1L0l4J59k63O6
6707i3J70j65O4K9M7N5k22l7J24Q4M5Plj62K5L6l9N7k2K3J2O9j80J64m2qk0l7
6735a9Q0N2K2j49O2j96J19J90j37p8J47O3k98N4K31j6p3N5l23K34k3M6J18k50
$$ plain form
6759 -89 -83 -93 71 -37 -119 43 -55 -91 -140 81 -3 -249 -89 -24 74 -24 106 -9 -55 -140 0 -37 94 15 1 -92
6785 -92 -76 17 12 -115 12 -10 76 -30 -23 174 124 66 102 -54 -83 -49 34 -91 -65 174 -60 -176 26 -88 165
6810 165 -100 37 -51 -228 25 -87 18 31 85 183 -121 105 -32 30 -60 60 -65 -43 108 96 -115 27 150
6833 150 57 -52 -42 -40 39 21 -36 -61 76 313 -20 -60 50 73 -23 7 -61 -47 -117 -35 58 -71 -197 71 28 -170
6859 -170 3 -124 66 -122 -33 56 45 -107 -9 -47 242 185 152 123 -11 -15 -83 -60 51 43 59 52 -14 -141 -22 40
6885 40 -36 -5 -31 65 -41 -2 -126 91 -109 95 108 -160 4 -60 -60 113 -71 -3 72 65 5 -3 -115 -143 74 6
6911 6 47 52 111 -26 -19 -107 -66 -166 196 -28 91 -127 54 -47 -19 -85 10 64 28 -52 -112 -82 52 -44 -10 55 90
6938 90 119 51 -218 -18 -17 -45 -18 -18 64 6 69 136 90 128 -148 42 -13 136 -70 -6 125 80 81 -19 14 37 19 -80
$$ packed form
6759h9Oj0J64j08q2J62r8l6m9K21q4k46J60O5R8r8J30j15m6q5J40l7J31p9j4r3
6785i2J6R3nj27J27k2Q6j06PJ97n0n8L6j56k9L4Q3j25K6K39k34j16K02j14K53
6810A65k65J37q8j77K53j12J05J3N4R8l04K26j37O2r0J20j25K2J51j2k11J42J23
6833A50r3j09J0KP9j8n7k5J37K37l33m0J10K3r6L0o8J4p0Q2R3j29j26K68m3j98
6859a70J73j27J90j88Q9Q9j1j52R8l8K89n7l3k9j34mo8K3J11qJ6po6j27J19O2
6885D0p6L1k6R6j06L9j24K17k00K04J3k68J64o4%J73j84O8P5po0qj12k8K17o8
6911FM1NN9j37Pq8M1j00L62k24J19k18J81j01K8o6R5N4l6q0o0L0J34r6L4O5L5
6938I0K9o8k69K00Jk8K7%Q2n8O3O7m6L8k76J90n5J49k06O4J31m5Jj00L3K3j8r9
$$ plain form
6966 -80 77 -151 -18 36 32 127 -42 58 46 183 42 16 -10 91 -86 4 49 196 -27 -86 -25 -130 211 24
6990 24 -28 -54 201 77 -62 33 0 -72 70 69 55 99 89 168 67 -319 -36 -22 10 119 3 40 -71 57 29
7015 29 -158 42 -147 8 -199 -11 -86 189 -82 -35 -57 59 110 -225 32 195 235 -134 -39 -98 150 17 -30
7038 -30 -20 -142 77 305 31 42 -13 116 126 -152 36 1 0 -180 -58 -55 79 -7 -38 162 55 -67 192 -154
7062 -154 -39 -144 -159 -3 56 -62 64 -132 -34 99 91 -85 -190 111 6 87 6 148 -142 80 -112 65
7084 65 -125 77 -140 -37 -136 23 260 -32 37 14 120 -69 -210 13 40 79 96 -112 29 -146 -39 4 45
7107 45 -158 123 -100 -21 -147 62 -57 -41 -25 8 -43 85 -162 139 -4 -35 -207 38 -2 -193 56 -39 -87
7130 -87 -5 -65 -25 -71 96 -27 5 -91 30 -5 -93 -99 49 50 67 0 -104 -116 -148 25 -105 -250 -49 40 28 -150
$$ packed form
6966h0J57k28J33N4mR5j69J00j2J37j41k6k6J01j77R0M5J47k23n9O1j05L41j87
6990B4n2k6K55j24j39R5l3p2J42jj4M4j0P9j01l86K83J4L2J09j16L7j11J28k8
7015B9j87K00j89J55k07J88p5K75k71M7k2J16N1l35K57J63M0l69R5n9K48j33m7
7038c0J0j22K19K28k74J1n5J29J0k78J88l5jj80J22LJ34q6l1K00j07j22K59l46
7062a54J15j05j5J56N9j18J26j96R8J33qj76j05L01j05Q1q1J42k90K22j92J77
7084F5j90K02k17J03r9J59K37k92O9k3J06j89j41K23K7L9J7k08J41j75J07M3M1
7107D5k03K81k23P9j26K09j19J6J6L3n1J28k47L01j43l1j72K45m0j91K49r5m8
7130h7Q2o0M0m6J67j23L2r6J21l5q8oJ48JJ7o7j04j2l2J73j30j45K01Q9j2j78
$$ plain form
7156 -150 111 265 35 -2 98 -80 -77 66 -14 64 131 -47 87 -83 6 -70 -135 -68 192 61 -87 -148 -60 31
7180 31 -160 -157 -75 52 -8 11 -113 -73 -121 -54 -69 137 -138 -100 -29 -48 7 -131 30 46 -25 -59 -181 140 26 141
7206 141 -19 44 -70 44 57 -11 -96 -172 86 4 27 -12 180 -68 32 -134 -45 -140 -7 0 58 -13 111 -5 7
7231 7 43 -13 -62 16 -19 -143 83 230 -88 -56 66 177 -112 41 141 99 42 90 -60 -75 3 -59 115 -31 -38
7256 -38 -58 -115 129 16 -16 -28 -16 59 -42 66 148 63 -60 -60 -291 170 43 -219 147 -54 317 22 153 57
7280 57 -102 -49 -4 -68 57 66 -82 21 -132 -14 114 -120 -127 60 -28 197 147 -244 -160 94 10 289 12 -5
7304 -5 52 67 -90 3 -178 182 -49 41 -401 -149 -144 -76 36 -160 23 -48 33 -67 17 95 15 24 53 131 146 -130
7330 -130 -56 -71 43 130 -199 120 -34 62 -254 28 104 115 -41 -79 41 30 211 3 180 117 34 125 59 -111
$$ packed form
7156a50K61J54k30l7J00j78LJ43q0P8O7j78J34j70Q9p6o5O7K60j31j48o1Q8R1
7180C1j91LQ2J27o0J9j24M0m8O7j5K06k75L8P1j9N5j38J61J6p1l4j22L21j14J15
7206A41j60O3j14J14J3o8q5p6K58q2K3l9J92k48J00j66Q9r5J33PN8p1J24j16J2
7231GL6n6m9P8l5j24K26J47l18L2J22J11k89J53J00m2n7M8j50j5P8o2J74j46p
7256c8k0n7K44j13l2j2J2P5j01J08Q2q5j23%k31M61j27k62L66k01L71k95J31r6
7280E7j59N3M5o4J25Rj48J03j53J18J28k34pJ87q8K25n0l91Q4K54q4K79k77j7
7304eN7J5j57R3j81L60k31R0m42K52NO8J12j96J83p1Q1j00Q4P8q0RK9P8J5k76
7330a30P4j5J14Q7l29L19j54R6l16K82P6J1j56l8J20j1J81k08J77o3q3R1o6j70
$$ plain form
7354 -111 -59 -110 218 109 9 -4 -61 85 -156 -33 91 -150 151 -134 -94 30 15 -32 293 56 -164 166
7376 166 43 -117 -64 14 -5 187 35 62 75 -217 83 -41 124 86 7 97 123 -21 36 -35 34 -32 63 -7 59
7401 59 56 -88 111 20 31 15 -65 -56 88 -51 38 -70 58 142 52 16 15 -63 -110 128 -80 43 8 117 -38 -138
7427 -138 174 -122 30 -18 -48 -135 187 -99 -114 11 1 15 23 98 -198 -185 -10 63 -18 31 -92 -32 -29 -87 6 37
7453 37 115 -40 64 -47 41 4 8 -54 1 53 -7 104 -116 6 -44 126 -82 38 28 70 -90 -57 59 -136 -118
7478 -118 -192 -67 -49 -26 -123 44 4 113 -133 -67 -60 -4 89 62 -53 92 54 -37 -102 -81 87 -108 100 14 -43 36
7504 36 -63 -77 2 -25 -3 15 51 -66 -53 -69 -113 206 -15 -218 -114 -57 107 -131 -72 52 74 -147 -107 -79 5 -52
7530 -52 74 39 26 -7 112 -184 -37 133 -37 -8 -163 -29 -32 87 39 -86 53 -100 57 113 -88 -28 15 122
$$ packed form
7354a11N2n1L28j09j00j3n7J46k41J23J24k41L01k85M0J24j5m7L25k37k20L30
7376A66j23j60N3P8j9J92j52K7J3k92L00j24J65l8p9R0K6j44N7p1O9o6R5p0O6
7401E9lj44J99r1J1j6q0RJ44j39Q9j08J28Q4r0l6jp8m7K38k08J23l5J09j55j00
7427a38L12k96J52m8l0q7L22k86j5J25j0J4QP5k96J3J75P3q1M9j23O0Ln8R3L1
7453C7P8j55J04j11Q8l7Mo2N5N2o0J11k20J22n0J70k08J20j0M2j60L3J16j95J8
7478a18p4J25J8K3r7J67m0J09k46O6PN6R3k7j15J45l8r1o5K1J68j95K08q6n7P9
7504C6r9j4P9k7K2J8L6j17J3j6m4L19k21k03J04N7J64k38N9J24K2k21M0K8Q4n7
7530e2J26l5j3l3J19k96J47J70j70K9j55J34lJ19m8j25J39j53J57N6k01O0M3J07
$$ plain form
7554 122 133 129 -49 -114 131 -106 -80 47 -53 65 40 -35 -43 -70 -18 -117 -61 142 30 -144 -72 125 20 -22 121
7579 121 119 162 128 28 31 -120 -41 -159 64 -54 126 91 -23 -182 38 -52 -24 -5 48 -101 -123 63 200 10
7603 10 -116 104 -48 -78 -156 78 10 42 -21 -82 56 38 44 -118 -34 -87 -84 62 -85 154 -118 -8 69 73 -43 69
7629 69 84 11 -164 -58 15 121 53 106 -23 78 265 32 -103 19 -34 28 -157 90 20 -68 -117 43 108 -111
7653 -111 -99 14 -80 153 -32 -68 75 -99 -96 150 24 -93 153 -60 49 229 59 -36 -28 -50 255 -22 39
7676 39 58 -68 -97 -23 -9 28 16 -34 99 103 4 6 15 -87 124 -46 -4 4 154 120 32 32 147 133 -171 10 -189 62
7704 62 -63 61 -64 150 94 -13 119 29 0 185 117 -97 -75 -52 -27 -57 102 18 -2 -13 -96 36 43 -59 -27
7729 -27 -88 -4 21 -28 -150 43 33 87 -36 108 -77 138 -8 -27 31 156 -18 -39 36 87 89 -16 1 -39 -99 -56
$$ packed form
7554A22J1mj78o5K45k37K6J27j00J18k5p5qk7N2r9N6K03j12j74P2J97j05m2J43
7579A21kM3l4j00Lj51P9j18K23j18J80l5j14j59K20r0K8J9N3j49k2J86J37j90
7603A0j26K20j52l0p8K34o8L2o3o1J38j8Oj62Q4n3LJ46j47K39k72J10P7Mj16J12
7629F9J5p3j75J06P3J06o8N3j29J01J87k33j35J22n3O2j85K47p0q8m9J60O5k19
7653a11J2J13r4K33j85l6J43j74LK46j26j17K46k13J09J80j70r5Qk2L05k77O1
7676C9J9j26k9P4J4L7j2n0J33Mr9KRj02K11j70M2QJ50l4q8%J15j4l04J81j99K51
7704F2j25J24j25K14n6j07J32r0k9J85o8k14K2K3K5l0J59q4k0j1q3J32Pj02L2
7729b7o1Q4K5m9j22J93j0N4j23J44j85K15j46j9N8J25j74k1P5N1Kj05J7m0o0M3
$$ plain form
7755 -56 -156 34 -6 -79 -64 -234 6 99 -155 -123 18 -47 87 172 58 82 -63 51 -9 126 21 66 -6 15
7779 15 62 -173 93 -48 77 -48 -48 13 -14 -106 -298 -50 36 -62 -42 -86 55 -136 -116 27 77 -64 -219 147
7803 147 -55 -147 -19 123 87 148 -62 -23 73 22 117 10 239 -141 -13 1 -47 89 74 52 34 -37 214 107
7827 107 -95 -56 14 24 -90 -77 137 -110 -160 -140 -78 91 -20 86 -27 22 -57 -27 -68 44 9 125 -37 -18
7851 -18 190 -35 -99 137 131 -47 130 142 -238 45 -76 -84 91 21 -51 -116 124 -91 -159 -59 -4 -40 -24 72 18
7876 18 24 -6 116 46 13 -29 -165 -75 75 15 -128 35 -10 42 -26 172 92 23 -161 32 -110 -96 5 -45 27 -149
7902 -149 -29 -137 -74 -167 37 106 21 -76 -8 24 112 -53 13 61 124 -78 -73 31 -177 36 -166 -79 -15 70 52 5
7928 5 43 -10 -171 -1 -44 82 -48 31 -217 -24 -68 15 147 -160 -75 -177 106 -66 -79 17 48 103 -85 17
$$ packed form
7755e6j00J90m0p3J5j70K40R3k54L2J41o5J34Q5j14K4j45J14o0J35j05M5p2K1
7779A5M7k35K66j41J25j25%O1k7r2j92K48Q6r8K0m4J41j91K0J43N0j41j55L66
7803A47k02r2J28J42l6O1k10L9R6n1R5j07K29l80J28J4m8J36j5k2j8p1K51j07
7827A07k02L9P0J0j14J3K14k47n0K0O2J69j11J06j13M9p9L0m1J12l5J16j62J9
7851a8K08k25o4K36oj78J77J2l80K83j21qJ75p0p2o5K40k15o8J00N5l6J6R6n4
7876A8Ol0J22p0l3m2j36R0J50o0j43J63m5N2o8J98q0o9j84J93j42J4J01n0P2j76
7902a49J20j08O3r3K04O9q5r7O8L2Q8j65O6M8O3k02NJ04k08K13k02Q7O4Q5j8m7
7928EL8n3j61J70m3J26j30P9k48J93m4Q3J32l07Q5j02K83j72j3R6L1N5j88J02
$$ plain form
7952 17 -52 47 88 -122 154 88 53 -206 -28 -70 36 203 -63 45 116 -18 47 -33 -99 -193 65 -37 22 -32 -31
7977 -31 5 -120 60 -203 -8 -5 52 -103 -55 -60 8 -27 -68 -137 32 -42 -92 48 54 -134 38 -7 -121 -107 51 18
8003 18 12 97 -123 19 26 -45 -20 14 62 14 140 66 -52 36 171 -50 -22 151 -49 10 -25 -100 53 -11 -53 -4 56
8030 56 -62 -202 22 62 -145 -102 4 -31 13 133 -194 31 -34 -49 239 -92 36 109 -20 10 -107 43 -71
8053 -71 -74 -161 9 37 66 -70 -61 -78 -96 -158 -228 -21 -5 -45 2 161 136 -67 64 -5 -90 -257 71 -236 113 85
8079 85 -15 -3 -62 170 -85 -31 30 223 -221 -12 79 145 -123 12 -34 207 139 -32 83 65 24 -32 -172 61
8103 61 -129 69 20 89 -87 -17 -4 72 139 38 65 51 0 -22 66 114 -16 27 20 25 72 -30 41 -95 -140 -26 114
8130 114 -7 -20 -75 49 47 25 1 -134 -223 47 55 94 97 -107 131 -9 143 2 -36 -17 -86 -146 -67 -6 -7 105 2
$$ packed form
7952A7o9R9M1k10K76o6l5k59J78m2J06J67k66J08P1j34O5q0o6r4K58j02N9n4J
7977c1L6j25J80k63J95LN7j55M8nO8l5m1o9J69p4n0J40Oj88J72m5j14J4J58l3
8003A8oQ5k20J42Pp1K5L4M8m8J26p4j18Q8J35k21K8J73k00N9l5p5J53o4m2M9O0
8030E6j18j40K24M0k07M3J06l5M4J20l27K25o5j5K88l31J28P3j29L0j17J50j14
8053g1lq7J70K8K9j36Rj7j8o2p0K07J6m0M7J59k5k03J31o9q5j67L28l07L49k8
8079H5j00J2n9K32k55N4O1J93m44K09R1O6k68J35m6K41o8j71J15j8m1n6j40K33
8103F1j90J98m9O9j76P0J3P6O7j01K7j4n1k2Q8M8j30M3pNM7j02P1j36m5J14J40
8130A14j21j3n5J24kk2k4j35q9K70QL9Lk04K38j40J52j41l8J9o9o0P9O1jJ12j03
$$ plain form
8157 2 104 -65 11 -31 -53 -31 33 -26 -122 -2 -91 -45 45 60 -70 9 -42 -80 -55 84 -79 -107 -22 74 -40 -24 97
8184 97 23 105 -123 -59 -24 124 142
$$ packed form
8157BJ02j69P6m2k2K2O4n9r6J20q9M6R0J5j30P9n1l8K5J39j63k8Q5R6j14J6J21
8184I7p4Q2k28O4L5J48J8
8191A42
$$ Imaginary data points
##PAGE= N=2
##DATA TABLE= (X++(I..I)), XYDATA
$$ plain form
0 0 0 0 0 0 0 0 0 0 0 0 0 -1 16 -16 16 -16 17 -32 32 -48 48 -64 78 -81 97 -113 133 -159 177 -208 238 -270 304
33 304 -341 388 -436 487 -548 611 -681 756 -840 932 -1033 1139 -1260 1388 -1532 1687 -1858
50 -1858 2049 -2256 2489 -2748 3040 -3368 3743 -4172 4679 -5282 6006 -6905 8050 -9569
64 -9569 11680 -14832 20043 -30193 57366 -282588 -758792 -105671 279497 26311 -215756
75 -215756 168354 479891 316602 127584 319587 399856 143234 -31923 125745 150812
85 150812 -127169 -314856 -208281 -172172 -316660 -345886 -180763 -119841 -163993 -65923 116999
96 116999 103317 3134 88155 238296 176003 53271 130503 251772 167756 47037 94890
107 94890 118373 -48361 -140655 13798 107619 -71386 -212165 -92777 -11341 -181679 -304776
$$ packed form
0@%%%%%%%%%%%jJ7l2L2l2L3m9O4q0R6j12J42j59J78k10K46k92L36l85M46n08N74
33C04o45P29q24R23j035J159j292J437j596J772j965K172k399K648k920L219l545
50a858L907m305M745n237N788o408P111p915Q851r961J1288j2911J4955j7619
64i569K1249k6512L4875n0236Q7559l39954m76204O53121L85168k53186k42067
75b15756L84110L11537j63289j89018J92003Q0269k56622j75157J57668K5067
85A50812k77981j87687J06575L6109j44488k9226J65123O0922m4152R8070J82922
96A16999j3682j00183Q5021J50141o2293j22732P7232J21269q4016j20719M7853
107I4890K3483j66734r2294J54453R3821j79005j40779J19388Q1436j70338j23097
$$ plain form
118 -304776 -181264 -97290 -203280 -178391 87275 194077 1579 -50829 218773 364166
128 364166 158511 25995 212750 325913 116724 -55127 45061 74927 -171837 -331408
138 -331408 -170659 -34426 -172827 -277701 -102521 72506 -4587 -107827 -14125 94775
148 94775 50415 18387 111936 153682 64165 34454 127622 143460 26142 -22132 60351 87098
160 87098 -3112 -57697 -40055 -72809 -146893 -133052 -71100 -101405 -162096 -97684 20315 17086
172 17086 -45590 -293 94752 90594 57425 124835 188884 116392 35749 90605 135826 14625
184 14625 -117079 -75337 2635 -65183 -155455 -99705 -21195 -78693 -140770 -53636 38638 -23419
196 -23419 -90260 11999 136012 86647 -12338 34214 130759 99390 17429 36355 85618 40891
$$ packed form
118c04776J23512Q3974j05990K4889K65666J06802j92498n2408K69602J45393
128C64166k05655j32516J86755J13163k09189j71851J00188K9866k46764j59571
138c31408J60749J36233j38401j04874J75180J75027p7093j03240R3702J08900
148I4775m4360l2028R3549M1746q9517k9711R3168J5838j17318m8274Q2483K6747
160H7098r0210n4585J7642l2754p4084J3841O1952l0305o0691O4412J17999l229
172A7086o2676M5297R5045m158l3169O7410O4049p2492q0643N4856M5221j21201
184A4625j31704M1742P7972o7818r0272N5750P8510n7498o2077Q7134R2274o2057
196b3419o6841J02259J24013m9365r8985M6552R6545l1369q1961J8926M9263m4727
$$ plain form
208 40891 -20592 6473 34638 -36416 -110028 -79146 -28191 -62002 -113833 -88883 -36205 -29644
220 -29644 -30201 5588 32504 25946 42388 93127 103866 58717 35972 57851 56461 16672 -2781
233 -2781 2935 -14981 -40634 -24930 -4508 -42407 -90732 -68347 -16685 -26488 -68149 -52877 197
246 197 11599 -4267 17013 52535 43018 23472 57588 97957 68028 13511 21429 57716 33375
259 33375 -29881 -48621 -31569 -44038 -73644 -67069 -43343 -50728 -62970 -29558 18770 22628 502
272 502 11433 49097 60341 40136 26945 28019 24004 18291 22398 18850 -3728 -18033 -4360
285 -4360 9542 -4476 -27783 -33188 -25697 -21446 -21704 -27114 -38804 -42408 -22960 1929 3173 -8708
299 -8708 2189 35602 58009 55629 48348 47677 43626 33555 24342 10266 -19049 -45540 -45561 -32370
$$ packed form
208D0891o1483K7065K8165p1054p3612L0882N0955l3811n1831K4950N2678O561
220b9644n57L5789K6916o558J6442N0739J0739m5149k2745K1879j390l9789j9453
233b781N716j7916k5653J5704K0422l7899m8325K2385N1662r803m1661J5272N3074
246A97J1402j5866K1280L5522r517j9546L4116M0369k9929n4517P918L6287k4341
259C3375o3256j8740J7052j2469k9606O575K3726p385j2242L3412M8328L858k2126
272E02J0931L7664J1244k0205j3191J074m015n713M107l548k2578j4305J3673
285d360J3902j4018k3307n405P491M251k58n410j1690l604J9448K4889J244j1881
299h708J0897L3413K2407k380p281o71m051j0071r213j4076k9315k6491k1J3191
$$ plain form
313 -32370 -37340 -55437 -54774 -31675 -10831 -2360 3511 9445 13396 20645 33233 36462 20586 3554
327 3554 6070 18743 18886 3802 -7005 -3098 7322 12944 10430 486 -9090 -9308 -2713 -5177 -22188
342 -22188 -38380 -39072 -28559 -19175 -15149 -14893 -10632 5809 30280 43828 37772 26867 29027 38439
356 38439 36764 18562 -3359 -15994 -17427 -15558 -18984 -30109 -39484 -33700 -13741 915 -2502
369 -2502 -10856 -5057 11397 20706 15294 3905 -3401 -728 7495 10906 3489 -4944 -809 13346
383 13346 23894 20794 10019 3504 5216 8565 4849 -9195 -24897 -30149 -23020 -14684 -17895 -26807
397 -26807 -25367 -8992 9008 16340 13740 10901 15285 26331 32815 24443 7219 -1777 3070 8166
411 8166 1997 -11945 -19806 -15636 -5188 234 -3853 -11503 -13274 -5619 3843 2918 -9108 -17844 -11776
$$ packed form
313c2370m970j8097O63K3099K0844Q471N871N934L951P249J2588L229j5876j7032
327C554K516J2673J43j5084j0807L907J0420N622k514r944r576k18O595k464j7011
342b2188j6192o92J0513R384M026K56M261J6441K4471J3548o056j0905K160R412
356C8439j675j8202k1921j2635j433J869l426j1125r375N784J9959J4656l417
369b502q354N799J6454R309n412j1389p306K673Q223L411p417q433M135J4155
383A3346J0548l100j0775o515J712L349l716j4044j5702n252P129Q336l211q912
397b6807J440J6375J8000P332k600k839M384J1046O484q372j7224q996M847N096
411H166o169j3942p861M170J0448N422m087p650j771P655R462r25j2026q736O068
$$ plain form
426 -11776 2121 7291 1430 -4190 368 12292 22266 21915 13159 6078 9107 16571 16337 3071 -13440
441 -13440 -17662 -9369 -3732 -11809 -24734 -25957 -14513 -2938 -900 -5025 -6950 -1656 9289 17847
455 17847 16088 6434 2082 9694 20069 18543 5865 -3311 -154 7096 7126 -1240 -10929 -15738 -12423
470 -12423 -5233 -4838 -14468 -22352 -16366 -2048 5475 682 -5438 -2093 9462 18794 17350 8664 3840
485 3840 8406 15986 16247 6502 -3965 -6267 -2085 1034 -2497 -10874 -17525 -14882 -4583 115 -8918
500 -8918 -19133 -15015 -757 5818 1864 -459 4090 10233 16100 21266 19443 9020 2387 9854
514 9854 18614 9054 -12013 -20184 -10873 -5219 -13091 -22046 -20679 -13485 -6318 1301 5696 782 -3424
529 -3424 5200 19007 19062 5934 -802 6180 13837 10810 1482 -4251 -4205 -694 3526 3583 -2539 -9319
$$ packed form
426a1776J3897N170n861n620M558J1924R974l51q756p081L029P464k34j3266j6511
441a3440m222Q293N637q077j2925j223J1444J1575K038m125j925N294J0945Q558
455A7847j759r654m352P612J0375j526j2678r176L157P250L0q366r689m809L315
470a2423P190L95r630p884N986J4318P523m793o120L345J1555R332j444q686m824
485C840M566P580K61r745j0467k302M182L119l531q377o651K643J0299M698r033
500h918j0215M118J4258O575l954k323M549O143N867N166j823j0423o633P467
514I854Q760r560k1067q171R311N654p872q955J367P194P167P619M395m914m206
529c424Q624J3807N5j3128o736O982P657l027r328n733M6L511M220N7o122o780
$$ plain form
545 -9319 -8940 -3484 -2436 -9127 -16510 -17636 -10676 -626 3486 -1917 -5818 4054 19075 22409 14505
560 14505 10470 14559 17186 13753 8074 -382 -12418 -19794 -14356 -7894 -15847 -28922 -24058 -3594
574 -3594 5945 -1568 -5639 4796 14628 14816 13974 15644 10799 1730 2986 11320 7995 -7639 -13464
589 -13464 -1839 8582 2988 -7294 -8336 -4072 -3468 -5173 -6777 -10883 -15882 -12535 -1680 2900
603 2900 -3055 -7273 958 14959 21245 17455 12141 12716 18659 20116 10795 -3295 -10861 -11271 -11522
618 -11522 -15324 -19746 -21709 -21372 -16254 -6073 1384 -1179 -4349 4853 20642 23558 12623 6319
632 6319 11562 14410 8722 3094 1752 -1813 -6382 -2334 4673 -197 -13969 -16215 -3897 2391 -7862
647 -7862 -17979 -13893 -4373 -2683 -5500 -4811 -1426 1621 8141 18097 21038 14081 10244 16079 21256
$$ packed form
545i319L79N456J048o691p383j126O960J0050M112n403l901R872J5021L334p904
560A4505m035M089K627l433n679q456j2036p376N438O462p953j3075M864K0464
574c594R539p513m071J0435R832J88q42J670m845r069J256Q334l325j5634n825
589a3464J1625J0421n594j0282j042M264O04j705j604m106m999L347J0855M580
603B900n955m218Q231J4001O286l790n314N75N943J457r321j4090p566m10k51
618a1522l802m422j963L37N118J0181P457k563l170R202J5789K916j0935o304
632F319N243K848n688n628j342l565m569M048P007m870j3772k246J2318O288j0253
647g862j0117M086R520J690k817O89L385L047O520R956K941o957l837N835N177
$$ plain form
662 21256 14487 706 -7315 -6784 -5151 -9389 -17327 -22773 -21236 -15262 -10267 -8300 -7267 -4758 1041
677 1041 9008 15518 15190 9517 6981 13248 19662 14207 1855 -2334 3952 6760 256 -7150 -8577
692 -8577 -8341 -8990 -7845 -6728 -11622 -16850 -12816 -1940 1470 -5346 -7824 1392 11862 13191 9568
707 9568 9923 12825 13577 13054 12759 8478 -234 -5136 -1952 -207 -7057 -16800 -18634 -12005 -6810 -8616
723 -8616 -12710 -11237 -3673 3763 6215 5417 5089 6922 10529 14402 14665 9359 3293 3552 8583 7803
739 7803 -1681 -10751 -9666 -3653 -3971 -10755 -14092 -10896 -7101 -5149 -2476 -571 -1968 -1832 4702 11469
755 11469 10121 3220 2205 8527 12265 8346 2203 190 972 1394 556 -1675 -6088 -9574 -7923 -2721
771 -2721 -3115 -8917 -12106 -7872 -534 2167 -428 -1860 2105 8604 12132 10389 6988 5998 7114 7657
$$ packed form
662B1256o769j3781q021N31J633m238p938n446J537N974M995J967J033K509N799
677A041P967O510l28n673k536O267O414n455j2352m189O286K808o504p406j427
692h577K36o49J145J117m894n228M034J0876L410o816k478R216J0470J329l623
707I568L55K902P52n23k95m281q712m902L184J745o850r743j834O629N195j806
723h616m094J473P564P436K452p98l28J833L607L873K63n306o066K59N031p80
739G803r484r070J085O013l18o784l337L196L795J952K673J905j397J36O534O767
755A1469j348o901j015O322L738l919o143k013P82M22q38k231m413l486J651N202
771b721l94n802l189M234P338K701k595j432L965O499L528j743l401r90J116N43
$$ plain form
787 7657 5704 899 -4735 -8169 -6778 -4449 -6042 -11056 -12236 -6364 327 1246 -1361 -1029 3236 6240
803 6240 7374 7011 4373 969 880 5336 5943 -302 -5854 -2915 3083 3721 -1139 -4415 -3180 -331
819 -331 85 -1491 -4530 -6958 -6125 -2053 373 -1878 -4122 -1049 5292 8615 7684 5687 5339 6017 7286
836 7286 6198 1189 -4418 -6297 -4930 -4705 -7130 -10009 -9712 -6260 -1459 2133 2226 869 2544 7566
852 7566 10634 7175 1681 71 2999 3553 520 -2990 -4652 -3998 -1492 1268 188 -3604 -3897 601
868 601 3855 725 -3968 -4822 -2154 -426 -1053 -2089 -2447 -1496 1660 5617 6978 4444 2608 4965
884 4965 7651 6410 1226 -2705 -4370 -4106 -3793 -5404 -8613 -10082 -6705 -1010 1372 -286 -781 2589
900 2589 7038 8677 6612 3284 1457 2421 4088 2809 -1838 -5673 -3928 402 846 -1989 -4277 -2744
$$ packed form
787G657j953m805n634l434J391K329j593n014j180N872O691R19k607L32M265L004
803F240J134l63k638l404q9M456O07o245n552K939N998O38m860l276J235K849
819c31M16j576l039k428Q33M072K426k251k244L073O341L323r31j997l48O78J269
836G286j088n009n607j879J367K25k425k879K97L452M801L592R3j357J675N022
852G566L068l459n494j610K928N54l033l510j662O54K506K760j080l792k93M498
868F01L254l130m693q54K668J728o27j036l58R51L156L957J361k534j836K357
884D965K686j241n184l931j665K64L13j611l209j469L377N695K382j658m95L370
900B589M449J639k065l328j827R64J667j279m647l835J745M330M44k835k288J533
$$ plain form
916 -2744 -97 1581 1172 -1113 -3760 -3152 327 1681 -1432 -4231 -2656 1903 4525 3880 2190 1637
932 1637 3211 5500 6129 3212 -1548 -3385 -535 845 -2474 -7100 -7759 -4526 -1415 -465 -1661 -2646
948 -2646 -1243 3090 6024 4535 705 -51 2712 4916 3543 -259 -2573 -1745 617 1571 290 -2674
964 -2674 -3568 -858 2270 1897 -1879 -3861 -2017 808 1630 -281 -2852 -3385 -539 2765 2773 -463 -2060
981 -2060 319 4319 4686 1603 -1208 -1031 1634 2926 1516 -1874 -3935 -2282 1065 1544 -1853 -4573
997 -4573 -2954 855 2151 211 -1661 -1989 -263 2673 3191 821 -1758 -1237 2087 3641 1396 -1674
1013 -1674 -2402 -62 2418 2273 -259 -2607 -1772 1306 3159 1143 -2357 -2852 -117 2203 1132 -2346
1029 -2346 -4005 -2769 140 1608 -503 -2716 -2067 1650 4315 3472 785 -35 1549 3827 3811 937
$$ packed form
916b744K647J678m09k285k647O08L479J354l113k799J575M559K622o45j690n53
932A637J574K289O29k917m760j837K850J380l319m626o59L233L111R50j196r85
948b646J403M333K934j489l830p56K763K204j373l802k314Q28K362R54j281k964
964b674q94K710L128l73l776j982J844K825Q22j911k571n33K846L304Ql236j597
981b060K379M000L67l083k811J77K665J292j410l390k061J653L347M79l397k720
997d573J619L809J296j940j872l28J726K936N18k370k579N21L324J554k245l070
1013a674p28K340K480j45k532k348Q35L078J853k016l500m95K735K320j071l478
1029b346j659J236K909J468k111k213O49L717K665q43k687q20J584K278j6k874
$$ plain form
1045 937 -2037 -2813 -901 495 -742 -3830 -4788 -2339 730 1259 -634 -2022 -1047 1376 3374 2129
1061 2129 -498 -1761 -351 2327 2610 95 -2028 -896 2182 3971 2410 -362 -1271 832 2458
1076 2458 1302 -1920 -4630 -4080 -1949 -881 -2342 -4350 -3816 -803 2715 3597 1615 568 2715 5524
1092 5524 5952 3031 -70 -879 170 766 -691 -3581 -5010 -3625 -883 264 -1115 -2718 -1651 1239
1108 1239 2884 1821 -628 -1491 -77 1833 1558 -110 -1697 -972 1448 3070 2541 679 0 1091
1124 1091 3007 2839 -436 -3320 -3163 -1388 -1124 -3189 -4762 -4421 -1920 412 1605 1137 802 2075
1140 2075 4667 6165 4237 827 -383 1164 1984 -404 -3400 -4278 -2745 -1528 -1244 -1521 -2529 -1961
1156 -1961 418 2799 2663 523 -757 473 1995 1682 -154 -1812 -777 667 1809 1433 -88 -862
$$ packed form
1045I37k974p76J912J396j237l088r58K449L069N29j893j388R75K423J998j245
1061B129k627j263J410K678K83k515k123J132L078J789j561k772r09K103J626
1076B458j156l222k710N50K131J068j461k008N34L013L518Q82j982j047K147K809
1092E524M28k921l101q09J049N96j457k890j429J385K742J147j379j603J067K890
1108A239J645j063k449q63J414J910k75j668j587P25K420J622n29j862o79J091
1124A091J916j68l275k884J57J775K64k065j573L41K501K332J193m68l35J273
1140B075K592J498j928l410j210J547Q20k388k996q78J533J217K84k77j008N68
1156a961K379K381j36k140j280J230J522l13j836j658J035J444J142l76j521p74
$$ plain form
1172 -862 343 2103 2089 133 -1825 -1896 -937 -55 -1445 -3582 -4265 -1988 848 1417 -54 -228 1767
1189 1767 3816 4145 3023 1417 611 730 1570 957 -1702 -4210 -3859 -1402 -821 -2614 -3641 -1680 574
1206 574 1912 1739 1340 768 1217 2612 3384 1705 -784 -1033 912 1778 465 -1485 -2205 -835 325
1223 325 289 -847 -2018 -2040 -460 560 -508 -2304 -2258 -506 1394 1618 999 80 1021 2809 4033 2673
1241 2673 554 445 1596 1946 564 -1680 -2992 -3113 -2480 -1980 -2321 -3618 -3693 -1602 1333 1955 -105
1258 -105 -304 1902 4181 3613 2217 1634 1827 1830 2156 1369 -916 -2537 -2124 -387 -356 -2426 -3777 -2686
1276 -2686 -977 -555 -1457 -1778 -1397 83 1546 2096 1260 467 1062 2557 3356 2498 1225 799 1394 1999
1294 1999 1401 -548 -2605 -2386 -1313 -1151 -2780 -4073 -3685 -2263 -1060 -675 -934 -1000 162 2669 4235
$$ packed form
1172h62J205J760j4j956j958p1R59Q82j390k137o83K277K836N69j471j74J995
1189A767K049L29j122j606q06J19Q40o13k659k508L51K457N81j793j027J961K254
1206E74J338j73l99n72M49J395P72j679k489k49J945Q66j313j950p20J370J160
1223C25l6j136j171k2J580J020j068j796M6J752J900K24o19r19R41J788J224j360
1241B673k119j09J151L50j382k244j312j21O33N00l41j297p5K091K935O22k060
1258a05j99K206K279n68j396n83J93LL26p87k285j621M13J737L1k070j351J091
1276b686J709M22r02l21L81J480J463N50q36p93N95J495P99q58j273m26N95O05
1294A999n98j949k057K19J073J62j629j293L88J422J203L85k59o6J162K507J566
$$ plain form
1311 4235 3470 1735 1838 3947 4317 1616 -399 -563 -314 -664 -1532 -2490 -3261 -3839 -2271 -972 -867 -2470
1329 -2470 -2114 68 1686 1766 552 450 1233 2003 2351 2188 811 211 1036 2229 1674 -143 -1270 -1067
1347 -1067 -35 -20 -1350 -2945 -3259 -2146 -771 -1300 -2373 -2665 -576 1809 2340 1920 1392 2074 3148
1364 3148 3822 2923 1311 -363 -54 865 210 -2184 -3635 -2987 -1729 -1190 -1475 -1570 -1367 -108 1043 1933
1382 1933 950 -69 447 1957 2328 1378 -241 -193 595 1145 794 -328 -998 -689 734 1110 -215 -1913
1400 -1913 -1961 -637 -215 -1040 -1978 -1930 -1174 407 1333 907 240 573 2251 3243 2375 871 286 502 691
1419 691 145 -1090 -2545 -2767 -1852 -622 -841 -2169 -1891 -6 1751 1906 873 549 1048 1852 2373 1513
1437 1513 -28 -1183 -155 918 225 -1228 -1916 -1004 218 447 -211 -1000 -1073 -228 471 605 -748 -1274
$$ packed form
1311D235p65j735J03K109L70k701k015j64K49l50q68r58p71n78J568J299J05j603
1329b470L56K182J618Q0j214j02P83P70L48j63j377o00Q25J193n55j817j127K03
1347a067J032J5j330j595l14J113J375n29j073k92K089K385N31m20n28O82J074
1364C148O74q99j612j674L09R19o55k394j451O48J258N39k85r5K03J259J151Q90
1382A933r83j019N16J510L71r50j619M8P88N50l51j122o70L09J423L76j325j698
1400a913m8J324M22q25r38M8P56J581R26m26o67L33J678R92q68j504n85K16J89
1419F91n46j235j455k22R15J230k19j328K78J885J757J55j033l24M99Q04N21q60
1437A513j541j155J028J073o93j453o88R12J222K29o58p89p3Q45O99J34j353n26
$$ plain form
1455 -1274 -584 842 987 274 58 146 1180 2027 1952 867 -243 -35 844 561 -1033 -2502 -2499 -1157 -455
1474 -455 -1000 -1773 -1851 -695 903 1787 1109 319 835 2431 2788 1462 65 -124 158 274 96 -855 -1977
1493 -1977 -1872 -550 225 -597 -1782 -1323 -188 793 545 -140 -479 77 758 1217 1099 -38 -131 719 1952
1512 1952 1592 196 -301 126 508 449 -313 -1483 -1933 -1380 -367 -885 -1774 -2222 -711 618 834 373
1530 373 199 925 1637 2296 2084 1032 296 687 1410 855 -603 -1544 -1193 -646 -784 -1067 -1488 -1450 -995 175
1550 175 918 -107 -605 -171 1258 1466 662 -111 -130 709 1099 1298 525 -342 -286 786 1142 -28 -1167
1569 -1167 -956 -153 -149 -594 -1231 -1569 -1174 -376 198 79 -611 -64 941 1780 1381 545 754 1074 1250 1083
1589 1083 122 -637 -1111 -678 -81 -652 -1519 -1653 -813 45 126 -406 -535 -62 849 1084 842 59 -391 244
$$ packed form
1455a274O90J426J45p13k16Q8J034Q47p5j085j110K08Q79k83j594j469LJ342P02
1474d55n45p73p8J156J598Q84o78p90N16J596L57j326j397j89K82J16j78r51j122
1493a977J05J322P75q22j185M59J135R81k48o85l39N56O81M59j18j137r3Q50J233
1512A952l60j396m97M27L82n9p62j170m50N53J013n18q89m48J511J329K16m61
1530C73j74P26P12O59k12j052p36L91P23n55j458r41L51N47j38k83m21L8M55J170
1550A75P43j025m98M34J429K08q04p73j9Q39L90J99p73q67N6J072L56j170j139
1569a167K11Q03Mm45o37l38L95P98N74j19o90N47J005Q39l99q36K09L20J76j67
1589A083r61p59m74M33N97n71q67j34Q40Q58Q1n32j29M73R11K35k42p83m50O35
$$ plain form
1609 244 942 764 -321 -639 -283 604 389 77 -411 -445 136 262 380 -499 -1174 -634 185 -51 -451 -749
1629 -749 -454 44 742 687 191 -201 254 1136 1139 416 -428 -510 242 387 -230 -808 -1094 -699 118 289 -45
1650 -45 -405 -122 822 1166 670 -161 -194 298 490 184 -267 -901 -706 -28 222 -63 -570 -489 124 538 495
1671 495 68 -131 135 430 685 180 -396 -607 -30 451 287 -386 -747 37 557 657 -91 -275 -365 -4
1691 -4 294 -35 -657 -939 -255 289 299 -34 -348 58 507 881 644 232 -173 352 751 331 -484 -926 -767
1712 -767 -114 -181 -598 -677 -826 -299 316 468 82 23 184 839 957 548 -44 -123 126 475 2 -439 -441 -227
1734 -227 186 298 9 -492 -388 83 502 -23 -702 -546 -210 131 111 -209 -265 -141 246 548 622 232 137
1755 137 291 694 574 294 -475 -350 29 -58 -444 -1073 -753 -407 -84 -45 -123 -234 17 539 737 421 182
$$ packed form
1609B44O98j78j085l18L56Q87k15l12m88l4N81J26J18q79o75N40Q19k36m00k98
1629g49K95M98O98n5m96l92M55Q82Lp23q44q2P52J45o17n78k86L95Q17J71l34
1650d5l60K83R44L44m96q31l3M92J92l06m51o34J95O78K50k85n07Q1O13M14m3
1671D95m27j99K66K95K55n05n76k11N77M81j64o73l61P84N20J00p48j84r0L61
1691dK98l29o22k82O84N44J0l33l14M06M49L74k37m12m05N25L99m20q15m42J59
1712g67O53o7m17p9j49N27O15J52l86n9J61O55J18m09n92p9K49L49m73m41kK14
1734b27M13J12k89n01J04M71M19n25o79J56L36L41k0l20n6J24L87L02P4l90r5
1755A37J54M03j20k80p69J25L79q7l86o29L20L46L23L9p8j11K51N22J98l16k39
$$ plain form
1776 182 -124 213 354 220 -116 -569 -168 155 433 -154 -202 -391 74 168 95 -24 -259 -164 -18 282 -204
1797 -204 -704 -204 87 522 257 -265 193 495 465 402 -21 159 -41 94 380 32 -554 -749 -237 98 47
1818 47 -461 -448 66 270 437 215 114 73 174 510 222 -145 -393 -145 -60 237 -66 -358 -351 89 320 220
1840 220 -104 -2 318 337 278 -26 -197 -189 -112 146 -144 -374 -529 -105 337 394 -318 -165 107 386 381 -150 -353
1863 -353 -170 -64 0 187 -83 -455 -191 232 685 78 -194 -151 158 301 -38 -180 -398 -247 -108 -117 -263
1884 -263 -530 -560 -1 323 302 -25 33 476 611 343 376 -54 156 199 194 -59 -488 -494 -109 -60 -124 -269 -267 -251 16
1909 16 253 45 -245 -321 82 339 235 -52 -65 78 88 212 159 42 -24 110 428 387 -67 -418 -209 37
1931 37 -112 -651 -360 -348 -170 -51 -61 -218 -336 76 499 608 303 37 193 506 364 215 -11 -305 -144
$$ packed form
1776A82l06L37J41j34l36m53M01L23K78n87m8j89M65R4p3j19k35R5J46L00m86
1797b04n00N00K91M35k65n22M58L02l0o3m23J80k00J35K86l48n86j95N12L35n1
1818D7n08J3N14K04J67k22j01m1J01L36k88l67k48K48Q5K97l03k92PM40K31j00
1840B20l24J02L20J9n9l04j71QP7K58k90k30j55M24M42N7p12J53K72K79nn31k03
1863c53J83J06O4J87k70l72K64M23M53o07k72M3L09J43l39j42k18J51J39rj46
1884b63k67l0N59L24k1l27N8M43J35k68L3m30K10M3nk53m29oL85M9o4j45KJ6K67
1909A6K37k08k90p6M03K57j04k87j3J43J0J24n3j17o6J34L18m1m54l51K09K46
1931C7j49n39K91J2J78J19j0j57j18M12M23J09l05k66J56L13j42j49k26k94J61
$$ plain form
1952 -144 -66 -295 -319 -502 -450 -41 192 62 -269 -300 -106 263 92 179 -164 50 353 326 205 -76 -16 365
1974 365 367 273 59 -187 -159 96 6 42 -239 -435 -188 237 -31 -308 -124 194 186 108 214 418 229 292 356 645
1998 645 -7 -210 -84 229 9 -204 -231 -258 98 58 -205 -254 -184 -211 358 163 20 45 -40 263 233 87 -113
2021 -113 -128 -77 111 153 -66 -90 86 73 247 -61 -90 -108 -183 78 -145 -96 -218 -103 34 103 -53 -195 -179 199
2045 199 342 27 74 -42 46 172 83 16 -197 -313 -45 66 -219 -211 -172 188 327 204 70 17 13 171 133 119
2069 119 -150 -141 -84 86 11 -261 -123 -257 12 14 16 -59 -135 26 78 72 -11 -186 49 23 225 -36 10 -36 128 142
2095 142 232 94 -107 124 244 -117 -81 -210 -225 -191 -85 -190 -37 -204 109 328 130 160 101 142 390 153
2117 153 195 -172 -96 -54 40 -183 -176 -104 -281 9 -39 -95 -57 -100 87 119 220 54 -74 44 191 361 172 -49
$$ packed form
1952a44P8k29k4j83N2M09K33j30l31l1J94L69j71Q7l43K14L03k7j21k81O0L81
1974C65Kr4k14k46K8K55r0L6k81j96K47M25k68k77J84L18qp8J06K04j89O3O4K89
1998F45o52k03J26L13k20k13k7k7L56m0k63m9P0k7N69j95j43K5q5L03l0j46k00
2021a13j5N1J88M2k19k4J76j3J74l08k9j8p5K61k23M9j22J15J37O9j56j42J6L78
2045A99J43l15M7j16Q8J26q9o7k13j16K68J11k85QL9L60J39j23j34n3mJ58l8j4
2069A19k69RN7J70p5k72J38j34K69KKp5p6J61N2oq3j75K35k6K02k61M6m6J64J4
2095A42R0j38k01K31J20l61L6j29j5L4J06j05J53j67L13K19j98L0n9M1K48k37
2117A53M2l67P6M2R4k23PP2j77K90m8n6L8m3J87L2J01j66j28J18J47J70j89k21
$$ plain form
2141 -49 75 214 191 -9 34 139 226 -6 120 -186 -167 -95 -19 -11 3 -133 -61 133 87 138 37 220 80 292
2165 292 237 296 212 -37 225 208 96 -97 -86 -323 -150 -160 26 63 -12 -13 46 -55 -96 -49 156 128 71 -10 -105 -11
2191 -11 231 55 -115 27 -110 76 104 187 2 -45 2 -117 -89 -64 -98 -91 -104 -60 -77 -89 -90 -49 178 143 105 46 -34
2218 -34 24 84 32 9 -235 -78 90 -134 -290 -359 -94 8 138 -7 94 60 -52 140 145 170 163 150 65 97 56
2243 56 -61 -47 -141 -33 122 43 -17 -65 106 -11 18 5 -72 -79 -127 -38 -10 135 33 58 79 60 -31 -50 86 -16
2269 -16 45 48 75 -36 106 99 -6 -43 -25 13 -90 47 39 13 77 142 -70 -20 56 20 -180 -100 78 48 -72 -188 78
2296 78 3 -73 48 -70 26 147 17 -59 -132 57 128 70 27 72 71 4 39 -60 61 -57 40 49 -68 -82 40 -86
2322 -86 148 49 -128 32 90 -40 7 92 -202 -41 -182 36 133 30 130 -164 62 88 -55 -154 -42 6 -156
$$ packed form
2141d9J24J39k3k00M3J05Q7k32J26l06J9P2P6QJ4j36P2J94m6N1j01J83j40K12
2165B92n5N9q4k49K62j7j12j93J1k37J73j0J86L7p5jN9j01m1M7K05k8n7q1r5R4
2191a1K42j76j70J42j37J86K8Q3j85m7M7j19K8K5l4Pj3M4j7j2jM1K27l5l8n9q0
2218c4N8O0n2k3k44J57J68k24j56o9K65J02J30j45J01l4j12J92NK5pj3q5L2m1
2243E6j17J4r4J08J55p9o0m8J71j17K9j3p7pm8Q9K8J45j02K5K1j9r1j9J36j02
2269a6O1LK7j11J42pj05l7J8L8j03J37qk6O4O5k12N0P6l6k00Q0J78l0j20j16K66
2296G8p5p6J21j18R6J21j30p6p3J89P1n8m3M5jo7L5r9J21j18R7Rj17j4J22j26
2322h6K34r9j77J60N8j30M7Q5k94J61j41K18R7j03J00k94K26K6j43r9J12M8j62
$$ plain form
2345 -156 66 12 90 152 34 206 -98 57 -123 33 18 174 50 -45 75 -22 149 -141 28 -115 227 -127
2367 -127 -160 -343 25 51 -150 2 37 41 37 123 57 0 125 73 224 -94 -113 -14 90 35 2 111 -42 195 92
2392 92 60 92 93 56 41 56 76 64 35 163 -133 -106 11 -51 -147 86 -55 187 101 -30 -37 -150 79 18 -99 -16
2418 -16 100 -7 -115 -44 -152 79 22 -12 -18 -36 -107 48 -332 20 -150 -7 21 140 82 -57 21 41 -37 -39 51
2443 51 67 57 -37 13 134 -20 -57 -32 -12 175 -32 12 13 -55 -64 -101 26 -9 -77 35 -74 73 -106 -53 -165 86
2469 86 -90 -113 165 -14 -67 98 -80 -77 192 -76 89 -159 17 87 -79 -52 53 -12 56 158 64 47 159 -118
2493 -118 60 -10 -29 -34 78 196 -159 85 -19 -8 -91 67 4 -44 60 24 -40 72 -36 -4 188 95 168 117 -144
2518 -144 99 98 69 7 62 57 -78 -61 17 -90 -28 -212 33 -24 95 135 -182 79 -70 81 -15 -49 -83 9 86 92
$$ packed form
2345a56K22n4P8O2j18J72l04J55j80J56j5J56j24r5J20r7J71k90J69j43L42l54
2367a27l3j83L68K6k01J52L5MmQ6o6n7J25n2J51l18j9R9J04n5l3J09j53K37j03
2392I2l2L2Jl7j5J5K0j2k9J28k96K7J17o2r6K33j41K42q6j31pj13K29o1j17Q3
2418a6J16j07j08P1j08K31n7l4oj8p1J55l80L52j70J43K8J19n8j39P8K0p8kR0
2443E1J6j0r4N0J21j54l7K5K0J87k07M4Jo8rl7J27l5o8J12j09J47j79N3j12K51
2469H6j76k3K78j79n3J65j78LK69k68J65k48J76P0j66K7J05o5O8J02r4j7J12k77
2493a18J78p0j9nJ12J18l55K44j04J1q3J58o3m8J04l6o4J12j08L2J92r3P3n1k61
2518a44K43jk9o2N5nj35J7P8j07O2j84K45n7J19M0l17K61j49J51r6l4l4R2P7O
$$ plain form
2544 92 89 9 -138 -69 -120 -99 44 -57 -83 185 181 67 5 -243 -74 61 170 70 -73 -6 -27 -24 66 -56 -15 -15
2570 -15 9 95 -95 -107 -151 -79 -75 62 51 -26 -32 134 -22 5 -9 -194 70 10 -45 -170 0 81 13 -93 -32 7 -158
2597 -158 186 174 -70 10 -105 95 67 43 -285 -14 -30 81 81 -58 17 -154 24 142 76 -35 -82 9 92 40
2621 40 6 8 -160 -284 80 -14 -65 -128 8 15 -115 -16 -34 -138 -25 44 -63 69 -51 3 8 62 -168 -68 111
2646 111 224 -175 178 -67 65 -138 145 80 43 110 -115 141 102 -10 49 11 -16 17 -52 192 16 40 103 29
2670 29 96 -96 -27 144 -33 5 7 18 89 128 11 24 -285 -20 61 46 74 -7 -31 71 77 -78 158 87 -45 -46 61
2697 61 33 -138 -111 -46 143 94 -68 -59 0 114 142 30 15 -91 91 97 54 -42 -117 -21 33 -7 -201 -220 -218 37 182
2724 182 -96 -157 -73 -66 110 33 138 -152 78 28 116 63 117 10 118 50 -135 55 -40 69 140 31 -150 -29
$$ packed form
2544I2lq0j47O9n1K1J43j01k6K68mj14o2k48J69J35J09j00j43O7k1LR0j22M1%
2570a5K4Q6j90j2m4P2MJ37j1p7oJ66j56K7j4j85K64o0n5j25J70Q1o8j06O1L9j65
2597a58L44j2k44Q0j15K00k8k4l28K71j6J11%j39P5j71J78J18o6j11m7R1Q3n2
2621D0l4Kj68j24L64r4n1o3J36Pj30R9j8j04J13O9j07J32j20N4NN4k30J00J79
2646A11J13l99L53k45J32k03K83o5l7O7k25K56l9j12N9l8k7L3o9K44j76K4O3p4
2670B9O7j92O9J71j77L8KJ1P1L9j17J3l09K65Q1j5K8q1k4J02Oj55K36p1j32jJ07
2697F1k8j71K7O5J89m9j62RN9J14K8j12j5j06J82Om3r6p5R6N4m0j94j9KK55J45
2724A82k78o1Q4PJ76p7J05k90K30n0Q8n3N4j07J08o8j85J90r5J09P1j09j81J21
$$ plain form
2748 -29 -62 -29 -39 127 317 -26 166 191 215 -144 -155 107 102 299 238 66 -138 -172 22 121 -125 -106 -131 103 -67
2773 -67 -116 -162 -9 187 -132 72 -8 -95 -206 63 101 30 -239 21 243 208 -34 -110 -210 -67 72 -2 47 -33
2797 -33 -120 83 -20 -141 -52 -47 40 61 139 41 256 12 75 257 73 55 -174 49 114 30 -83 -88 -37 171 15
2822 15 -48 -88 -116 26 1 134 -193 -40 2 -25 76 37 -45 -88 -139 29 142 -11 -237 -144 -109 -37 -13 -144 100
2847 100 17 -81 -89 10 -123 49 144 60 48 10 116 -6 126 40 105 94 60 77 36 -63 -91 -26 -83 -65 131 -181 -11
2874 -11 -16 46 74 -13 40 -113 26 -109 29 25 -112 137 6 95 13 -40 123 -24 97 60 85 -137 27 316 -6
2899 -6 -36 -78 25 21 83 -69 -77 -113 -32 150 54 141 -111 99 -23 101 -81 -156 -27 112 -28 71 75 -57 -43 161
2925 161 81 120 -144 -60 76 162 25 -79 -132 -132 -129 -73 -102 -54 70 -24 82 -92 -16 -67 1 -86 43 -11 109 31
$$ packed form
2748b9l3L3j0J66J90l43J92K5K4l59j1K62nJ97o1j72k04l4J94R9k46J9k5K34j70
2773f7m9m6J53J96l19K04q0q7j11K69L8p1k69K60K22l5k42p6j00J43J39p4M9q0
2797c3q7K03j03j21Q9NQ7K1P8r8K15k44O3J82j84j8k29K23O5q4j13nN1K08j56
2822A5o3m0k8J42k5J33l27J53M2k7J01l9q2m3n1J68J13j53k26R3L5P2K4j31K44
2847A00q3r8qR9j33J72R5q4j2l8J06j22J32q6O5j1l4J7m1r9k8O5n7J8J96l12J70
2874a1nO2K8q7N3j53J39j35J38mj37K49j31Q9q2n3J63j47J21l7K5k22J64K89l22
2899fl0m2J03mO2j52ql6Q1J82r6Q7k52K10j22J24j82p5J29J39j40R9Mj32J4K04
2925A61q0L9k64Q4J36Q6j37j04n3%LN6k9M8J24r4J06j74P6n1O8q7J29n4J20p8
$$ plain form
2951 31 80 27 -90 -21 -15 -52 56 104 23 -88 -10 232 19 66 -14 -137 59 137 64 -146 -91 91 98 175 54 164
2977 164 28 -11 109 80 107 -135 61 205 -225 -34 -89 -68 -89 -25 -25 -104 -107 -75 -149 46 68 -168 -104 68 82 28
3003 28 52 -3 27 147 81 -100 105 41 13 156 253 -55 -162 -176 17 -129 -198 -216 -29 23 146 -54 -83 -49 139
3028 139 163 129 -98 -79 80 -47 40 -68 -99 30 198 -40 48 -183 -2 -162 150 28 -115 -113 -132 -124 100 -77
3052 -77 23 -87 -48 24 151 232 70 -116 -21 -114 53 23 -63 115 -226 15 -176 -73 -89 -112 -55 -134 -85 -63 160
3077 160 28 162 58 -159 -30 157 125 -179 -99 69 118 74 23 -146 -98 19 169 112 20 -84 -97 2 17 -2
3101 -2 -200 -71 -75 40 -1 -148 -33 29 132 13 116 -87 -16 208 154 101 -4 106 46 -117 46 34 0 70
3125 70 70 -77 132 -88 -32 59 -38 121 169 61 -88 -38 163 5 -68 -64 -8 45 -22 6 94 57 248 60 6 -51
$$ packed form
2951C1M9n3j17O9Ol7J08M8q1j11P8K42k13M7q0j23J96P8p3k10N5J82PP7j21J10
2977A64j36l9J20k9K7k42J96J44m30J91n5K1k1O4%p9lL2p4J95K2k36O4J72J4n4
3003B8K4n5L0J20o6j81K05o4k8J43R7l08j07j4J93j46o9j8J87N2J23k00k9L4J88
3028A39K4l4k27J9J59j27Q7j08l1J29J68k38Q8k31J81j60L12j22j43Kj9QK24j77
3052g7J00j10L9P2J27Q1j62j86R5r3J67l0q6J78l41K41j91J03j6k3N7p9M9K2K23
3077A60j32J34j04k17J29J87l2l04Q0J68M9m4n1j69M8J17J50n7r2j04j3R9J5j9
3101bj98J29mJ15m1j47J15O2J03j19J03k03P1K24n4n3j05J10o0j63J63j2l4P0
3125G0%j47K09k20N6R1r7J59M8j08j49N0K01j58p3MN6N3o7K8Q8l7J91j88n4n7
$$ plain form
3151 -51 -1 -43 142 -49 -42 -56 -76 -79 -51 -38 135 18 205 228 104 76 58 -11 116 134 6 -128 -100 13 25 158
3177 158 -118 -106 117 -91 166 -22 -110 -42 -45 117 -45 -118 -243 75 -86 -6 0 72 -43 124 156 -8 76 -106
3201 -106 -47 33 -27 -27 14 -19 -64 -2 37 -43 -196 57 114 101 -33 -217 8 20 165 122 -16 -6 -91 81 147 22
3227 22 60 -60 -75 -28 -33 83 -176 -2 204 74 -341 -20 -8 -164 127 57 -95 71 -40 126 -7 86 -10
3250 -10 0 121 67 -53 -247 -119 -156 95 95 97 15 -10 198 -72 -6 17 -46 -9 122 125 -84 -144 59 152 64 121 -32
3277 -32 -46 65 204 -47 -27 -69 -31 165 -184 -27 225 103 117 -177 -79 60 19 -55 -70 3 -152 -29 79 125
3301 125 140 -103 -30 -178 -56 36 83 12 -182 91 -31 3 -89 105 69 9 137 -89 5 -30 205 131 88 53 -114
3326 -114 -7 103 173 224 -8 180 -45 172 36 14 14 51 225 80 -66 -11 -7 60 -67 -27 -57 -63 -25 -83 -48 -18
$$ packed form
3151e1N0m2J85j91Pj4k0lK8J3J73j17J87K3j24k8j8o9J27J8j28j34K8J13J2J33
3177A58k76J2K23k08K57j88q8O8lJ62j62p3j25L18j61Q0OP2j15J67L2j64Q4j82
3201a06N9Q0o0%M1l3m5O2L9q0j53K53N7j3j34j84K25J2J45m3j38J0q5J72O6j25
3227B2L8j20j5M7nJ16k59J74K06j30m15L21J2j56K91p0j52J66j11J66j33R3r6
3250a0J0J21n4j20j94J28l7K51%Kq2k5K08k70O6K3o3L7J31Lk09o0K03R3q8N7j53
3277c2j4J11J39k51K0m2L8J96l49J57K52j22J4k94R8J39m1p4j5P3j55J23J08M6
3301A25J5k43P3j48J22R2M7p1j94K73j22L4r2J94l6o0J28k26R4l5K35p4m3l5j67
3326a14J07J10P0N1k32J88k25K17j36k2%L7J74j45j46N5MO7j27M0l0oL8n8L5L0
$$ plain form
3352 -18 -10 71 87 113 111 64 217 39 96 -43 -120 -157 247 54 79 38 15 -222 104 -51 220 -2 -56 188 20
3377 20 87 -59 -29 -138 113 49 -97 18 -166 -14 331 -53 129 45 -75 -56 58 -51 -27 -46 -111 60 228
3400 228 -15 -17 -2 -73 -103 -39 -251 -19 -122 165 187 -59 -29 -116 7 94 143 -94 -22 230 286 -20 7 -42 -80
3425 -80 -59 152 -82 -170 -201 142 206 -102 69 47 91 27 160 165 -151 -106 52 -33 100 -94 -94 63 87 -197 -104
3450 -104 -140 119 26 127 209 -16 -172 -19 -158 154 -48 -64 -33 17 -1 18 3 107 77 -70 42 -22 80 59
3474 59 233 121 -162 88 -61 -74 -47 -78 -50 -38 -21 54 134 -58 84 193 -81 39 -1 -112 -1 19 63 -120
3498 -120 114 86 -60 2 102 173 -37 -171 -10 -2 -139 79 -243 52 152 -53 10 83 -26 -46 243 119 -89
3521 -89 127 49 26 62 0 -98 7 -48 -53 -94 -92 -46 -161 68 124 52 -200 -29 -98 -80 95 -199 -5 -43 -61 46
$$ packed form
3352a8QQ1J6K6km7J53j78N7j39p7l7M04j93K5m1k3k37L26j55K71k22n4K44j68
3377B0O7j46L0j09K51o4j46J15j84J52L45l84J82q4j20J9J14j09K4j9o5J71J68
3400B28k43kJ5p1l0O4k12K32j03K87K2k46L0q7J23Q7M9k37P2K52N6l06K7m9l8
3425h0K1K11k34q8l1L43O4l08J71k2M4o4J33Nl16M5J58q5J33j94%J57K4k84R3
3450a04l6K59r3J01Q2k25j56J53j39L12k02j6L1N0j8J9j5J04l0j47J12o4J02k1
3474E9J74j12k83K50j49j3K7l1K8J2J7P5Q0j92J42J09k74J20m0j11J11K0M4j83
3498a20K34k8j46O2J00P1k10j34J61Qj37K18l22K95J00k05O3P3j09k0K89j24k08
3521h9K16p8k3L6o2r8J05n5nm1KM6j15K29N6p2k52J71o9J8J75k94J94l8j8J07
$$ plain form
3547 46 52 -90 -52 111 -7 -2 107 85 75 70 -66 89 129 -7 -9 108 -146 -69 -82 -26 11 -21 39 -44 -22 60 -11 97
3575 97 -40 102 115 41 45 -106 -184 22 54 154 81 -27 51 83 50 18 42 -125 8 -37 48 -98 -258 31 -79
3600 -79 63 -85 -177 123 11 -58 150 -90 15 -44 -79 81 -181 -80 22 80 53 73 42 -160 -67 -75 -12 -160
3624 -160 -153 -302 1 39 15 19 34 -122 150 17 -50 -47 -148 140 220 -60 -37 29 -70 82 87 138 -190 -198 -227 -61 -276
3651 -276 84 -160 -156 -1 41 -220 -135 -68 -84 68 28 2 -132 20 60 109 57 -83 -29 97 -4 10 -55 116 80
3676 80 108 -148 -17 -41 -18 57 149 47 -169 -59 102 -102 -5 95 -98 51 113 -6 19 -61 110 128 -128 85
3700 85 -171 -6 122 2 33 -107 -91 130 131 121 93 -196 -93 -25 -188 -241 -263 -23 -198 49 84 -20 -22 176
3724 176 12 42 85 -19 43 35 56 71 173 40 21 -191 178 -163 -72 163 -135 -9 -60 -50 81 164 4 199
$$ packed form
3547D6Oj42L8J63j18NJ09k2j0nj36J55M0j36kJ17k54P7j3N6L7l2O0q3K2Q2p1J08
3575I7j37J42J3p4Mj51p8K06L2J00p3j08P8L2l3l2K4j67J33m5Q5j46j60K89j10
3600g9J42j48r2L00j12o9K08k40J05n9l5J60k62J01J02N8k7K0l1k02R3qO3j48
3624a60Pj49L03L8k4MJ5j56K72j33o7Lj01K88Q0k80K3O6r9J52NN1l28qk9J66k15
3651b76L60k44MJ55M2k61Q5O7j6J52m0k6j34J52M0M9n2j40N4J26j01J4o5J71l6
3676H0K8k56J31k4K3P5R2j02k16J10J61k04R7J00j93J49O2j19K5q0J71J8k56K13
3700H5k56J65J28j20L1j40J6K21Jj0k8k89J03O8j63n3k2K40j75K47L5j04kJ98
3724A76j64L0M3j04O2qK1J5J02j33j9k12L69l41R1K35k98J26n1J0J31Q3j60J95
$$ plain form
3748 199 24 47 75 64 56 -116 96 37 2 35 28 -76 -165 128 -141 -10 24 -142 -246 -70 11 115 -94 -122 -244
3773 -244 97 36 -7 8 47 -117 18 217 -26 122 -34 39 -163 69 100 -236 -46 -167 19 -4 -207 53
3795 53 44 10 -38 -60 -163 -157 84 102 -28 -108 85 -90 103 105 -42 60 -195 101 162 17 134 107 -106 -215 -45
3820 -45 -195 42 33 88 -52 -3 156 31 120 132 157 36 32 27 13 48 78 1 -45 150 -14 -26 -46 -104 -90 -101 -77 -98
3848 -98 -163 99 -43 8 -54 39 -75 -8 37 23 -28 73 39 -53 -105 139 -216 -24 -159 -23 -229 122 143 -41
3872 -41 -45 84 -104 -136 -77 106 -52 58 23 -64 192 115 62 63 52 -41 93 -66 -94 -62 -32 11 79 -10 14 -70 -44
3899 -44 72 -78 -23 -160 109 28 16 -96 -48 -25 -61 -53 112 -3 -167 -7 1 32 -64 -14 33 109 103 11 -52 -45 -55 129
3927 129 -37 -45 -83 16 -33 149 8 36 14 62 13 45 160 -110 20 58 276 -40 -17 58 -74 43 96 -13 -53
$$ packed form
3748A99j75K3K8j1qj72K12n9l5L3pj04q9K93k69J31L4j66j04J76Q1J04k09k8j22
3773b44L41o1m3J5L9j64J35J99k43J48j56P3k02K32L1l36J90j21J86k3k03K60
3795E3rl4m8k2j03OK41J8j30q0J93j75J93Kj47J02k55K96O1j45J17k7k13j09J70
3820d5j50K37rN5j40M9J59j25Q9J2K5j21mnj4L5L0p7m6J95j64j2k0n8J4j1K4k1
3848i8o5K62j42N1o2R3j14O7M5j4n1J01l4r2n2K44l55J92j35J36k06L51K1j84
3872d1mJ29j88l2N9J83j58J10l5q7K56p7n3Jj1r3J34j59k8L2L0M3O8q9K4q4K6
3899d4J16j50N5j37K69q1j2j12M8K3l6QJ65j15j64J60QL1r6N0M7P6or2o3Pj0J84
3927A29j66ql8R9m9J82j41K8k2M8m9L2J15k70J30L8K18l16K3P5j32J17N3j09m0
$$ plain form
3952 -53 1 -18 243 27 -49 -87 289 -124 -44 -67 -203 90 -118 -24 89 -63 56 199 -11 175 44 8 -118
3975 -118 -171 52 116 146 49 107 40 -105 66 -41 94 144 15 -58 67 -22 35 57 170 -74 131 233 125 138
3999 138 -70 15 -195 181 98 -144 62 70 -7 -134 -154 0 -120 180 -44 34 -81 -15 139 -14 80 270 298
4022 298 71 130 283 -16 -30 -81 276 66 87 -91 -39 -25 -1 108 -138 -49 -79 41 76 -163 -79 -135 6 66
4046 66 104 56 24 -146 108 54 29 47 65 -157 12 37 -89 -190 -94 -242 243 -131 -28 -125 -10 -51 -66 -35 -17
4071 -17 -28 75 19 79 -47 -19 24 -70 61 40 76 70 123 14 -137 38 -53 11 170 -75 -58 -233 -5 -42 -97 171
4097 171 144 -176 -43 134 -13 185 48 34 101 164 56 -51 -120 -140 75 52 -32 -87 66 89 25 -41 -170 -208
4121 -208 -89 107 85 -45 -75 -63 -70 136 -31 -164 -85 -81 36 175 -113 -14 -65 114 233 24 -35 0 4 90 -206
$$ packed form
3952e3N4j9K61k16p6l8L76m13Q0k3j36K93k08R4J13j52J19J43k10J86j31l6j26
3975a18n3K23O4L0r7N8o7j45J71j07J35N0j29p3J25q9N7K2J13k44K05J02j08J3
3999A38k08Q5k10L76q3k42K06Qp7j27k0J54j20L00k24P8j15O6J54j53R4J90K8
4022B98k27N9J53k99j4n1L57k10K1j78N2J4K4J09k46Q9l0J20L5k39Q4n6J41O0
4046F6L8m8l2j70K54n4k5J8J8k22J69K5j26j01R6j48M85l74J03r7J15m1j5L1J8
4071a7j1J03n6O0j26K8M3r4J31k1L6oN3j09j51J75r1O4J59k45J7j75K28l7n5K68
4097A71k7l20J33J77j47J98j37j4O7O3j08j07o9k0K15k3q4n5J53K3o4o6j29l8
4121b08J19J96k2j30l0J2pK06j67j33P9MJ17J39k88R9n1J79J19k09n9L5MQ6k96
$$ plain form
4146 -206 -16 -138 29 10 2 -65 17 -26 -2 -56 105 -120 8 -103 140 138 -132 18 45 -6 170 24 82 -104
4170 -104 -17 44 -46 -145 -95 -30 -63 30 -18 -23 -142 91 116 -33 -14 -179 -46 42 21 44 -12 61 13 25 94 -33 -64
4197 -64 65 55 185 78 47 16 -21 -61 -38 3 -98 -12 135 12 -85 -272 157 129 226 -56 93 -81 137 6
4221 6 103 -26 90 70 8 105 -98 -93 -85 78 -118 -129 -173 -84 -112 -115 -22 71 28 51 57 236 161 -4 -18 113 48 1 110
4250 110 -68 -115 110 -78 -110 -138 -60 204 -58 -39 90 -147 4 76 -4 3 66 54 -79 94 181 138 11 244
4274 244 68 126 129 -221 66 32 94 -18 142 -172 -78 -12 33 73 151 32 98 -63 -124 17 53 158 93 130 -27
4299 -27 48 64 160 116 196 130 -146 36 109 -50 142 27 41 98 35 -192 1 -83 94 4 147 116 -199 -96 57
4324 57 103 -75 -150 131 137 -38 -15 -66 -209 -52 121 43 -44 53 43 46 -60 4 -88 124 -216 224 -80 -52 91
$$ packed form
4146b06J90j22J67j9qo7Q2m3K4n4J61k25J28j11K43kk70J50K7n1J76j46N8j86
4170a04Q7O1r0r9N0O5l3R3m8nj19K33K5j49J9j65J33Q8k1K3n6P3m8J2O9j27l1
4197f4J29j0J30j07l1l1l7m0K3M1j01Q6J47j23r7j87M29k8R7k82J49j74K18j31
4221FR7j29J16k0o2R7k03NQJ63j96j1m4Q9k8lR3R3m3K3OJ79p5j65j4J31o5m7J09
4250A10j78m7K25j88l2k8P8K64k62J9J29k37J51P2q0PO3j2j33J73Q7m3j27K33
4274B44j76N8Ll50K87l4O2j12J60l14R4O6M5M0P8j19O6j61o1J41L6J05o5L7j57
4299b7P5J6R6m4Q0o6k76J82P3j59J92j15J4N7o3k27J93q4J77r0J43l1l15J03J53
4324E7M6j78p5K81Oj75K3n1j43J57J73p8q7R7j0Lj06O4r2K12l40M40l04K8J43
$$ plain form
4349 91 -108 179 151 114 -119 239 39 -60 -109 38 -55 -92 -14 8 123 -17 -143 -27 10 183 -143 -29 -107 -84
4373 -84 -23 -31 -164 38 40 10 -70 -55 -199 89 65 124 -54 -160 65 82 215 -109 1 -124 -49 -54 67 -38 90
4398 90 141 -91 -10 -62 79 -8 36 -14 18 -41 -97 2 -20 93 -26 -107 62 16 -69 142 -164 12 -165 -80 192
4423 192 -52 -150 -62 -53 63 55 3 -5 -70 -60 0 70 -20 65 187 83 82 173 -164 56 76 91 126 -2 8 76 -48 -43
4451 -43 -97 -70 20 96 102 -122 -58 -110 100 226 199 150 -50 -77 24 113 -138 135 -58 36 52 47 0 41 59 4 -118
4478 -118 -184 -99 85 129 97 29 -13 -57 56 -2 124 31 164 154 -25 -78 -67 -91 -137 24 1 149 -154 90 58
4503 58 -108 -47 -17 -182 -102 -129 154 -40 77 -129 59 126 61 3 -29 139 30 -6 -52 23 72 -39 223 -62
4527 -62 -138 -56 -29 -26 -65 -5 -162 -47 5 78 141 42 -185 7 -84 -120 67 -132 6 107 -61 6 -16 -123 28
$$ packed form
4349I1j99K87k8l7k33L58k00r9m9J47r3l7P8K2J15j40j26J16L7J73l26J14p8K3
4373h4O1qj33K02Kl0q0J5j44K88k4N9j78j06K25J7J33l24J10j25P5nJ21j05J28
4398I0N1k32Q1n2J41q7M4n0L2n9n6R9k2J13j19q1J69m6q5K11l06J76j77Q5K72
4423A92k44r8Q8RJ16qn2qo5J0O0P0r0Q5J22j04jR1l37K20K0J5L5j28J0O8j24N
4451d3n4K7R0P6Ok24O4n2K10J26k7m9k00k7J01Q9k51K73j93R4J6nm7M1J8n5j22
4478a18o6Q5J84M4l2o8m2m4J13n8J26r3J33j0j79n3J1k4m6J61k3J48l03K44l2
4503E8j66O1L0j65Q0k7K83j94J17k06J88O7o5n8l2J68j09l6m6P5M9j11K62k85
4527f2p6Q2K7Ll9O0j57J15N2P3O3r9k27J92r1l6J87j99J38J01j68O7k2j07J51
$$ plain form
4552 28 -91 34 -71 -127 15 12 69 -20 -25 -140 89 -49 -137 -226 -132 -105 -4 -7 92 -56 107 70 -72 143 36
4577 36 24 59 65 38 -4 70 29 25 202 34 -14 -89 -266 44 -64 -15 20 -84 65 4 170 -16 -54 19 241 13
4603 13 34 1 -38 6 -7 -108 -48 -193 -45 -180 118 -80 -12 -204 120 -12 -155 -235 -99 -47 31 115 118 173 -107
4628 -107 18 161 142 -31 63 6 32 19 100 -107 -121 -20 -28 -36 -43 -90 105 142 55 49 28 -1 63 49 145 -45 47 41 296
4657 296 26 -77 -81 -5 46 119 178 -20 130 -22 -102 -86 -120 -67 0 -82 -38 -171 52 -151 -34 77 -94 179
4681 179 90 40 164 85 71 -150 203 10 -2 44 52 40 -34 -127 -107 -141 -163 -28 50 -61 41 49 0 308 15 240
4707 240 121 62 -64 111 131 -4 173 65 -89 76 121 -106 -109 -95 58 91 127 -18 50 58 -80 -124 -63 -117 -129
4732 -129 183 56 23 -24 31 98 180 -87 -127 223 -12 40 -92 -63 -138 125 54 80 73 61 -114 53 174 44 -234
$$ packed form
4552B8j19J25j05n6J42lN7q9nj15K29j38q8q9R4K7J01lR9j48J63l7j42K15j07
4577C6j2L5Ok7m2P4m1mJ77j68m8p5j77L10j08M9L5j04J49o1J66j86l8P3K22k28
4603A3K1l3l9M4j3j01O0j45J48j35K98j98O8j92L24j32j43q0J36N2P8Q4LN5k80
4628a07J25J43j9j73R4n7K6j3Q1k07j4J01qqpm7J95L7q7ok1k9O4j4R6j90R2oK55
4657B96k70j03mP6N1P3N9j98J50j52q0J6l4N3O7q2M4j33K23k03J17J11j71K73
4681A79q9n0J24p9j4k21L53j93j2M6Qj2p4r3K0l4k2J35P8j11J02Qm9L08k93K25
4707B40j19n9j26J75K0j35J77j08j54J65M5k27lJ4J53L3L6j45O8Qj38m4O1n4j2
4732a29L12j27l3m7N5O7Q2k67m0L50k35N2j32K9p5K63p1K6pj2j75J67J21j30k78
$$ plain form
4757 -234 47 71 38 53 176 89 100 -112 82 124 -11 20 -31 245 8 56 -22 -85 143 -36 -30 -129 -128 63 194
4782 194 -199 -5 -100 22 -14 130 -7 -112 48 76 170 42 63 -43 -24 26 92 110 89 -44 186 14 2 -36
4806 -36 -38 -216 -106 30 20 -146 -135 76 157 75 -39 -20 29 31 162 -35 -38 -149 163 82 -152 119 32 -27 -45 52
4832 52 65 -28 23 -48 -103 -3 -263 -38 -164 -31 -124 35 -104 -19 -27 7 261 230 34 7 61 66 -138 100 -47
4857 -47 -111 64 -126 -342 -111 -102 1 57 -223 -175 162 28 25 82 67 -17 65 202 105 140 43 79 177 -103 134 187
4883 187 -96 158 195 -48 15 -132 110 -1 -92 -23 20 39 66 -120 -129 25 18 6 108 42 -47 158 67 4 147
4908 147 -26 -88 -151 -202 40 -114 151 -70 -78 9 122 -82 -194 243 23 -26 -30 -118 -39 44 111 111 -41 -107 -8 16
4934 16 146 -67 -24 -132 108 169 155 -79 -156 106 166 66 135 28 -42 22 156 101 -136 101 22 -2 143 10
$$ packed form
4757b34K81K4l3J5J23q7J1k12J94M2j35L1n1K76k37M8p8o3K28j79Or9JJ91J31
4782A94l93J94r5J22l6J44j37j05J60K8R4j28K1j06J9N0O6J8k1j33K30j72j2l8
4806c6kj78J10J36j0j66J1K11Q1q2j14J9M9KJ31j97lj11L12q1k34K71q7n9j8R7
4832E2J3r3N1p1n5J00k60K25j26J33r3J59j39Q5qL4K54l1j96k7N4Nk04K38j47
4857d7o4J75j90k16K31RJ03N6k80M8L37j34lN7j5q4Q2J37r7L5r7L6R8k80K37N3
4883A87k83K54L7k43O3j47K42j11r1O9M3J9K7j86rJ54pj2J02o6q9K05r1o3J43
4908A47j73o2o3n1K42j54K65k21qQ7J13k04j12M37k20m9mq8P9Q3O7%j52o6R9K4
4934A6J30k13M3j08K40O1j4k34p7K62O0j00O9j07p0O4J34n5k37K37p9k4J45j33
$$ plain form
4958 10 127 -41 -30 52 -76 -146 -230 -180 16 116 -21 136 51 -70 17 53 77 1 233 22 71 69 -165 62 82
4983 82 11 -96 -134 -92 -96 19 4 22 -44 115 105 6 -90 26 -162 -49 35 43 41 20 -76 41 146 -3 33 -141 9
5010 9 51 16 148 -31 63 -31 1 100 97 -74 53 104 -99 36 23 -35 -198 66 3 34 -88 -73 128 -7 -10 -67
5036 -67 -38 201 60 68 108 -51 2 69 9 78 -109 58 -53 68 45 -115 -63 -62 7 64 -114 -169 -14 81 94 -23
5062 -23 -209 -101 50 192 -125 24 63 215 73 -42 135 -110 125 -149 87 -37 -196 -190 -34 -9 10 -155
5084 -155 -236 -104 -64 -207 40 135 -114 34 36 124 53 53 136 95 -3 -56 -64 -155 123 33 56 -9 -174 -36 -26 41 -62
5111 -62 -22 -116 -18 75 -60 -80 -96 48 -60 63 125 84 87 14 -105 95 61 134 62 101 12 -286 117 100 78 115 -71
5138 -71 -125 -103 -5 107 -147 -67 26 96 -115 -40 180 -72 100 -102 -9 -47 -192 -63 58 120 5 -18 -178 -133
$$ packed form
4958A0J17j68J1Q2j28p0q4N0J96J00j37J57q5j21Q7L6K4p6K32k11M9kk34K27K0
4983H2p1j07l8M2mJ15j5J8o6J59j0r9r6J16j88J13Q4Qkk1r6J17J05j49L6j74J50
5010IM2l5J32j79R4r4L2R9lj71J27N1k03J35j3n8j63K64o3L1j22J5K01j35ln7
5036f7K9K39j41QM0j59N3O7o0O9j87J67j11J21k3j60N2JO9N7j78n5J55R5J3j17
5062b3j86J08J51J42l17J49L9J52j42j15J77k45K35k74K36j24j59OJ56K5J9j65
5084a55q1J32M0j43K47R5k49J48KQ8p1%Q3m1r8n3qr1K78r0K3o5j65J38J0O7j03
5111f2M0r4R8R3j35k0j6J44j08J23O2m1Lp3j19K00l4P3p2L9q9k98M03j7k2L7j86
5138g1n4K2R8J12k54Q0R3P0k11P5K20k52J72k02R3l8j45J29J21O2j15k3j60M5
$$ plain form
5162 -133 -90 88 -65 -94 -35 43 -36 63 22 -25 49 10 1 -14 -261 -2 -36 18 -109 60 -90 8 41 -138 -123 4
5188 4 -124 -131 109 -6 -44 -10 63 196 4 99 -122 2 286 -42 100 -119 -68 47 -37 233 24 172 -74
5211 -74 -124 -40 32 -21 163 6 141 190 32 86 16 -37 21 -22 -84 -30 44 12 -76 7 18 -108 23 -45 73 144 117
5238 117 7 -84 127 -173 2 68 75 118 11 6 25 -140 43 96 -101 -47 -98 145 24 -144 -42 228 101 23
5262 23 165 133 60 158 143 159 53 94 148 -137 170 27 -137 6 -54 -65 -136 -32 -175 18 98 39 -187 -12
5286 -12 41 134 17 17 -33 -17 27 131 -17 -27 -109 -56 94 29 -82 226 2 66 0 94 -42 45 122 -8 69 100
5312 100 -14 48 108 261 -71 81 60 -121 -24 41 83 -2 -167 2 5 -109 -21 -197 215 54 93 -19 74 123
5336 123 16 -5 46 -28 38 50 84 63 -190 35 177 104 -51 -66 -40 -113 117 126 27 -139 -108 -105 27 76 -150 1
$$ packed form
5162a33M3J78j53k9N9P8p9R9m1m7P4l9rj5k47K59l4N4j27J69j50R8L3j79J5J27
5188Dj28pK40j15l8L4P3J33j92R5k21J24K84l28J42k19N1J15q4K70k09J48k46
5211g4n0Q4P2n3J84j57J35M9j58N4p0n3N8m3o2N4P4l2q8Q3J1j26J31o8J18P1k7
5238A17j10r1K11l00J75O6PM3j07nJ9j65J83N3j97N4n1K43j21j68J02K70j27p8
5262B3J42l2p3R8j5J6j06M1N4k85L07j43j64J43o0j1p1J04j43J93Q0n9k26J75
5286a2N3R3j17%n0J6M4J04j48j0q2N3J50o5j11L08k24O4o6R4j36Q7P7j30P7L1
5312A00j14O2O0J53l32J52k1j81R7O5M2q5j65J69Lj14Q8j76M12j61L9j12R3M9
5336A23j07k1N1p4O6J2L4k1k53K25J42p3j55j5K6p3K30Rr9j66L1LJ32M9k26J51
$$ plain form
5362 1 -77 86 -61 73 -46 153 19 278 90 49 8 24 71 -56 12 146 34 42 44 -29 -46 84 95 20 43 -74
5388 -74 -93 -91 -130 12 -157 -15 -52 23 69 52 -49 -22 101 -36 229 107 105 -85 57 -57 23 159 -8 -42 37
5413 37 149 -1 -12 58 26 -26 -17 -5 -70 48 82 18 -59 121 -10 -21 -25 -32 -37 -35 -30 -150 47 46 -122 50 83 -97 49
5442 49 -117 -96 79 2 -84 29 -73 -75 -47 40 89 161 -71 -214 94 119 142 -81 156 33 45 62 112 111 -106 140
5468 140 -108 22 125 59 84 126 -21 -12 -55 70 -32 -35 59 1 31 63 37 -34 19 -95 -87 91 131 44 344 -119
5494 -119 36 -110 28 -149 -163 77 -91 69 -174 78 39 92 107 4 -100 -119 128 82 55 243 -82 168
5516 168 7 38 46 154 -159 -12 67 16 -72 -32 100 -94 185 -167 -7 -124 -134 43 52 -4 337 43 81 53
5540 53 -25 -13 14 -59 -111 -57 -16 -61 -58 -3 -120 -9 -179 32 6 17 185 -77 42 -88 -114 -45 15 -18 -38 -6 -35
$$ packed form
5362Ap8J63j47J34j19J99j34K59j88m1m1J6M7j27O8J34j12QKp3j7J30J1p5K3j17
5388g4j9Kl9J42j69J42l7P5M6j7j01K7J23j37K65j22kj90J42j14Q0J36j67l4P9
5413C7J12j50j1P0l2n2RJ2o5J18L4o4p7J80j31j1mpnKNj20J97jj68J72L3j80J46
5442D9j66K1J75p7q6J13j02kK8Q7M9P2k32j43L08K5K3k23K37j23J2J7N0jk17K46
5468A40k48J30J03o6K5M2j47Rm3J25j02lR4n8L0L2k6p1N3j14QJ78M0q7L00m63
5494a19J55j46J38j77j4K40j68J60k43K52l9N3J5j03j04j9K47m6k7J88l25K50
5516A68j61L1QJ08l13J47P9n1q8M0J32j94K79l52J60j17j0J77Rn6L41k94L8k8
5540E3p8J2K7p3n2N4M1m5LN5j17J11j70K11k6J1J68k62J19j30k6O9O0l3k0L2k9
$$ plain form
5567 -35 -113 -19 -29 -100 55 9 90 28 -69 51 33 68 -4 26 27 179 4 -33 111 101 7 122 -28 -105 -48 172 83
5594 83 -62 -133 -107 -126 6 106 57 -98 -13 -4 142 212 -63 -41 -86 -65 45 -151 68 -45 -57 -24 65 -87 -96 165
5620 165 133 30 -199 -8 21 129 132 -138 161 46 23 -101 66 129 -201 -147 14 127 7 212 -71 1 -163
5643 -163 -135 81 172 -105 124 44 1 -123 -284 97 60 -76 296 55 -45 14 136 170 117 -165 84 -33 -164
5666 -164 219 10 -69 -60 170 -76 84 -7 -21 70 109 98 97 -66 -54 -12 -201 84 -142 -16 16 6 79 -25 0
5691 0 187 2 -37 -155 31 -173 -211 -68 2 45 29 -8 13 -108 -137 119 -9 44 -142 74 -109 1 -140 -65
5715 -65 -189 -109 -117 164 39 47 57 -40 30 2 43 78 134 53 86 156 46 98 -155 39 86 -5 -70 -113 1 170 -7
5742 -7 25 64 -102 -38 120 179 95 81 -265 75 -36 4 -176 -64 197 7 -215 97 73 -79 -156 -40 148 -53
$$ packed form
5567c5p8R4j0p1J55m6Q1o2r7J20j8L5p2L0JJ52j75l7J44j0r4J15j50p7N7K20q9
5594H3j45p1K6j9J32J00m9j55Q5RJ46P0k75K2m5K1J10j96K19j13j2L3Q9j52rK61
5620A65l2j03k29J91K9J08Lk70K99j15k3j24J67O3l30N4J61J13j20K05k83P2j64
5643a63K8K16R1k77K29q0m3j24j61L81l7j36L72k41j00N9J22L4n3k82K49j17j31
5666a64L83k09p9RK30k46J60r1j4R1L9j1jj63J2M2j89K85k26J26L2j0P3j04K5
5691@J87j85l9j18J86k04l8J43P0M3j6l7K1j21k9K56j28N3j86K16j83J10j41P5
5715f5j24Q0qK81j25QJ0r7P0k8M1L5N6q1L3P0j10N2k53J94M7r1o5m3J14J69j77
5742gL2L9j66O4J58N9q4j4l46L40j11M0j80J12K61j90k22L12k4j52p7J16J88k01
$$ plain form
5766 -53 122 -78 -47 -8 -48 13 195 -18 238 80 -2 -6 40 179 9 159 59 60 -99 132 -56 -83 -98 -21 -91
5791 -91 136 63 -149 232 110 -159 -47 19 -15 -74 -5 -12 -147 -97 -84 -7 7 39 18 -54 38 -107 15 13 10 56 36
5818 36 -10 -106 95 -98 73 126 -43 -111 48 -208 -147 59 42 52 108 -6 -209 9 -59 -134 149 47 -36 85
5842 85 -124 99 -62 24 -110 63 1 8 94 -74 34 127 97 -107 -87 33 -69 -67 -49 163 91 -93 110 67 16
5867 16 -91 53 165 33 99 -72 -57 13 -17 221 -37 -39 -200 138 95 24 34 -17 -16 -80 179 152 -57 -72 -40 -78
5893 -78 82 -27 145 -234 -60 -99 128 -143 -85 5 -18 159 6 88 -70 -104 92 -52 -133 -45 -82 -13 43 65
5917 65 -79 -247 -45 -68 -31 -15 -77 -87 3 -69 22 75 -243 155 192 10 18 -101 170 240 -44 72 102 104 21 -76
5943 -76 -95 125 91 77 -123 1 20 -218 29 -118 96 -225 -14 -14 -57 -85 115 74 -33 79 -52 67 8 11
$$ packed form
5766e3J75k00L1L9m0O1J82k13K56j58q2mM6J39j70J50j00Jj59K31j88k7j5P7p0
5791i1K27p3k12L81j22k69J12O6l4n9O9pj35N0J3P7J4L2k1p2R2j45J22klM6k0
5818C6m6r6K01j93J71N3j69o8J59k56O1K06j7J0N6j14k03K18o8p5K83j02q3J21
5842H5k09K23j61Q6j34J73o2PQ6j68J08R3l0k04K0J20j02KJ8K12p2j84K03m3n1
5867A6j07J44J12j32O6j71J5P0l0K38k58kj61L38m3p1J0n1Jo4K59k7k09j5L2l8
5893g8J60j09J72l79J74l9K27k71N8R0k3J77j53Q2j58l4J96j44q1Q8l7O9N6K2
5917F5j44j68K02k3L7J6o2j0R0p2R1N3l18L98L7j82Qj19K71P0k84J16L0Kq3r7
5943g6j9K20l4j4k00J24J9k38K47j47K14l21K11%m3k8K00m1j07J12j31J19n9L
$$ plain form
5967 11 -72 -3 51 11 25 127 71 72 -60 -84 80 -40 -77 3 53 59 -13 157 128 -32 -133 -41 26 -22 -132 -1 -62
5994 -62 -45 47 100 13 84 -16 151 79 -3 -43 82 76 83 60 -43 -52 146 -81 20 193 -67 49 49 -83 -111 219
6020 219 51 40 -32 -95 -63 -91 45 -152 82 112 -141 281 134 78 -29 94 -86 -47 -79 51 -127 121 123 166
6044 166 0 29 -104 31 -124 98 -151 107 -2 50 64 9 31 -4 -20 -59 26 91 167 -9 216 -136 84 199
6068 199 66 -135 5 12 -51 -28 154 -106 144 51 116 -3 2 -88 -165 -51 132 24 -187 -28 268 52 -76
6091 -76 41 -48 -67 102 24 -68 -19 105 -30 110 -7 -166 5 -103 -29 -53 134 97 -38 129 120 -87 98 117
6115 117 -34 111 78 -122 70 49 146 50 -148 110 -44 -15 -63 -40 98 64 -37 -4 30 13 213 20 -57 -18
6139 -18 -46 -53 -135 -141 94 -86 77 31 102 11 -7 -24 -39 87 84 -13 -81 -52 100 -172 112 -62 -157 14 54 71 -29
$$ packed form
5967A1q3O9N4m0J4J02n6Jj32k4J64j20l7Q0N0Op2J70k9j60j01R2O7m8j10J31o1
5994f2J7R2N3q7P1j00J67p2q2m0J25oPk3j03rJ98k27J01J73k60J16%j32k8L30
6020B19j68j1p2o3L2k8J36j97K34L0k53M22j47n6j07J23j80L9l2J30j78K48KM3
6044A66j66K9j33J35j55K22k49K58j09N2J4n5K2l5j6l9Q5O5P6j76K25l52K20J15
6068A99j33k01J40Po3K3J82k60K50r3O5j19Nr0p7J14J83j08k11J59K96k16j28
6091g6J17q9j9J69p8r2M9J24j35J40j17j59J71j08P4k4J87l7j35J67rk07J85J9
6115A17j51J45l3k00J92k1R7r6j98K58j54K9m8K3J38l4j01L3L4j7K00j93p7L9
6139a8k8pq2oK35j80J63m6P1r1j8j7j5J26lr7o8K9J52k72K84j74r5J71M0J7j00
$$ plain form
6166 -29 -118 49 -68 -116 -47 103 -58 -44 -98 -84 35 75 -82 -101 -194 -44 186 34 -38 -121 218 155 69 6 -56
6191 -56 -82 60 -62 -82 -123 -23 70 -77 -53 40 19 -276 25 -87 77 -30 -109 24 -63 5 -93 58 -60 171
$$ packed form
6166b9q9J67j17m8O9J50j61J4n4J4J19M0j57j9r3J50K30j52p2q3L39o3q6o3o2
6191e6k6J42j22k0m1J00R3j47K4R3k1k95L01j12J64j07p9J33q7O8r8J51j18K31
$$ [...]
8191E4
##END NTUPLES=NMR FID
##END=
