##TITLE=1H ikalashn
LR-792-C1M
14.11.2024
##JCAMPDX= 6.0         $$ Bruker NMR JCAMP-DX V2.0
##DATA TYPE= NMR FID
##DATA CLASS= NTUPLES
##ORIGIN= UXNMR, Bruker Analytische Messtechnik GmbH
##OWNER= root
$$ TOPSPIN		Version 1.3
$$ 2024-11-14 13:49:20.375 +0400  Irina@DPX200
$$ Compression mode = diff/dup
##.OBSERVE FREQUENCY= 200.131300845
##.OBSERVE NUCLEUS= ^1H
##.DELAY= (6, 6)
##.ACQUISITION MODE= SIMULTANEOUS
##.ACQUISITION SCHEME= undefined
##.AVERAGES= 32
##.DIGITISER RES= 18
##SPECTROMETER/DATA SYSTEM= spect
##.PULSE SEQUENCE= zg
##.SOLVENT NAME= CDCl3
##.SHIFT REFERENCE= INTERNAL, CDCl3, 1, 17.49637
##AUDIT TRAIL= $$ (NUMBER, WHEN, WHO, WHERE, WHAT)
$$ ##TITLE= Audit trail, TOPSPIN		Version 1.3
$$ ##JCAMPDX= 5.01
$$ ##ORIGIN= Bruker BioSpin GmbH
$$ ##OWNER= Irina
$$ $$ F:/spectra/data/iren/nmr/1H/4/audita.txt
$$ ##AUDIT TRAIL=  $$ (NUMBER, WHEN, WHO, WHERE, VERSION, WHAT)
(   1,<2024-11-14 13:49:01.265 +0400>,<Irina>,<DPX200>,<TOPSPIN 1.3>,
      <created by zg
	started at 2024-11-14 13:46:48.906 +0400,
	POWCHK disabled, PULCHK disabled
       configuration hash MD5:
       BE 6D 3F 07 2A EA 11 49 91 17 2B D3 AF B3 58 0D
       data hash MD5: 16K
       73 0E 6D 70 57 47 1E 3F 05 2A 84 27 B0 7A 87 24>)
$$ ##END=
$$ 
$$ $$ hash MD5
$$ $$ 37 B9 09 89 0D 8D A1 58 3B 9F CE 4C 91 5F C5 45
##$RELAX= 
##$RELAX= 
##$RELAX= 
##$RELAX= 
##$RELAX= 
##$RELAX= 
##$RELAX= 
##$RELAX= 
##$RELAX= 
$$ Bruker specific parameters
$$ --------------------------
##$DU= <F:/spectra>
##$EXPNO= 4
##$NAME= <1H>
##$PROCNO= 1
##$TYPE= <nmr>
##$USER= <iren>
##$AMP= (0..31)
100 100 100 100 100 100 100 100 100 100 100 100 100 100 100 100 100 100 
100 100 100 100 100 100 100 100 100 100 100 100 100 100 
##$ANAVPT= -1
##$AQSEQ= 0
##$AQ_mod= 1
##$AUNM= <au_zg>
##$AUTOPOS= <>
##$BF1= 200.13
##$BF2= 200.13
##$BF3= 200.13
##$BF4= 200.13
##$BF5= 200.13
##$BF6= 200.13
##$BF7= 200.13
##$BF8= 200.13
##$BYTORDA= 1
##$CFDGTYP= 0
##$CFRGTYP= 5
##$CHEMSTR= <none>
##$CNST= (0..63)
1 1 145 1 1 1 1 1 1 1 1 1 1 1 1 1 1 1 1 1 1 1 1 1 1 1 1 1 1 1 1 1 1 1 
1 1 1 1 1 1 1 1 1 1 1 1 1 1 1 1 1 1 1 1 1 1 1 1 1 1 1 1 1 1 
##$CPDPRG= <>
##$CPDPRG1= <>
##$CPDPRG2= <>
##$CPDPRG3= <>
##$CPDPRG4= <mlev>
##$CPDPRG5= <mlev>
##$CPDPRG6= <mlev>
##$CPDPRG7= <mlev>
##$CPDPRG8= <mlev>
##$CPDPRGB= <>
##$CPDPRGT= <>
##$D= (0..63)
0 2 0 0 0 0 0 0 0 0.06 0 0.03 0 0 0 0 0.0002 0 0 0 0 0 0 0 0 0 0 0 0 0 
0 0 0 0 0 0 0 0 0 0 0 0 0 0 0 0 0 0 0 0 0 0 0 0 0 0 0 0 0 0 0 0 0 0 
##$DATE= 1731577736
##$DBL= (0..7)
120 120 120 120 120 120 120 120 
##$DBP= (0..7)
150 150 150 150 150 150 150 150 
##$DBP07= 0
##$DBPNAM0= <>
##$DBPNAM1= <>
##$DBPNAM2= <>
##$DBPNAM3= <>
##$DBPNAM4= <>
##$DBPNAM5= <>
##$DBPNAM6= <>
##$DBPNAM7= <>
##$DBPOAL= (0..7)
0.5 0.5 0.5 0.5 0.5 0.5 0.5 0.5 
##$DBPOFFS= (0..7)
0 0 0 0 0 0 0 0 
##$DE= 6
##$DECBNUC= <off>
##$DECIM= 32
##$DECNUC= <off>
##$DECSTAT= 4
##$DIGMOD= 1
##$DIGTYP= 9
##$DL= (0..7)
0 120 120 120 120 120 120 120 
##$DP= (0..7)
150 150 150 150 150 150 150 150 
##$DP07= 0
##$DPNAME0= <>
$$ [...]
##$SW= 21.9926040160658
##$SWIBOX= (0..15)
0 0 2 0 0 0 0 0 0 0 0 0 0 0 0 0 
##$SW_h= 4401.40845070422
##$TD= 16384
##$TD0= 1
##$TE= 300
##$TE2= 300
##$TE3= 300
##$TEG= 300
##$TL= (0..7)
0 120 120 120 120 120 120 120 
##$TP= (0..7)
150 150 150 150 150 150 150 150 
##$TP07= 0
##$TPNAME0= <>
##$TPNAME1= <>
##$TPNAME2= <>
##$TPNAME3= <>
##$TPNAME4= <>
##$TPNAME5= <>
##$TPNAME6= <>
##$TPNAME7= <>
##$TPOAL= (0..7)
0.5 0.5 0.5 0.5 0.5 0.5 0.5 0.5 
##$TPOFFS= (0..7)
0 0 0 0 0 0 0 0 
##$TUNHIN= 0
##$TUNHOUT= 0
##$TUNXOUT= 0
##$USERA1= <user>
##$USERA2= <user>
##$USERA3= <user>
##$USERA4= <user>
##$USERA5= <user>
##$V9= 5
##$VALIST= <valist>
##$VCLIST= <CCCCCCCCCCCCCCC>
##$VD= 0
##$VDLIST= <DDDDDDDDDDDDDDD>
##$VPLIST= <PPPPPPPPPPPPPPP>
##$VTLIST= <TTTTTTTTTTTTTTT>
##$WBST= 1024
##$WBSW= 25
##$XGAIN= (0..3)
0 0 0 0 
##$XL= 0
##$YL= 0
##$YMAX_a= 2038151
##$YMIN_a= -1050318
##$ZGOPTNS= <>
##$ZL1= 120
##$ZL2= 120
##$ZL3= 120
##$ZL4= 120
##$ABSF1= 10
##$ABSF2= 0
##$ABSG= 5
##$ABSL= 3
##$ALPHA= 0
##$AQORDER= 0
##$ASSFAC= 0
##$ASSFACI= 0
##$ASSFACX= 0
##$ASSWID= 0
##$AUNMP= <proc_1d>
##$AXLEFT= 0
##$AXRIGHT= 0
##$AXTYPE= 0
##$AXUNIT= <>
##$AZFE= 0.1
##$AZFW= 0.1
##$BCFW= 1
##$BC_mod= 2
##$BYTORDP= 1
##$COROFFS= 0
##$CY= 7568.61572265625
##$DATMOD= 1
##$DC= 2
##$DFILT= <>
##$DTYPP= 0
##$F1P= 17.9538593292236
##$F2P= -4.03888763876832
##$FCOR= 0.5
##$FTSIZE= 32768
##$FT_mod= 4
##$GAMMA= 1
##$GB= 1
##$INTBC= 1
##$INTSCL= 1
##$ISEN= 128
##$LB= 0.02
##$LEV0= 0
##$LPBIN= 0
##$MAXI= 945.577
##$MC2= 0
##$MEAN= 0
##$ME_mod= 0
##$MI= -402.1523
##$NCOEF= 0
##$NC_proc= 0
##$NLEV= 6
##$NOISF1= 8.587773
##$NOISF2= 6.764455
##$NSP= 1
##$NTH_PI= 0
##$NZP= 0
##$OFFSET= 17.49637
##$PC= 1
##$PHC0= 121.4716
##$PHC1= 2.52035
##$PH_mod= 0
##$PKNL= yes
##$PPARMOD= 0
##$PPDIAG= 0
##$PPIPTYP= 0
##$PPMPNUM= 100
##$PPRESOL= 1
##$PSCAL= 0
##$PSIGN= 0
##$REVERSE= no
##$SF= 200.13
##$SI= 32768
##$SIGF1= 18.5376
##$SIGF2= -6.396296
##$SINO= 400
##$SIOLD= 32768
##$SREGLST= <1H.CDCl3>
##$SSB= 3
##$STSI= 0
##$STSR= 0
##$SW_p= 4401.40845070422
##$SYMM= 0
##$S_DEV= 0
##$TDeff= 0
##$TDoff= 0
##$TI= <>
##$TILT= no
##$TM1= 0
##$TM2= 0
##$TOPLEV= 0
##$USERP1= <user>
##$USERP2= <user>
##$USERP3= <user>
##$USERP4= <user>
##$USERP5= <user>
##$WDW= 1
##$XDIM= 8192
##$YMAX_p= 0
##$YMIN_p= 0
$$ End of Bruker specific parameters
$$ ---------------------------------
##NTUPLES= NMR FID
##VAR_NAME=  TIME,          FID/REAL,        FID/IMAG
##SYMBOL=    X,             R,               I
##VAR_TYPE=  INDEPENDENT,   DEPENDENT,       DEPENDENT
##VAR_FORM=  AFFN,          ASDF,            ASDF
##VAR_DIM=   8192,          8192,            8192
##UNITS=     SECONDS,       ARBITRARY UNITS, ARBITRARY UNITS
##FACTOR=    0.0002272,     1,               1
##FIRST=     0,             0,               0
##LAST=      1.8609952,     -84,             -270
##MIN=       0,             -1050318,        -1050318
##MAX=       1.8609952,     2038151,         2038151
$$ Real data points
##PAGE= N=1
##DATA TABLE= (X++(R..R)), XYDATA
0@%%%%%%%%%%%l2O4o4O4r6J28j28J60k23K55k88L52m16M82n78O75p73R00j042
$$ 0 0 0 0 0 0 0 0 0 0 0 0 -32 32 -32 32 -64 64 -64 96 -127 128 -160 192 -224 258 -320 355 -418 482 -560
30e60J202j376J567j776K014k272K556k870L207l580L988m441M936n470O056o696
$$ -560 642 -734 833 -943 1071 -1201 1355 -1515 1692 -1888 2100 -2341 2595 -2875 3181 -3515
46c515P392q158Q996r907J0913j2026J3256j4616J6131j7837J9767k1966K4504
$$ -3515 3877 -4281 4715 -5192 5721 -6305 6951 -7665 8466 -9371 10396 -11570 12934
59A2934k7464L0975l5226M0483m7190N6095o8560Q7421j19661J89651o14546M68034
$$ 12934 -14530 16445 -18781 21702 -25488 30607 -37953 49468 -70193 119458 -495088 -27054
71b7054N38455j275815j97495O90966J66919p14325M4823O89782K98386l15827
$$ -27054 511401 -764414 -961909 -270943 -104024 -818349 -773526 -83744 214642 -101185
81a01185J06194M11733m9374m72824K14922P81639J78664o17183j29632M72917
$$ -101185 5009 416742 367368 -105456 109466 891105 1069769 452586 322954 795871
91G95871j05170p87398j58399M71637r1566o72618j42058L39728K655k57414P0418
$$ 795871 690701 -96697 -255096 216541 124975 -547643 -689701 -349973 -347318 -604732 -534314
102e34314J99831J81O3609L07320J26451k30485q7185M30943M55759j59540n01252
$$ -534314 -334483 -334302 -270693 36627 163078 -67407 -154592 276351 732110 572570 71318
113G1318n7374L21099k1364l22846K1863K19376j57014k44218J56702Q9689l89660
$$ 71318 13944 335043 313679 -9167 12696 232072 75058 -169160 -12458 77231 -312429
124c12429k17285L98682L26879k37961k72805J07482J15899j53386q4210K85997
$$ -312429 -529714 -131032 195847 -42114 -314919 -207437 -91538 -244924 -329134 -43137
134d3137L88761N4635k19001m6486J80329P187j85223K8320J69294j42710l34359
$$ -43137 345624 400259 181258 134772 315101 322288 137065 165385 334679 191969 -142390
145a42390q8196K1088j57391o8353K23741J43286j43021r7593J37815J63581M6127
$$ -142390 -230586 -209498 -366889 -435242 -211501 -68215 -211236 -308829 -171014 -7433 38694
156C8694j0138J4142Q7564J02102k0869r4053m993K4964m1546L5757J46670L261
$$ 38694 28556 42698 130262 232364 211495 117442 112449 137413 95867 131624 278294 281555
168B81555j86531j24946k1714n2676j9445P7012J6838r6976q6045o7635o5520
$$ 281555 95024 -29922 -51636 -104312 -123757 -46745 -29907 -126883 -212928 -280563 -346083
179c46083O3639J77850R3994N822M1073Q047o0869M3979J62158P1384l1658r32
$$ -346083 -282444 -104594 -10600 -4778 36295 44342 -16527 27452 189610 260994 229336 228404
191B28404k4144j11449p5536L64k1868l6231J148j6439l5295Q878j1264n9787
$$ 228404 204260 92811 17275 17639 -4229 -40460 -39312 -55751 -91046 -82168 -93432 -153219
203a53219L1683J27561M0552l1860L1300j196j18691m1195J18446P4713k4113
$$ -153219 -121536 6025 46577 14717 46017 44821 -73870 -115065 3381 78094 53981
214E3981J9086K3671q2562q0117L4081P0770L8102P758n5349r3915m6515j9244
$$ 53981 73067 96738 14176 -65941 -31860 38910 77012 84770 29421 -64494 -111009 -130253
226a30253k0321O2472J11823j614o7034L7913O1222m0891J726J27660O0906p0875
$$ -130253 -150574 -88102 23721 22107 -44927 -7014 54208 13317 15043 142703 203609 132734
238A32734l6306P644p0190q7316l75K7420j339n651k9043n7836k4867J595l678
$$ 132734 96428 104072 33882 -53434 -53809 -26389 -27728 -33379 -62422 -120258 -145125 -143530 -147208
251a47208O0181J11158J5014o6825K635L5288l6111O508J25382P1033n7964l4748
$$ -147208 -87027 24131 39145 -27680 -25045 10243 -25868 -19360 106022 177055 119091 84343
263H4343J4297l9962m2787M3368M9157j5468l6638n2902q0510m5264j403j1174
$$ 84343 98640 58678 15891 59259 108416 92948 56310 3408 -77102 -122366 -123769 -134943
275a34943J4856N8278l421o7829L996O2451J1028K6759J15772P1714m2322k9553
$$ -134943 -120087 -61809 -65230 -133059 -129063 -66612 -55584 -28825 86947 158661 116339 86786
287H6786J3101l0063k8955M2847L0189l6490l6747l6449o6772k9727L2830J4015
$$ 86786 99887 69824 40869 83716 113905 77415 40668 4219 -62553 -92280 -59450 -45435
299d5435k952K9892l923p0269k8396L6944J2759J4247P6176M6659l7665j9903
$$ -45435 -48387 -18495 -22418 -92687 -121083 -84139 -71380 -57133 19043 65702 28037 8134
311H134K6181J37R746P1537M1253l7381l7471k9651o7174m1505K9278J2970k8964
$$ 8134 34315 34452 44198 115735 156988 119607 82136 52485 -14689 -56194 -26916 -13946 -42910
324d2910q028j6466o4063k4384N3124M2682K2695N6073L2786l5972j6791L3459
$$ -42910 -50938 -67404 -131467 -155851 -102727 -60045 -37350 18723 51509 15537 -1254 32205
336C2205J2833R705N2012K3348m4776l2524q933m3379k4073M2980K1709l7819
$$ 32205 45038 54743 106755 130103 85327 52803 43870 491 -23582 19398 41107 3288
348C288k1157j2856o1097m1010L4033L3824M524K6205J6147l5718j5079M2525
$$ 3288 -17869 -30725 -91822 -132832 -98799 -64975 -60451 -34246 -18099 -53817 -68896 -26371
360b6371L2899L1177O8656L3812m3905l1009N520k3082k0480L8233J8650n5158
$$ -26371 6528 37705 106361 140173 96268 65259 70779 47697 27217 65450 84100 28942
372B8942m9677k2184m4602k6497L8170L2650o532Q344N505l7619j0813N0549L4718
$$ 28942 -20735 -42919 -87521 -114018 -75848 -43198 -49730 -41386 -35881 -73500 -84313 -33764 954
385I54J1325M3473K7789l8782k9388K3128P811k494L7504K4041m1370m2548j8320
$$ 954 12279 55752 83541 44759 15371 38499 46310 43816 81320 105361 63991 21443 3123
398C123l8389k4871L2282K0778k7178j5162p511m4024k0570N2202N0184J4124
$$ 3123 -35266 -60137 -27855 -7077 -34255 -49417 -56928 -100952 -121522 -69320 -19136 -5012
410e012K9827K2874l1011k2590L2851K7737P364L1758J2221m9109m4581o759k0261
$$ -5012 24815 47689 16678 -5912 26939 54676 62040 93798 106019 56910 12329 5570 -14691
423a4691j7034L0664K0736l4198k6438m381l1303j8795M3123M1645k8J0281J1826
$$ -14691 -31725 -1061 19675 -14523 -40961 -45342 -76645 -95440 -52317 -10672 -10700 -419 11407
436A1407l1730k1123L8697L4325O992K8925K1913l8235l9153N886O51p728K5560
$$ 11407 -20323 -41446 -2749 31576 38568 67493 89406 51171 12018 17904 18555 10827 36387
449C6387J3742m1814m0278j0244k4514j5033L8452L2786j3058l122J1287k2338
$$ 36387 50129 8315 -31963 -42207 -66721 -81754 -43302 -10516 -23574 -26696 -15409 -37747
461c7747j4374M4746M5498P112J5188J2386l5531l5356J1995J0075l966K2718
$$ -37747 -52121 -7375 38123 45235 60423 72809 37278 1922 13917 23992 20026 42744
473D2744J2296m5673m4842j364o590j2267K9745L0696j7613k0596j3j4914r194
$$ 42744 55040 9367 -35475 -36839 -43429 -55696 -25951 4745 -12868 -33464 -33477 -48391 -57585
486e7585L6720L5876N731J3992J0125l2082j9272L5328K2697j3357J5329K2569
$$ -57585 -20865 15011 20742 34734 44859 12777 -6495 28833 51530 38173 53502 76071
498G6071m1554n6916k356R744j0719P682J7715j8290l0642j2964q731J1219M4091
$$ 76071 34517 -22399 -24755 -15011 -25730 -18048 -333 -18623 -49265 -62229 -70960 -59741 -15650
511a5650K6097p855R990J2320l3683j9454N1215L9340j9164k805K3123k6580n0306
$$ -15650 10447 2592 12582 24902 -8781 -28235 22980 62320 43156 40351 63474 36894 -13412
524a3412K801K5013j298J032R730j7842l2137j6929j2656L624L3150J8144j7048
$$ -13412 -10611 14402 13104 14136 23866 6024 -26113 -43042 -55698 -52074 -18924 -780 -17828
537a7828k449R151k6226j3768N1365M4948j1822k384K0228k5244m1259J9906L7462
$$ -17828 -20277 -11126 -37352 -51120 245 45193 33371 30987 51215 25971 -15288 4618 42080
550D2080r328j3278R422j5753l9973j4075J1929J4876J6162J104j6410k691L15
$$ 42080 32752 19474 28896 13143 -26830 -40905 -28976 -14100 2062 3166 -13244 -15935 -15620
563a5620k6363m436N2972K9431l0087l720L1703k3616n0272K6021N9047l227k6561
$$ -15620 -41983 -46419 6553 35984 5897 2177 33880 10264 -40008 -13987 45060 41833 15272
576A5272Q234k541l7887k0542J6833K7227J4627j3099k7216m129N847k1358m562
$$ 15272 23506 20965 -16922 -37464 -20631 6596 21223 8124 -19092 -23221 -17374 -38732 -43294
589d3294N3433L3614l7802k0437L1110m087l7353J9797N2590l305k9121L65n389
$$ -43294 10139 43753 5951 -14486 16624 12537 -24816 -5019 47571 44266 15145 15510 10121
602A0121k8562q391J8553J4191Q628l07k3435j9731O30l696K524L6611K4200k8015
$$ 10121 -18441 -26832 -8279 5912 14540 14233 -9202 -28933 -28303 -31999 -29475 7136 31336 3321
616C321k2865J1762o331j4965L5842M4340j6807k7212J1610k106l1128L853L3515
$$ 3321 -19544 -7782 -14113 -29078 6764 51104 34297 7085 18695 16589 -14539 -10686 22829
629B2829M592j6147o400j0399j6509j817K703N677K3782J1976k6041j8731J3190
$$ 22829 27421 11274 4874 -5525 -22034 -23851 -21148 -15471 8311 20287 -5754 -24485 -11295
642a1295m615j7564K8970M3095j2674l0276L121k954j9202J4856L6283L001j3273
$$ -11295 -15910 -33474 -4504 38591 25917 -4359 -1238 -4192 -23394 -8538 27745 30746 17473
655A7473l588j9560k4476J3743K7204J206L11P748j5677k4265K932R638k043J3687
$$ 17473 13885 -5675 -30151 -16408 10796 12002 12313 20061 4384 -19881 -16949 -7311 -9354 4333
669D333J7606j2972j5418M856j0023j8609K2151L3685j1333j8398R016r866l1262
$$ 4333 21939 8967 -6451 -1595 -11618 -30227 -8076 25609 14276 -4122 4894 -4972 -36234
682c6234O873L5591Q295m083O787j1953k4695M675K2446Q147Q602R309j7264k4624
$$ -36234 -29361 6230 14525 10442 17229 5276 -19419 -14744 7702 15849 24451 33760 16496 -8128
696h128j319J154k430J9777J6407k0139j8329R155r402k4850J5319L2848q214
$$ -8128 -9447 -8293 -10723 9054 25461 5322 -13007 -3852 -13254 -38104 -22785 10063 1849
709A849j6637J5026J28l0259k006L3779J8754K413M389o166j4672m666j896K475
$$ 1849 -14788 238 366 -29893 -31899 1880 20634 23047 27436 21270 6598 1932 36 2511
723B511K3577J5169k6629k6518O143n929k3970J6537L6986j1319l0780L912N870
$$ 2511 26088 41257 14628 -11890 -5747 -11676 -35646 -19109 17877 6558 -24222 -20310 -14440
736a4440j8711L555L1321J2806m866K880m580j1820M513J0690K145J3678J4477
$$ -14440 -33151 -29596 1725 14531 9665 12545 7965 -3855 658 11348 13493 27171 41648
749D1648j7619k5013K381j230j6798J1768K8179j2973l2174j902J69j9973N774
$$ 41648 24029 -984 1397 167 -16631 -4863 23316 10343 -21831 -23733 -23564 -43537 -37763
762c7763L3019R663j0684K188K91j1033P800K2129J0310Q038P274j6606k2744
$$ -37763 -4744 4919 -5765 -3577 -3286 -14319 -6519 15610 25920 33958 41232 24626 1882
775A882M309O330j1147P173K0864j5016l3222j771L546j6681J548K7099L739j8443
$$ 1882 6191 12521 1374 8547 29411 14395 -18827 -20598 -17052 -33733 -32185 -5086 -1347 -19790
789a9790k950J92q809R327K5364J2503N805R974j0261j9092Q421J7460m919K752
$$ -19790 -22740 -22548 -31357 -22030 3334 15837 21642 31616 21355 2263 10684 28144 23225 25977
803B5977J6548j3725l4881p828N609j0562n73J9046k449k2582o131m67p576J0787
$$ 25977 42525 28800 -6081 -13909 -8300 -18862 -19435 -389 -2838 -25420 -31551 -32018 -39594 -28807
817b8807K6103N616k878R322k822j6015R480K4584L053N22J3081p836k7817l746
$$ -28807 -2704 2912 34 9356 6534 -9481 -1 24583 27636 28158 41239 33403 5586 1840
831A840J0109o738j263J3837q101k7923r357J50r769N411K2556K582j0132L572
$$ 1840 11949 5211 3948 17785 9684 -18239 -27596 -27446 -37215 -31804 -9248 -6666 -16798 -13226
845a3226k8j0476J2288K8243O386k696J0788l925k3234o35J7328j020l495Q527
$$ -13226 -13254 -23730 -11442 16801 23187 20491 31279 27354 4120 3485 20813 19793 16298 24825
859B4825p268k5247p953K230p227L608J7144m194j8202O13J644j2130Q416K8865
$$ 24825 17557 -7690 -15643 -13413 -20640 -17032 112 -4082 -22284 -21671 -20027 -32157 -23741 5124
873E124P120q964O596J796j4956L172K0548N607k555O527q871k3516m000Q046
$$ 5124 12244 3280 9876 11672 -3284 -112 20436 26043 23488 30015 21144 -2372 -6372 1674
887A674n860j51J4089o636k4273l323N669p747M821K3629M397j2482K213J815
$$ 1674 -4186 -4337 9752 3116 -21157 -24480 -18811 -26558 -21737 1892 6289 -6193 -3980 -2165
901b165j1331N928K3581N560n195N765m131k1162k355J5372N63k118Q815o149
$$ -2165 -13496 -7568 16013 21573 16378 22143 18012 -3150 -5505 9867 10430 8312 17127 10978
915A0978k4130n664O922n103L340J8825r2j8161q86N024q321M309K4178O245r642
$$ 10978 -13152 -18816 -11894 -16997 -13657 5168 5076 -13085 -13971 -8947 -17268 -12959 11219 17464 7822
930G822J498m10j4554O2J6646K779l545P221n724k2087l372J1670l059n0J5852
$$ 7822 9320 8910 -5644 -5582 11064 13843 10298 17519 11795 -10292 -13664 -1994 -5053 -5103 10749
945A0749n29k1173n314P307n328K818K0141M063j2852j459j04j1103K965K1045
$$ 10749 10220 -10953 -16267 -8960 -14288 -11470 8671 12734 -118 -1577 -1681 -12784 -9819 11226
959A1226L928p839M380k763j9667k170J6418K223l954R924j140k0303m656R642
$$ 11226 15154 7315 11695 8932 -10735 -12905 3513 5736 1782 11706 10566 -9737 -14393 -4751
973d751j830J566J6884J473j6072l130K896r804J459K0247L899j1341J43m92j5108
$$ -4751 -6581 -5015 11869 13342 -2730 -5860 -2964 -12768 -11309 8938 12837 1496 1639 1147 -13961
988a3961j630J7986N413l313P319j977j8551l586J3359J624l49J3372J99j9476
$$ -13961 -15591 2395 7808 4495 11814 9837 -8714 -12300 1059 2683 2334 15706 15905 -3571
1002c571n536O996n259N4J5957L052j3758k754R79j1380m46J8096M485p663N164
$$ -3571 -9107 -2111 -7370 -7316 8641 11693 -2065 -4819 -3840 -15220 -15666 2430 6915 -748 4416
1017D416N15j6578k439J6523M852j976J0511J493j7261o115Q631j857k56J3142
$$ 4416 4931 -11647 -14086 2437 7289 5313 15824 17317 56 -6059 2572 715 459 13601
1031A3601O41j7346o100K706r267n20J7429M800j1629K95K484j1748q37J8316
$$ 13601 14242 -3104 -9204 -6498 -15765 -16285 1144 5944 -5685 -5390 -2906 -14654 -15491 2825
1045B825O082l851O926J597j5059l969J2395J173k394J0269J831j7448p395M449
$$ 2825 8907 5056 11982 13579 -1480 -5449 6946 8119 5725 15994 17825 377 -7018 -2569
1059b569n313l000J3995L325j3881l990J485r382k47J8360O461o644N212L588
$$ -2569 -7882 -10882 3113 6438 -7443 -11433 -9948 -19330 -19577 -1217 5244 -1400 3812 7400
1073G400j2789k367J6836O226l775P468R32j6687p573P233j770l864R718Q37j6282
$$ 7400 -5389 -7756 9080 15306 11531 18999 19931 3244 -4329 2904 1134 -2730 6988 7825 -8457
1088h457n757L233o921p36J6408N751r634R96M020r296j583J7590Q019m268N546
$$ -8457 -14214 -10981 -17902 -18638 -2230 3521 -6113 -5117 -1097 -10393 -11976 5614 13633 9365 14911
1103A4911K842j4233o487J1448J743m100P535J77j7279q589M058m095l278J2471
$$ 14911 17753 3520 -2967 8481 10224 6124 13659 13836 -3443 -12032 -7974 -12069 -15347 -2876
1117b876M168j2064k919M329o482j73J7983Q288n783L516N100j1656m572J4095
$$ -2876 1292 -10772 -13691 -9362 -15844 -16017 1966 10254 4471 7987 13087 1431 -3141 10954
1131A0954O186n832M432J078j6052r250O208j494m071R129K762j4591n846M114
$$ 10954 17140 11308 15740 16818 766 -8484 -2276 -3770 -7841 1288 4050 -10541 -16387 -12273
1145a2273m216q78J6134Q052q712M43N528q326k786J5930Q217n414K771K873j3710
$$ -12273 -16489 -17367 -1233 6819 -1893 -1450 4078 -4248 -7034 8896 17113 11699 14470 17343 3633
1160C633q543R094K256n331N359J271j4340q642M324k840j889J2962N698j0714
$$ 3633 -4910 4184 6440 1109 6468 7739 -6601 -15243 -10919 -13759 -15648 -2686 3012 -7702
1174g702k243O646n493k102J6874R701p278R52N153j0819p188J0520N572n336
$$ -7702 -9945 -3299 -8792 -10894 5980 15681 8403 9355 14508 3689 -3499 7021 12593 7257
1188G257K406J521j4430q637N460J62l371R763L373j2608m421N738l652k199J5173
$$ 7257 9663 11184 -3246 -11883 -6423 -6261 -9632 131 3504 -9104 -13525 -7787 -11439 -13638 1535
1203A535Q696r214p79O731o963n455J3423Q149o070k28K461j1246q149O040K806
$$ 1535 10231 1017 238 6969 6 -5449 7974 16123 10053 9825 12286 1040 -7109 -1069 1737
1218A737l858M768J126j2515n687O152j958k490J3656P772j1289l367P032l950
$$ 1737 -2121 2647 3773 -8742 -14429 -8277 -10235 -12725 931 8703 -2586 -5953 1079 -2871
1232b871n560J2685J0256o477k979L125p397p026Q422N371l480K656J104j1625
$$ -2871 -8431 4254 14510 8033 5054 8179 782 -6244 2178 7549 4069 6725 7829 -3796
1246c796o953O785O5l738Q369N689j1805n866P293j870m495J2704R583q583l547
$$ -3796 -10749 -3964 -3899 -7637 732 6421 -5384 -11250 -3957 -5827 -10322 2382 11965 3382 -165
1261a65N529m883o653R696P870n038j604J549q926o308P104K801l050O716K822
$$ -165 5364 481 -6172 3524 11394 6356 4752 6301 -2625 -8933 -1829 972 -2078 4638 7460
1276G460j2373n748Q385j064m940J0443Q651j0883p024N220j233n537R116R447
$$ 7460 -4913 -10661 -2276 -3340 -8280 2163 10814 -69 -7093 -1873 -3106 -8643 473 9920
1290I920m533k892K624p020n201Q265N008l906L263L788j1790q381P700K923m248
$$ 9920 5387 2495 5119 -1901 -7102 1163 6171 2265 5528 9316 -2474 -10855 -3155 -232 -4480
1305d480O829P432j0168q147N139k18m518Q909Q488p435n196L527l596n626Q528
$$ -4480 2349 9781 -387 -8534 -3395 -3613 -8131 778 9266 1831 -3365 162 -3434 -9060 -532
1320e32Q452l667k59L400p786o192P396M056l971M476M867j0757r114O089J218
$$ -532 7920 4253 3994 7394 -392 -6584 812 4868 897 5373 10240 -517 -9631 -3542 -2324
1335b324n620P125Q825p677p659L757j440l542Q097P900m164j467K529o750n040
$$ -2324 -7944 -819 8006 329 -7330 -3573 -5013 -8555 -458 7442 3278 1811 4340 -2410 -7450
1350g450R010O362m770K242N204r262q960O436M025m488L454O196q746q403L241
$$ -7450 1560 7922 3152 5394 10598 1336 -7624 -1188 2837 -1651 1803 7999 -747 -9150 -5909
1365e909j70m059O818Q537n181l778L847k888n066R133Q656l908q14M038o027
$$ -5909 -6079 -10138 -3320 5217 36 -3742 105 -2783 -7849 1284 9940 6032 5218 9256 3229
1380C229q685N862M960l790J986M725q196r323M413K018m630N025P242o599o205
$$ 3229 -5456 406 5366 1576 3562 8287 91 -9232 -4819 -2801 -7431 -2406 4836 -1763 -7968
1395g968L672o01l931P611Q604l547k264M661m348n953P917O900m507j95L996
$$ -7968 -4296 -4897 -8828 -1217 7387 3840 1576 6237 1889 -4064 3853 10753 6246 6051 10047
1410A0047p354r704M246L088m321K256N290p036p475L721R29l347P093Q619m711
$$ 10047 2693 -7011 -2765 323 -3998 -1742 3548 -3488 -10963 -7242 -6313 -9660 -2567 6052 1341
1425A341m165M648j983n209P211R162l542k474L748n138p790M449N455l397Q0
$$ 1341 -2824 1824 -159 -5368 1843 11005 7463 4989 8737 3599 -4191 258 5713 2316 2396
1440B396L805p397q886L037K551m577L982P745m936o203M131J032l226O912R708
$$ 2396 6201 -1196 -10082 -7045 -4494 -9071 -5089 2656 -2280 -8483 -4352 -3320 -6546 366 10074
1455A0074l512k977L754l146o793N115O620l950j423L512o777q539L477M238l796
$$ 10074 6562 3585 7339 4193 -2600 2515 9135 5185 3762 7274 497 -8042 -4565 -327 -4123
1470d123J743O123o385p569L390K073l700N916Q327l260m907L857l07m952O112
$$ -4123 -2380 3743 -2642 -10211 -6821 -4748 -8448 -2532 5795 2535 -2372 1485 1178 -3774 2338
1485B338Q481k991k099K888m767q414M122M851m155k44L762o002q995L380L800
$$ 2338 10819 7828 5729 8617 3850 -4564 -442 4409 254 10 3772 -2230 -11225 -7845 -4045
1500d045l494L465P566l216o182K987J538l210N381Q287k866l505L022k962o039
$$ -4045 -7539 -4074 3492 276 -5906 -2919 -1381 -4591 790 9077 6211 2706 5728 2766 -3273
1515c273M578O783l331j773L836n326r198K173N180l997J040N597l753p793K697
$$ -3273 1305 8088 4757 2984 6820 1494 -7704 -5531 -351 -4348 -3308 2289 -1464 -9257 -6560
1530f560K221k476M663P895k156m871L141K98n030M885P957l007l606L661l537
$$ -6560 -4339 -6815 -2152 5743 3587 -1284 1857 2155 -2875 2010 9967 6960 3354 7015 3478
1545C478q270K578O024l224j459M411m295p895J802L512l005K368O904l066o156
$$ 3478 -4792 -2214 3810 586 -873 3538 -757 -8652 -6850 -3338 -6343 -3975 2929 -137 -6293
1560f293L434J655l984M528Q635j699l978L501j488o272L253P197l122k571K832
$$ -6293 -2859 -1204 -5188 -660 7975 6276 2298 5799 4311 -1961 1292 8489 5367 2796 5628
1575E628l641q630J584M824k894m02N297l279p146K068K947k470L130P380j739
$$ 5628 1987 -6643 -5059 -235 -3129 -3531 1766 -1513 -8659 -6591 -3644 -6114 -2984 4396 2657
1590B657m794L200P84m833L472Q443j798l914L096j684p256J545N708k816j784
$$ 2657 -2137 1063 1847 -2986 486 8929 7131 3217 6313 4629 -2627 -1082 4626 1810 26
1605B6L182l311q324J633L175k521J235O211j741o454K411K983l065L459Q417
$$ 26 3208 -103 -8427 -6794 -3619 -6140 -4905 1306 -435 -6889 -4478 -1495 -4560 -1101 7316
1620G316p92m742K520j68n197K583O350j863l307K680l136p709J160M657l228
$$ 7316 6524 1782 4302 4134 -1063 1520 7870 6007 2700 5380 2244 -5465 -4305 352 -2876
1635b876m73M966k902p052R41L700k372K393P268r74n023K451K153m232L004P807
$$ -2876 -3349 1617 -1285 -8337 -7396 -3696 -6068 -3675 3593 2619 -2404 47 2200 -2032 972 8779
1651H779q87m106K219r51p041O56N625j610k889K449k587p608O13M116k220N54
$$ 8779 7892 3786 6005 5054 -1987 -1331 4294 2684 -205 2244 -343 -7951 -7338 -3222 -5442 -4888
1667d888O036j102o396K181L277k703J946Q246p1m334J469O44m853J476N939j250
$$ -4888 1148 46 -6350 -4169 -892 -3595 -1649 6597 6526 2192 3661 4305 -548 928 6867 5617
1683E617l090K111k065p718K86M574k364j167M633j366p218O47M049j651J067
$$ 5617 2527 4638 2573 -5145 -4859 -285 -2649 -3816 817 -549 -7767 -7120 -3071 -4722 -3655
1698c655P627n36m952K071K222l947J887P233q84m039J892o77o750K93N372j355
$$ -3655 3972 3436 -1516 555 2777 -1170 717 7950 7066 3027 4919 4242 -2508 -2215 3157 1802
1714A802k575K503j609p149j1M319j721l1O004j130n531J625L045k682J880P547
$$ 1802 -773 1730 121 -7028 -7039 -2720 -4441 -4472 1532 402 -5129 -3504 -459 -3141 -1261 6286
1730F286K55m348J443O94m574L55O066p74l763K068j379o686p02M644j860j358
$$ 6286 6541 2193 3636 4330 -244 111 6177 5403 1640 3708 2329 -4357 -5059 -415 -2275 -3633
1746c633L699l00o323O2L967j699O10O298O00m677J018K877l309J045O108J66
$$ -3633 66 -234 -6557 -6495 -2528 -4227 -3617 2681 3281 -1396 -378 2499 -810 235 6343 6509
1762F509l686J273L1o197K45M961q68k844K327j038o558m69L925r31j014N247
$$ 6509 2823 4096 4127 -2070 -1825 3136 2268 -576 1751 713 -5845 -6314 -2389 -3320 -4334 913
1778I13k10n789R30L260j794R86N931P04m142R28J805m100N40N756Lm153K026
$$ 913 703 -5086 -4156 -896 -2690 -1704 4227 4931 789 1717 3522 -578 -38 5718 5721 1568 3594
1795C594m69o429o19M719j066k241L328n04o445k32L728r06J68N571K35m419R54
$$ 3594 3125 -3304 -3923 796 -270 -2511 817 313 -6132 -6364 -2636 -3542 -3374 2197 2432 -1987 -1033
1812a033K391k758R13O253M31m260J299L36m388j162N300l54l416K244No247j308
$$ -1033 1358 -1400 -487 5766 6197 1937 3236 3572 -816 -1978 3322 2968 -448 1796 1801 -4446 -5754
1829e754M161j149p92L758R77n804j5L057j240Q00N514Q73l712J013J854m049
$$ -5754 -1593 -2742 -3534 224 1201 -4603 -4618 -1561 -2801 -2001 3513 4386 674 1687 3541 -508
1845e08M21N840J41m330J686K84o384j432M547n44k504K586j0n395p53L533m18
$$ -508 -87 5753 5894 1564 3250 3534 -2850 -4282 265 -279 -2783 -197 -207 -5602 -6355 -2822 -3240
1862c240lM868J161m932P97L091k629L25O281Q84m021J042N84m814m25M359Ml415
$$ -3240 -3243 1625 2786 -2146 -1349 1742 -887 -562 5719 6603 2582 3624 4208 -606 -1031 3328 3332 -83
1880h3J326n7n877j994L696k8j921L900J011m127p52L903o88L53N050J393l334
$$ -83 1243 1186 -4691 -6685 -2989 -3017 -4938 -1038 -27 -4154 -4906 -1003 -1691 -1338 3712 5105 1771
1897A771N10J807l654k56N507M41m288P18R59n428k148L922K4k873J847Q87n210
$$ 1771 2281 4088 434 178 5685 6126 1838 2556 3515 -1913 -4061 -139 -115 -2988 -1141 -254 -5464
1914e464j244K855m1k23M672J488l563Q88K822j446m56N577J467l955J69J062
$$ -5464 -6708 -3853 -3894 -4117 555 2043 -1520 -632 2190 744 288 5865 7332 3377 3546 4608
1930D608m129k237M125L63l158P44r3m590k113L961m41j228L329J510m199n11
$$ 4608 479 -1758 2367 2730 -428 316 223 -4367 -6480 -2519 -2960 -4188 -859 651 -3548 -4059
1946d059L361p39p38N175K584m170L54K392k617j770M779J272l952j1P37m540
$$ -4059 -698 -1437 -2175 3000 5584 1414 1768 4160 1543 -227 4552 5824 1872 1861 2598 -1942
1962a942k650L225L31k345J494J507m866p52L553P23j208M278J717l360n81L249
$$ -1942 -4592 -1367 -1036 -3381 -1887 -380 -5246 -5998 -2445 -1722 -2930 1348 3065 -295 -876 2373
1978B373j371q81M824R48l581l08J704l652k109L663Q36l490O49O95m642j491
$$ 2373 1002 121 4945 5893 2312 2004 3708 56 -2053 1610 2446 -1044 -395 300 -4342 -5833
1994e833L017O00j584L053J827m191l33L737k21j305N471K085m277r64K803k448
$$ -5833 -2816 -2216 -3800 -747 1080 -3111 -3444 293 72 -1233 4238 6323 2046 1082 3885 1437
2010A437j811L399J398l160p08J049l992j979L085N57k162K014J028l656k316
$$ 1437 -374 3025 4423 1263 555 1604 -2388 -4367 -1282 -725 -2887 -873 155 -3501 -5817
2025e817M217L76j487L573K476l476q95K633p06q93M258J620l306j058J680k934
$$ -5817 -1600 -1224 -2711 862 3338 -138 -1033 1600 894 1 4259 5879 2573 1515 3195 261
2041B61k551L453J158l177J95J052l741k090K479J362j513L092J355l279r20K923
$$ 261 -2290 1163 2321 -856 -661 391 -3350 -5440 -2961 -1599 -3112 -20 1335 -1944 -2864 59
2057E9p4j576M393K114l264j160K535j648k527M113J671k911j331J275l159j993
$$ 59 -15 -1591 2802 4916 1652 492 3027 1379 -1148 2965 4636 1725 394 1669 -1490 -3483
2073c483K457O87k045J348J221l490k151L598M37j593L750K317k900j162L022
$$ -3483 -1026 -339 -2384 -1036 185 -3305 -5456 -1858 -1421 -3014 736 3053 153 -1009 2013
2088B013o83j377K866K330l181o39J651k682k019K772J114k623p7J226k920k911
$$ 2013 1330 -47 2819 5149 1968 1329 2980 298 -1721 1051 2165 -458 -535 691 -2229 -5140
2104e140L091P63j603J807J953k849j785L410M90j503L239L100l007j230K459
$$ -5140 -2049 -1286 -2889 -1082 871 -1978 -3763 -353 137 -1366 1873 4973 1966 736 3195
2119C195j114k669K785K161l051o46O26k654k453K583Q42j691Q18J544l375j895
$$ 3195 2081 -588 2197 4358 1307 661 1287 -1367 -3820 -1237 -395 -2086 -1268 276 -3099 -4994
2135d994L271Q28j611K385K638k148k171K700P49j528K673K275k543j207J398
$$ -4994 -1723 -895 -2506 -121 2517 369 -1802 898 1647 119 2792 5067 2524 1317 2715
2150B715j599k845K874J295l502q5J601l084k805K589J533j694J248K750k207
$$ 2715 1116 -1729 1145 2440 -1062 -1147 454 -2630 -5435 -2846 -1313 -3007 -1759 991 -1216
2165a216j653K709R48j276K729K406k714j091K028j090k121K729J816k996p98
$$ -1216 -2869 -160 788 -488 2241 4647 1933 842 2870 1780 -341 2388 4204 1208 410
2180D10J003k284l044K724J314k403K92J623k215k754L202J558j624K199L228
$$ 410 1413 -871 -3915 -1191 123 -2280 -1988 -365 -2580 -5334 -2132 -574 -2198 1 3229
2195C229k553j276K202M61j394J919K987k916j888J552k047k635J918J950k216
$$ 3229 676 -600 1602 2063 669 2588 5575 2659 771 2323 276 -2359 -441 1509 -707
2210g07r79J556k471k508K496J969j782Q89K734k203k074K548J304j254K001L144
$$ -707 -1686 -130 -2601 -5109 -2613 -644 -2426 -1537 1197 -1006 -3080 -532 772 -482 1519 4663
2226D663k454j581K028p24k144K078K041k529j624J352k289k769J611K043k079
$$ 4663 2209 628 2656 1932 -212 1866 3907 1378 -246 1106 -1183 -3952 -2341 -298 -2377
2241b377l45K242j653k235K462J920j642J941K765j406k052J945P76k361K381
$$ -2377 -2722 -480 -2133 -4368 -1906 14 -1628 313 3078 1672 -380 1565 2341 -20 2361
2256B361K072k211j766J449j420k395J699K027k530p94J704k050l106K303K081
$$ 2361 4433 2222 456 1905 485 -1910 -211 1816 -714 -1508 196 -1854 -4960 -2657 -576
2271e76j790N82K996j999j752K232J498r88R53L098j291k257J573l62k553J692
$$ -576 -2366 -1784 1212 -787 -2539 -307 1191 203 1156 4254 2963 706 2279 1917 -636 1056
2287A056K052k463j419J492j289l226J894K156k186J54J896j314k536K033J514
$$ 1056 3108 645 -774 718 -571 -3797 -1903 253 -1933 -1779 117 -1197 -3733 -1700 -186
2302a86q35P86K787j494j867K044M02j388J365K655k100j936J714j147k609J257
$$ -186 -1021 -235 2552 1058 -809 1235 1637 249 1614 4269 2169 233 1947 800 -1809 -552
2318e52K011k109j272J660j442k225J941J896j518L87K448j314k263K071J863
$$ -552 1459 -650 -1922 -262 -1704 -3929 -1988 -92 -1610 -1223 1225 -89 -2352 -281 1582
2333A582j864J080K379j455j450R77N83k242J253K317k015j616J515j399k604
$$ 1582 -282 798 3177 1722 272 1249 1832 -410 843 3160 1145 -471 1044 -355 -2959
2348b959J105K517k045j064J964p52k510J771K153j229R57J890k32k590J574J416
$$ -2959 -1854 663 -1382 -2446 -482 -1234 -3744 -1973 180 -1049 -92 1798 1566 -1024 550 1966
2364A966j484J204K588k195j810J654o14k898J329K180j704j512J331p73l073
$$ 1966 482 1686 4274 2079 269 1923 1309 -1589 -260 1920 216 -1296 35 -738 -3811
2379c811J316K031j195r7K199j256k204K054J501r27Q57K949j171k215J610N57
$$ -3811 -2495 -464 -1659 -1756 443 -813 -3017 -963 538 -389 468 3417 2246 31 1641 2198
2395B198j836O31K147j257k107R56l34l314J205K094j529j142J395l37k827J737
$$ 2198 362 993 3140 1883 -224 732 398 -2916 -1711 383 -1146 -2288 -893 -1230 -4057 -2320
2411b320K137r75J8L131r48k027J698J398j843P29K643j122j821J164j31k963
$$ -2320 -183 -1158 -1140 1991 1043 -984 714 2112 269 998 3641 2519 698 1862 1731 -1232
2427a232J049J956j279j980J395o20k923O13K150p44m66K223p48j858J347K225
$$ -1232 -183 1773 494 -1486 -91 -711 -3634 -3021 -871 -1615 -2081 142 -606 -2464 -1117 1108
2443A108j077O13K743j071j763J431O51k402P05K390j258k489O52J79k832L56
$$ 1108 31 644 3387 2316 553 1984 2635 233 938 3328 2070 -419 233 412 -2420 -2064
2459b064J703r46q52J543o46k502J263K397r86J26L070p41k098J642J657j051
$$ -2064 -361 -1307 -2159 -616 -1262 -3764 -2501 -104 -1090 -964 2106 1365 -733 909 2566 1515
2475A515M2K411j009k098L62K72k225J14J836j294k047J007k04k610O91K502o36
$$ 1515 1557 3968 2959 861 1223 1495 -730 -616 1220 -74 -2121 -1114 -1318 -3928 -3237 -735 -1371
2492a371r07K354j32j976J201K009q91N18K517l58k094Q80J114k268QK382r16
$$ -1371 -2278 76 -56 -2032 -831 1178 287 805 3322 2964 870 1750 2864 596 604 2986 2070
2509B070k722M39J87k512k34J956p35r71J616q71j712J465K065n16k50K754j31
$$ 2070 -652 -213 -26 -2538 -2772 -816 -1551 -2522 -906 -1777 -3489 -2024 41 -475 -725 2029 1898
2526A898j902O02J948j429K56J991j88k776N28M86k390O1J751j293j534Q73R1
$$ 1898 -4 598 2546 1117 1373 3364 3176 400 928 1414 -976 -915 836 -457 -1991 -1118 -1027
2543a027k438K06K547r24l82J902K28j569N12K099k4j29K232n89k025L62J605
$$ -1027 -3465 -3259 -712 -1636 -2018 -116 112 -1457 -945 1154 1130 1001 3233 2644 619 981 2586
2560B586k417KJ833n30k400M30K83k267N7J874n38j063J541o8k104J106K128r67
$$ 2586 169 171 2004 1474 -926 -496 -213 -2480 -2423 -549 -1087 -2150 -609 -677 -2781 -1675 453 -514
2578e14j18K676m39k343J544J726j222o95K536k18k725L71K59j516o83K233r43
$$ -514 -632 2044 1605 -738 806 2532 1310 615 3151 2933 208 579 838 -678 -1361 872 -71
2595g1j992J167L39k215L4K226j24j050K022M91k193P06J608m49m24K167P41k534
$$ -71 -2063 -896 -557 -2772 -2738 -512 -636 -1686 336 827 -1366 -660 948 499 75 2242 2983 449
2613D49L99O79j178l34J968o07k289N41O43k390m02K341m78j359J157K80k161
$$ 449 848 1527 349 15 1983 1376 -913 -372 271 -2119 -2521 -180 -658 -2017 -860 -580 -2741
2630b741M16K497l92l43J863O06k231N07K059j142m49J592J68k175Q6R35j795
$$ -2741 -2325 172 -220 -563 1300 1906 -325 182 2241 1099 650 2242 2410 235 321 1256 -539
2647e39p46K065q87j469N41P65j838o18K500m12j099J534O62j758J16K370m51
$$ -539 -1285 780 -107 -1576 -1035 -270 -2108 -2726 -226 -638 -1737 -203 459 -1299 -1183 1187 736
2664G36p11K191J68j938J04R99j167m90J751l76j970M72M52j754r0J384J28j644
$$ 736 25 2216 2384 446 550 1549 382 -108 1643 1267 -703 -231 221 -1533 -1623 -239 -111 -1755
2682a755J043O08j761l78K698p03o94J637R24j439l14K174r39o36J845j73j718
$$ -1755 -712 -104 -1865 -2243 455 -248 -942 695 1619 180 -134 2040 1101 465 2310 2137 419
2699D19J56P09j568o52J606J48k117J96J040k016l55J753L82j381J232O01j615
$$ 419 575 1284 -284 -936 670 818 -1299 -1103 -63 -2079 -2434 -681 -299 -1680 -448 153 -1462
2716a462M22K017j03r47J940N68k138j39J421r09p09J887M5k091j91P75j622o22
$$ -1462 -1040 977 874 -73 1867 2435 297 158 1579 670 -39 1848 1893 -198 -389 386 -1236 -1858
2734a858K061q78j359Q61P38j868K05K057J7p76J679L80j625R1J988n86m17J343
$$ -1858 203 -675 -2034 -1173 -435 -2303 -2098 -41 -24 -800 879 1259 -366 -275 1713 1127 710 2053
2752B053L83j765l25P91j328o08J597o0k112L77O16j613l26J761k46j045J227
$$ 2053 2436 671 346 1137 -191 -799 798 738 -1374 -997 -381 -1994 -2320 -559 -805 -1850 -623
2769f23R58j486K8J979j08o87J864N33j740L4J086r16j070J830K24j980k81N28
$$ -623 335 -1151 -1123 856 748 61 1925 2458 718 752 1838 922 -148 1682 1906 -74 -355 173
2787A73j450q05J660L21j461L82P32j447k46K006Q1p12R13J107j225j89J596l44
$$ 173 -1277 -2082 -422 -101 -1562 -1180 -448 -1895 -2141 -135 -54 -766 147 1254 29 -160 1436 1092
2805A092o50J621K53j728J3O94j280j280K096k37j880K48M73j730k32J637M26
$$ 1092 442 2063 2316 588 601 1295 15 -1265 831 594 -1286 -1038 -565 -2295 -2527 -890 -464
2822d64j185J082J178j396j30J653K23o85J291R74j525o91J492q80p81J184J81
$$ -464 -1649 -567 611 -785 -915 738 961 276 1567 2541 1016 325 1817 937 156 1340 1521
2839A521j663o32Q44j105o75J190O50k042N62R54r41p69K161K17p56J307Q61j448
$$ 1521 -142 -774 70 -1035 -1710 -520 130 -1912 -1350 -396 -1337 -2106 55 272 -484 823 1684 236
2857B36l99J791l20n19J199J78j549n00P48o73j508J268N57j681j00L91q37o04
$$ 236 -163 1628 1308 789 1988 2166 617 117 865 192 -1316 -48 509 -1172 -1272 -881 -1718 -2322
2875b322J354K63q20P32J213j002m99J980J79j057J291J361j920l52J257m34j029
$$ -2322 -968 -705 -1525 -793 420 -582 -1081 899 1078 21 1312 2673 753 401 1658 1224 195
2892A95R52O57k171n36J329j464q56O37J098j474J82J012j016l30J647O09p01
$$ 195 1147 1804 -367 -903 426 -1038 -1894 -1257 -159 -1633 -1451 -439 -1455 -1785 -138 471 -230
2909b30Q75M73o19m74J353ln87O65O19j462n06O08m31r39Q74k5j364j70P39r72
$$ -230 645 1118 499 25 1378 1375 788 1453 2072 610 104 712 281 -658 216 191 -1173 -1343 -604 -1576
2929a576o48J112P36r90O28J115p01o29J610P08r47P74R99j336p93J127k26q32
$$ -1576 -2224 -1112 -376 -1366 -738 377 -324 -953 657 1365 418 1192 2191 855 62 1189 963 131
2947A31Q49N59j697j031J274q51j161R97O06j198J46R89m90j088J732P91p94P97
$$ 131 980 1539 -158 -1189 85 -766 -1927 -930 -324 -1522 -1376 -387 -877 -1965 -233 558 -236 561
2965E61R21j035k32J129J29p57M70P91j451n10J000r04j142J375n2j208p68J066
$$ 561 1482 447 215 1344 1473 716 1186 1977 526 16 1016 112 -1030 345 293 -915 -1683 -617
2983f17n98j027J227J038j287Q15P32l95p22J292Q08o31N23R87j242n26Q68l50
$$ -617 -1215 -2242 -1015 23 -1264 -449 283 -112 -834 458 1266 635 1158 2145 903 377 1245 895
3001H95j219J037N87j212j172Q77n95r29J094L01j133n0Q56k80o36J216R58o76
$$ 895 -324 713 1300 88 -1084 -207 -802 -1731 -637 -336 -1469 -1519 -663 -943 -1579 -363 595 -81
3019h1P04Q78n23r80J156K03p28N89Q40j665n66N79l65r96R69P99j825m65N30
$$ -81 623 1501 978 -2 1154 1357 629 1218 2058 393 -173 406 41 -955 14 813 -1012 -1477 -947
3038i47l2j212J458O62r00M26J064p10p24J589Q21r08N47P87q60o55Q68m08r81
$$ -947 -979 -2191 -733 -71 -971 -545 519 -191 -915 674 1495 587 1134 1921 1061 406 1274 866 -115
3057a15O36N74j169r12R25j97j214O31P65o70m79P38o0j377J488J004p82J98J518
$$ -115 521 1095 -74 -986 -61 -258 -1472 -841 -76 -746 -1225 -487 -547 -1924 -436 568 -214 -16 1502
3076A502r70m71J223K19j010K90R77j146j054Q18Oq55M73M26j073o19J027m85
$$ 1502 532 61 1284 1503 493 783 1760 614 -440 378 384 -471 2 428 -645 -1264 -237 -722
3094g22j275J087J111p06L3R22o26k32Q29Q03p80K81Q06p05q38O78N91j480O23
$$ -722 -1997 -910 201 -505 -472 450 -176 -408 421 1224 444 725 1531 826 -12 666 1257 -223 400
3113D00N59q89j087Q43m16j010P32P53q39l43N62J20p98J031Q98l97L2J044l25
$$ 400 959 70 -1017 -174 -590 -1600 -868 -115 -954 -1297 -735 -615 -1413 -382 516 119 151 1195 870
3132H70r29Q20O22r93M59P99o99j115N89r2j314N43Q37r72n27O75j17r91M11J099
$$ 870 -59 761 1383 390 849 1648 949 -166 423 331 -983 -440 397 -575 -1102 -427 -544 -1535 -1124 -25
3152b5n33M6O84r8n65M49J004n37L45P39n03j144P42K46p94M67M47l88j397L14
$$ -25 -558 -512 172 74 -491 -42 962 425 770 1509 1006 -138 604 850 56 523 970 582 -815 -501
3172e01J90j195N75P82n03q20J007M9j081J088N00l54J79J312o91n88P89M46l20
$$ -501 -311 -1506 -931 -149 -652 -1472 -465 -416 -1497 -409 91 -263 -84 1228 537 -51 738 1184 864
3191H64q0Q35o81j327O94M7j192L94N92o36o77N53l87j001N70J433o83k07R12
$$ 864 784 1619 938 -389 305 352 -840 -446 146 -490 -1167 -614 -1001 -2002 -1432 1 -682 -889 23
3210B3L05j145Q23J190n99K02R48p16p60N41N10j115J04O84q95p92L23j98r99
$$ 23 328 -817 6 1196 597 799 1747 1031 271 812 1322 207 311 995 100 -692 -369 -567 -1566
3229a566M44R06p14n91J176k91o71N73R41k12J07J069j63p61L94J113j238M69
$$ -1566 -1122 -216 -930 -1521 -345 -636 -1307 -734 207 -5 102 1171 1008 247 641 1754 516 985
3247I85N91n78j323M57M39j297L83K64n42r22O61L85j166M76J039m27o6M42O47
$$ 985 1576 998 -325 132 571 -726 -343 -79 -621 -1543 -882 -497 -1663 -1187 -148 -575 -641 -199 448
3266D48o48M23Q16o62L95O61J92j922Q07O78j103pP25o04r60K54q2m08l51J005
$$ 448 -200 223 1039 377 772 1433 1625 -297 510 1188 85 78 803 199 -761 -507 -589 -997 -1348 -343
3286c43m12p36R62K66q23K29J596r12K03Q76k0p91Q67K55m69m68J048k44j397
$$ -343 -755 -1491 -529 -263 -1086 -857 739 -173 30 906 886 95 962 1217 748 280 1328 1084 -313
3305c13J26O85j373M6Q23n06p61K60N54j186L71J155k34m25R29J34p94J035P48
$$ -313 -187 498 -875 -829 -6 -512 -1273 -1013 -459 -1645 -1274 -119 -353 -778 151 285 -509 526 1274
3324A274q72J63Q48j11j314M67O33p65k29Q84q32j236L92r9o98M93Q18m36p15
$$ 1274 402 565 1413 1302 -12 455 1088 323 94 978 146 -1090 -698 -797 -1495 -1002 -184 -620 -1335
3343a335R02M6n46K6J478k23m26J118k38o47N21M17m87N4O50n64j048L31K41n81
$$ -1335 -433 -387 -933 -907 571 348 -78 1040 802 155 676 1093 606 660 1310 746 -302 29 270 -311
3363c11q55J397p78n94L16O12q21k16J174R8q08P95O97r99N26P52k25k98O58j79
$$ -311 -1166 231 -547 -1141 -825 -213 -1034 -1250 -76 22 -786 9 706 -293 233 985 760 462 1120 941
3383I41j084L41M94q04K50L85j59j364M40L04o99n7P20k0q18P16K09q20L76J218
$$ 941 -143 198 692 -112 138 523 364 -1000 -560 -256 -955 -1012 -292 -312 -1130 -414 -205 -1025 -649 569
3403E69k54l14N25M87r74N8J218n26m85P03n8j359M25K67r20J8N09M14j507L55
$$ 569 315 1 526 1013 39 97 1315 789 304 1007 949 -410 15 282 -638 -620 -111 303 -1204 -849
3423h49N97j021NJ219m92k00P18N52p35J44Q52j93l32N90J49q67J84N12k45r42
$$ -849 -252 -1273 -1268 -49 -541 -741 -23 529 -206 -62 790 597 265 855 1004 137 321 833 588 -354
3443c54R63j73j424L40L36p33J12Q79l07m34M16M59j216M66J484n8q45L10P78
$$ -354 609 436 -988 -648 -312 -1045 -933 -54 -361 -795 -379 80 -1136 -670 814 756 -89 221 999
3462I99p83j95J245o00o69J437o45j247K08N15n49m98N87M20j121J74K09r5n88
$$ 999 216 21 1266 666 -3 1434 789 -458 -250 265 -284 -782 -195 225 -896 -722 -513 -608 -1196
3481a196J029k9m21N38M29n08p2J174m60k39P72nq67J99P66o84n89P98l28j364
$$ -1196 -167 -196 -617 -79 350 -158 -230 944 484 245 1017 1012 145 344 1110 426 -163 635 307 -1057
3501a057N67O19p68m44Q21M9r69N17L86m59p8P69K23n45P30N94o55K4Q38n59n33
$$ -1057 -490 129 -639 -1083 -262 -213 -1182 -665 -279 -738 -816 -47 176 -369 361 955 300 324 1162 603 70
3522G0R00Lq41k19J67k93m37K21L53q06K27q8j37q0J222m79m84P63J57l44OJ051
$$ 70 970 973 132 -87 80 -213 -650 -429 -76 -882 -655 -743 -880 -960 262 -217 -701 62 219 -125 -119 932
3544I32N1o80Q03J6r59L07PK27q43L82L5j133L13N75r17l28Q29K6p89K46J077
$$ 932 983 303 1106 1122 163 470 477 704 -139 243 278 -855 -542 33 -884 -1212 -383 -357 -1146 -900 177
3565A77q99oJ182j3j83K18K72p29M14N09k77l40M15l3p76j16K29j07p74Q54O8
$$ 177 -722 -728 454 441 258 476 748 19 433 942 665 325 740 707 -69 -185 44 -63 -837 17 85
3586H5j017k14M21j99k60P71M13p64N48M83j76R4P12m1m80M30J29m84J37o6J0
$$ 85 -932 -1146 -725 -924 -1184 -413 0 -764 -216 267 91 185 897 856 376 806 935 451 588 522 532
3607E32r52P92j43j090k8L20n8m41M64K23n19j53Q46l64o3Q66K90m60N83L26n09
$$ 532 -420 372 229 -861 -889 -569 -627 -1068 -604 -381 -900 -1053 -207 -571 -634 232 522 62 645 971 462
3628D62k69J021j17r17L67M17p84l93L32K3j012Q37j15p82p9L91p3k09M06Q58
$$ 462 193 1214 1097 180 547 964 180 -213 119 142 -870 -33 -148 -930 -1009 -618 -691 -900 -494 364
3648C64p21N40J12l11K4L75N93k53k12O01o17o33O32j84l72p0N79r08j07K80m58
$$ 364 -357 183 295 -16 8 383 976 723 511 1112 495 -138 494 310 -62 -132 447 -461 -568 -288 -746
3669g46l23R58j12q20M73M99k23l03J122K87q15m6J124j252K16N34M2n77L83J93
$$ -746 -1069 -111 -223 -1043 -570 -71 -294 -597 525 812 -3 -49 1075 -177 39 573 615 38 421 614
3689F14p81m08M03k09n26M68L80r16J04R22n25o15J031K73n75L70R72r09kN81
$$ 614 -167 -575 -172 -381 -907 -439 -59 -975 -871 51 -474 -1089 -58 215 -360 10 982 73 71 652
3709F52M99o43K11K95q16k01Q73m4j093M74J29j104j44R13n51l74N24L28p73K69
$$ 652 1151 508 719 1014 198 -3 870 826 -267 207 336 -768 -912 1 -550 -924 -400 -72 -845 -576
3729e76N94j27m03P89M60n06J98N15l62n04O38j5m43J01K68p91J67O6R3j227L79
$$ -576 18 -109 -512 277 737 231 429 944 582 78 716 701 258 359 627 -164 3 69 162 -1065 -686
3750f86N99p70M00OJ49l13L90L75l05j77Q02k71k04N67j08n4Q4K74l79m13O81
$$ -686 -87 -857 -457 -451 -302 -615 -225 150 -155 -332 470 199 -5 562 454 400 484 758 379 -34 647
3771F47n48m1L5r6j83p54R22k59q26Q58K25p65O6R31n25M3N85n8l79L57O55l32
$$ 647 99 58 93 -3 -186 -940 -18 -277 -1103 -245 -20 -785 -719 212 -313 -270 315 257 -122 235 890 558
3793E58p40P98R0n85L16J72n09m46N02j74j028P43J60l98k32M41K84m75L40N73
$$ 558 -182 616 706 121 437 609 100 -346 156 -18 -1046 -303 -143 -541 -773 -332 -48 -523 -183 390
3813C90r67J68P59p9m95Q08j49J21m73N47j73m21M02k75m26K69M07p95l88K40
$$ 390 -577 -409 350 271 -224 584 435 556 83 630 457 36 438 163 -263 6 413 -382 -770 -530
3833e30J80q74Q42J23k14j8M61Pm89M07L84m45M68N44n16k09N77N59q60k7K03
$$ -530 -350 -1224 -382 -259 -473 -491 -30 -23 -512 -105 279 -166 302 846 330 121 698 1257 397 370 573
3854E73J09j011M9K83p53N35L22m88l54L42L49n51R3N31r9j72L58L71o59R97j9
$$ 573 682 -329 -280 3 -750 -215 107 -381 -735 -393 -44 -595 -502 29 -70 -242 116 487 -172 825 806
3875H06n31RJ27p3k38J98K06o15k29M30n64j22J78J36k85q6Q37n49j65M60J1o48
$$ 806 275 284 411 338 100 298 504 -111 -340 90 -474 -596 -418 -282 -567 -653 184 -365 -530 -70 -59 -707
3897g07P41L30k45K82L08k53j39M26j94l99J33N01r05l03N54n6m83J8K87n06k34
$$ -707 34 364 119 401 709 456 317 743 549 150 283 784 -121 -424 130 74 -409 -391 -104 -610 -844
3918h44N24R8n65O53M45o18K51L28O1n37O74L55o46O3M00k55m78O48l24j44j40
$$ -844 -320 -222 -787 -134 311 -307 -56 272 333 -204 470 825 179 242 642 387 -91 557 233 89 -51
3939e1J77n42m02O91l7q35L99N22k35n13M41Q5L7L36K45k42L23L44j23m57K49
$$ -51 126 -416 -818 -127 -164 -999 -600 -78 -313 -826 -385 -300 -263 73 318 76 399 743 620 163 412
3960D12M24m32l20J42R1o78P17j14p79K7O15q20k31Q53j83k63K89K29j5k52N60
$$ 412 836 404 84 226 317 -361 356 242 -537 -510 105 -715 -946 -93 -276 -539 -250 -21 -36 -288 272
3981B72l2n11Q02J69j92q4P4M2k27j86K22m46%L76o99j58j3J34M9k20N86o9l97
$$ 272 240 -271 531 700 508 424 498 540 313 127 349 -97 -97 279 -420 -578 -591 -457 -408 -628 -42 -111 -508
4004e08N75N6l70K41M52k42m13O70L57r36O06J02m46O3L3m49j81L49Q2o33J16
$$ -508 67 123 -247 -6 446 204 -209 461 818 -118 488 590 144 207 240 -209 -390 -41 41 -592 -476
4025d76K87m60J90j06J6R4L03J02l04P5N69L29n96K30L60l17l8L25o5n33M58M2
$$ -476 -189 -649 -459 -565 -549 -455 -152 -50 -354 -279 290 619 23 253 613 296 258 583 518 -15 443 485
4047D85n32k37L99k68p87K62M65m89K64M34k46l10L70K90k50L37N00m93O3L96
$$ 485 -47 -284 115 -153 -940 -678 -213 -702 -438 -4 -250 -560 -190 100 -150 187 687 194 257 653
4067F53k20o19M86J21N2m97L88m71m59M54m6m13J14M82n14j49r3L34j93j22Q91
$$ 653 433 -186 300 421 473 -24 364 -107 -566 -112 -158 -571 -457 25 -489 -638 -731 -397 -590 -712 179
4088A79k01q9L90K87n31K27O45n31j27J42Pl72k63O44o81k57N00J39o08j04M72
$$ 179 -22 -111 279 566 35 262 907 376 249 391 398 26 -237 407 -274 -531 -31 108 -500 -604 -132
4109a32l11r2M60j41k10Q73l12k59k0M78n8k38P59l04k70J03J85j02o15P2L77
$$ -132 -443 -535 -75 -216 -426 447 135 -124 -144 334 276 38 797 493 223 326 511 409 -206 -134 243
4130B43n49P1M14k41p90N36M3q00N51K36M6k64P15j08q4J80L53l75r9P10j89n05
$$ 243 -306 -235 179 -62 -852 -316 -273 -1073 -522 -286 -240 -504 211 103 19 199 552 177 78 788 599 94
4152I4K18J00n56oO55m96l78L00m73N4m6K90l14M2N67o2m25M16M96m51j78O47
$$ 94 312 412 -144 -150 505 9 -369 -69 -542 -488 -534 -244 -558 -516 51 -11 -436 -20 476 25 -153 494
4174D94r8j79K95K46q06M07K48k39m98J40K72n01N4J01l71j46N97k89k35K08M41
$$ 494 396 217 512 758 -48 359 607 368 -130 10 282 -219 -165 -64 -435 -581 16 -273 -508 -300 141
4195A41m12J3N95k46L5j03M25j59n4K83l09O8j5m4k56K9P20r38j9L01m73k51K84
$$ 141 -271 -258 337 91 126 23 448 289 235 518 209 277 262 218 -38 -9 711 -227 -246 55 -418 -669 -385
4218c85M02m70J6J57J35l31O50pj21j63O50k83k10K58L84o36j39O31k52k23R9
$$ -385 17 -453 -437 -280 -145 -476 174 167 46 -117 533 250 40 298 682 46 -93 538 286 63 162
4239A62q2n06O1K44l25n4L47j0m36Q9M74k34JO29l31l66K96M31l52J95N00j28
$$ 162 80 -426 -365 -121 -446 -500 -153 -163 -599 -510 -36 -270 -269 360 29 -337 -41 390 38 233 733 605
4261F05k61NK84k86l11M64o73j37L39K88o82P3j37k80L80K08j11n55O67K78m74
$$ 605 344 349 633 347 36 500 -173 -310 29 317 -365 -292 -429 -709 -329 -121 -232 -787 -120 158 -316
4282c16N6N71J57l21K84N1l01j53N51l91m49M37J66n62J10L28k44m50J61l87K91
$$ -316 -260 311 468 147 431 482 181 28 579 188 -261 176 342 -220 -110 218 -26 -476 -315 -702 -411
4303d11k05N7J96n0L20K95j72K12K74o68K53R7J39m91N03j2n49j35O00l50k33
$$ -411 -616 -559 -363 -413 -93 202 30 242 516 -152 101 198 337 -154 349 337 -212 -347 253 -97 -330
4324c30J97k75N28j30j66l71J11M62j98j09J73J4J23j49P41k50Q1J72mo94K92
$$ -330 -133 -408 120 -10 -176 -547 -436 26 -172 -281 -108 -94 29 -120 621 371 452 624 620 -74 218
4345B18J84j97j23j12N77o57k02K67k35j74J79l39O9K16O3j75L58M1L62m40L12
$$ 218 402 205 82 -30 547 -110 -312 -45 -280 -454 -275 -614 -545 -329 -266 -441 -83 -42 320 -120 192
4366A92N23k94j30QoO8J5K86q35L6M47l7k85J32j77j46k14K02k72j15N96j02n5
$$ 192 715 421 291 299 293 361 376 662 -173 -137 310 273 -12 120 -57 -203 -417 -215 -487 -602 -6 -108 -163
4389a63J83M69l00J52K19P7o51J74K62k42k30M48j95n16K25L32n4l29J32k93l96
$$ -163 20 489 189 341 560 637 -14 160 422 180 -50 398 203 -313 -88 244 190 -139 -7 -300 -696
4410f96M09O8k46M6M17r0r9L24j0J05R7K10j12j98K47K81p38L31j14l46j7L74
$$ -696 -287 -219 -465 -419 -2 -92 -191 133 123 228 325 535 423 225 472 753 15 346 232 -114 -131 243
4432B43o2o22l16P43k63j76J94l51K93J46O3n2J49K07l71J61L41k87J51l4J42
$$ 243 181 -441 -757 -14 -277 -453 -259 -610 -317 -171 -108 -160 -11 196 -175 -14 327 40 191 157 299
4453B99J17m35L77k05k91L62K6m58j12L25m61K26J42K20l84l5K60L0m30N28N21
$$ 299 416 -19 358 153 -138 224 250 -208 -320 5 -456 -230 -88 132 -252 -287 -27 3 -427 101 622
4474F22m82J00K1rlJ04k08l9k06J21P7k80L33j16m97K37J94O4l9k82J24j30J90
$$ 622 140 240 261 252 249 353 145 106 -100 21 98 -182 151 35 -462 -225 -31 33 -6 -288 -164 -294 -104
4497a04p1l3K20J55j38k4K76J39n4j11k16J52k93L40j18l71M76j17j20k69j5k12
$$ -104 -175 -208 12 167 29 5 281 420 366 255 39 191 -102 238 120 -251 225 108 -12 -281 -296 -508
4519e08J54K55K40j50j78J82j7j86M58j5J59j14m8K46l63J28j28K30J33k07K43
$$ -508 -354 -99 141 -9 -187 -5 -22 -208 250 235 394 280 232 478 115 243 115 345 478 271 514
4540E14o96M62j19p88N89P3l29j44J78L0l87L05J43J03k29L91L53k65r0N85p24
$$ 514 -182 280 161 -627 -38 35 -294 -438 -260 -230 -617 -312 -169 -66 -295 96 449 184 94 679 -45
4561d5J99M6R3l56N3n4r2Q1j47Q0j43o4M46p62R7M85k88R7K56K7j74J47N2J74
$$ -45 154 200 293 -63 -10 -64 -156 -75 -222 -142 -285 -349 97 -665 -568 -83 -371 -274 -18 9 -165 -18 34 208
4585B08J13k22L38o04L73pl52L37P1l46%K5L83l20k97O7j0j97K92K21m14N09m97
$$ 208 321 99 437 -167 206 199 -153 184 255 -91 -91 -66 317 -3 -300 -233 -243 -440 -148 73 -341 168 -329
4608c29K99k23N11Q1l20k71P53m98J59J67j64j39P4K11m51P7L5L10n04J6l9O1
$$ -329 -30 -253 258 339 19 -252 501 3 162 329 165 26 100 311 -140 -63 -28 282 -222 -206 -245 -184
4630a84k40L06l2LK12m3k42L33N3l8j24K20L20k08k01P2k9j83K45k68N4j59j28
$$ -184 -424 -118 -150 -147 65 22 -220 113 166 128 4 224 544 336 135 207 178 -5 240 -28 26 -133 -261
4653b61j11M08k62p3k51N52Q7j9l82L32K61l93M12j03j16j43N47l40J00J5M5k24
$$ -261 -372 36 -226 -299 -550 2 89 70 -312 20 281 -112 300 197 81 -62 485 145 245 260 305 81
4675H1j75L77j63j56k2KP9p4q0j76K67m6k16r7O31m12L3M0K92N3m43M59j28k5
$$ 81 -94 283 120 -36 -58 -56 23 -51 -131 -307 -40 -86 -302 -399 232 -180 -147 -107 185 238 -205 254 126 101
4699A01j01J64J98j97J66l40k26J66M0j0k78rr8q4Q3O22m64q3O39k63l2j05J37
$$ 101 0 164 362 165 331 -9 -235 -69 -29 -39 -317 -326 -424 -508 -425 197 -267 -350 289 26 -6 -111 26
4722B6q0K39L56m87j50L59J69n67L17l06J41K7j65Q4l15L0M61l79j05P3K92j04
$$ 26 -54 185 541 54 -96 263 432 -135 182 -124 17 44 -121 -37 -352 -322 139 -240 -345 -272 20 -84
4744h4j80Q5n8N9L66n2j48M01j71j56j11J18K09q2l24R5j23r9L08K6m56J04o6
$$ -84 -264 -179 -237 -178 188 136 -12 389 218 62 -49 69 278 196 -128 -33 -156 -255 53 79 -377 -273 -339
4767c39n8K66J79m08N38k0o4LJ8K2j37R6J62l41K65j76L94m16J28K78n43J47j32
$$ -339 -397 -131 48 -360 178 158 94 97 115 137 0 96 258 -83 182 6 400 -16 112 390 -153 -6 -138
4790a38k68K55J30k61J52k19Q6J25L21q2M1J16k79j16J53K19J59l46j71K89j60
$$ -138 -406 -151 -21 -282 -130 -349 -263 -138 183 101 142 258 -21 -137 16 235 394 48 -123 166 6
4811Fn7j4j05L93j74n11N11k15pM17j53l84L68k57J34j12m7N6M19j5l35M92K8
$$ 6 -51 -65 -170 223 49 -462 49 -166 -173 244 91 -293 75 -182 -48 -160 -207 -151 268 253 -82 410 438
4834D38j11K58j74l61N81q26N7N80o14q3J99n1j62RL41l19L56j43j22L20m14K93
$$ 438 327 585 411 50 631 -195 -138 442 -172 -255 -56 -107 -269 -260 81 -238 118 -25 -147 173 -241 52
4856E2L9k38N97o08J23K36m9r8k59Q4J1K9n3K93m9J32n04M10l23J4J79l43J92
$$ 52 91 -147 450 -158 -35 201 152 54 -205 -121 -110 -81 -134 159 110 242 -262 148 -175 -161 18 -325 -133
4879a33KJ16j78j5N61j53j47J80j75j89K93J76m10L94m00O3lN2N6j27P8k62lp2
$$ -133 -131 -15 -193 -208 353 200 53 233 58 -131 162 338 -72 322 -78 -15 -18 34 90 -37 41 -221 -224 -296
4903b96N38k43om5m4k9k34L27k84N23K03k86k99p0M82k77j68J62O18p19J69n8
$$ -296 242 -1 -7 -52 -96 -125 -359 -32 -316 207 410 124 -175 -245 237 -40 -208 -46 572 -147 22 -36
4925c6l97Q2L10j25o3L81k45Jl52K93j76L53m3Q9l33N39j32Q6n23K03J62k62L62
$$ -36 -433 -351 -41 -166 -229 152 -93 -92 -444 -151 -327 26 -17 72 -261 278 146 232 -291 -88 74 -188 174
4948A74J30j75k99K36m7R1p3o4K5m6k09N9j51M07r8k17J08K57k20L4r6N4Q6o6
$$ 174 304 129 -170 66 19 110 37 -27 -2 -48 -257 -198 -349 58 -40 -257 -149 108 -112 -78 -174 -120 -34 -100
4972a00L28j30r0K47k32k08j22J77K58l57K15k18P7j54M87m89j26N99k29O6L2
$$ -100 228 98 8 255 23 -185 -307 -130 128 -229 -14 -232 -155 -309 178 -311 -437 162 -67 -1 31
4993C1KJ28q7L51k44k59K15j78K49k30L60j48n34M78j70Jk79J95q2k6P16p17L72
$$ 31 33 161 74 425 181 -78 137 -41 208 -22 338 190 -344 134 -36 -35 -314 -119 -201 -227 489 -228 144
5016A44l90L6j12K95L3j68K61P0J67j99KK45j61l68pM31k01p4K33j91l90L58l21
$$ 144 -246 -210 -322 -27 6 -162 99 169 336 137 139 384 223 -145 -152 279 78 4 237 46 -344 14 -307
5039c07J32L03k08l7P4kK19j76K87l21j28N61j54j63N3K32j46O8k54j08L36m74
$$ -307 -175 128 -80 -117 -43 -45 174 -2 285 -36 -164 397 243 80 133 365 219 287 33 -75 261 -213
5061b13K67K06m15m25L44Nj61L87J8j62N1P4K41k22L36l34Q1M02l79L23m19M2
$$ -213 54 260 -155 -580 -236 -231 -392 -5 13 -149 -98 -24 217 -5 331 -3 78 480 101 424 5 47
5083D7N12o34J83J74m58k38L41Q0l06p3M89l98L38k20K30J5Mp3l09L42J6p2k6
$$ 47 559 -75 108 282 -176 -414 -73 7 -299 -372 117 -281 57 -163 67 82 86 13 -296 46 62 -10 -36
5106c6N80n03j07K68j22m4J02l5j97p2k5J89K28k65q0k36j59K30K76j6n04M89
$$ -36 544 41 -66 202 80 36 138 103 -94 -166 -191 -2 226 -39 -119 -355 -514 -284 -8 -24 -528 -39
5128c9J24o7l3j6M23m24J77Q6j64K14j41j55j16K22k59N4K69M3j69n21L83p1J13
$$ -39 85 18 -15 -31 392 -32 145 231 67 281 140 -15 -131 91 -168 -114 155 198 29 -492 -109 -180 -67
5151f7Q5j90N2J04j08R4j34J85J94l67M81m44N22l86K50m45K18P4P4n60K67j97
$$ -67 18 -172 -120 -16 -124 -30 -164 21 215 -152 329 -115 407 21 271 -174 44 118 192 -368 -101 -298
5173b98M8L7Q7K13l10J0R4j69J38K79L7j28L5K90l39J40J74O7m17l08L21K45k27
$$ -298 -250 -213 -126 87 -223 -213 -119 -288 -150 129 166 38 73 363 24 164 338 405 -12 -320 1 246 19
5196A9m7M4l7j65q5K6L29k98J08j5L1J87J91k71j78J35J01n8j3J93J26j20n5k07
$$ 19 -28 16 -21 -186 -271 -245 84 -214 -106 -121 -90 97 288 17 -161 -26 75 17 4 197 323 203 148 -59
5220e9K56oqLk37j87q9P3L22l55K45K19k99J75n41N45j69J78J67m64K83l19K64
$$ -59 197 191 183 186 -51 -238 -327 -254 68 -287 -42 177 -122 53 -488 57 -112 66 233 -231 52 -267 -3
5243cr7J24K7k22J59J54O5p7J85j10O1r9n29K55j49J20R5j31O3j12M7K92j23j78
$$ -3 -100 24 51 -171 -12 142 207 130 315 205 266 167 -362 -107 -256 -136 -41 -172 -109 -221 -174 118 -5 -183
5267a83N94k30j40J98j02q0J42j5k76M34p71O91l41j11J44p4J29k48L4P8q4K55
$$ -183 411 181 41 239 137 57 199 184 -92 342 -429 262 -79 -190 -46 -120 9 -239 -205 -127 -211 44
5289D4j71L70j36K2l86K14J74N9k06n0N54j81l32j87r9K1K11q3K30l29k95O62
$$ 44 -127 243 107 129 -257 -43 131 190 -16 -66 488 307 -25 -212 -311 -290 -79 -162 68 -261 -556 106
5311A06l58J60j51K19j34L8j36m2K96J93n58K97J48J04k02k31K74j24J50J75k9
$$ 106 -252 -92 -243 -24 -158 -120 -256 -298 -2 191 -367 -70 78 182 -20 -251 23 -101 49 224 195
5332A95j24k44L16k76O2KJ02k59K12K02j85j82J06J93j18O6K00k05rj94K02J66
$$ 195 71 -173 143 -133 -71 -69 33 -226 -14 188 3 -179 -73 120 2 68 268 63 54 -140 62 228
5354B28k14M2K04l49N7j03K13K53qo13j08N89p09L90K21m43j01M00L53n47L33
$$ 228 14 56 260 -89 -32 -135 78 331 323 -290 -398 191 -518 -128 93 -350 -451 -51 302 -245 88
5375H8m22M17j37M57m60q2J27M02n34j08L09k34j08K25O1K8k91r4M61k79K54K9
$$ 88 -334 83 -54 403 -57 -139 -12 390 -144 -252 57 -177 -285 -60 1 29 -262 -356 105 -174 80 109
5397A09k95J76j66j16M66k33o0r4L40n2pk33K74k9o0K18M3l91k74K41J21j14J02
$$ 109 -186 -10 -176 -292 174 -59 -119 -213 127 75 68 -165 109 80 20 238 281 -110 -384 -143 -22 -136 -34
5420c4K3k85K14P9j9n10P46l5k44K35K32k74j86j22N69P3l20q5j23m7Q7J30M9
$$ -34 -11 -296 -82 -3 -22 -532 214 179 -65 170 402 128 -58 -180 389 462 142 57 -66 -113 -26 104 153
5443A53j28j62j17K07l05K90o9K09K2k15j90J02J32p7K04M0l09O27m89L30k68
$$ 153 25 -137 -254 -47 -352 -62 -131 78 100 -115 -305 -203 -71 -148 56 96 -213 414 -75 255 -13
5464a3K82l9j04j01M6j6k57M38j64m25LP1M0m8L42q6k02j7M22m4M03p04M61j41
$$ -13 269 230 126 25 71 55 -202 236 72 -353 -350 -279 -239 -287 55 -31 -233 -250 172 128 531 -173 288 147
5488A47J94l41K86m14j9r3N26m51J07K88k96M0j73J66k34K84l52L49L93m96l2
$$ 147 341 0 286 -128 -147 -240 286 -165 -58 230 -66 -26 -199 -33 -267 17 -335 14 407 -89 -121
5509a21K37k41M3k67O08n88N37k03k13M38k01Q7k58J90k08J73m41P09m51J43j29
$$ -121 116 -125 -82 -349 259 -329 208 5 -208 230 29 116 -142 48 -160 13 -428 281 -170 -27 -156
5530a56J39Qm30O31l57o7L73k07M0k6jM73l33j15M9L79m17j16K66J14k59m7pj43
$$ -156 -17 -9 -439 192 -165 -232 141 -66 -26 -52 -53 420 87 -28 21 400 -17 -133 133 247 -12 -59 -66 -209
5554b09K62k92RJ72p7n1P0J91q2Q4p5L58l29l7J21n4k1n3J53J93m76K19k65L4
$$ -209 53 -239 -230 -58 -135 -186 -116 75 -7 77 2 360 31 -6 115 61 40 -13 140 333 -143 76 -189 -155
5578a55K50j54j62L79j50j92J7J58M3k81J78M5J74j74o4K01j79K34K22m30K22
$$ -155 95 -59 -221 158 8 -184 -167 -9 34 -247 -69 -24 150 -24 -88 113 -66 168 390 -40 182
5599A82j05K68m88N03m82K50l38K46L17l77K07o12L28j20L05k85R3K27N8m78L40
$$ 182 77 345 -143 360 -122 128 -210 36 353 -24 183 -429 -101 -221 84 -201 -108 119 177 -301 39
5620C9L17m29k9J95r6L13l03K23J10o65L67K3l34j2J42N8K3M9j95J26k67L07L54
$$ 39 356 -73 -102 93 -3 310 7 230 340 -325 42 65 -269 -281 -139 -81 -58 -9 -204 -78 -345 -38 316
5643C16n92J93M0J63k82K59K2k98K8K03n8L20m01J16M64m00k77K63L19q44L35
$$ 316 -276 -83 -43 120 -162 97 119 -179 -151 52 -6 314 -87 29 493 93 -184 79 398 -446 -111
5664a11M03m84O8K19lo7m63M62j74M11m22K62j83J48J2l8p0l43M81q3J55p8j48
$$ -111 292 -192 -124 95 92 25 -438 24 -150 261 -161 101 -82 66 78 40 -30 -373 108 25 180 102 -46
5687d6j6j2J57k49J19k41J98J49M8n12L12L30n14L05n6j8L70j98J77k42J10j04
$$ -46 -62 -74 83 -166 -47 -288 -90 59 107 -405 -93 237 -277 28 -28 -46 324 126 303 61 171 67
5709F7K37l54j57M03l85K60l50K80j30J41j37J15J19m31J90M50o27N9M10j28l3
$$ 67 304 -50 -207 196 -189 71 -279 1 -129 12 -125 -10 109 -322 -132 318 -309 -250 160 32 -1
5730aK45k00K6J7k40J80M0K26p5j29j47L3l80p9O53N9k07k32J71j47J59J14m11
$$ -1 244 44 70 87 -153 27 67 293 218 89 -58 -25 -405 -484 169 228 21 -211 -40 -187 -28 86 -325
5753c25K51J16r7J16K24j44K74k67j27J72k77M09j13l45M04n10K73j79rml01L16
$$ -325 -74 42 -55 61 285 141 415 148 21 193 -84 325 212 -133 271 -239 34 -145 -154 -158 -459 -143
5775a43L13m14J67n9l8j6J86J28m20K82Q3k69K19J7k80J15j74M27k31K43l87M33
$$ -143 170 -244 -77 -136 -174 -190 -4 124 -296 -14 69 -200 19 36 -244 -129 -303 124 -107 136 -251 182
5797A82k70M39j92q9J13j27J7o94O78l48K50J71j02K39l58Q4J25p8j30J26P4J68
$$ 182 -88 351 159 70 183 56 73 -621 57 -291 -41 130 28 267 -91 -7 118 40 -90 36 110 278
5819B78J78k04l69J62Nq6j78L62j74M2J7l5L08m99L42M9m00L56j98Q7j07k23L40
$$ 278 456 252 -117 45 50 -36 -214 148 -26 16 33 -2 306 -193 149 198 -202 154 -44 43 -64 -287 53
5842E3k35K90q4k07Q4N61j47j77Q0m13k3P2K44o9l55O94l94J90k5j46j6N6j8N5
$$ 53 -182 108 24 -183 -99 462 315 138 218 -195 -218 -146 98 29 -326 368 -26 164 139 -7 -23 33 15 70
5866G0j0J90K00m67j7K96Jk25J66o87L06L0K78j13l09M96k83L74j98k34J63J5
$$ 70 60 250 450 -17 -34 262 263 38 204 -483 -177 -147 131 18 -291 205 -78 296 98 -136 27 42
5888D2n34O52N7m93O2L3P3j09L02j45K41m5j84k0K70k66J43kK80m93J84O9j17
$$ 42 -492 160 217 -276 -214 -181 -108 -217 85 -60 181 136 -48 -68 202 -64 79 77 357 -136 48 117 0
5911@l11N71m16j78J58J83N2J32l40L24k32J86j57J25L46l27L1j03L61l21l19
$$ 0 -311 260 -156 -334 -176 7 59 191 -149 175 -57 129 -28 97 443 116 147 44 405 84 -235
5932b35j29N79j94k44q2M47l27K38p9r9MJ20k13M92j74k91J76L24k82J83j70m9
$$ -235 -364 215 21 -223 -305 142 -185 53 -26 -125 -121 -1 -214 278 104 -187 -11 313 31 214 44 -5
5954eL60j86j9J12k82l4J45L04m54l36L75j29J89n3j24J17m75N37l72L87j36j1
$$ -5 355 169 150 262 -20 -54 91 395 -59 -395 -20 -149 40 -13 -137 -20 -495 42 -330 57 -79 -90
5976i0L86l41l2L8N02k48k10K7L23l57K9j96Q2j42M22k16l2l63K70q8Q2M6P8K
$$ -90 296 -45 -77 -39 463 215 5 32 355 -2 27 -169 -87 -229 193 -23 -55 -418 -148 -236 -154 -108 -30 -28
6000b8l23P5J88j97J65o3M97k90j63L4J99k5L30j34j74R5p4J21m75K75l04J29
$$ -28 -351 -276 -88 -285 -120 -183 314 24 -139 -105 94 69 399 265 91 186 112 233 -242 33 -271 -142
6022a42J71l58K07j89L57k65J70l42L49p7P3J63J69k89J85j3p2l08L39l6n59M00
$$ -142 29 -329 -122 -311 46 -219 -49 -391 -42 -119 -46 117 286 -3 182 169 97 -211 128 92 -467 -67
6044f7J00k16l12M79j31J84j15k07L12j01k43N06l66M15k26K05q5P7m25K32k56
$$ -67 33 -183 -495 -16 -147 37 -78 -285 27 -74 -317 189 -177 238 12 217 132 209 -216 16 -240
6065b40L64k95K50K14k34L56k30m39J32K63k43P9j03k13J05J92%j44K63Mj56K88
$$ -240 124 -171 79 293 59 415 185 -254 -122 141 -102 -23 -126 -339 -234 -42 -42 -186 77 81 -75 213
6087B13m9j66J40M8j80j21J34l4J30J30k40k1J03n08O65k29J48j17j10K27m83
$$ 213 164 -2 138 186 6 -115 19 -15 115 245 5 -16 87 -421 244 15 163 46 -64 163 -320
6108c20M33p6l0l51P54k65l21K56L14m6p33O24q0l59R6n1L35J26k10k85N3J93
$$ -320 113 37 7 -344 410 145 -176 80 394 348 -385 239 159 -200 -104 -155 180 306 96 -189 -136 57
6130E7k14J95j47j42Q3j75N37n49M50J27k59N9J71l32Q1l5J67p8qJ50j17L81m03
$$ 57 -157 38 -109 -251 -168 -343 194 -355 95 222 -37 22 193 -139 -58 -93 74 -4 -12 138 21 402 -1
6153ar5k04j79N7K68J81l08N90j68l78K47J5K41l71R8j55j3L61p3j9j51K60n6
$$ -1 -96 -300 -479 -422 -154 27 -281 309 141 -237 10 25 266 -105 -7 -162 -175 186 113 94 -57 203 147
6176A47k13J49J07k28J75o0k02P6n74L53r8K56m7j33J35J93j72k05j2O07l26L1
$$ 147 -66 83 190 -38 137 77 -125 -49 -623 -270 -368 -112 -159 -292 -157 36 -136 -341 -353 254 -72 -41
6198d1M8K97Q2j23k64j21O5p1L33j41k23K62m67L84J52l70j92M33k88L63j12j51
$$ -41 7 304 386 263 -1 -122 -57 -128 205 64 -159 103 -364 20 172 -198 -390 43 -245 118 6 -145
6220a45K04k69N75k50J43k25K63l60J37J47j35J2N1m3k84J71J9L51l13q7j83p6
$$ -145 59 -210 365 115 258 33 296 -64 73 220 85 97 148 105 -179 -8 11 362 49 -38 -221 -297
6242b97L24n68P25n47M07K7K9q6j07L21l03M8j0n5M53j03R9k49l08J14q9K52J57
$$ -297 27 -541 184 -363 44 71 100 14 -93 228 -75 -27 -37 -92 361 258 357 108 -200 -86 -175 77 234
6265B34l95j0j16N5J17Q7rk33J21J21J16k84L37L43m94k19N42m68J05J74l92K78
$$ 234 -161 -171 -287 -232 -115 -28 -37 -270 -149 -28 88 -196 141 484 -10 -229 313 -155 -50 124 -268 10
6287A0J57j02L6k05m4J10j83j94O83m13j01J61j24l94P50l09J03K46p0K87k9j64
$$ 10 167 65 101 -104 -148 -38 -221 -415 268 -145 -246 -85 -209 -603 147 -162 -59 187 117 404 375 211
6309B11j65J55k35N35n25O2o7k8Mq4L11j87k72o0K57k7N8o1J38j71K22K87m30
$$ 211 46 201 -34 501 -24 38 -29 -57 -53 -137 174 -13 -285 -345 -88 -115 -57 -118 20 -151 71 358 -72
6332g2J70j06J01m6K18M1m76M17j18k55M1J29l7l04K93j12j21J06l08M48l33J46
$$ -72 98 -8 93 47 265 306 -170 247 129 -126 -85 44 7 -297 -4 -116 -237 -131 -439 9 -324 -178
6354a78jN49n83N84k83k14J37J47N2rq2j42J56kj73qq0J30j13R1M7pN0m69O28
$$ -178 -179 370 -213 371 88 -126 11 158 210 201 119 -23 133 131 -42 -50 -130 0 -113 -22 25 18 68 -401 227
6379B27n63K87j83L5M1l1O09j78l05K52l24L26J08k11N8k84L90r1j98j30K56j18
$$ 227 -336 -49 -232 -197 -156 -187 422 244 -61 191 -133 193 301 90 148 -136 254 163 -35 -165 91 -27
6401b7O1q9l03N19j23j17J17r5N2l21O69m42K0%K33J82j92K45l19J74K39o64K85
$$ -27 34 -55 -358 161 38 -79 38 -57 -5 -326 343 -99 -79 -79 154 336 144 389 70 244 483 -181 104
6424A04j30k16M04J80k55n61N59k66N8j49J98P1R9l7M5k66J50p3J17K21j47K84
$$ 104 -26 -242 162 342 87 -474 85 -181 -123 -272 -74 -3 96 59 104 -162 -12 -85 32 253 106 390
6446C90p6l85l10N39O6q9l21j28N7K41j52K87l22m51M41R1K13l50r5J96R2K12
$$ 390 314 -71 -381 158 224 135 -186 -314 -257 -16 -168 119 -203 -654 -213 -122 91 -259 -354 -158 -66 146
6468A46j14k19M01k04M46o60N91j22j99n7R7j91K31j43P6m2j58m7Q0P7L14l90
$$ 146 32 -187 214 10 456 -204 387 265 66 9 106 -85 146 3 79 37 -121 -168 -88 -11 303 -87
6490h7j03L72j61J0k4J23j48M28l6k74k4J58N5j72k94L93j39k72J82j27j41N80
$$ -87 -190 182 21 31 7 130 -18 410 374 100 76 234 289 117 -177 216 77 -195 -13 -140 -281 299
6512B99j84l36J99J46j87K52k66k47L32O3L14n67K19k51J98O4R9K78l65j73L52
$$ 299 115 -221 -22 124 -63 189 -77 -324 8 71 385 -182 37 -214 -16 48 147 425 60 -113 239
6533B39l63N38n54K01kk43L60m93m7M83j87l03P8J53J08kk67L38J61k71K11k21
$$ 239 -124 414 -140 61 59 -184 176 -317 -364 119 -68 -371 -293 -140 -32 -34 -301 37 198 -73 138 -83
6555h3Q3J76k86l1p7L70m29K35J83n06M59K2k38k50l9K07J97k05M10n4k29L46
$$ -83 0 176 -110 -141 -218 152 -277 -42 141 -365 94 116 -122 -372 -411 -204 -7 -212 198 144 -85 261
6577B61Q0k41L25j25l2J0J4j21l03L77k56J11j87n4j8n0O4M2j18k32L55J11n67
$$ 261 341 100 425 300 268 278 292 171 -132 245 -11 100 -87 -141 -159 -209 -145 -103 -221 -453 -98 13 -554
6600e54N07j41K31k10M26M1k77L7k6J33nJ5J14l64L76k38q3j40K84k90L5K38k09
$$ -554 -47 -188 43 -167 259 300 23 60 34 167 162 177 291 -73 303 65 -18 -158 126 -164 -129 109 -100
6623a00J60l30J52J62l18Q4L21l33kL27n4J95m0j07l40K15N18j78o80M60Q7r0
$$ -100 60 -270 -118 44 -274 -190 131 -202 -204 123 69 264 224 117 -223 -8 510 332 -348 112 199 109
6645A09j81j25n1L2N31j68m80L98K3p8l7j20M03m62M85o08L24j80R7q8M68K18
$$ 109 -72 -197 -248 -216 315 147 -333 65 88 10 -27 -147 256 -206 279 -329 -5 -185 -88 -176 292 510
6667E10k43k92J84N9J92k48r8k55k82L41q5K00k29K30k72K30l8L38k62o5R4K55
$$ 510 267 -25 159 218 410 162 64 -191 -473 -132 -217 -17 -246 -16 -288 -58 -96 242 -20 -85 9 264
6689B64k24K04m8k30j15M15l3n53N87l8l10K9M64k68n64L91j59j00p7J01L31p5
$$ 264 40 244 196 -34 -149 266 233 -320 267 229 -81 -52 412 144 -420 -29 -188 -288 -365 -264 67 -8
6711hr9j8R2RJ01j7l3K45k53o5J85j48k67K27J73l4k01O38n62j51J52k66K19m64
$$ -8 -107 -125 -33 -24 77 60 27 272 19 -46 139 -9 -276 -49 124 90 -111 527 -35 -186 -34 -300 -81 -545
6735e45N83j17n8J52J77l06R1L10j62k30L15l98R8K00J15J1l85J08J69J97n22
$$ -545 38 -79 -137 15 192 -114 -23 287 125 -105 210 -188 -90 110 225 236 -149 -41 128 325 -197
6756a97K96m27P5K49j6k66J06P8q7J0K67J2J7k17K98k57R7J44l78O63k83M54p87
$$ -197 99 -328 -253 -4 -20 -286 -180 -102 -189 -179 88 100 117 -100 198 -59 38 182 -196 467 184 638 -149
6779a49J70j64N57l49k50K79n1m49L41L4k3k46J22K84k90K26L3q7j1K24k92l3
$$ -149 21 -143 414 65 -185 94 43 -406 -65 -31 -54 -300 -178 106 -184 42 75 -12 -23 201 -91 -124
6801a24P3Q5n3J54k18M93m30N77m90k85Q5Q6j55j8O9j86M36m52M68k81L36k96
$$ -124 -51 34 -19 135 -83 410 -20 557 67 -218 -133 -47 -202 -220 -151 -337 99 -353 115 -166 170 -126
6823a26n4J57J34q1M1n1O2K29m07L75j95j79L64k50l72K36J79r0k30j36K20J35
$$ -126 -180 -23 111 30 71 20 82 311 -96 279 84 -95 269 19 -353 -117 62 -28 -258 -394 -174 -39
6845c9l84M21J8k25P0l1J72J9J98j73R6M9k33K58rP3m20p8L49j81j17K20Kl01
$$ -39 -423 -2 16 -209 -139 -170 2 21 219 46 142 191 -42 216 207 280 -140 -218 131 -50 -167 53 55 -246
6869b46R0K4J18k10R5q3J01L9n7j41K74q2J67J34L2l78L79r4K6r6j42N7k02L96
$$ -246 -156 -132 -14 -224 -129 -212 -111 -72 -129 -270 4 -78 89 223 255 -123 256 162 188 92 -50 7 -195 201
6893B01k18k25L48k30j65P6j68k18M35j08q2P65k02j39M91m20k75L88J1n1k59
$$ 201 -17 -242 106 -124 -289 -213 -381 -599 -164 -272 -354 411 209 70 561 141 -134 254 265 214 -45
6914d5M29l88Lk9R6J94k86K0r3o8n4J65k67j45N15J01o92M37N4l9M34k09Q4Q7
$$ -45 384 -4 -1 -30 66 260 -26 -6 -99 -167 -221 -56 -323 -468 47 148 -544 -107 -53 -92 342 133 217 304
6938C04j20m85N40j21K09j37j84J63l18lJ67j61P6p7O4k2N2j84M98m01P8r4j60
$$ 304 184 -301 239 118 327 190 6 169 -149 -152 15 -146 -70 -147 -83 -105 -53 -237 261 -140 -62 -156 -316
6961c16J58K86R8m09L48L95n52OJ40j8k90K59J20n04K76j38M25m74%Q8n0J37K0
$$ -316 -158 128 226 -183 165 560 8 14 154 136 -154 105 225 -279 -3 -141 284 -190 -190 -102 -152 -15 5
6984Ek36K50K1k17p6K45J00KP1R9j5j51o7N29l64m15N45J8p99P39J09m98n3O3
$$ 5 -231 19 40 -177 -253 -8 92 94 165 264 249 98 31 560 196 -219 326 344 -455 284 393 -105 -158 -95
7008i5k4k96J10L69k00L25l43k43N19K16j14j12p4J73L2p0l8k31L42j84k26J7
$$ -95 -119 -415 -305 64 -136 189 -154 -397 122 338 224 112 38 211 243 173 135 -96 246 62 -164 -147
7030a47j09j37L41o5k9J61l66J90n7L08q6K40l85J9j8L11J83k70Q8j11o4M0o3
$$ -147 -256 -393 -52 -117 -146 15 -351 -161 -218 90 4 244 -141 -122 -140 171 354 84 172 61 -3 37 -26
7053b6O92o09oJ89l89L21j35m28J99l72O56j73j25J23J46L7K60k80j72j05J84
$$ -26 666 57 51 240 -149 172 37 -391 -192 -564 92 -81 -206 -83 63 100 360 80 -92 -197 -13
7074a3J89l68P71m23J71j54j22j58K49M8l29j33K04K6J42N0M1j80P9j70N7j7k11
$$ -13 176 -192 579 156 327 173 51 -107 142 190 -139 -272 -68 -42 100 150 191 11 90 -80 -23 -40 -251
7097b51K61K1j04L92l36q5M77K3k58J1J07k64P6R3m2L0j6o3j74k7Mrk10N1L64
$$ -251 10 31 -73 319 -17 -102 375 398 140 151 258 -6 70 163 121 151 135 72 -102 -129 -125 -134 -344 -293 71
7122G1p0J96j16p5K54o4K73k80l41N47km49P1J17k66L0L2K32l53J52R7J97m36
$$ 71 1 197 81 6 260 196 469 189 -152 395 393 -56 15 132 -134 -104 -72 160 -193 -41 56 253 -183
7145a83p6K48k48J71n7K79m69N42j19j69M63K6m87J79M24l48k55lL38p9j12K25
$$ -183 -259 -11 -259 -88 -145 134 -335 207 88 -81 382 408 -79 100 524 176 -79 -82 256 177 65 290
7167B90l17o9R6j29J6K46k95J06M6K93k29j69Q2j12q6M35j8l44J10L67l09j92
$$ 290 -27 -96 0 -129 -113 133 -162 -56 -10 283 54 -115 -33 -145 -231 204 186 -158 -48 319 10 -182
7189a82J88o9J30j17R1j64J39j15o6j04K69j58K50j68k88q4J49N19K53j85l93
$$ -182 6 -63 67 -50 41 -123 16 -99 -165 -269 0 -158 92 -76 -364 -448 -299 220 473 288 -105
7210a05L85k21o6N4K73l50j02pO3oK0J53k02j36L1p9J86l15L78l16J99L73j53
$$ -105 280 59 -7 47 320 -30 -132 -139 -76 -82 -62 91 -111 -247 -216 -295 -109 -424 -46 -362 -163 210 57
7233E7m89M32J17KK2k51M57m0Oo1n30O41m87J42m0q6l53M01Q7J11m60P7M42l47
$$ 57 -432 0 117 119 141 -110 347 307 313 252 -278 363 -124 18 -22 -108 -461 -60 27 138 -322 -245 197 -150
7257a50J13k99M09k15l36O23j17J4j01n1P8Q1K8j89J9j00rM51m44q2L3K39j91
$$ -150 -37 -336 73 -142 -478 145 28 42 -59 -110 -32 49 77 -112 -93 -193 -202 249 -195 -277 -244 -5 -196
7280a96j2M27n78O04j88J0o4j00l39K96J03N1k08J27J78j59J68J3l7K12m50Q5
$$ -196 -208 219 -359 245 57 67 3 -97 -436 -140 -37 14 -194 -67 111 -48 120 133 96 308 -142 -57
7302e7K21l53k15M99n19K24N7j59J74J58j57j37L43J93n46J61L1j31L49j91J42
$$ -57 164 -189 -404 95 -424 -200 -143 -302 -128 30 -127 -264 79 272 -274 -113 -82 -213 136 -55 87
7323H7J12q9Pj17j72M38j93n1M3k44N4L32j93k04N3j9J08%l1J05j53L16k01R9
$$ 87 199 110 117 0 -172 266 73 22 65 -179 -125 207 14 -190 -137 -156 -48 -48 -79 26 -127 189 -12 87
7347H7J8j11L22l25O3l89M30l55M09P1j80J9m7j19m2j02K41k66K15k33K24k3j9
$$ 87 105 -6 316 -9 54 -335 95 -260 149 220 40 59 12 -107 -149 -251 -10 -276 -61 -294 -70 -93 -112
7370a12r8l9L80k10J10M87l31r2k11L94j75l00M0O8N1l81L69J48m70m8L57j53
$$ -112 -210 -249 131 -79 31 518 187 95 -116 278 103 -197 -157 -89 -38 -419 -50 98 -372 -420 -63 -216
7392b16J26J16N7j38J54k8l28M68J3k62j12K57P7j28R3J08l72L34l52L49J9j51
$$ -216 -90 26 83 -55 99 71 -257 211 224 -38 -150 107 184 56 149 257 -115 219 -133 216 235 84
7414H4J20k57j30J81k66p8K05L08l46j40J67l74K55K22J65K1K42or2k45M9l4k92
$$ 84 204 -53 -183 -2 -268 -346 -141 167 -179 -319 -152 -526 -271 -49 116 137 379 373 281 36 85 51 -241
7437b41M69n8k61m1N5K71p68K83K40l9J8l5j71M00l08J59J0Q2J05j75J32L50m6
$$ -241 228 170 -91 -132 -77 194 -574 -291 -51 -90 -72 -107 -278 122 -186 -27 -17 65 170 -5 127 477 431
7460D31j23k89J20l60L67J66j82O2j41k15j54M43l06J15k09K49J06m2k69J83K1
$$ 431 308 19 139 -221 146 312 130 192 51 -164 -318 125 -181 -66 -275 -26 80 38 -231 -48 -27
7481b7m4J21L93m21RK65K08l36K35m22p4O0L11j81j21j78P4q6M9M84l02l30L85
$$ -27 -71 50 443 22 31 296 504 168 403 -19 -93 -33 278 97 -24 -202 -128 -214 -165 319 17 -313 72
7504G2j93K5q4J07l1L3q2j43O24Qj30l09K91O1l67J69J59r5j10K8k00k8K38l33
$$ 72 -121 -96 -180 -73 -104 -71 -153 -296 328 336 206 -103 188 249 -118 51 210 115 5 33 -167 -195 43 -290
7528b90r7K23J86j16Rk55L27k06J77nJ8J46J56j80J44j9J07l52j68J70L34k75
$$ -290 -387 -164 22 -94 -85 -340 -13 -219 -42 -47 -29 117 273 93 237 218 325 -27 -195 -25 309 34
7550C4j51L77m06K4k4J22Q0L0O8p9k48J67j8M23p5l59K46j58L27j07k21J14k38
$$ 34 -117 260 -146 -122 -146 -24 56 86 154 75 -173 -6 -24 399 324 -35 211 53 380 273 52 166 -72
7573g2k81M14J71j23q4N4j12p6l12k21K72K85j89K83J04n87L73j17QJ92J82j39
$$ -72 -353 61 232 109 25 79 -33 -109 -421 -642 -370 -85 -274 9 113 -474 -101 -218 -210 -18 164 25
7595B5j59O00m90l1K7j50K81p9L3J62l05k46L86j97j13N52k31q5L33j45k15o8
$$ 25 -134 466 -24 -55 -28 -178 103 24 57 219 -86 -332 54 -143 -256 296 65 -20 313 168 -47 -115
7617a15J00o1M20j77q2k94K48K44l54K48J24k25j30L27k87q3k04L44j12nO6k87
$$ -115 -15 -76 344 167 85 -209 39 283 -71 177 301 76 -54 273 -14 -97 -301 43 -69 -74 -8 -295
7639b95N6J61%p6K60k23K39j90K95j07K91j38k52N11k83j3k56J43O5o23L59rK97
$$ -295 -239 -78 -78 -154 106 -117 122 -68 227 120 411 273 21 532 249 236 -20 123 188 -435 -76 -85 212
7662B12k31n4j84K64p0K70k98J45M0k81K08J38m1k69K47m1L80l60k08k5L94p8
$$ 212 -19 -73 -257 7 -63 207 -91 54 94 -187 21 159 118 -151 96 55 435 75 -133 -158 236 158
7684A58J1j44j20k7K04k85J90j11j92N29l00m23M61L5l9J79k26q5L41n8j06L9
$$ 158 169 25 -95 -122 82 -203 -13 -124 -316 213 -87 -510 -49 -14 -53 126 -100 -185 156 98 -8 31
7706C1L60q5l28K54k58P1r1L13k5l44L96l64P4k22L72k49k05M07Rk96K43j05L8
$$ 31 391 306 -22 232 -26 45 -46 267 242 -102 294 -70 4 -218 154 -95 -300 107 116 -180 63 -42 -4
7729dK37J66o0l79K85J59k78j92K75l52N8j55O3J99j3m43L39n5L93j41k25R8j8
$$ -4 233 399 339 -40 245 404 126 -66 209 -143 -85 -240 -177 22 9 -434 -95 -150 243 102 -123 -25 -43
7752d3K16k56K46P4m29J76K01m4q7J84j09l92N11r9l4j15L22l95m5J77n01L12
$$ -43 173 -83 163 237 -192 -16 185 141 54 238 129 -263 248 149 115 0 322 -73 -118 59 -442 -130
7774a30j41K88Oj15j74M58m43L45r7j08j06R6K30lr5mO3k27L71r0j81k92L03M5
$$ -130 -271 17 23 -92 -266 192 -251 94 -3 -111 -217 -121 109 106 11 7 70 -157 214 124 -57 -349 -46 -1
7798aj67r3P1J50r0J54j49O1J41m75L48o7L05l12M22k33M25n91J84K56j8k42J70
$$ -1 -168 -261 -190 -40 -130 24 -125 -64 77 -398 -50 -117 188 -124 298 65 490 -101 83 339 321 79 249
7821B49l35L08j7j02m2n5n4j85J6K05k65L54j57kM91n27j52K74P5l9O6K74m86
$$ 249 -86 222 205 103 61 6 -48 -233 -217 -12 -277 77 -80 -82 409 -118 -270 4 79 40 106 380 -106
7844a06K72l91m8M08K1r4j47K03n09k6N23o5k53J16L0J90j07P2o1J57k96J66m6
$$ -106 166 -225 -273 135 156 62 -85 118 -391 -417 106 41 -212 -96 -66 124 17 89 28 185 -111 55 9
7867IJ56k08J2j14J82N06j32k63R0R1k20k09K04k16P0M7j15l7K21l26l2N07j54
$$ 9 165 -43 -31 -145 37 543 411 148 238 329 109 -100 104 -112 -42 5 -110 -147 74 -252 -284 223 69
7890F9Lj78P5O01m75j82O7Q1K66p6k08q0p5N7Q0J88l34L5l0j29j26K04j49L03
$$ 69 72 -106 -31 570 95 -87 -20 61 327 251 43 -37 -112 -55 25 213 -121 -86 -116 -245 -371 -167 -316 -13
7914a3P1k47M61k76R4m76M87K45m29K66Q0j2j11k77L22j13k60K98J72j47l36M68
$$ -13 58 -189 272 -4 90 -386 101 346 -83 183 263 251 140 -137 185 72 -188 110 282 135 -201 267
7936B67m35R4l63K97J25kk98K8L50n0k0j22M27j46Pj37K73k68j12R9M95m06O3
$$ 267 -168 -74 -437 -140 -15 -17 -315 -287 63 13 -7 -129 298 152 159 22 295 27 -85 14 509 103 166
7959A66o5k30K12m07K43k7O0p9p0j57J84K0J57J93l92J21K52j10p3J82o1J34j05
$$ 166 101 -129 83 -324 -81 -108 -48 -127 -197 -354 -170 -150 7 200 -192 -71 181 71 -2 180 119 253 148
7982A48J09k25l8M56l15j06k27M40l24J02L75r48J84J35j47J57J95j94K12l43
$$ 148 257 32 -6 450 135 29 -198 242 -82 20 395 -553 -369 -234 -381 -224 -29 -223 -11 -354
8002c54L93K3K4o0J34q7J33j36p9J36j99k12K31L31k23r3k16J9M22o3m77M09j39
$$ -354 39 62 86 26 160 73 206 70 -9 127 -72 -284 -53 278 55 -38 -254 -235 187 124 -353 56 -83
8025h3l92L48K82k50P5K19l41O5K94k31o2j37K95l45K74K51r9k56L82k97k0k55
$$ -83 -475 -127 155 -95 -20 199 -142 -77 217 -14 -76 -213 82 -263 11 262 163 -93 289 -8 -28 -283
8047b83L68k75K00m54L47r2k04N31j12j49J29l32K38J89j39pK63P8m00m0K03Q1
$$ -283 85 -190 10 -444 -97 -189 -393 138 26 -123 6 -326 -88 101 -38 -45 218 296 -104 -144 59 140
8069A40kj47J03k09O2k93K11K87l13L01j82j14j2J71l21Q1M79m51K92J46K46k10
$$ 140 138 -9 94 -115 -53 -346 -135 152 -161 140 -42 -156 -168 3 -318 -237 242 -209 83 229 475 265
8091B65n54J66Q5k9J32j03p5K77l38J47J57k7k81l16M05j19J27j16k97R77m03
$$ 265 -289 -123 -38 -67 65 -38 -113 164 -174 -27 130 103 -178 -494 -89 -208 -81 -197 -494 483 80
8112H0J16j03j04m1p3J54k2N00q2k1k67K81o67K43J16J40m92j14M07l63N94k23
$$ 80 196 93 -11 -52 -125 29 7 507 425 404 137 418 -249 -6 110 250 -242 -356 51 -312 282 59
8134E9k5l94L45k87L72l02L11m43O12k69J07J01k50K39l97L89Qj49o0m0Q1K8l51
$$ 59 34 -360 -15 -302 70 -232 79 -364 248 -21 86 187 -63 176 -221 168 176 27 -33 -73 8 36 -315
8157c15J53K58n2l19L37k84o4M19p0j38J52j33J03k15j0K39J22M4J0j54O4j27
$$ -315 -162 96 44 -275 62 -222 -286 133 63 -75 77 -56 47 -168 -178 61 183 227 237 83 147 20
8179B0J6j62J11j65J14J89j29l16K74J40O3k39
$$ 20 36 -126 -15 -180 -66 123 -6 -322 -48 92 155 -84
8191h4
$$ Imaginary data points
##PAGE= N=2
##DATA TABLE= (X++(I..I)), XYDATA
0@%%%%%%%%%J5m7O4o4R6j28J40j72K24k57K98l62M49n44O40p64Q91j024J185j375
$$ 0 0 0 0 0 0 0 0 0 0 15 -32 32 -32 64 -64 76 -96 128 -129 169 -193 256 -288 352 -412 479 -545 640 -735
29g35J568j794K050k329K640k983L363l778M231m734N288n888O546p261Q047q908
$$ -735 833 -961 1089 -1240 1400 -1583 1780 -1998 2233 -2501 2787 -3101 3445 -3816 4231 -4677
45d677R842j0866J1989j3212J4553j6034J7665j9469K1475k3722K6252k9120L2404
$$ -4677 5165 -5701 6288 -6924 7629 -8405 9260 -10209 11266 -12456 13796 -15324 17080
58A7080l6210M0683m6029N2549o0712P1279q5551J06031j38078J95721l31535
$$ 17080 -19130 21553 -24476 28073 -32639 38640 -46911 59120 -78958 116763 -214772
69b14772J223987J028936k069085m49006O60341K41693r03794k23204L20463n8074
$$ -214772 1009215 2038151 -30934 -479940 180401 422094 -481700 -704904 -384441 -442515
79d42515o07803N5697M90281P5389m25954J93999P23337K52846m07610J16380
$$ -442515 -1050318 -994621 -504340 -428951 -854905 -660906 62431 315277 -92333 24047
89B4047O36393j813p09633j71P40453J87243n35301j20061K87374j33896m25215
$$ 24047 660440 658627 -51006 -51177 689276 876519 341218 221157 508531 374635 -50580
100e0580J8597K24187r9697k44700o9742j42401k87499N760M71375L22888l39099
$$ -50580 -31983 192204 92507 -152193 -221935 -364336 -651835 -646075 -174700 148188 -190911
111a90911n42117Q7977N88553K72616j15338J11151K58006j31459k36456K07578
$$ -190911 -733028 -645051 -56498 216118 100780 211931 469937 338478 102022 309600
121C09600K19198k84556k53396K34897J09758m29678l46584J53161J54239j93071
$$ 309600 528798 244242 -9154 225743 335501 -94177 -440761 -287600 -133361 -326432
131c26432j47476K30733L20866O784k06110j6393J91697K6460j35253J08811K83531
$$ -326432 -473908 -243175 77691 84475 -121635 -138028 53669 80129 -55124 53687 337218
142C37218l4951k81856m7196J22468l0992Q714K34989P7012k94604k62405L0716
$$ 337218 302267 20411 -26785 95683 64691 73405 308394 385406 90802 -171603 -140887
153a40887Q2567m3700q0163m4839j3069p308n4632l1858J25457J83743P0043N2016
$$ -140887 -58320 -102020 -182183 -227022 -240091 -247399 -302031 -333889 -208432 -24689 45354 97370
165I7370J25057K3482j08407j952J17137K3443m9839M232l2749j26799r2570m4189
$$ 97370 222427 245909 137502 135550 252687 276130 226291 230523 197774 70975 -21595 -65784
177f5784o6052m290Q2951Q698p7928k3414j2908p3055J6874J50641Q2159k7057
$$ -65784 -131836 -136126 -53175 -44477 -122405 -145819 -158727 -231782 -214908 -64267 17892 -9165
189i165R238J3895o4127k1391R4817Q7176L5176L3140j3135o9131l2418n706l3338
$$ -9165 73 13968 -50159 -71550 23267 110443 145619 178759 165624 96493 64075 58369 25031
202B5031K0057O9184n1377j49568n4460K265n5393J3743J47668P2957o2593o736
$$ 25031 45088 114272 62895 -86673 -141133 -138868 -194261 -180518 -32850 40107 -22486 -29222
214b9222O0712r598j8090P5263P1902j2932m6322o1003p0754k3298O933j4814
$$ -29222 31490 21892 3802 79065 150967 138035 91713 30710 -40044 -63342 -56409 -71223
226g1223K4914O7313k6138r2158R095N1758m3348j1510J22723O7835p7563m5186
$$ -71223 -46309 21004 -5134 -97292 -88197 -36439 -79787 -91297 31426 99261 21698 -23488
238b3488L4711j4615k2835P7725R6435J3461l0724m7452o2111j9086K3920L766
$$ -23488 11223 -3392 -26227 51498 147933 161394 130670 83218 21107 2021 25941 29707
250B9707N506J4356p5824j36891l1199N2710n278J474R6134M6511p1261j9586
$$ 29707 35213 49569 -26255 -163146 -194345 -141635 -146913 -145439 -49305 -2794 -74055 -93641
262i3641P9729M0745R140P2228O7841j6827l7053k3200l9925k1579J5343m323
$$ -93641 -13912 26833 35973 108201 176042 159215 122162 98962 59037 37458 52801 48478
274D8478j1623J4236l7904j00822l3976M1625k816j0094O5132K7082q5087n6259
$$ 48478 36855 51091 13187 -87635 -121611 -79986 -82802 -92896 -27764 -682 -85769 -142028
286a42028L7040K7592K3413Q5238O6832k0896k6731O604k901K0119O2692J8149
$$ -142028 -104988 -77396 -53983 31255 98087 77191 50460 57064 54163 74282 136974 155123
298A55123m3463l1776m4114q8726m0244L5022M012k7710J8141Q747n7180k2307
$$ 155123 111660 79884 35770 -52956 -93200 -58178 -54166 -81876 -63735 -54988 -112168 -134475
310a34475N3794L5862K0316O5840M3537l4434k4759J4414q715O53N7953L1803
$$ -134475 -80681 -44819 -24503 41337 84874 50440 25681 40095 31380 32033 89986 121789
322A21789l5131k7553k0041n9276k9492M3366K3618k7638j1518j9433p0655l7107
$$ 121789 86658 59105 39064 -20212 -49704 -6338 17280 -10358 -21876 -41309 -111964 -149071
334a49071M1495L5570J4229M5918K6719l4802r819M3648K6257K3068O5613L0297
$$ -149071 -107576 -72006 -57777 -11859 14860 -19942 -29761 13887 40144 63212 128825 159122
346A59122m9748l9519p722l9672l2959K9609J4877m2049l1137j8315n0206k4707
$$ 159122 109374 69855 62133 22461 -10498 19111 33988 -8061 -39198 -57513 -107719 -132426
358a32426M1221L3048P179L2546J6360m3915j8036M4639K8375J3551N7014L7661
$$ -132426 -91205 -58157 -50978 -18432 -2072 -45987 -64023 -19384 8991 22542 79556 117217
370A17217m1408l7212J0280l901n996L8569J9550m4798m3258k8114n1901k7468
$$ 117217 75809 38597 48877 44976 38980 77549 97099 52301 9043 -19071 -70972 -98440
382i8440L6741K1420k1060J309N927l9281j5022N6497N0057J7546M0077K9759
$$ -98440 -61699 -40279 -61339 -60030 -54103 -93384 -108406 -51909 -1852 15694 55771 85530
394H5530l1769k7590J8626Q716P5L3701J2319m9195m1926j3370l5381k2273L8547
$$ 85530 53761 26171 44797 53513 53588 87289 99608 50413 8487 -4883 -40264 -62537 -23990
407b3990K8674k7977k0156m605l6859k0694M5224M4196P661K1134J6223l2238
$$ -23990 4684 -23293 -43449 -48054 -84913 -105607 -60383 -16187 -8526 12608 28831 -3407
419c407j9790L4648K8802J0458L7615K0754m3672m1035l298j7712j8308K8949
$$ -3407 -23197 11451 40253 50711 88326 109080 65408 24373 21075 3363 -14945 14004
431A4004J9034l9234l5910j1570l2362j6604M5445M1496l397Q140J6798k5100
$$ 14004 33038 -6196 -42106 -53676 -86038 -102642 -57197 -15701 -19098 -10958 5840 -19260
443a9260j8599L9596L8169Q204K1498J2686m0581l5721Q102J228q142K5414J4588
$$ -19260 -37859 1737 39906 48110 69608 82294 41713 5992 14094 15322 7180 32594 47182
456D7182m0787l6009l033k0949j7093L7288L5245j4719j3668M492k2993j5834
$$ 47182 6395 -29614 -32647 -53596 -70689 -33401 1844 -12875 -26543 -22051 -45044 -60878
468f0878M0814M2923J0253J8904J3196l6076l1767K2229K1743m758J4455J0305
$$ -60878 -20064 22859 33112 52016 65212 29136 -2631 19598 41341 36583 51038 61343
480F1343m1513m6171q332r247j0078K5127K2067j7793j4128K095j9722n255N0054
$$ 61343 19830 -26341 -34673 -43920 -53998 -28871 -6804 -24597 -38725 -36630 -56352 -61607 -11553
493a1553L8579j0404O854K3893k5501l6767K5454M0088j56r90P578k6335l8997
$$ -11553 27026 16622 23476 47369 21868 -14899 10555 50643 50487 49497 57075 30740 -8257
506h257r575K569O106K2194P84l7531k0881J544k4663j1212N3485M2443k5666
$$ -8257 -17832 -15263 -9157 13037 13821 -23710 -44591 -43047 -67710 -78922 -25437 17006 -8660
519h660j4074K7268n598k7202K8942N2526Q395q012L201j8373l1035o310N449
$$ -8660 -22734 4534 -1064 -28266 676 53202 61597 53585 56786 38413 7378 1068 6517
532F517N319J7144j587l8198k3777L121j6487j0082M3812L4617k9602k3519J6643
$$ 6517 11836 28980 27393 -10805 -34582 -31461 -47948 -58030 -14218 20399 -9203 -32722 -16079
545a6079q729k2874L4694N1721n254k0114R941l008k5374L470K9303J5166K92
$$ -16079 -24808 -47682 -12988 38733 33479 13365 23306 20298 -5076 -1606 27697 42863 43155
558D3155j4056k8059j4645M3j6026l371M0686J7163m4712k1745K8640q520l4311
$$ 43155 29099 1040 -13605 -13562 -29588 -32959 7727 24890 -19822 -41567 -12927 -21447 -55758
571e5758L5660O5966q547m0713M948J0894k1914m356L3422K6693l413k6490l0361
$$ -55758 -20098 45868 37321 -3392 1556 12450 -9464 -13820 19602 46295 42882 16392 -13969
584a3969m943J2792r340m867L7723J6791n1551l2113L1909R481k9090K0277N2095
$$ -13969 -18912 -6120 -15460 -20327 17396 34187 -17364 -49477 -17568 -8087 -37177 -16900 35195
597C5195q423m0477J962J3107j1080N802L1225J5070n819j2065k4024j7007R143
$$ 35195 26772 -13705 -11743 1364 -9716 -3914 27311 42381 36562 24497 473 -16534 -7391
610g391P964Q21J7959N181m0633l1930J6963J0414q251K7518L4201k5859l7654
$$ -7391 573 1394 19353 24534 -16099 -48029 -31066 -20652 -28903 -1385 32816 6957 -30697
623c0697J4481J4547j5586J1104L9245L125k5601p258L76o747N898J1847M599
$$ -30697 -16216 -1669 -17255 -6151 33094 36219 10618 3360 3736 -3011 2887 14734 19333
636A9333Q188k199l2466k2968J6045O915j3385J9442L0543k3713m0811N487J5460
$$ 19333 27521 25322 -7144 -30112 -14067 -7152 -20537 -1095 29448 5735 -35076 -29589 -14129
649a4129o024J5903L3648m146k7589o927m658q859K1663L1657m825j5846r84j2587
$$ -14129 -20153 -4250 29398 25252 -2337 -9264 -13922 -22781 -1118 30539 25714 9868 8884 -3703
663c703j9946J0592J9863L71M184R608j6283k0026P772M044q519J9568K7779j8468
$$ -3703 -23649 -13057 6806 7177 11361 20969 4686 -15340 -7568 -3524 -12043 7525 35304 16836
677A6836l0722N165J092k0601J1151L7002J629k2663n362p757j7491J0961K9027
$$ 16836 -13886 -8721 -7629 -28230 -17079 19923 21552 -1111 -6473 -14230 -31721 -20760 8267
690H267N985n156R0j5683j7784J1882J9205O340J3232J1590k2263k2225J1005
$$ 8267 14252 9096 9186 -6497 -24281 -12399 6806 13146 26378 37968 15705 -6520 4485
703D485K968j8276J2509K8408j6644l1247M790L352k5274L52L5873J3376j5021
$$ 4485 7453 -10823 1686 30094 13450 -17797 -13007 -9655 -34929 -34577 1296 14672 -349
716c49q695n667r834M970J4562J1689J9196R545k5846k2642J7361J2836j1896
$$ -349 -9044 -14711 -24545 -19575 -5013 6676 25872 35417 9571 -13071 4290 17126 5230
729E230J3229K9271j9137m2470j05J1963j5188j716K3703K242k2693q971k493
$$ 5230 18459 47730 28593 -13877 -13982 -2019 -17207 -18923 4780 7022 -15671 -24642 -27135
742b7135o604R318J8655O876P576J0122j3294j7994J4860J7361l925J0708K2429
$$ -27135 -33739 -24421 -5766 1110 8686 18808 5514 -12480 2380 19741 15816 26524 48953
755D8953j7054l8092j029J1109j2297Q23K4285l583k9504j0428L58q079O862K1200
$$ 48953 31899 -6193 -7222 3887 -8410 -7587 16698 13115 -16389 -26817 -26459 -34538 -27676 -6476
769f476N358m400J92r826j0848J8411K4449J100P055J9614j1753k9227L777J6588
$$ -6476 -1118 -5518 -5326 -15152 -26000 -7589 16860 17960 25015 44629 32876 3649 7426 24014
783B4014r248l615J6668p484l3287j3547K643p033M321J8252J571j0693j273p246
$$ 24014 14766 11151 27819 20335 -12952 -26499 -23856 -30889 -26568 -8316 -6745 -17438 -18711 -25957
797b5957j1043J6910K8732K942L35J5340n616k4512N842K5278J218k282J2904
$$ -25957 -37000 -20090 8642 11584 11919 27259 21643 -2869 2973 28251 29469 27187 40091
810D0091p698l0130j0465M114o441J784J2607p887k1668l772k885j2174J1581
$$ 40091 32393 2263 -8202 -4088 -10529 -8745 3862 -4025 -25693 -29465 -32350 -44524 -32943
823c2943K7610L958n857J0146K26j5460R542K7100O112j640J1175o486k6787o110
$$ -32943 -5333 -1375 -7232 2914 3140 -12320 -2778 24322 30434 28794 39969 33483 6696 586
837E86J0547l072p84J1539r262k5464p144q52r032O747K2342j327j4981L448J610
$$ 586 11133 8061 7277 18816 9554 -15910 -23054 -23906 -32938 -26191 -3849 -5176 -20157 -16709 -15099
852a5099j2642R683K9470Q449m509Q186p53j6889M96J4789R34o76Q146j0576k6439
$$ -15099 -27741 -18058 11412 19861 15352 23538 22785 5896 6392 21181 22115 21439 29585 19009 -7430
867g430n585M073r598J602J8861k814k2167k436N541q073N858K5581P827p525
$$ -7430 -13015 -8942 -18540 -16938 1923 -891 -23058 -25494 -19953 -28026 -22168 3413 11240 3715
881C715L444j523j2756O547K0692K976l006Q483p035k5159l250J2757m142k613
$$ 3715 7159 5636 -7120 -573 20119 23095 20089 28572 21537 -3622 -6872 5885 1743 -870
895h70J2398n027k3749o286N194o247M657K1443L066j2762J053K256j0652N987
$$ -870 11528 6501 -17248 -23534 -18340 -24587 -19930 1513 4579 -8183 -7130 -4874 -15526 -9539
909i539K4465O529o138M309m144j9760q11J5559P65k559R047o428k4439m846R823
$$ -9539 14926 21455 15317 19626 15482 -4278 -5089 10470 11235 8676 17723 11295 -13144 -17990 -8167
924h167m375J151J7396Q02j8247l369M561o353M170K0970N901q834K414j838j5456
$$ -8167 -12542 -11391 6005 6807 -11440 -14809 -10248 -16601 -12431 8539 14440 5606 8020 6182 -9274
939i274K352J9148K696n293P431l919k2943n151J3468M28j626J2700p57j9590
$$ -9274 -6922 12226 14922 9629 17060 13141 -9802 -14953 -1485 -1057 -2683 10017 9260 -10330
953a0330m864O262l885M424K0144J534j4947r39J671j2250K240K1047M086r627
$$ -10330 -15194 -8932 -12817 -8393 11751 13285 -1662 -2601 -930 -13180 -10940 10107 14193 4566
967D566K822j209j7292k047J6093L290k592R661j988j9283m408R638k480J158
$$ 4566 7388 6179 -11113 -13160 2933 6223 3631 13292 11304 -7979 -12387 -2749 -5229 -4071
981d071J6839J375j7907m761M277q591J664J9464M860j1529q69q11j5097j17J8498
$$ -4071 12768 14143 -3764 -8525 -4248 -12839 -11175 8289 13149 1620 751 -60 -15157 -15274 3224
996C224M878n322O585q34j8177l288J4888K613j300J1904R04j7405n371O236n136
$$ 3224 8102 2780 9365 8531 -9646 -12934 1954 4567 3267 15171 16075 -1330 -6701 -465 -5601
1011e601k91J5637J901j5169k460J506j2078j349J9144O225q439L347J033j4658
$$ -5601 -5892 9745 11646 -3523 -5983 -4477 -16555 -17904 1240 7465 -974 2373 3406 -11252
1025a1252k782J6654O067k051Q612P09j7631m733J0111j418r31J3803R46j8739
$$ -11252 -14034 2620 8687 6636 15248 15957 -1674 -6407 3704 2286 1355 15158 16104 -2635
1039b635n974L816p802j863J6025L397j2074j96K059j1092q03J7926O833m481
$$ -2635 -8609 -4793 -12595 -14458 1567 4964 -7110 -7306 -5247 -16339 -17142 784 7617 3136
1053C136P158L090j4790l696J3264K522k669R311Q04j7637p559M708m761k344
$$ 3136 10294 13384 -1406 -5102 8162 10684 8015 17326 18130 493 -7066 -2358 -7119 -9463
1067i463J3941K062j5396l677L580r295j172J8073P943p956K151L360j0952j465
$$ -9463 4478 6540 -8856 -12533 -8953 -18248 -19420 -1347 6596 -1360 791 4151 -6801 -8266
1081h266J5537O256k393O719J199j5714n607P826k236l220J0080J59j7932o718
$$ -8266 7271 13527 11134 17853 19052 3338 -2269 5557 3321 101 10181 10340 -7592 -14310
1095a4310M053o736k922J5626O565j0181l44M389p708r71J7379Q868m255M632
$$ -14310 -10257 -16993 -19915 -4289 2276 -7905 -8249 -3860 -11568 -12539 4840 13708 9453 14085
1109A4085K568j3376n324J1425J930m080O630M90j7348q365M974m068l653J3139
$$ 14085 16653 3277 -2047 9378 11308 7228 13858 14348 -3000 -11365 -6391 -10459 -14112 -973
1123i73L327j3380l224M416o305j185J7722R573o472J402M217r323l130J3672
$$ -973 2354 -11026 -14250 -9834 -16139 -17324 398 9971 3499 4901 9118 -205 -3335 10337
1137A0337O018m266M597Q31j5764p949O626j923l977Q706K022j5546o859N302
$$ 10337 16355 12089 16686 17517 1753 -6196 430 -1493 -5470 3236 5258 -10288 -17147 -11845
1151a1845m360j997J5186Q928r307j039O572o546k786J5255Q795m680J668K017
$$ -11845 -16205 -18202 -3016 5912 -3395 -4434 2138 -4408 -7194 8061 16856 12176 13844 15861
1165A5861j2343o425Q342J276m539N792R72j6189p734O369k958l778J2678O877
$$ 15861 3518 -2907 5435 6711 2172 7964 8936 -7253 -14987 -8618 -11576 -15354 -2676 4201
1179D201j1892m225O514l620k915J4710J0743o035j18L350q342m794J0993M813
$$ 4201 -7691 -11916 -5402 -9022 -11937 2773 13516 7481 7363 10713 2371 -2423 8570 13383
1193A3383m894L059Q58j5273q060P145j389m351R445M285j3947n954P508j003
$$ 13383 8489 11548 12406 -2867 -10927 -3782 -5171 -9522 -77 4208 -9739 -15693 -8185 -9188
1207i188l733J3313R823p947k988N102m855l787J0319P804m195K25O39j1247n651
$$ -9188 -12921 392 10215 2268 -720 4382 -473 -4260 6059 13863 9668 9893 10532 -715 -6366
1222f366Q910Q39m735O798K692j5259q225P774K47n531J0591R208r121o576N712
$$ -6366 2544 3383 -1352 5446 8138 -7121 -15346 -7572 -7325 -12856 -2265 6943 -2178 -8754 -3042
1237c042o95k838J0890Q582m528j819K221q613n271R724L471n686L474K664j3096
$$ -3042 -3737 -6575 4315 12897 8369 6550 8771 158 -5113 4611 8082 2396 5870 8534 -4562
1252d562p535Q771J520m956Q054O983j1564q045O925L03m386R157R430p066n527
$$ -4562 -12097 -3326 -1806 -6762 1292 8275 -3289 -11334 -4409 -4106 -8492 665 10095 3029 -2498
1267b498L368l843k896R764O058m034M62J907j1749n480J0203K618n761M592O142
$$ -2498 870 -2973 -5869 3895 9953 5919 6381 8288 -3461 -8941 1262 3880 -1881 2711 8853
1282H853j2328r685P684M017m789O708Q210p008o825K540j958k754R460O514n678
$$ 8853 -3475 -13160 -5476 -1459 -6248 460 8670 1662 -5163 -2623 -4581 -7335 2125 8639 2961
1297B961j432L123q513n801J0823O916n158J988M753j0107q583P173M083m472
$$ 2961 1529 4652 -3861 -9662 1161 8077 2919 4907 9660 -447 -9030 -1857 2226 -2246
1311b246M767O273r911q326M898M92l917P829Q067o217m910K877m048l754R376
$$ -2246 2521 8794 -1117 -9443 -4545 -4053 -7970 -141 7926 1709 -3201 -324 -4372 -8126 1250
1326A250O546m767N64M022r081p306R486N901n159K739O783q852j0575M418L602
$$ 1250 7796 3029 3593 7615 -1466 -8772 714 6615 1456 4195 10978 2126 -8449 -4031 -429
1341d29m145M842O261p496o451K652k496l162R996P488n621k058N441n580o464
$$ -429 -4574 268 6529 -967 -7418 -4766 -7262 -10424 -428 7060 1439 -619 4822 -758 -7222
1356g222Q877Q615m964k22M408p573q954M962M143l481L465N374q270q017M160
$$ -7222 1655 10270 5306 5084 9492 1919 -7035 -2073 2070 -1411 2054 7428 -842 -8859 -4699
1371d699r5m383O918Q261o597m650M091k702m989Q253R023l378o36M777o010p531
$$ -4699 -4794 -9177 -2259 6002 -595 -5245 -1154 -3856 -8845 -592 8431 5053 4417 9194 3184 -4347
1387d347O493N794m463P85M767q205j0180L986K339l818M321O229o617n879M262
$$ -4347 2146 7940 3477 4262 9029 824 -9356 -5370 -3031 -6849 -2528 3701 -2916 -8795 -4533
1402d533m87l851P942R092m918l273M637k813o149O989P645l510j367M201p054
$$ -4533 -5020 -8871 -929 8163 3245 -28 4609 1796 -4353 2636 10281 6771 5404 9605 2551
1417B551p858L895L469m472K905M514p688q214L331R06l847O103R185m686m499
$$ 2551 -5307 -1412 2057 -2415 490 5004 -2684 -10898 -7567 -6661 -10508 -4405 4780 94 -4405
1432d405M132k44l740O890Q402l189k163K991m808p786M716N655m871r1M556o874
$$ -4405 -273 -517 -4257 2633 11035 7846 5683 8674 3866 -3920 796 6451 1580 1489 6045 -829
1448h29r087L636K882l592L471O802n209o929L240J572l816O559R155l203l366
$$ -829 -9916 -6280 -3398 -6990 -3519 3283 -1926 -8855 -5615 -4043 -7859 -1300 7855 4652 1286
1463A286M086j897n722N834P359l423k381L193o051r599L718L506l889J113N415
$$ 1286 5372 3475 -2247 3587 10946 7523 5142 8335 2284 -7315 -3597 -91 -3980 -2867 2548
1478B548n766p981L890K937l315N112Q352l390n069L686o44m206N897Q012k839
$$ 2548 -3218 -11199 -7309 -4372 -7687 -2575 5777 2387 -2682 1004 360 -3846 2051 10063 7224
1493G224l122L579m798p739M750O421m111j120M083n850r124K549L673k763K233
$$ 7224 4102 7681 2883 -4856 -106 6315 2204 1084 5167 -683 -9807 -7258 -3585 -6348 -4115
1508d115O491l570o373L496J296k677N703Q435k474l797K753j525o515L903P784
$$ -4115 2376 -1194 -7567 -4071 -2775 -5452 251 8686 6212 2415 5168 3643 -2872 1031 8815
1523H815l108l081L192l898q934K385M763k451L88M771m595p273K257K666l050
$$ 8815 5707 2626 5818 1920 -7014 -4629 134 -2317 -1929 2842 -1753 -9026 -6769 -4103 -7153
1538g153M373P775k891n104L391R74m853M671Q429k224l698L179k727p588K623
$$ -7153 -2780 4995 2104 -3000 391 1365 -3488 1183 9612 7388 3690 6869 4142 -3446 -823
1553h23N807l388j627M147m815q356K122L725k769J951O988l440o307K748K469
$$ -823 4984 1596 -31 4116 -699 -9055 -6933 -3208 -5977 -4026 2962 -478 -6785 -4037 -1568
1568a568l656L841Q975k137m285K912l29o430L674P460j980l273K711l141p625
$$ -1568 -5224 -1383 7592 5455 1170 4082 3753 -2677 997 8457 6477 3204 5915 2774 -4851
1583d851J362M497l053m96M687m080p046J712L203k783K716Q253k061n407L375
$$ -4851 -3489 1008 -2045 -2541 2146 -1934 -8980 -7268 -4065 -6848 -4132 4121 2060 -3347 28
1598B8J756m398L485Q169j338l780K200j721o417J413N825k417k230L189l649
$$ 28 1784 -2614 871 9040 7702 3922 6122 4401 -2016 -603 5222 2805 575 3764 115
1613A15p889Q95M918l164Q13N662k020o895J768L363k492K750P783o49m273K895
$$ 115 -7774 -6879 -1961 -5125 -4312 1350 -670 -7565 -5797 -2434 -4926 -2176 5607 4958 685 3580
1629C580M50m889K433O874j798k998K416k751q038R31M905k860j190M236k592
$$ 3580 4030 -859 1574 8448 6650 3652 6068 3317 -4721 -3790 1115 -1745 -2935 1301 -1291
1644a291p586J548L371k061K038P036j010n524K350K329l556K902P539p09l718
$$ -1291 -8877 -7329 -3958 -6019 -3981 3055 2045 -3479 -1129 1200 -2356 546 8085 7376 3658
1659C658J860q74o307J581N235k047k681K647k580p950P06M275k174k94N552r21
$$ 3658 5518 4644 -1663 -82 5153 3106 425 3072 492 -7458 -6752 -2477 -4651 -4945 607 -314
1675c14o126Q17L638j828J915P836l39m099J727P11m836J660O712j032l787K227
$$ -314 -6440 -5623 -1985 -3813 -1898 5938 5599 1500 3227 3938 -898 762 7474 6442 2655 4882
1691D882k094p576P08M580j827j997L932j665o776N53M249k276J385O782l61m789
$$ 4882 2788 -4788 -4080 500 -1327 -3324 608 -1057 -7833 -7280 -3031 -5307 -3922 2860 2499 -2290
1707b290J902K228l224J838P419o19m012J706m91n843Q3N195j405k761K806k011
$$ -2290 -388 1840 -1384 454 7873 7254 3242 4948 4457 -1386 -1303 3892 2487 -274 2532 521
1723E21p291k59M276j497m63N669p40n541P76L369j904J548O904L53m778J612
$$ 521 -6770 -7029 -2753 -4250 -4713 956 216 -5325 -4549 -1180 -3084 -1536 5368 5721 943 2555
1739B555R49l988J213N817q11l468J797j085o374m99M463j162k431L358q95o014
$$ 2555 3504 -484 729 6546 5735 2267 4064 2979 -3395 -3894 569 -593 -3024 334 -561 -6575
1755f575q7L607j291L50O282p4m723J230K638k824J380O506J86m195J436q9m545
$$ -6575 -6662 -3055 -4346 -3996 2286 2212 -2511 -1281 1357 -1467 -87 6419 6605 2410 3846 3757 -788
1772g88n62M972k82l155J807n94o634l11M210j514j006M221kn519R0L551j596
$$ -788 -1350 3622 3340 185 1992 1398 -5236 -5547 -1337 -2851 -3857 364 362 -5157 -5067 -1516 -3112
1789c112Q65O124O59m317J273J770l970M16O039L48m093J181J32o003q41M671
$$ -3112 -2247 3877 4536 219 1492 3262 -708 -292 5747 6095 2002 3183 3315 -2688 -3529 1142
1805A142m11k490L100j162n637r76M128q72m51N359K33n032N73K811k636R96O543
$$ 1142 731 -1759 1341 179 -5458 -6434 -2306 -3178 -3629 1730 1963 -3069 -2496 315 -2321 -1325 5218
$$ [...]
8191b70
##END NTUPLES=NMR FID
##END=
