##TITLE=1H ikalashn
LR-791-R2-O-C1
13.12.2024
##JCAMPDX= 6.0         $$ Bruker NMR JCAMP-DX V2.0
##DATA TYPE= NMR FID
##DATA CLASS= NTUPLES
##ORIGIN= UXNMR, Bruker Analytische Messtechnik GmbH
##OWNER= root
$$ TOPSPIN		Version 1.3
$$ 2024-12-13 09:33:48.421 +0400  Irina@DPX200
$$ Compression mode = diff/dup
##.OBSERVE FREQUENCY= 200.131300845
##.OBSERVE NUCLEUS= ^1H
##.DELAY= (6, 6)
##.ACQUISITION MODE= SIMULTANEOUS
##.ACQUISITION SCHEME= undefined
##.AVERAGES= 32
##.DIGITISER RES= 18
##SPECTROMETER/DATA SYSTEM= spect
##.PULSE SEQUENCE= zg
##.SOLVENT NAME= CDCl3
##.SHIFT REFERENCE= INTERNAL, CDCl3, 1, 17.49637
##AUDIT TRAIL= $$ (NUMBER, WHEN, WHO, WHERE, WHAT)
$$ ##TITLE= Audit trail, TOPSPIN		Version 1.3
$$ ##JCAMPDX= 5.01
$$ ##ORIGIN= Bruker BioSpin GmbH
$$ ##OWNER= Irina
$$ $$ F:/spectra/data/iren/nmr/1H/4/audita.txt
$$ ##AUDIT TRAIL=  $$ (NUMBER, WHEN, WHO, WHERE, VERSION, WHAT)
(   1,<2024-12-13 09:33:07.437 +0400>,<Irina>,<DPX200>,<TOPSPIN 1.3>,
      <created by zg
	started at 2024-12-13 09:30:59.750 +0400,
	POWCHK disabled, PULCHK disabled
       configuration hash MD5:
       BE 6D 3F 07 2A EA 11 49 91 17 2B D3 AF B3 58 0D
       data hash MD5: 16K
       4A 8E 9F 97 26 EF 57 AA 38 F0 94 F5 C9 C9 6B 36>)
$$ ##END=
$$ 
$$ $$ hash MD5
$$ $$ 3F 9B C5 7B DB BB 52 E3 8E E0 50 7B E1 96 45 AF
##$RELAX= 
##$RELAX= 
##$RELAX= 
##$RELAX= 
##$RELAX= 
##$RELAX= 
##$RELAX= 
##$RELAX= 
##$RELAX= 
$$ Bruker specific parameters
$$ --------------------------
##$DU= <F:/spectra>
##$EXPNO= 4
##$NAME= <1H>
##$PROCNO= 1
##$TYPE= <nmr>
##$USER= <iren>
##$AMP= (0..31)
100 100 100 100 100 100 100 100 100 100 100 100 100 100 100 100 100 100 
100 100 100 100 100 100 100 100 100 100 100 100 100 100 
##$ANAVPT= -1
##$AQSEQ= 0
##$AQ_mod= 1
##$AUNM= <au_zg>
##$AUTOPOS= <>
##$BF1= 200.13
##$BF2= 200.13
##$BF3= 200.13
##$BF4= 200.13
##$BF5= 200.13
##$BF6= 200.13
##$BF7= 200.13
##$BF8= 200.13
##$BYTORDA= 1
##$CFDGTYP= 0
##$CFRGTYP= 5
##$CHEMSTR= <none>
##$CNST= (0..63)
1 1 145 1 1 1 1 1 1 1 1 1 1 1 1 1 1 1 1 1 1 1 1 1 1 1 1 1 1 1 1 1 1 1 
1 1 1 1 1 1 1 1 1 1 1 1 1 1 1 1 1 1 1 1 1 1 1 1 1 1 1 1 1 1 
##$CPDPRG= <>
##$CPDPRG1= <>
##$CPDPRG2= <>
##$CPDPRG3= <>
##$CPDPRG4= <mlev>
##$CPDPRG5= <mlev>
##$CPDPRG6= <mlev>
##$CPDPRG7= <mlev>
##$CPDPRG8= <mlev>
##$CPDPRGB= <>
##$CPDPRGT= <>
##$D= (0..63)
0 2 0 0 0 0 0 0 0 0.06 0 0.03 0 0 0 0 0.0002 0 0 0 0 0 0 0 0 0 0 0 0 0 
0 0 0 0 0 0 0 0 0 0 0 0 0 0 0 0 0 0 0 0 0 0 0 0 0 0 0 0 0 0 0 0 0 0 
##$DATE= 1734067986
##$DBL= (0..7)
120 120 120 120 120 120 120 120 
##$DBP= (0..7)
150 150 150 150 150 150 150 150 
##$DBP07= 0
##$DBPNAM0= <>
##$DBPNAM1= <>
##$DBPNAM2= <>
##$DBPNAM3= <>
##$DBPNAM4= <>
##$DBPNAM5= <>
##$DBPNAM6= <>
##$DBPNAM7= <>
##$DBPOAL= (0..7)
0.5 0.5 0.5 0.5 0.5 0.5 0.5 0.5 
##$DBPOFFS= (0..7)
0 0 0 0 0 0 0 0 
##$DE= 6
##$DECBNUC= <off>
##$DECIM= 32
##$DECNUC= <off>
##$DECSTAT= 4
##$DIGMOD= 1
##$DIGTYP= 9
##$DL= (0..7)
0 120 120 120 120 120 120 120 
##$DP= (0..7)
150 150 150 150 150 150 150 150 
##$DP07= 0
$$ [...]
##$SW= 21.9926040160658
##$SWIBOX= (0..15)
0 0 2 0 0 0 0 0 0 0 0 0 0 0 0 0 
##$SW_h= 4401.40845070422
##$TD= 16384
##$TD0= 1
##$TE= 300
##$TE2= 300
##$TE3= 300
##$TEG= 300
##$TL= (0..7)
0 120 120 120 120 120 120 120 
##$TP= (0..7)
150 150 150 150 150 150 150 150 
##$TP07= 0
##$TPNAME0= <>
##$TPNAME1= <>
##$TPNAME2= <>
##$TPNAME3= <>
##$TPNAME4= <>
##$TPNAME5= <>
##$TPNAME6= <>
##$TPNAME7= <>
##$TPOAL= (0..7)
0.5 0.5 0.5 0.5 0.5 0.5 0.5 0.5 
##$TPOFFS= (0..7)
0 0 0 0 0 0 0 0 
##$TUNHIN= 0
##$TUNHOUT= 0
##$TUNXOUT= 0
##$USERA1= <user>
##$USERA2= <user>
##$USERA3= <user>
##$USERA4= <user>
##$USERA5= <user>
##$V9= 5
##$VALIST= <valist>
##$VCLIST= <CCCCCCCCCCCCCCC>
##$VD= 0
##$VDLIST= <DDDDDDDDDDDDDDD>
##$VPLIST= <PPPPPPPPPPPPPPP>
##$VTLIST= <TTTTTTTTTTTTTTT>
##$WBST= 1024
##$WBSW= 25
##$XGAIN= (0..3)
0 0 0 0 
##$XL= 0
##$YL= 0
##$YMAX_a= 724357
##$YMIN_a= -1185052
##$ZGOPTNS= <>
##$ZL1= 120
##$ZL2= 120
##$ZL3= 120
##$ZL4= 120
##$ABSF1= 10
##$ABSF2= 0
##$ABSG= 5
##$ABSL= 3
##$ALPHA= 0
##$AQORDER= 0
##$ASSFAC= 0
##$ASSFACI= 0
##$ASSFACX= 0
##$ASSWID= 0
##$AUNMP= <proc_1d>
##$AXLEFT= 0
##$AXRIGHT= 0
##$AXTYPE= 0
##$AXUNIT= <>
##$AZFE= 0.1
##$AZFW= 0.1
##$BCFW= 1
##$BC_mod= 2
##$BYTORDP= 1
##$COROFFS= 0
##$CY= 7568.61572265625
##$DATMOD= 1
##$DC= 2
##$DFILT= <>
##$DTYPP= 0
##$F1P= 17.9538593292236
##$F2P= -4.03888763876832
##$FCOR= 0.5
##$FTSIZE= 32768
##$FT_mod= 4
##$GAMMA= 1
##$GB= 1
##$INTBC= 1
##$INTSCL= 1
##$ISEN= 128
##$LB= 0.02
##$LEV0= 0
##$LPBIN= 0
##$MAXI= 945.577
##$MC2= 0
##$MEAN= 0
##$ME_mod= 0
##$MI= -402.1523
##$NCOEF= 0
##$NC_proc= 0
##$NLEV= 6
##$NOISF1= 8.587773
##$NOISF2= 6.764455
##$NSP= 1
##$NTH_PI= 0
##$NZP= 0
##$OFFSET= 17.49637
##$PC= 1
##$PHC0= -35.1467
##$PHC1= 8.961438
##$PH_mod= 0
##$PKNL= yes
##$PPARMOD= 0
##$PPDIAG= 0
##$PPIPTYP= 0
##$PPMPNUM= 100
##$PPRESOL= 1
##$PSCAL= 0
##$PSIGN= 0
##$REVERSE= no
##$SF= 200.13
##$SI= 32768
##$SIGF1= 18.5376
##$SIGF2= -6.396296
##$SINO= 400
##$SIOLD= 32768
##$SREGLST= <1H.CDCl3>
##$SSB= 3
##$STSI= 0
##$STSR= 0
##$SW_p= 4401.40845070422
##$SYMM= 0
##$S_DEV= 0
##$TDeff= 0
##$TDoff= 0
##$TI= <>
##$TILT= no
##$TM1= 0
##$TM2= 0
##$TOPLEV= 0
##$USERP1= <user>
##$USERP2= <user>
##$USERP3= <user>
##$USERP4= <user>
##$USERP5= <user>
##$WDW= 1
##$XDIM= 8192
##$YMAX_p= 0
##$YMIN_p= 0
$$ End of Bruker specific parameters
$$ ---------------------------------
##NTUPLES= NMR FID
##VAR_NAME=  TIME,          FID/REAL,        FID/IMAG
##SYMBOL=    X,             R,               I
##VAR_TYPE=  INDEPENDENT,   DEPENDENT,       DEPENDENT
##VAR_FORM=  AFFN,          ASDF,            ASDF
##VAR_DIM=   8192,          8192,            8192
##UNITS=     SECONDS,       ARBITRARY UNITS, ARBITRARY UNITS
##FACTOR=    0.0002272,     1,               1
##FIRST=     0,             0,               0
##LAST=      1.8609952,     -41,             51
##MIN=       0,             -1185052,        -1185052
##MAX=       1.8609952,     724357,          724357
$$ Real data points
##PAGE= N=1
##DATA TABLE= (X++(R..R)), XYDATA
$$ [...]
1055a60j557J026M80j245M21J112r12r02J107L85p49J342J521j002n37J183n77
1072I36j423R62J261j252o86Q41q37j506P60O19q40M34J322q20j310J227L72r99
1090i39P46J617o95r20J052j42j240R21J316j001o30R70n73j757M42Q60r70j58
1108a101J182n08j165O66N42o58P04J655m31q47J128Q6j374M69J190p57n41O43
1126H83m68j479K43R27j013k49J203l0j405L20P55o03K03J268j21o74J003j4q58
1145a09L57J467p38o79R27L0j495j98O75n86p75P47m9j145M87M90o43m7J563p5
1165B04p59R76O81p56p3J142l80o64Q61Q7j306k34J080q86r69Q28K06j308R0P55
1185d25n06n42R72Q2o19P50Q71o73m3J284j70n10N37N14q22j60P37o60r42N12
$$ plain form
1055 -160 -1717 -691 -211 -1456 -1035 77 -835 -1737 -630 -245 -994 348 1869 867 330 1513 936
1072 936 -487 475 1736 484 -202 639 -198 -1704 -944 -325 -1165 -731 591 -229 -1539 -312 60 -939
1090 -939 -193 1424 729 -191 861 719 -521 400 1716 715 85 1055 482 -1275 -833 27 -943 -1101
1108 -1101 81 -427 -1592 -926 -384 -1042 -338 1317 886 39 1167 1253 -121 348 1538 781 240 883
1126 883 415 -1064 -821 106 -907 -1156 47 17 -1388 -1068 -313 -916 -713 555 434 -240 763 749 -109
1145 -109 248 1715 977 298 1225 1255 -240 -438 237 -349 -1124 -377 -426 -1571 -1084 -594 -1237 -1284 279 204
1165 204 -555 421 1102 346 273 1415 1035 371 1232 1319 13 -221 859 -27 -996 -168 38 -1270 -1180 -425
1185 -425 -931 -1473 -501 -419 -1038 -288 583 -90 -133 1151 981 471 1008 1522 700 540 1277 617 -325 187
1205A87J02j404l0J074n39q11O36L22o60J40Q89r7P8Q15m3o69P98M15r27K08J039
1226A523l96j127L52L11r33l04P22l06p42L81n7r38K06J131m13l29R03M01p24
1245c39L76Q14k78Q2P76k83p28K47J36q16l32J019m82r18L45L41j100j33Q37l4
1265d70n04P49L77q03P4R61k36j12Q14L02o99J09L23n74j37P24j31r17L07J69
1285C26j131m06R90j78m41M37K62n25j69P75j20q5Q29M14q07J65N05m83m57R36
1305H37R7o97j4K93p24l39N78l48m82N96L47p71l92Q09j33m40O71O97n13j56N54
1326D70l38o4P11o1m77K96L71p68n45O13Kp54K36N79o36m40M99l0n21O19M11m40
1348b67o0O43j17n08N75K32k70J50K95m33m30O08P1o90O3N67m16o02N43p6m16
$$ plain form
1205 187 289 -1115 -1145 -71 -610 -1421 -785 -463 -1123 -983 -94 -191 -113 702 659 -10 788 1203 276 484 1523
1226 1523 1127 0 352 663 -270 -574 148 -158 -900 -519 -576 -1514 -1308 -177 -590 -919 -16 385 -339
1245 -339 37 851 573 655 1431 1148 420 667 803 -13 -345 674 192 -726 -381 -40 -1140 -1273 -436 -470
1265 -470 -974 -225 152 -651 -577 384 148 36 850 1152 453 562 885 311 174 898 767 -150 157 326
1285 326 -805 -1211 -221 -399 -840 -403 -141 -666 -835 -60 -180 -265 564 978 171 336 841 358 -99 837
1305 837 934 237 223 516 -208 -547 31 -317 -799 -203 144 -627 -1019 -210 -343 -783 -112 585 72 -84 470
1326 470 132 68 779 718 241 537 908 140 -405 208 210 -544 -308 271 -365 -805 -306 -336 -857 -238 173 -267
1348 -267 -327 316 199 -309 266 498 228 378 673 240 -190 418 489 -201 -138 429 13 -589 -46 -122 -538
1369e38R9M48k02k55N63k18m21N63L90m97Q1N81k49m42M50N1n06R7L76l76k61
1390b66L65L3p17L50N39n27k41L52J80m00J29L79l84L9L83j08k11L81K52n65Q1
1411D4L49k06m73N42K9l57p1M00m46k69N16R9n23J72N38m84k19M22K18n23L07
1432F5L46k63k04K38o7k34L11L23n47j20N35m32k28L22J42l86R7K01m02OJ60J22
1454a5j56K75K63m04k40K66J51k34J36J98j21q5K78j72l80K32L23l93k6L86k61
1475B1m18L63R7k78J66L26k21l06J87R0l12J20N13j72k48J63j17j94J18K91j66
1496B3r5N02l32m08J15L00k52K1L38j52k18M5J90k43K4L15k22j30L14p9k60N3
1518a51L03o7k2K81k00l28J25L21l27J9K79j78j80J32K23m81J03K81j58j98K53
$$ plain form
1369 -538 -439 9 -193 -448 115 -103 -524 39 429 -68 13 594 345 -97 353 404 -102 -5 371 -5 -266
1390 -266 99 132 -585 -235 304 -223 -464 -112 68 -332 -203 176 -208 -169 214 106 -105 276 528 -37 44
1411 44 393 187 -286 256 285 -72 -143 257 -189 -458 58 157 -366 -194 344 -140 -359 63 281 -242 65
1432 65 411 148 -56 182 115 -119 192 515 -32 -152 383 -49 -277 45 187 -199 -102 99 -303 -297 -137 -15
1454 -15 -171 104 367 -37 -277 -11 140 -94 42 240 119 34 312 140 -240 -8 315 -78 -104 282 21
1475 21 -397 -34 63 -215 -49 277 56 -250 -63 27 -285 -165 348 176 -72 91 -26 -220 -102 189 23
1496 23 -72 430 98 -310 -195 105 -147 -126 212 60 -158 -113 77 -166 -142 173 -49 -179 135 56 -204 -151
1518 -151 152 85 63 344 144 -184 -59 262 -65 -46 233 55 -125 7 230 -251 -148 133 -25 -223 30
1539C0k2k40j1L62k06k5K20J42m29m4M23k74P4K64l1l76J66K80l26j38L18q8k17
1562a48K34J17l81l2J70j71l2J89Q8k36R5L14j95k65L47J54l72J02K95j89l2J39
1584A91j17k26K54J56m05j6L20k02k36L26p1j51k5K92j70k26K95K03j92QK01j12
1606I7r3J84l7j28n1M27m02j28L89k25k01l8J84j61o3J86nj32J53P7l37K81L07
1629B84k49j12J81J96l30J63J38j70j49J14J61k66l0J20o2k67K53p5j88J68J18
1650bk26K6J64P6k05L57jk45K6K13M0k05K22J02l53L6J61k23nq1J97k79n0K27
1674b8j43J4J13L5j01J04J96l05J23J20K6r9J29M6j14q9r2k3LJ22O4j45j0j4p6
1699a44L9p7Jo6J88L7j13k8K71o6k3N7J77j59n0P3m5p1OJ12p7j30J69j37o5nJ39
$$ plain form
1539 30 8 -232 -243 119 -87 -112 108 250 -179 -223 200 -74 0 264 233 -143 23 303 -23 -161 157 69 -148
1562 -148 86 203 -178 -210 -40 -211 -243 -54 34 -202 -107 207 12 -253 94 248 -124 -22 273 84 52 191
1584 191 74 -152 102 258 -147 -163 157 -45 -281 45 -26 -177 -202 90 -80 -306 -11 192 0 8 209 97
1606 97 4 188 151 23 -28 399 -3 -131 258 33 -168 -206 -22 -183 -246 -60 -65 -197 -44 33 -304 -23 284
1629 284 35 -77 104 300 -30 133 271 101 -48 66 227 -39 -69 51 -11 -278 -25 -100 -288 -120 -2
1650 -2 -228 -202 -38 38 -167 190 189 -56 -30 183 223 18 240 342 -11 25 186 -37 -42 -123 74 -205 -255 -28
1674 -28 -171 -157 -44 -9 -110 -6 190 -115 8 128 154 55 184 230 116 27 -65 -88 -85 37 101 -44 -54 -68 -144
1699 -144 -105 -182 -181 -247 -59 -22 -135 -163 108 42 19 76 253 94 44 117 72 1 7 119 42 -88 81 -56 -121 -126 13
1726A3j82J3K05j37p5K9J31j06R8J63k6j62J39M8j87J36J9J2n8Q8j89J4j28J25
1750a7r1j13J72L2j13J47P3k39K02J24j67n0J44N0k25O0J68j2q3J7K0q3jOk0r2
1776i1Q6O9k98J44J55j63n7J60K7k05K27J17k05P3J70j57p2J34q2K9j15J47j33
1799d0l1L2J34j01m5j0M8j34J34o2l5J03J12o7L3on0j8J00l1k2J9j6pm4M7P1j15
1827aN0J3j23k0OJ42j84kJ26p9O3q2J34M7m1k8r5P3L3p5L2l2J32k14M6J75p0l1
1855en9J14k23J54N6N2j99O0P6l1R0Q7j51r0J25N8o8LN0j50R3m2J71j30o5J71
1881A47j59n3L6k5J18j53J62j53R0K6kK8jK5j15LP0pl5J05jk93K23J58k38J17
1907G3M2q7p4O0j6jo9R4k0k6J01Q8j93qPm6M0R4j02o8J23J57j59m6k3J48k8O4
$$ plain form
1726 13 -169 -156 49 -88 -163 -134 -3 -109 -11 152 126 -36 103 151 -36 100 119 131 73 161 -28 -14 -142 -17
1750 -17 -108 -221 -49 -17 -130 17 90 -149 53 177 10 -40 104 154 -71 -11 157 145 62 79 99 16 15 21 1 -91
1776 -91 -5 64 -234 -90 65 -98 -155 5 32 -173 54 171 -34 39 209 52 -20 114 32 61 -54 93 -40
1799 -40 -71 -39 95 -6 -51 -61 -13 -147 -13 -75 -110 -7 105 38 71 65 15 -3 97 66 44 63 47 40 -4 43 114 -1
1827 -1 49 62 -61 -81 -75 67 -117 -119 7 -72 -9 -91 43 90 49 21 -74 -1 32 -43 -11 -43 89 -125 -79 96 26 -5
1855 -5 -64 50 -173 -19 37 89 -110 -50 26 -5 85 172 21 -69 56 114 46 49 99 -51 42 0 171 41 -24 147
1881 147 -12 -65 -29 -54 64 -89 73 -80 10 36 34 62 61 86 -29 -26 44 37 2 107 106 -187 36 194 -44 73
1907 73 115 28 -46 14 -2 -3 -72 22 2 -24 77 165 -28 -36 -29 -75 -35 59 -43 -111 12 169 10 -36 -59 89 61 125
1935A25p5n5l8K41j17j62J61j44O9J7o1J8l3N7Jj58O3J34j9j4R4r5m2k4J40Qk21
1962a30J48j46P7j01J32j5m6J91n6j67M6N3l5J4M5r0J15Om3r6K30K2j17j15rK13
1988A26r5j5O9mj3j46J05k6r8Q3k1m0J5P9k5m9%N6r6J93m9k44K70M5k4l4o1J2
2016A3j3k0N5q5M2j6ko8J0J23j78J43J35k49L7O3N8j43Q6kO3q5RRj5J54m9o2j9
2045fL2o0r6O8O6o1j19J60j1n4Q4p3M0j63J93R9Jj41R9n6n5J32N7j44Q1M9j62
2072d0k1J01m1l2J31j01j56L3J20m3L4R6J41k27K7j6l7J13m0n8lQ2J6j9r7M1J9
2099B3K0Ll4r3J63k0q8o9K15j29j19P5O3j3kL6n4L9J6K3p7M6P3r9J5K5n2K8j29
2128a15J48Jj07k5p0K25l9R1j41p0l4J91m5K9j0J5m1l5J10J5q0M1j35jP7Pk6K
$$ plain form
1935 125 50 -5 -43 198 81 -81 80 -64 5 22 -39 -21 -54 3 4 -154 -91 43 24 10 104 9 -33 -57 83 91 -130
1962 -130 18 -128 -51 -152 -20 -35 -81 110 54 -113 -67 -14 -49 -35 10 -80 35 41 -2 -98 132 154 37 -78 -87 126
1988 126 31 16 85 81 68 -78 27 1 -97 -14 -35 -75 -60 19 -6 -55 -55 1 -95 98 49 -195 75 120 96 62 1 13
2016 13 0 -20 35 -50 -8 -24 -26 -94 -84 39 -139 4 139 -110 -73 -10 48 -95 -9 -11 52 -33 -24 -15 -30 124 75 13 -6
2045 -6 26 -34 -130 -62 4 -57 -176 -16 -27 -81 3 -70 -30 -193 0 99 100 -41 58 2 -53 79 136 -8 73 122 -40
2072 -40 -61 40 -1 -33 98 -3 -159 -126 -6 -49 -15 81 222 -5 22 6 -31 82 42 -16 -19 63 79 60 -37 4 23
2099 23 43 46 12 -81 82 62 -26 -95 120 -9 -128 -53 10 -3 -5 31 -23 16 32 55 -22 24 97 -2 13 38 -14 14 -115
2128 -115 33 34 -73 -98 -168 57 18 109 -32 -102 -136 55 10 39 29 44 3 -32 78 93 13 54 -81 -82 -5 2 -24 -22
2156b2L7j01M8P9m8j33J60n0n7M3J1KJ29j31L9j76J47Q2j6o0m4K38k98J67p8Q2
2182E0o1Q4m8r5QM5k3p0J16J5j14J79j15r3JK42n1j3O5j44k9M4J76k03K0o5P9
2209@j24R9j03N2M8K3m5k7R4j25O8q2R1KQ0j8K8l4r2J34oq5J11q9j87J33K19j12
2237E3n5m5J23j31J14J29j91k6l8R1j15K10m5K8J0j11J52j07qR1l7k5L3n0p3J91
2263A68j50j24K06r3M4p9L8n6n7J57oj66L4J64j44O3K7J12j58L0K17k32N0l2m3
2288c0j4N9J92k71P6j3L9q0l9Q9J9N4j68J21Ol8M5OL6m4m1r3P5j5Nl3J04Ol4L4
2318E3pn7l5k7J49j36o9K15m9j48J79J4J1o9qj16l8K04L7p8Q2m5p6Q3m1q5OJ67
2346A16j40J3R8K6k65K16M3j42l7P3o3j6O2R4r5q9J06K2n7Q6l5J4j73K33lj10
$$ plain form
2156 -22 15 -86 -38 41 -7 -140 20 -30 -87 -44 -33 -31 98 -33 6 -170 -23 59 43 -17 -61 177 -121 46 -32 50
2182 50 -11 73 25 -70 -62 -17 -40 -110 6 21 -93 86 -29 -122 -121 121 70 57 122 -22 -51 -7 169 -34 -14 -79 0
2209 0 -124 -25 -128 -76 -28 -5 -50 -77 17 -108 -40 -122 -31 -29 51 33 61 27 -65 69 63 -22 89 0 -187 -54 165 53
2237 53 -2 -47 76 -55 59 188 -3 -29 -67 24 -91 119 74 102 112 1 153 46 38 129 92 67 100 50 -23 168
2263 168 18 -106 100 7 51 -28 10 -46 -103 54 48 -118 -84 80 -64 -1 26 138 -20 10 227 -5 45 13 -30
2288 -30 -44 15 207 -64 12 -1 38 -42 -81 8 27 81 -87 34 40 2 47 53 89 45 4 -89 -14 -29 -24 -57 47 53 19 53
2318 53 46 -11 -46 -73 76 -60 -129 86 37 -111 68 82 93 24 16 -100 -138 66 103 25 107 62 -14 69 28 -57 -51 116
2346 116 -24 -11 87 113 -152 64 107 -35 -72 1 -62 -78 -16 78 -17 -106 0 22 -35 51 16 30 -143 90 87 -23
2372b3J14O9k21J20lj78O1O7p5N1R6q6J15r1P8p8n5J00L4K5j32J13m1l9P1P1l15
2399a52Q9J09o2j24K02r2j46J57O7Kj27KQ7j28J40Om2j11J92p6O1p2J18j46J26
2424H0ok2l9L6q5J14J22j24j24Q4j69K33j84J08M8q7NM0k7j42O6P6N4n5J78j26
2450E4j2pK0L9k30J42L1n0K7J21k59N7P9k4Lj29Q6J36q2Q5j31k6J05Or8L9m5Q2
2478A9q6J53j46O5J12p1q3j0J33Jj01n1J45K0j42J7Q2o1lP0k2Kq9P2J9oq4J01
2506E6n9Q5p4K7L2q1M4o8l4K4R6q0o8q4K51N0j56N5J4Q0j15J9l6J03j26J58j95
2533h2M9R6n2l5K6j3L7K0M1j61k3Q6R0oj09Q9n4m2O%m1K13j36J69k03L8J70k95
2561a22J41n8N1j85L61j87j56J30N6J1q9R3Lj60Q1K1j6L4k1Q9J04j11J0n5Mn6
$$ plain form
2372 -23 91 160 -61 59 56 -122 -61 6 -69 -18 78 -8 107 16 94 16 -39 61 95 120 -12 101 60 21 92 163 -152
2399 -152 -63 46 -16 -140 62 -30 -176 -19 48 50 -77 -75 12 -116 24 30 -12 -123 69 -7 54 -18 100 -46 80
2424 80 74 52 13 49 -36 78 200 76 -48 36 -133 100 -84 24 72 -15 -10 30 3 -139 -73 3 57 2 180 54
2450 54 42 35 55 94 -136 6 37 -13 14 135 -124 -67 12 -12 -9 -138 -52 84 2 87 -44 -70 35 41 -57 -18 -63 19
2478 19 -67 86 -60 5 117 46 -37 -47 86 87 -14 -65 80 100 -42 -25 57 -4 -7 63 41 43 -46 26 45 39 -45 56
2506 56 -3 82 8 35 67 -14 30 -38 -72 -48 48 -32 -100 -184 67 117 -39 16 30 110 -5 14 -22 81 -45 113 -82
2533 -82 -33 63 11 -24 2 -11 26 46 87 -74 -97 -11 79 73 -36 53 -1 -43 -37 -37 -78 135 -1 168 -35 3 173 -122
2561 -122 19 -39 12 -173 188 1 -155 -25 31 42 -47 46 49 -111 -30 -9 -25 9 -12 77 181 70 80 25 29 -27
2587b7o8O9J37j16rL9j07J32j75J05j34J56j20J01r7N8Q2j36N8O1l5P9k6Q5r7
2612A5qQ8J2j55l3R2m4J3P9r1l9M3N3p5J63L0j80R2M7o3J0r3qJ51n1l0J2j1N1
2641G0P5p2q5l1l4R5j5r3M0J9J23j38q3J84q2Kn9N0N1%p9J24K2j48J87j71LNK3
2670a7l7R7J2m6l1j0q5R2K7O1m2p2J7o5J14K3o3O6j28Q7J45j94O0j05J42j05J26
2697F9K7j63J65j64lk7J18j48J36n2j22P8J46n2J07j06J03o2k9J41j35j44J07
2720a0J04J3o1O0j59J52j11J02m0o4KM8r0N1m6O3q5R2l7k3L7NJ05n8PPj72K02
2748I4p8k0J8q0l4Q3M4K8j5r6O2n7J00j05j31J97Q3j64J2Q2J2q0LM9m2j20J43
2775a2k7Q3n8J06j13l2P4oL1o2O8j63K7JJ2m3J29J11r0Ok3P3j9j59J03L2n9J17
$$ plain form
2587 -27 -95 -26 111 -5 -14 25 -82 50 -125 -20 -154 2 -118 -17 -114 -56 26 -110 -52 9 -26 53 27 112 15
2612 15 7 95 107 -48 -81 11 -33 -20 59 -32 -71 -28 25 -50 113 143 -37 55 102 39 49 -44 -52 99 48 18 30 19 70
2641 70 145 73 -12 -43 -77 18 3 -90 -50 -31 92 -46 -129 55 -27 -25 -84 -34 17 17 -62 62 84 -64 123 -48 -45 -40 -17
2670 -17 -54 43 55 9 -22 -32 -117 -25 2 63 21 -51 -34 -99 15 38 -25 41 -87 0 145 -49 11 -94 48 -57 69
2697 69 96 -67 98 -66 -69 -96 22 -126 10 -42 -164 -86 60 8 115 9 112 50 21 162 27 -117 -10
2720 -10 94 107 46 106 -53 99 -12 90 50 -14 -12 36 -54 -3 -49 14 -71 21 -16 -39 -2 3 108 50 57 64 -108 94
2748 94 16 -4 14 -66 -100 -17 27 55 40 -56 6 -51 49 -56 -187 10 93 -71 -59 23 35 -45 -42 7 -35 -155 -12
2775 -12 -39 44 -14 92 -21 -53 21 15 46 -16 52 -111 -84 -83 -71 -114 15 126 36 42 19 92 73 -86 17 49 -10 107
2803A07j4j54nM3N8OPq0J81k06Ml1O4m2K5j28J83O5q4m1J1L0J3L7RN2j34lN1J1
2833C5o7Q2n1p5Q3L2nml4K09k82Q5o6j7k3R5m1O0m3J4oM5j01Q6Nk9M6n4J34j04
2863IJ24m7n8L0O8mo4K0p0%M8j35J33n5L7o3l0%K4J03j03M8m3M6j66K22j18m3
2891h7R6m0o8J19j35N5J03nQ1j88P9jq8J21r2J63n4J0K2r2o3q1R8pJ58j98J23
2918B9kj1j2p4J88k3L4q9rr8L4j5P3j6j9o5J19J6j0k8l2r2J39n6j32J51N5K5j6
2947F4oJ9q7m0L8j75K70k4p8R0l1l8R8q4L9j01KO0k3J16j24J38j59Q6l5O3jk0
2975E7l5o1N9j1j2L4n0q0J91k6O6k45J26l1J7n7K3J22j49o5J39J30j70P4p8J35
3001A03j17k3J13j14Qj6P0n7oP5j19J23p9R0n7K2J1Q5j10r4J79r7N6P2k40J62
$$ plain form
2803 107 93 -61 -66 -23 35 41 48 -32 149 -57 -53 -84 -20 -62 -37 -165 18 83 -1 -42 -31 -1 12 49 58 110 -24 -27 24 35
2833 35 -32 50 -1 -76 7 39 34 30 -4 205 -77 8 -58 -75 -98 -3 -44 16 -27 -13 -19 26 -75 11 16 -13 33 -21 113 9
2863 9 133 86 28 58 126 122 58 78 8 8 56 -79 54 -1 36 -27 -57 -57 -33 70 -33 15 -28 18 -148 74 -44 -87
2891 -87 9 -31 -99 20 -115 -60 43 38 119 -69 10 9 -79 42 -50 113 59 69 91 -1 -64 -145 -47 -54 104 -94 29
2918 29 27 16 4 -70 118 95 129 40 31 -67 -33 -48 25 9 -10 -75 44 60 50 22 -10 -102 37 -19 -151 0 55 80 64
2947 64 58 77 -10 -50 -12 -187 83 59 -19 71 40 2 100 16 55 -46 -44 16 -7 109 -15 123 -36 50 15 78 77 57
2975 57 22 -39 20 9 -3 31 -19 -99 92 66 132 -113 13 -18 -1 -58 -35 87 -62 -127 12 142 -28 46 -32 103
3001 103 -14 -37 76 -38 -30 -46 24 -33 -39 36 -83 40 -39 51 -6 16 27 112 2 -92 87 -10 46 118 -122 40
3027D0L6N3j6j11l4k6k5P0m4j0J56o4Oj02J43q0O7nk0oK9j36L9K2Q5j8pk7K4m9
3057a0m3J9k4J5J04j6PR3j34M3l1k3K7J16k46J78j17M2N2q3K7J08L6j31o1M3J7
3084HN3Jn9m4O0j1Nj46L3M8J43o0j25MJ0L7L6k8l5Q6po0Q7Kl9J08q1Pk7p9Q6r1
3116g8R7j09J63q7J48k00J16l8Qj45j0J20l0j6L5p7P2K05j19p6J6kn8J58Qn9j19
3143g7P0P2O2j15J05j88J88q9j15O7P2j69J27L9j06R7Q6r0j19R5O8K1j56J41j6
3168G0P1j65M9j10O6P3j88J83k5q2n8N2J02o6Q4l0j15J80o6j35pJ48k3p3O3R7
3194I5p3m1k3m9J31Mr1P9O2m6O6j56P0j38lK00j97J02l4P8r0J00n2j1K7j26j6
3221a32J74M2o1K9j3m2o1L0k0K05pj92L3L2q7J15j97J45K5n3Lj20J36L9k7%j3
$$ plain form
3027 40 76 129 113 2 -32 -58 -83 -13 -57 -67 89 25 31 -71 72 -8 59 54 34 28 57 -79 -40 -18 67 49 42 15 39 -10
3057 -10 -53 -34 -58 -43 61 45 52 145 11 54 23 0 27 143 -103 75 -42 0 52 -31 -4 104 140 9 -52 -9 8
3084 8 61 62 3 -41 19 8 13 -133 -100 -52 91 31 -94 -90 -80 -43 -7 -35 -70 16 9 -51 36 38 -1 107 26 33 6 -73 13 -78
3116 -78 19 -90 73 -14 134 -66 50 12 20 -125 -135 -15 -45 -61 -26 -103 -31 174 55 -21 -5 -7 -65 93 101 42 -77
3143 -77 -7 65 127 12 117 -71 117 28 -87 -20 52 -117 10 49 -57 40 126 36 -83 12 80 101 -55 86 70
3168 70 141 -24 25 -85 -19 54 -134 49 24 -58 -116 -64 38 -28 56 26 -89 91 25 -110 -117 31 8 -65 -2 95
3194 95 22 -19 -42 -91 40 44 -47 32 94 48 114 -42 28 -110 -113 87 -110 -8 -42 36 -54 46 -6 -17 10 -116 -132
3221 -132 42 84 23 52 39 -3 -64 -34 -54 151 144 -48 -15 17 -70 45 -152 -7 18 -35 -32 -152 -16 23 -4 -4 -17
3248a7J3Q7k18L7J20O1n6M9j06k9J26J7j77Q3l4l2J28K0o2J7q0m2J04L7n3%J50
3275A43j99J0n2J39k9O7J5j14J7r1R9P5j23j1L0RJ6J4J00j02jq8J77j26O4n9j21
3302a41J25k4M4n5R5p9j8J02NO4j46O3K8j16L4o0N7k6L1N2o5on6R0l2N2o2nJ36
3331H7j00N3n2j2R1J4o6o2Q1m7Nq3K31j69J22j77J35p3l7L7J28j39J00j34R0N8
3357H1m8p1R4mKl2m3m7J10l8J8Jj01J02j4P6j09O7o1R6p6kj39J61j80P7M2J10
3385G2q2L2P0q2j3l1L8O5nq8J12r9k9JQM3j8J13k70J40kO5L0r3Nn1N7n9K2P6l9
3416a2k9N6l6L4J5k2o5M3k7J06k1m3k2J63r3j8m3M1P7j65J22Jm0M9L6j18O8J8
3444G5kn0k8m8Q4o7nl8O3k4k1J80j58M8p4M2o0L1K01k24M6M2J6n1r3M6P3k1J8
$$ plain form
3248 -17 -4 83 -135 -98 22 83 27 76 -30 -59 67 84 -93 -10 -44 -76 52 72 10 27 -53 -95 9 46 -7 -7 143
3275 143 -56 -46 -98 41 12 79 94 -20 -3 -94 5 80 -43 -54 -24 -15 1 15 115 13 12 -76 101 -25 39 -20 -141
3302 -141 -16 -40 4 -51 44 -35 -53 49 54 118 -28 35 63 -53 -19 -79 -22 -48 -17 35 -30 -36 -92 -2 -34 18 -44 -49 87
3331 87 -13 40 -12 -24 67 81 15 -47 34 -13 -8 -91 140 -29 93 -84 51 -22 -59 -22 106 -33 67 -67 23 81
3357 81 33 -38 56 52 54 22 -21 -68 42 4 22 23 -78 24 10 86 -23 44 -17 79 3 1 -138 23 -157 -80 -38 72
3385 72 -10 22 92 10 -3 -34 4 69 64 -24 88 -11 -40 -39 -31 12 -6 107 -163 -23 -25 40 70 -23 -18 -69 -12 -71 -49 27 -12
3416 -12 -41 15 -21 13 28 6 -59 -16 -43 63 42 -1 -23 140 47 29 -14 27 104 -61 61 62 22 71 107 -11 57 75
3444 75 73 23 -5 -53 31 -36 -41 -79 -16 -40 -61 119 -39 9 -65 -23 -83 -52 149 -75 -29 13 29 -22 -115 -69 4 -17 1
3473AK9l8o8K9Q8r2j1j1J33n8M7q9J8K9l3n4KP1K5k1q0R1l0M3p1K2J04P7j15N6
3503I4m6q0Q6n6o6J14kq9J58j9n5M2j45J74o5K3p9P7j8o7K9K1l3J07n4N0j30J23
3531I4m5j35P5L5l9l5j0P5K1j41O3J50j09J0M2Jj3l6P9j02M2k5k2r7J31N4m9%
3559A4p1L7R2l8O7k12N6P5O2j19O8m1m4J9QJ17m9pN0j71J60O0J4j77L5J7m7P0
3587D5j08l8K3N5MP5l1KkL2j34m7J04J01l0j4l1M5n2m9N5p6M2M6L%Q2j17P4o0
3617aPj1p9J09O2j88P7N6mp4N3P6m7m1j04J7J20j17J53K0k08J67L7n6r7J22r0
3644d1J38qn8m5n3L8j2J57j14LJ6Q1q2J2%M2j01M3j3N0J2j5qJ0j2O1m6p9P1L1
3674G8k37R0j3N6J9j6m8j8J62j17qP3k4P6j51J02R4j82K2N2J1l5ORj28L3J13M5
$$ plain form
3473 1 30 -8 -76 -47 41 -51 -62 -73 60 2 49 -40 -22 7 -26 -80 -78 -7 18 -3 -83 8 -22 21 -50 -28 76 153 38 94
3503 94 48 -32 54 -2 -68 46 44 -45 113 94 39 81 -64 110 45 68 -11 66 48 -19 10 31 -2 105 51 101 -29 94
3531 94 49 -86 -11 24 -15 -50 -60 15 36 -105 -42 108 -1 9 51 52 39 3 82 -20 22 -3 -25 -122 9 63 14 14
3559 14 -57 -20 72 34 101 -111 -55 20 82 -37 31 -10 -54 -35 -27 90 41 34 84 -87 73 133 147 -30 5 22 -25 45
3587 45 -63 -101 -78 -23 -19 56 25 27 25 57 -77 -124 -20 81 51 37 6 51 -1 -50 5 -71 -29 17 20 20 102 -15 59 -1
3617 -1 6 -5 -84 25 87 -101 -24 32 28 -46 7 83 36 -5 -109 -92 28 -89 64 84 -124 43 80 24 -73 49 -41
3644 -41 97 89 31 -14 -67 -29 -41 116 2 5 21 102 20 32 32 74 -27 16 3 53 65 50 42 52 40 101 55 -24 47 78
3674 78 -159 -69 -82 -26 -7 -23 -71 -89 73 -44 -52 21 -3 73 -78 24 118 -64 -42 10 21 -14 -8 1 -127 -94 19 64
3702F4n4j25K72k27K1P6r1MR8p0Q5L0j76J16l6P2j33J10L7q6lk6j20J56Q1j13
3728c8J57k44J29o9j10J55J35j83Q6N8q8K8o8M9N5q4J72j96J07l3M5k5K4p9o6
3753h3J64j45J64j26o4O1j6J43j21m4Q5m5J36j08o2PJ51k16P8m3O6k6k3N4o3m6
3779a22O5J13j33M5m0R7j3l4P8j0p0K9r6M8J06l4l7L2k5m1N1l6n0J06KNk6pO3
3808F6j13Lj49J68K3j05P9K3j2l6M6Nj6m9nJ6M3l6J25k1n1j3P9j67J13K3o4N0
3836B5j88J35R5Pq9J0Jl0j1kk0J55l4k0o9M0J48k37M7J0j4%J04j24mR6kRm7L8
3866B9j4o7j2J03l8m4P9q3K8J18m9p2O1qj81P9J00m7Q9j45Q0M8j4P9j02p7mJ01
3894C7o7l8R5m4q2J47p8K2K1L7jJ4j02J44j12j6R6j82J2nJ44l9P4j56O1r4K34
$$ plain form
3702 64 10 -115 157 -70 -49 27 -64 -60 38 -32 53 83 -93 23 -13 59 -74 36 73 -13 -16 -42 -162 -6 75 -38
3728 -38 119 -125 4 -65 -175 -20 115 -68 18 76 -12 16 -52 -3 52 -32 140 -56 51 18 63 38 62 -17 -83
3753 -83 81 -64 100 -26 -90 -29 -45 98 -23 -67 18 -27 109 1 -61 -54 97 -119 -41 -84 -18 -44 -67 -13 -76 -122
3779 -122 -57 56 -77 -32 -72 25 12 -22 56 46 -24 5 -91 -43 63 29 -8 24 -1 -42 9 -27 -77 29 31 36 10 3 66
3808 66 -47 -44 -193 -25 -2 -107 -28 -5 -17 -53 -7 -2 -18 -67 -72 -56 -13 -49 76 55 4 -9 70 -97 16 39 -25 25
3836 25 -163 -28 67 74 -15 -5 -4 -34 -45 -47 -67 88 54 34 -35 5 153 -84 -37 -27 -41 -41 63 -61 -65 31 29 38 -9 29
3866 29 15 -52 -64 39 1 -43 36 -47 -19 99 50 -22 39 31 -150 -71 29 -18 71 -74 6 54 40 119 17 -60 -64 37
3894 37 -30 -68 27 -17 -99 48 -30 -8 13 50 49 63 -39 105 -7 -23 73 -109 -97 -102 42 3 77 -79 -18 -112 122
3921A22q2m7O7k5j7n5k8J45r6p3J04j27J03J0R3q3o6J4P9p5rk3J41J1n5J03r6
3948C5K5m7l5J02j18L4j59J11Q2l5q4Q6J08p8rP1q3RK7j36j9QJ03l8j1J34R8k76
3976i5J12MJ6j8j03J32P4j04K6n5M6K8K7j7r8%J61j63J02n9K7Q0k19J09qr8J29
4003C6k3K5j06O9O1j91J33m9j23J82j11J77r2M5J6j69R0J02R3j01onJ01o2p2q0
4029f0K2Q9j57P1j1l2P8J00p8J1%r1J75Jj21n3j0Q6jj19K03q2q2J18o5K3j15J19
4057A9l0o6J04ok7j3o0M0J92j14n5l2J21j5K6j69n4J49n5m7J07Q2j39J19jo5q2
4084g1M0K9RL8L3j05R9l0q4R2N8o8L3o3l4m6lJ15ORQj12P3l3l1N0O6j10k8R7J7
4115E4m5J31q8J3j31J08j03N3P1k6j26J13M4P3j00j6M2o2jP4k6j52P4l1P8l0R9
$$ plain form
3921 122 40 -7 60 35 18 -37 -65 80 -16 -89 15 -112 -9 1 94 11 -55 -41 38 -37 -46 -69 72 83 28 131 35
3948 35 60 13 -22 80 -38 -4 -163 -52 30 -5 -89 -3 105 27 18 89 6 15 42 -94 -113 -105 -2 -40 -51 83 181 -95
3976 -95 17 21 37 19 -84 48 122 18 44 -11 35 63 90 73 -25 -25 136 -27 75 16 43 123 -96 13 5 -93 36
4003 36 13 38 -68 1 62 -129 4 -45 -168 14 -97 80 -12 33 49 -120 -30 72 165 64 58 53 154 92 20 -60
4029 -60 -38 51 -106 -35 -46 -78 0 100 22 33 33 -58 117 118 -3 -56 -66 20 19 -100 103 21 -61 57 -8 15 -100 19
4057 19 -11 -77 27 21 -6 -19 -79 -39 153 39 -16 -48 73 58 84 -85 -139 10 -45 -92 15 97 -42 77 76 11 -71
4084 -71 -31 -2 7 45 78 -27 72 42 -42 50 108 40 73 10 -24 -70 -73 42 48 57 65 -47 26 -7 -38 12 78 -32 -60 37 54
4115 54 9 140 52 65 -66 42 -61 -8 63 37 -89 24 68 141 41 25 67 5 4 78 52 -100 -26 -57 21 -9 90
4142I0j48P5Po5j3l2P6ro0J61j12J36j88J61j02J26k44R7L0K1j10J90o8K1j6M1
4168F5j40J50j5q8K7l7P8q2N1N3qL3Ll0k6m3L0p2j7jm9J9M4L2q1K3K9j1K30j28
4198C9k0p9P2o4l8J30j00J50k26J82o9j11K43k15K60j63j56J82J35j21n0N0L4
4221F5r6J18k30P4j9J48Lm9l7j7p1J58j23J59j23J39j29K7M8n1O4m3L0Q0j39o3
4247g7N8J1J16o4NjJ0j39K1R6L8j14J17Np7N0l6J08j29P6l3o4J35o5q4o9J45N7
4275I6K5p4q4p7J14J0m5Pj7Q6n1nr2J11jj1mr9J66j9K1l2J4o5K3m2o5J66p8J35
4305A13j79k8N7J8J2O0Rp0N3o6j10J20J1L7m3l1J68m4l3j25m4N0J05q7P0qMoq1
4334f8L6Q3j25J80l1o7j6N3l4N9j28J82o4j38j8J63r6L6r1J05M0m3p3rJ13J0K0
$$ plain form
4142 90 -58 17 24 -41 -54 -86 -10 -19 -79 82 -30 106 -82 79 -23 103 -141 -44 -14 7 -103 87 19 40 24 65
4168 65 -75 75 60 -28 -1 -38 40 -42 9 62 54 87 90 60 34 -9 21 -51 -68 -69 -118 -99 -55 -23 -104 -81 -52 -63 167 39
4198 39 19 -60 12 -52 -90 40 -60 90 -136 46 -23 -134 109 -106 154 -9 -165 17 152 31 -19 31 65
4221 65 -31 87 -143 -69 -88 60 63 14 -23 -40 -111 47 -76 83 -40 99 -30 -3 45 -6 58 15 45 125 -14 -77
4247 -77 -19 -8 108 44 49 48 58 -81 -60 36 74 -40 77 82 5 55 19 127 -2 74 41 -23 112 47 -37 -106 39 96
4275 96 121 47 -37 -114 0 10 -35 -28 -45 41 -10 -15 -107 4 3 -8 -12 -111 55 36 57 25 39 -26 -3 -45 -110 56 -22 113
4305 113 -66 -94 -37 -19 -7 53 62 -8 45 -21 -131 -11 0 37 -6 -37 131 87 54 -71 -115 -65 40 -47 23 15 19 13 -68
4334 -68 -32 51 -74 106 75 8 -8 45 11 70 -58 124 60 -78 -96 67 -29 7 -84 21 61 18 -55 -64 49 59 79
4361G9r3N1j86M6O9N3J55j36o1k3J06j69m6J71l0m5OK1jN4J17j36j14Q4k0J38
4387I0j04M5K5j24K9pM8n8P8m2O2j49K39j54r5J56j24P0R3Q0j57P8n6O9p4j2n0
4414d4R7q2R6r4K0k5Q1J00j74L3j5J4J8J1j14O3Q5p1mK0o8J77k00R2J2N0n6QJ2
4443D2r6J06K2M7j42N1p5N8J33j45J5O6O0p9j05N4K8Mq2J93k65O3O0n2R5p8J20
4470I8j64KKJ24j20J02j27J96j68Q8K1KL2L3j44L6o6Q2m9J01j1l7jj9P0kr8R7
4498H0r9m5L7O4Q0j53J27j24j8P5P6q1K4N6j89R6J34j46pJ7l8M6o6j7J20o2l5
4525d8rl8M0J7K5k2Q3l3L1R8j53q2J00R7j71N2L9j4M6L2n1K1m1j9R4k52R8N0j18
4554a28K78j63K3K6o5Q1K8j8mo7j1N2j76J45k7L1J66j91Q6n1J00j14q6R3O0j27
$$ plain form
4361 79 -14 37 -149 -103 -34 19 174 38 -23 -46 60 -109 -155 16 -14 -59 -53 -32 -33 21 138 2 -112 -28 -48 90
4387 90 -14 31 56 -68 -39 -46 2 -56 22 -20 42 -107 132 -22 -117 39 -85 -15 78 158 1 79 23 92 18 6 -44
4414 -44 53 -29 67 -27 -7 -32 49 149 -25 8 -7 7 25 36 -78 -15 70 -1 -5 15 -53 124 -76 16 28 78 22 30 42
4443 42 -54 52 74 121 -21 30 -45 13 146 1 16 82 142 63 -42 12 40 44 -38 155 -110 -47 13 -39 56 -22 98
4470 98 -66 -64 -62 62 -58 44 -83 113 -55 33 54 56 88 121 -23 13 -53 29 -20 81 70 33 32 13 83 81 -17 80
4498 80 -19 -64 -27 37 117 -36 91 -33 -51 24 100 19 43 99 -90 6 140 -6 -13 4 -34 12 -54 -71 49 -13 -48
4525 -48 -57 -95 -55 -38 -13 -35 48 15 46 144 -9 -91 9 106 -65 -13 26 12 58 90 39 60 19 0 94 -158 -60 -10 -128
4554 -128 150 -13 10 36 -29 52 80 62 58 -9 -20 32 -144 1 -26 5 171 -20 66 15 115 1 -85 8 68 -59
4580e9P8k5M1j15MK4k6J49R0j27N4l7Pn5M6K0o7J09j37l3J61r7o1l0J84q3K6M
4608D5l3L0j80J49o7k6Q0j5Q7j52P8j3J12p7N4q1J46o5n8r9O1QJ16k13N8O9m7
4635c3J41j71J08%p5P3m9l4J17j04L2Mj91K66j33P5k3R6j00l1pN9J82k67J79j38
4661b4K6QJ16j88n7J81l5N6Llm0j1P6Kj71OOm2J5J55o7J4p3Q7p9J34j16k5K5Q2
4691F1Lr3J12J0o4Kj4q8J51j61J2RQ2j81K24r3j6J2K9r6O5M7q5J60n6q7R5l5K4
4720B9q1J00q2J44j30J6J2n3P9L0K2p9M2q4J9K22k88jj2R8k6O3j6J5j67j3J94
4747E3n4Pql8K7k9J3j3M4K9j2o9O0n8L9l0p6J68m8o7Q7m7j08J22J5r1O0j05J25
4776dO2o5Q7p3o6Q8J77k05P9m1r3L1N2P5M2k98J79j1Pr7J65j29M4j0N9o0l3R8
$$ plain form
4580 -59 19 -6 35 -80 -76 -52 -78 71 161 34 88 51 58 3 49 69 2 111 -26 -59 102 5 -56 -86 98 15 41 45
4608 45 12 42 -138 11 -56 -82 -2 -17 70 -82 -4 -17 95 18 72 -9 137 72 14 -85 -24 -16 100 -113 -55 14 -33
4635 -33 108 -63 45 45 -30 43 -6 -40 77 -27 5 9 -182 84 -49 26 3 99 -1 -32 -39 20 202 -65 114 -24
4661 -24 2 10 126 -62 -119 62 27 83 86 83 43 32 108 110 -61 -55 -49 -91 -76 79 12 26 -47 40 -39 95 -21 -46 -21 61
4691 61 64 -29 83 93 29 31 17 -71 80 -81 -69 -60 22 -159 65 -28 -44 -32 -3 -99 -34 13 -72 88 32 -55 40 5 29
4720 29 -52 48 -34 110 -20 -4 8 -45 34 64 86 7 49 -35 -16 206 -82 -83 -95 3 -23 40 24 39 -128 -141 53
4747 53 -1 6 -2 -40 -13 -42 -29 -42 2 31 19 -50 10 -48 -9 -39 -115 53 5 -62 25 -22 -130 -8 7 -84 -24 -129 -4
4776 -4 58 -7 80 7 -59 29 206 1 80 39 -54 -23 29 104 146 -152 27 16 23 -74 91 -38 6 -4 55 -5 -38 60
4804F0q0J11l8R7j93N2q3N2P8O5q5j07Q8K8K6j56J99j47m3O0k7R7p0l9jL6Q3j12
4832d9K6K1j22P4O7m1M2n3J58p4K1j03P0rj0J4n6j25J06K5j2J27r3k4k7J98j90
4859c9m4L3J50j60J8K0N3K8q7J25Jj48j26J44pN9P3j40J40j08j70J69l3lJ70k5
4885I3p0j17O2Q2q0N2M3l9j40P9J19jr5J23n2j6j16r1J53Nj08J41p3R0m3K5L2
4912E8r4k7J49n3J5j11J46j32K13j35J4J54j98K5j3K2N7l4Jj69R1m8N8O0o4J69
4938A54j53k9l1rN7j22J70K3J9nr7o9J54lj27J35M1p4N8q7l0L7o5J0J5J15j06
4965a9J03N2j16r8K44m1j32L7Po3L1pr6J15j4J2m5k1k4J36r6o0Q0L8L0K0k6K0
4993F7j32k1J53j84O0j7N0K8j05J90M2j20L8j26J00k1Q5o4qQ3L1j18j7N0rJ3j41
$$ plain form
4804 60 -20 91 53 150 -43 9 -74 -22 56 121 36 -71 17 45 71 -85 114 -33 -76 -16 -43 54 -16 -55 -56 -20 63 -49
4832 -49 -23 -2 -124 -50 17 -24 18 -35 123 49 70 -33 37 28 18 32 -24 -149 -43 -18 -30 97 4 -20 -47 151 -39
4859 -39 -83 -50 100 -60 -42 -22 31 59 -28 97 98 -50 -176 -32 -39 20 93 -47 93 -15 -185 -16 -49 -52 118 93
4885 93 23 -94 -32 50 -30 22 65 26 -114 -35 84 83 -12 111 59 43 -73 -164 -11 -6 -114 27 -46 44 1 26 58
4912 58 -36 -63 86 33 48 -63 83 -49 164 29 43 197 -1 24 11 33 90 56 57 -112 -21 -69 -11 49 -15 154
4938 154 1 -28 -59 -68 -11 -133 37 60 79 74 -23 -92 62 59 -68 67 108 34 92 5 -25 12 -53 -43 -28 87 -19
4965 -19 84 136 20 -78 166 125 -7 30 37 -26 5 -2 -98 17 3 15 -30 -51 -75 61 -35 -95 -15 23 53 73 47 67
4993 67 -65 -86 67 -117 -57 -74 -24 4 -101 89 131 11 49 -77 23 2 87 23 15 98 129 11 -6 44 35 48 -93
5020i3R6l7l1J15p6J2mK7m7N9O0j18jN8L1p2N4N0p1j76K06l3j16Q1O6O7j12k6
5048c1L4R2k9Mn2%j22J22J19j99mR3k3QJ0l8Q4Nj48J09r0Q9L5n2j1j27P2J43k38
5077a45J86j13N9o4J89j23R5j01q9l1J54j04P4kL2r0L1R3j55N5q3J55J5j07J15
5102D6n3K2J40j21q4J00j2J14r1j34rP6k8l0K3J5mQO2rj04nP9j7M6j3q9M2pO3
5132B6j3O7j00L6L8o7rN1m2l6J12j09L6M2m0N8r5J7K9m1K7K4J5k5k9Q4ONQk7o2
5163a4L3N1j52J67n9J8jn0J02j85J40J03m7j02k7o3J33l7O7m4M8k10J50J7j30
5188i2K9L4L8k6oM3q9N8qL5n5J14K3k57J89q8R5o9O1qj33J01R8q8N3j46L5J0l4
5217h3n1J48M8M2p6K7j92P0J33j69J90j32%J12j68P8j50J98Kj8LJ07j42J06p1
$$ plain form
5020 -93 3 -34 -65 50 -26 -14 -18 9 -38 21 81 -37 -38 20 51 -21 33 83 12 -164 42 9 -107 -26 40 107 -5 -31
5048 -31 3 95 66 70 18 18 -104 18 137 -62 -66 27 4 12 22 -16 68 73 -75 34 -56 33 68 16 5 -122 -50 93 -145
5077 -145 41 -72 -13 -77 112 -11 84 -17 -106 -137 17 -87 -13 -15 17 -73 -42 51 -104 -49 -132 23 38 -69 46
5102 46 -7 15 155 34 -50 50 38 152 61 -73 -82 -6 -34 -64 -41 -26 -30 -22 40 31 -73 -78 1 -16 30 17 -72 -30 -37 26
5132 26 13 80 -20 16 54 -13 -22 29 -13 -49 63 -46 -10 32 -8 50 -45 -28 1 -40 -13 11 26 1 -28 56 62 67 75 48 -14
5163 -14 19 70 -82 85 26 44 43 -7 95 -90 50 153 106 4 -23 -86 47 10 77 33 81 -129 21 38 -92
5188 -92 -63 -29 9 -17 -23 20 -69 -11 -19 16 -39 75 98 -159 30 -58 37 -32 29 21 -112 -11 87 -1 52 -94 -59 -49 -83
5217 -83 -134 14 62 104 28 55 -137 -67 66 -103 87 -45 -45 67 -101 -23 -173 25 27 9 12 119 -23 83 12
5242A2j8O9K2n9p1K7J42j36R7n6k3k3j22J39j14J74p0K5Qlq2Q8J8j98J22J55k31
5269a08J79j5q3P1o5N5J73j21j16j8L3J38j90P2p2R0j12J87j2r6j1OP8J9m5J8
5295E5r3J12o9o5J54j97R1P3O0j84L2J69j04KJ4q0J0N4n0M1j45J71j06N0m7J26
5321G4p0N5J6L5k05J67k7j49N1R9%L6L4p7j21k9Q5K2K6M8j48O2J8n9n1J40l6j3
5349a7k9J7m0j8K06j30J14n0j52J19r1lK14pq8m2N0j83K21r1K9N3n3ll1M1m9N1
5377C8m3J8p7L5M3KK3M2j01QMj5rq7J08n4k2J51l5j8O9r3N4j01K18j30qk8N6j04
5407e6k2j26J71J3L1mMJ3k7M4R2j36R7q0l2l4J23k01J25j2P2L4o1Lo2Q0L3N0j11
5436B1n7oKM1o1J54j52J22P4r2j37l4K03r3J5j18J44q1j0J43n7j98K19N2q4n4
$$ plain form
5242 12 -6 63 85 26 -45 -18 124 -12 85 29 6 -17 -139 0 -114 60 -10 15 23 20 -62 26 44 -154 -32 123 -108
5269 -108 71 56 -27 44 -21 34 207 86 -30 -48 -15 123 -67 5 -67 23 -89 98 86 -10 -21 -15 63 82 37 55
5295 55 -38 74 5 -60 94 -103 -12 61 121 -63 -31 138 34 36 50 -30 -20 34 -16 25 -120 51 -55 -5 -52 74
5321 74 4 59 75 110 -95 72 45 -104 -53 46 46 82 116 39 -82 -111 -26 -4 22 70 -78 -16 2 -57 -108 32 -4 -17
5349 -17 -46 -29 -69 -87 119 -11 103 53 -99 20 -71 -74 140 133 45 3 53 -130 91 0 29 82 29 26 -5 36 -13 38
5377 38 -5 13 -64 -29 14 16 39 81 -20 -12 -8 -23 -32 -119 -11 -65 -87 64 29 11 80 -13 41 -60 158 28 20 -8 48 -56
5407 -56 -78 -204 -33 -20 11 7 11 24 -3 41 133 -3 94 14 -18 -52 71 -130 -5 -17 55 89 28 31 -31 49 82 132 21
5436 21 -36 -42 -40 1 -60 94 -58 64 138 46 -91 -125 78 -15 0 -118 26 -55 -65 78 21 -177 42 94 10 -44
5462d4q3J71M4k7j43NN3k6k7J10j45R8Q5O9j24P0j37J14j19K7J3k1n4J65Kl8M
5489D2k8Ro4J25jk37J18O7O0j36j5j0J28J6j08Qk5P1m4k2J2l7O1L3l1LJ00j00
5517eJ23j57J52j92J28P9j76J26Or8j39K21j41K2JJ21o4l2R1j87K56j18N7j30
5541e6j9L3Q4k8q8L5Q5J2Kp0R2k08Q7J45k2j10Q0k1j28L0J21O3j94N7J6N2m2M0
5569D8pRn5K9j06J57J6j06r2R9J9L8j30J06n1J5k6J12j07n8J08n8Rj07J37r1k6
5596a18J58J9OQk19J38L4K1n1M3L5q5K3K1q0J6q4J59M5j86m5J09O1M0nj22Q9J83
5624B13l30J7P9J44j43M2r7K6J28M7m6oko7L7o7J21j52P0j15J3J07Q0q4K0N1r1
5651eN4p0K9m3Q0r1M1L7q0KJ00j3n0P9o2M6o0n9J29J8n3j39J52k5l9J01M2j45
$$ plain form
5462 -44 -127 44 88 61 -82 -77 -24 -50 -77 33 -112 -14 71 140 16 86 -51 63 -56 -29 -16 -37 -91 74 76 38 42
5489 42 14 23 -41 84 83 -154 -36 31 91 -45 -60 -70 58 74 -34 -26 -51 20 -24 -46 -34 -71 -10 23 -8 -5 95 -5
5517 -5 118 -39 113 -79 49 128 -48 78 84 -14 -153 68 -73 -51 -50 71 7 -25 66 -121 135 17 74 -56
5541 -56 -75 -42 42 14 -74 -39 46 58 60 -10 82 -126 -39 106 84 -26 54 33 -95 -65 56 119 -75 -18 -2 50 8 48
5569 48 41 50 -5 24 -82 75 91 -15 -107 -8 11 49 -81 25 -26 -11 -37 75 -32 -90 18 -40 -31 -138 -1 -92 -118
5596 -118 40 59 65 73 -146 -8 26 47 -4 39 74 -11 12 33 -47 -31 -115 44 89 -97 -142 -33 28 68 63 -59 30 213
5624 213 -117 -100 -21 123 -20 22 -75 -49 79 126 80 74 72 5 42 -25 96 -56 14 -101 -88 19 99 15 35 86 -5
5651 -5 49 -21 8 -35 45 -46 -5 32 -48 -46 54 41 -9 70 8 54 -6 -65 64 82 29 -110 42 17 -22 79 121 -24
5679b4P1qj58N1J45n3m1J80k04P9o5M8J1o3l2R4o9n7J04r8J61j01J2n4L7q0J29
5706A5P5j07rlO5n6K8K03j20r1J02j14L7k7r6QJ23j19O4P8q8M6o6J10q5P2j00
5733e5Q9m7R8j48L2R4j22R5r7J07j7r8L8J86j25l2M6p1J8n1J17j24L9q6O2n6J33
5760B5r0M1K1JL6j09J43r5J5J2R3j68J11J2jn2M1Lq3J69j63P3m5qJ04J4L9r3r7
5789e1Q2J02j01q0R5K7j44R1L0o2j6p5J62q8J6%l7P4P0j55Q9j1J0On4l0K5K26
5817B01j79j21J35r6K4j2J24j1j36L3j8O8k3P9p5J43j96O9l9Q4o8J8N8p2J3j11
5843a08N1L4K11k14k0L3k6J50q3Qj07J39Q1n4r4R4j15K8K4J3J5r6L8O6j16R0j32
5870i0N4Qj6K9P3l7m4L8O3m6q4J06m0o5Q2o0J09k19J11Q3j02R9m7j22K7J25p6
$$ plain form
5679 -24 47 39 -119 -68 77 24 -17 163 -41 38 -27 21 32 -31 -63 31 -38 -95 9 -89 72 -29 -17 -71 -34 -114 15
5706 15 90 -17 -26 -29 36 -20 8 211 91 0 102 -12 25 -2 -98 -90 33 -86 -22 56 -32 14 -52 58 -27 45 -55
5733 -55 34 -13 85 -63 -31 63 -59 36 -61 46 29 -69 -31 155 30 -2 44 -27 -9 -60 57 -67 -28 -114 -52 -108 25
5760 25 -65 -24 -3 -2 34 -75 68 -27 -12 0 93 -75 36 48 47 -5 36 39 -44 125 -38 35 -10 -18 86 100 139 46 -51
5789 -51 31 133 32 -48 47 74 -70 21 51 -11 -27 -102 60 -28 -12 -12 -49 25 95 -60 29 18 28 34 -20 -50 -25 201
5817 201 22 -99 36 -60 -36 -48 76 65 -71 -38 -56 12 -11 68 -7 136 -60 9 -30 54 -14 4 62 -10 3 -108
5843 -108 -57 -23 188 -26 -46 -13 -39 111 28 36 -71 68 149 95 1 95 -20 8 32 45 60 -36 2 68 -48 42 -90
5870 -90 -36 -28 -44 -15 58 21 -23 15 78 32 -52 54 14 -51 31 -29 80 -139 -28 55 -47 52 5 -117 -90 35 -41
5897d1J27q3J9K4K3n4jpQ4q6M0j59O5J33j34n6K24j64O8j00M2J41j43J14Rp2M1
5924E4p5J7q5%J59j88O5O7%r6k6J04j02K24q6n4N6p7M0Q3jJ2k1n9KJJ2m6p1J22
5954C1m4J24p5J09j32p4j4N5J63n9j36K1P0o6L8P1m8Pnn7MK0J10p7k2O0o6J04
5982A12p5l9J5j26Q1L4Rj8n6j3J16K0o3n8o6J65j6ll1R9j79L5m0J22N5k7M0j6
6010G7L1q3K8j72J58qp6k3P4j18J69q9l2O9M3Jo7n6j1J0P5r9J11o8J2M6l5K4Q4
6039G5j04j9K6L4O5Rj9M0j14rl3P0J5l6q6jJ63j04KP3l0M2j48J91n2m5O2m9ON4
6069G8j02m7k1O3P5nj3p3J00j16O5J26n4Nr0q6J37Qn1J3O5K3kr7N4J6j3l1r7J07
6099C7j61J35qj43R4j1J05j08K7j2%M8R9j03n2P2M2k0o8n2K09k47J62m5J4j29
$$ plain form
5897 -41 86 3 22 46 69 15 14 7 91 5 45 -114 -49 84 -50 -106 118 -46 22 -78 -36 105 -38 76 85 13 54
5924 54 -21 -4 -89 -89 70 -118 -53 14 14 -82 -108 -4 -106 118 32 -22 34 -43 -3 80 79 91 70 11 13 14 26 -20 -91 31
5954 31 -13 111 36 145 13 -61 -75 -20 143 84 -52 -31 39 -27 11 82 34 41 36 -21 -17 3 113 36 14 74 8 112
5982 112 37 -2 13 -113 -32 2 11 -7 -63 -76 40 60 -3 -61 -127 38 22 19 -12 87 -92 -57 -97 25 80 53 93 77
6010 77 108 25 53 -119 39 31 -45 -68 6 -112 57 -32 -64 5 48 49 -18 -74 -85 -75 0 -99 12 -56 -44 2 -33 -9 75
6039 75 -29 -48 -22 12 77 86 67 107 -7 -16 -49 21 36 0 -86 -87 76 -28 -26 47 17 59 -89 102 50 5 67 18 24 78
6069 78 -24 -71 -92 -29 46 41 28 -45 55 -61 4 130 76 81 -9 -95 42 50 -1 12 77 100 98 1 55 71 58 27 -70 37
6099 37 -124 11 3 -140 -46 -57 48 -60 -33 -45 -45 3 102 -1 -53 19 61 41 -27 -79 130 -117 45 0 14 -115
6125a15J24k9Q0l2N6j29Mj9Q7K8m7K1j05J47j15J8O1r3j5J26M3L1j48J8J41O7
6151B05j66j21J31L5j00M2LL9n2Q3L3n3q8J06r2m0mKJ64j50N6j4p1p8J57k05J11
6178f7M1o7R3j17M1R1m7j9N9o6O8j10J03P1j50m4J6O2r7K02r6m3N9J5O1l5mj1
6206IL1q0K4j04K8L9J00n1o2p6J66M4j46J4K0Q6P4l2p9%L2rn2m9P2J7kq9J05p5
6236d5Q1r7J26N5q6m0R1J13l46J62q1j09K90j63J16j10O9j13j7J91j57O8p7J68
6260H9j71NNJ88q3j4M5o6J12j28N7PL4Jj01nQ8k4L6j1j44O4P4j15J61J1j61k8
6288g4M7J4n5J37kk33N8J08j7k0L3R6n1j61M8J08k16J26J2J38k1Kl4n8P9r7j5
6315d8R9jr6P3j18m3K13j14j39J02J07J4j29l9M0pR6m0J4O8j50R4P0j24Q7r3K31
$$ plain form
6125 -115 9 -20 60 28 84 -45 -41 -60 27 55 8 29 -76 71 -44 -26 35 -58 -73 53 96 127 -21 -3 138 205
6151 205 39 -82 49 84 -16 26 29 68 16 99 132 79 -9 97 5 -35 -39 -37 127 -23 33 19 -52 -130 27 -178 -67
6178 -67 -26 -93 0 -117 -76 15 -32 -51 8 -58 10 -100 3 74 -76 -120 -104 -42 -139 63 -33 -76 -17 -2 59 24 20 9
6206 9 40 -40 -16 -120 -92 -53 47 -4 -66 -142 24 68 -78 -64 -44 42 116 84 5 5 37 28 -24 -73 -1 16 14 -75 30 -45
6236 -45 36 -61 65 120 34 -6 85 198 -148 14 -67 -176 114 -49 67 -43 26 -87 -104 87 -70 -2 -79 89
6260 89 -82 -77 -72 116 33 19 64 -2 110 -18 39 46 80 81 -20 -25 63 39 75 64 -80 -16 58 -57 104 115 -46 -74
6288 -74 -27 -13 -68 69 67 -166 -108 0 -17 -37 -4 92 41 -120 -72 36 -180 -54 -42 96 75 77 43 -15 64 -33 -48
6315 -48 51 50 -46 27 -91 -134 79 -35 -174 -72 35 49 -80 -119 -79 -86 10 -30 -16 52 -98 -4 66 -58 29 -64 167
6342A67j41l6n7J79n4l4m5J7J70k39J31p7J0J00j46O0j6P1q6J29L0o1J8r7P2o3
6368BJ8k8j49J60Q5p4jJ4n6P3k1p7R2L7q5K8n4K4pm5M9N5l3j6koN1j47J34K1j19
6399g7M0j30R7Q9M5j19L5K1n4J01q1p1j9J73q8J10n0k7j2N2p2MqJ73j71O0nK8
6427D4K8m2j28kO3K7l2J4K9K6MJ3n2Q8Lq2jk1L0Q5m6R4j22l6nK0P0p9N2n0j2p
6459b7J44p2j1l5J9p6J35k8Mj03Q0K1q8L1p3J21R2o9r1L0J7n2K0nl8J30j04J21
6487I3k22J13nK9K3k5L9j01J04J5q7Oj4K2P2j59J56n0J05j97Q5M4j20J96j14R
6513A7J89j88o1j4j2l8JJ60n2N2j55J44J11r5o6o0J1pP7J06j55R8n1l6L5j3K4
6540B2r2P4L0p2K23k70N2j1J0J20o6l5J2K8j09J35p0m1J9K7o1J21p3Q2m7n4R7
$$ plain form
6342 167 26 -10 -67 112 58 24 -21 -4 166 -73 58 -19 -9 91 -55 5 -11 60 -26 103 133 72 90 -7 65 2
6368 2 20 -8 -157 3 88 14 13 27 -29 44 23 -54 38 75 -10 18 -36 -12 -19 -64 -15 40 7 -9 -11 -17 34 -113 21 42 -77
6399 -77 -37 -167 -70 19 64 -55 -20 1 -53 48 -33 -104 -123 50 -38 72 22 -5 -17 35 -37 -33 -41 132 -39 21 16 44
6427 44 72 30 -98 -100 -37 -10 -42 -28 1 27 31 44 -8 80 83 1 0 -21 9 94 48 142 20 -16 -21 -1 69 -10 42 -8 -20 -27
6459 -27 117 45 34 -1 18 -58 77 49 53 -50 30 51 -37 -6 -79 42 134 65 -26 4 21 -31 -11 -16 -54 76 -28 93
6487 93 -129 -16 -21 8 31 6 45 -56 48 63 -24 -18 -32 -10 62 -97 59 9 114 -83 2 46 -74 122 8 17
6513 17 206 18 -43 -57 -69 -107 -106 54 2 54 -101 43 154 59 -7 -67 -56 -63 14 120 -35 63 12 -24 11 -2 22
6540 22 -70 4 34 -38 185 -85 -33 -44 -34 86 20 -15 -3 25 -84 51 -19 -60 -41 -14 -75 46 -27 55 8 -46 51
6567E1j0K6jo5j5P3k59M58m79J93K04k7l61K62m7J2O2K8R1k73Q4J5l7O4n0qj22
6594a31J22R6j7m7o4RP5k0r5L4P8j02l1K05j23L2j84K15r5N4r3J56l4o2kk7o9
6621a20J58k6J5k5n7J03rJ46j69j7m6O9q2J39j57P9l3J55j77K7P1k9j36J24M5
6646D8q1q4J27M7j46J15R6k0p7n7n0K83k14J15n4J11k46P5M1n8j6K8L8l8k9P0
6672B4O1j21O5j4l6j9L5qK5l9J20p6J08J5l05J40l6J05J6o6m5N0qk0pN7j1P7o
6701H1j32JK8k2M8Q8k16J83M9p8p8k7J41m0j26J58n0k6q4J28j27J26q0N1K6k1
6727AQ5o3L8p6J20K0j52m0o3M2P0J9J14j47r2J95p2J9Ql9q6R8q4o8J75m0j1M0
6755A1kn1N1mo7K0J18k0L4j51J41l6pJ5J4pq1P6r9N8J70k54O8O4k2P1q9p1J28
$$ plain form
6567 51 41 67 66 1 -14 59 -200 258 -221 -28 176 149 -212 50 3 15 77 105 196 -77 7 22 -15 49 -1 -9 -131
6594 -131 -9 87 70 23 -41 -32 43 23 -72 -38 40 -62 -93 112 -11 21 -163 52 -43 11 -82 74 40 -22 -24 -51 -120
6621 -120 38 12 27 2 -55 48 39 185 16 -1 -47 22 -60 79 -78 1 -32 123 -54 -27 44 15 -121 3 48
6646 48 -33 -117 10 57 -89 26 122 102 25 -32 -82 201 -13 102 48 159 -87 -12 29 -29 -45 -17 21 -17 -46 24
6672 24 85 -36 29 15 -21 -40 -5 -13 12 -27 93 17 125 140 -165 -25 -61 44 60 -6 -51 -1 -9 -29 -36 21 10 87 81
6701 81 -51 -50 -22 -44 4 92 -124 59 108 30 -48 -75 66 26 -100 58 8 -18 -102 26 -101 25 -55 -4 22 1
6727 1 86 23 61 -15 105 125 -27 -67 -130 -88 -18 1 115 -32 -124 71 -1 18 26 -13 -99 -1 -85 -153 22 -18 -29 11
6755 11 9 -42 9 5 -62 -42 76 56 90 -61 80 44 37 52 66 59 -22 54 -45 13 183 -71 -3 61 39 110 21 -50 78
6784G8j31j4k3J85p3o7J50q7O6rn6rq2J14l1j38J25kO7k7J1p1J9QQ7m0j1N4j61
6813f8M0N5K4k8p2R1J0J28j35J5l9NQ3j15P0L5j17J23p3L7n0j83K87j07k7L3n4
6840c2N9q7R2j71K22q0j33J03k7J3l7j2J86j58O9j06P6JLJ8O7J8n6On6O7l5O5
6868G5j11K3KL0j07N8J23j06n8K07j50nJ2K2K4j00L9m2J44l1k1M4j03m5J58j37
6894e5K44k81O6J45k09J51j14k8R7o0pP3j01J77j61OP4O4N9j2j42m8J37m8k7N9
6920E9j34R6l4M2p5P0j53J10O3N4o8J5L2j8L8j33K13j28J3j48J94j29K9l3k9P9
6946B5jM8j1j42J42j01Lp6N6N7r6J00M8j10L3J08j14Q3m0K3P1M3j74j41Q3J28
6972D5P7j37R7j95R8J28k6j61N9K8n5JrP5m6J4j09Q0Q7m9n1J1n9J98k03O4Q7j42
$$ plain form
6784 78 -53 -67 -90 95 22 -45 105 18 84 75 19 10 -72 42 11 -127 -2 -4 63 36 47 -24 -5 3 90 50 39 93 -68
6813 -68 -28 27 51 23 -49 42 52 180 45 60 21 26 109 -6 64 99 -18 105 32 69 19 -164 123 16 -11 22 -32
6840 -32 27 -60 32 -139 83 3 -130 -27 -54 -41 -78 -90 96 -62 7 -99 -23 -22 -19 -1 66 84 28 34 -22 45 10 75
6868 75 -36 -13 -11 19 -88 -30 93 -13 -71 136 -14 -19 -7 15 39 -61 -22 -64 80 49 28 72 -31 -76 82 -55
6894 -55 189 -92 -26 119 -90 61 -53 -81 16 -44 -51 22 -79 98 -63 -57 17 81 140 128 -14 -62 75 27 0 59
6920 59 -75 21 -13 29 -46 24 -129 -19 44 98 30 45 77 59 97 -36 177 49 62 -86 108 -21 8 -25 -54 25
6946 25 24 72 61 -81 61 -40 -37 -113 -57 0 -96 4 52 -58 -25 83 -31 52 12 35 106 149 -25 -166 -83 45
6972 45 122 -15 82 -113 -15 113 87 -74 -15 13 -42 -41 -50 25 -21 -7 -116 -36 51 2 -49 -38 -97 101 -102 -38 49 -93
7000i3R1NK8R9k56K63j24o6K7O2j19J02L5r4J00r6K9k5nJ2m9N2P9J4j53P6R8q9
7028CK8m7J71q5l1Lq7JJ24m5q3r7J10J86j88J98j30L2j14J21q7n4M4N3NJ02j57
7055b4J8k1m3J54j20M8j19J22q6Q9j4q1L8R0k3M1p3J33p0mj23J53qp5j5K0K3k2
7083Hj0o3J94j50j18J12N6j6Q6j21J29q3L9j82J45L9m4Mp3J5j2J02j60K07j33
7108b9M2q0Q0M0k2k5M1j63P6K0j32Q1P7M4k5L1kk09J92Ln8J40j78P9J6j49P3J0
7136b7M6p5J95p2l0j06QNKL4L5n9M1j05J70O4j53ll8R4j68Q9M3j8J12pj11j00
7164a34R3N8n2J39n0N5p2J7m5R7o7j61K2J15PNl4j48K01o0L9J43q9j31N7L3j7
7191B1L9j43P0rL1r3MN7L7r8R5j9J03j91J31mlp6P7J1n5k8P3o5O1%N6r2Nk1K4
$$ plain form
7000 -93 -2 3 31 130 -126 137 13 -53 -26 36 -83 19 54 -40 60 -36 -7 -32 -37 -25 -74 -22 57 71 -82 -6 92 3
7028 3 31 -16 155 70 39 42 -45 -44 80 35 -48 -145 -35 151 -37 161 31 63 -51 70 -17 -71 -27 26 31 133 -24
7055 -24 -6 -27 -70 84 -36 12 -107 15 -71 18 4 -77 -39 51 28 69 -4 129 59 55 -68 85 77 2 -13 7 30 8
7083 8 -2 -65 129 -21 -139 -27 29 13 99 -22 107 24 63 -119 26 65 21 25 -48 -33 -45 57 -103 104 -29
7108 -29 13 -67 13 53 31 6 47 -116 -40 -20 -152 -71 6 50 25 56 54 -155 37 40 -18 122 -56 23 39 -110 -37 -27
7136 -27 19 -56 139 67 37 -69 -61 -56 -54 -20 15 -44 -3 -108 62 126 -27 -30 -68 26 -142 -53 -10 -28 84 77 -34 -134
7164 -134 -41 17 -35 104 54 109 37 54 9 106 39 -122 -100 15 22 27 -7 -155 46 -14 25 168 79 -52 5 38 21
7191 21 60 -83 -13 -22 9 -84 -80 -23 14 -84 11 -8 95 -96 35 31 28 -48 29 40 -15 -43 30 -35 26 26 82 -10 -5 -26 -2
7222bjP7k0j86J41j1m9R8k0rM8J31k44J05m8J3k4K2n0P0Qk08J16J49l7j17J08
7249F0q5L4J4L4m4l1K3L4M7q8O9o3r6J80q3m7O5J03k8j69J65r8M7Kj06J43k83
7276b01K84r9K8M7l4p2J50q0Q5pr6l4PJ21j24R3l6j10K2J06k5nJ3K0oq9K7LN3
7305D1m1j8P1J1nr0J74k50N2J87q5j06J44j39J08lm9R9k51K01o3q3J04m0mJ34
7331I9N6j85n0J56l8m7J17j56o5J53j00P0K1J1k5P7o0p3P6Rp3K4P6j43mQ6n0J01
7359F3j42R9MJ05j19M4p4o2M5N0J04n7M4j26R2N1k09JJ12R1j66m4J73j90J66k6
7385B9o8K8J5l1O7j98J49n3J07O2k12J7Q3k2J12m4o6M0On7M1M0o5N7j10P7Jr7
7413i2j4N2J29r7J37k5j30N2N5p9k2J2p4J40m9j8m2N4l3oOJ38m8l1n7P4J43j91
$$ plain form
7222 -2 -3 74 54 -132 9 -2 -51 47 27 18 66 197 -47 58 10 23 -1 21 -29 41 49 -159 -43 106 69 -48 60
7249 60 -25 9 23 57 13 -18 5 39 86 -2 67 4 -92 88 5 -42 23 126 98 -71 94 -4 43 45 -61 82 -201
7276 -201 83 -16 12 59 25 -47 103 23 108 101 5 -29 -22 99 -25 68 32 -78 -56 50 25 20 33 53 47 -42 -15 -12 41
7305 41 0 -18 53 64 59 -31 143 -107 -55 132 47 -59 85 -54 54 51 2 101 -150 51 -12 -95 9 -31 -35 99
7331 99 155 -30 -80 76 38 -9 108 -48 -113 40 -60 10 31 42 17 94 34 -39 37 46 -27 -3 73 -70 -74 12 -38 63
7359 63 -79 20 24 129 10 54 -20 -82 -37 13 117 60 104 -22 70 121 -88 -87 25 116 -50 -94 79 -111 55 29
7385 29 -39 -11 4 -27 40 -158 -9 -62 45 107 -105 -88 -5 -27 85 41 -25 15 21 -36 5 45 -20 37 -73 4 5 -92
7413 -92 -106 -54 75 -22 115 90 -40 12 67 -12 -34 -22 -96 44 -5 -23 -65 -11 -44 -50 -44 94 46 15 -42 32 175 -16
7441a6L3L9r0K7J10q8P2j53m3Q6J4n2J17q4P7m9N6j79J53p2K2J2N7R0j26Or7J58
7469H0N1q6Rj80O7J2PJ53k11R0l8J00N5j74K42j78J67j93LJ09m7o7Q9j38J82j73
7495f9J15j03J11N9j83Q5J19k06J04j13Q3j27P7J10j94J88j30J96k27kK0K08j87
7518f6J15o8q8J14K7j9l9k2R3j0j0q0K7k3J05j76K41r4m4P4j7m5p2J04n7j1Q1
7545D0O3j40N6j11N6M6n9J3N8k9N8l0n2k9K18j45j03J35LJ1M3j52N5L7j53K17
7571A06j44J19j22J18lk5Oj2l1K1j08J37j3l6j5J4l8N7L2p3k5J85j04n6J1K6j0
7598A7n5N8j6p0J49j13P7j7n7J00j8Jq7P5j36J11L7p9P7m5J06j50n1J54J0o5l
7625A0n5M1K3n5K0kN7o7J16o3l2M3l1l3k2P2q0M9J17j38N9RLj18L3J43j41J16
$$ plain form
7441 -16 17 56 -34 -7 103 15 87 -66 -109 -23 -9 -61 56 -28 49 0 56 -123 30 -42 -20 -8 49 139 13 19 -78 80
7469 80 131 45 54 -126 -59 -47 -40 113 -98 -8 -46 54 109 -65 177 -1 166 -27 -24 85 38 -29 60 -78 104 -69
7495 -69 46 -57 54 113 -70 15 134 -72 32 -81 2 -125 -48 62 -132 56 -74 122 -105 -107 -87 121 -66
7518 -66 49 -19 -107 7 34 15 -24 -46 47 37 27 -53 -26 -49 56 -120 121 27 -17 57 40 -5 -77 27 -30 -41 40
7545 40 103 -37 19 -92 -36 10 -49 -36 22 -7 51 21 -31 -60 158 13 -90 45 48 59 102 -50 5 42 -111 106
7571 106 -38 81 -41 77 74 49 55 43 12 33 -75 62 49 13 -2 12 -26 31 63 -10 -35 150 46 -10 1 27 17
7598 17 -38 20 4 -66 83 -30 47 30 -27 73 55 56 -31 44 -92 19 56 -23 54 9 115 -35 -86 68 78 13 10
7625 10 -45 -4 19 -36 -16 -18 39 -28 88 25 -7 36 5 -28 -50 22 -58 -9 108 -30 29 38 41 -77 -44 99 -42 74
7653G4j93J98k8m0n8J7J00n8o3J35n4j2k5MQ6k09R4J55r4q5O9J1j6NJ9L6j02l
7681c7J28l3k1p3L3M0p8J22j10o7J03L3O8j4j17J%J45o5n3O2Nj41J11J6k6Pj28
7709h9J26j28l9N0M8jR1n7L0p1o4Q4J0L2K9r8R7M5J3J4pj57l2O6N1j01K4J54m7
7738G3n1r4M7P7l1Q1k5j3j39R1O7l1M6k42J88r3M4R2j31Mj6Q4O7j42L4O1j3L5
7766G0kr4QJ2J02n4j6j11J12P8j06l3K2J4N5j27J11J9J9j31Q2L7m0P5r3n8M6l2
7794c5J5L1j5n8J27J04k77J98j58P1J02j67J94j77O0j35P7P4ql3j45o1Q9J37M2
7819E2m7j0m7J22K1j20L8p2O0J5j0m4J07p0J2KPm2n1O2K1m2l2J63m3j32J35j38
7847h3n1J79j15J75l7Nj26k3J82km7o9j00J7M4Q4P4j0j04o4l7O6nn2L9J04mr3
$$ plain form
7653 74 -119 79 51 11 -47 -30 70 12 -51 84 30 18 -7 -3 83 -126 -32 123 29 -56 13 24 8 13 32 68 -34 -37
7681 -37 91 58 37 -36 -3 37 -41 81 -29 -96 7 40 108 94 -23 -22 -22 123 58 5 67 72 -69 42 58 32 39 -89
7709 -89 37 -91 -130 -80 -32 -33 58 1 31 -40 -104 -20 -10 22 51 -47 50 95 108 122 115 -42 -74 -8 43 -58 -34 120 73
7738 73 22 -72 -25 52 21 102 77 64 -75 16 83 52 98 -144 44 -49 -5 87 -44 -40 -56 28 95 -47 -13 48 35 70
7766 70 68 -26 -18 -6 96 42 26 -85 27 105 -1 -34 -12 2 57 -70 41 60 79 -52 30 67 27 102 9 -49 -3 -35
7794 -35 -20 11 -4 -62 65 169 -108 90 -68 3 105 -62 132 -45 15 -120 -43 31 23 -10 -155 -216 -127 10 52
7819 52 5 -5 -52 70 91 -29 9 -63 -3 12 2 -42 65 -5 7 9 16 -26 -77 -15 6 -36 -68 95 52 -80 55 -83
7847 -83 -134 45 -70 105 68 73 -53 -76 106 104 57 -12 -112 -95 -51 33 107 97 -7 -71 -108 -42 -47 -99 -60 44 40 -53
7875e3j6L6j5LJ03j20L1O1p0J19M8k03q3R7N2N2Jm3O0j1j18N8M2K4n0P7o1j6M0
7904D5n3K5N4j05J41j22J28o3j96P8J20n0j33R1J29o6k5m6rJ00k6q4k9J34j24
7929h6J09kk4k3K5J25j86m6J70m4M6q0J5q2K12j3j27JJ0R4n4j51P1J56l08K20
7955B8j07J07Q6j41O7J4j90J49J37j14l3o7J56j37M7o5JM0J52j35p4P2j64L2J59
7980B0M1r0p1J54n1mk6N1j04J27j14J99j06j25J14M6P7j86K8l0Q1j69K80r8j13
8005f9N9R1K3l1j15k8J53k23J74m7o6R9q6qK2L5Rp5N5l2P8Qj56J80r0K4L1j08
8033i3m2J63Om8M6J10m6j01J23j03j05J06l4k8P7j9Q7o7P5m8Kr8n7K11L9j62J79
8060A73q8j78Q3m9j8k4M2O5N8j3p6l9Q9q7l7O5P2j3j8M4lp5J20r8N3n6R7j0n4
$$ plain form
7875 -53 -69 -33 -48 -45 58 -62 -31 30 -40 79 127 -76 -159 -62 -10 42 43 0 60 49 -69 -11 31 55 5 82 21 5 45
7904 45 -8 17 71 -34 107 -15 113 50 -146 -68 52 2 -131 -40 89 23 -2 -48 -57 43 17 -67 -96 38 -86
7929 -86 23 21 -3 -26 -1 124 -62 -108 62 18 64 -16 -1 -83 129 116 -11 -10 0 94 40 -111 -40 116 -192 28
7955 28 -79 28 114 -27 40 54 -136 13 150 36 3 -64 92 -45 2 -63 -62 -22 130 -5 -79 -7 -171 -139 20
7980 20 61 -29 -100 54 3 -1 -27 24 -80 47 -67 132 26 -99 15 61 138 -48 -20 -50 31 -138 142 44 -69
8005 -69 -10 81 104 73 -42 -70 83 -140 34 -13 -79 20 -66 -74 -52 -17 -8 -83 -28 -60 18 26 -130 50 -40 -16 15 -93
8033 -93 -135 28 34 -14 32 142 96 -5 118 15 -90 16 -18 -46 31 12 99 32 107 59 61 -37 -94 117 156 -6 173
8060 173 85 -93 -10 -59 -77 -101 -59 6 64 51 -25 -64 25 -62 -99 -34 38 25 7 51 48 -27 93 -5 48 -8 89 79 25
8089B5n5P5N5r6k8N2j4R1j02L2p5O3M1j11M5j9K5j03N4J30o0K5m3r7J29K6P2j74
8117c7m8OJ40p0m2Q8n6kK2m2o7Q5J20j50R4pm4J31k88J13k6oJ18Q3j08k1RO2Q
8146F5j20k7M8O9j1O0r6n5Q7N3Kj23J41j57N6n2P2P1j45J06o1P2j7M4j13l0l7
8173i8J33r9O5Q2l2qj39Q5l9P2K3j08J16j16Q4N5q2l5
$$ plain form
8089 25 -30 45 100 4 -24 28 14 105 3 35 -40 23 64 -47 -2 -21 4 -99 -45 85 25 50 7 -90 39 65 137 -37
8117 -37 -85 -79 61 -9 -51 37 -19 -21 1 -41 -108 -23 97 -53 41 34 -10 121 -167 -54 -80 -86 32 115 7 -14 -5 57 65
8146 65 -55 -82 -34 35 24 84 -12 -67 20 73 75 -48 93 -64 -8 -60 12 83 -62 44 -17 55 38 82 -31 -61 -98
8173 -98 35 -64 1 83 51 43 -96 -11 -50 22 45 -63 53 -63 21 76 -6 -41
8191d1
$$ Imaginary data points
##PAGE= N=2
##DATA TABLE= (X++(I..I)), XYDATA
0@%%%%%%%%%%%%%l2O4o4O4o4R6j28J28j60K00k32K88l31L69m24M96n89O71p61
32d09Q61r67J097j242J398j565J750j951K172k414K676k965L278l617L994m405
48b309M856n351N893o494P160p898Q725r662J0727j1947J3366j5045J7055j9521
62a0445K2637k6704L2260m0345N3221p6992J35077n31045p42716J173508O53954
73F42410n99024n11509O57910N34570l17021l59867K74385J28363l41998j37244
83b9025L81208M5511n75182l73324K86897J58459l32896j08136M28808J57138
93C9458l55673q1695M38735K02215k27859o4414K23388O4445p5332O1903J9384
104B44555k27705j03200K68397J93784k64522l13997J30613K96614r1437l30757
$$ plain form
0 0 0 0 0 0 0 0 0 0 0 0 0 0 0 -32 32 -32 32 -32 64 -64 64 -96 104 -128 160 -171 198 -226 270 -319 352 -409
32 -409 452 -515 582 -660 738 -827 923 -1028 1144 -1270 1406 -1559 1719 -1898 2096 -2309
48 -2309 2547 -2804 3089 -3405 3755 -4143 4582 -5080 5647 -6300 7066 -7979 9076 -10445
62 -10445 12192 -14512 17748 -22597 30624 -46368 88709 -442336 -1185052 -11544 642410
73 642410 43386 -468123 189787 724357 407336 47469 321854 450217 108219 -29025
83 -29025 352183 397694 -177488 -550812 -263915 -105456 -438352 -546488 -117680 39458
93 39458 -316215 -397910 40825 243040 15181 -49233 174155 238600 163268 225171 244555
104 244555 16850 -86350 182047 375831 111309 -202688 -72075 224539 133102 -197655
114a97655m3664J63027r2780k21438R0965K13370r3150j30163K48367K76725j29279
125H4325j70669K12519K60415p9374j42560J07247J09145j74435k51876j8873
135f4136J15885m6190j93010n9620J13163L3939r8814j6801R2258K9040J332J02563
147I609P2620q9663o7634R9984R6770k7580k1427N3108L2380j7330j1604n144
159A24089j5448j9623l3276m2634l2728n2033q2450l7194K5236J287k2500L3431
171a53843N1130n85K1083J00704Q5438J7157K0016L7487R16k7065k8001l9329
183H5108k6264O152k3292o7683l0611N825l7660m1501L7673N0359k0797l2276
195i4967J4642J6204n381O592K5405L7423M4313J2724j9077J7092M8624L181j6873
$$ plain form
114 -197655 -241319 -78292 -171072 -392510 -301545 -88175 -181325 -311488 -63121 213604 84325
125 84325 -86344 126175 386590 307216 164656 271903 381048 206613 -45263 -64136
135 -64136 51749 5559 -187451 -247071 -133908 -99969 -198783 -215584 -123326 -94286 -92954 9609
147 9609 82229 -7434 -75068 24916 121686 94106 72679 125787 158167 140837 129233 124089
159 124089 108641 89018 55742 13108 -19620 -71653 -154103 -191297 -166061 -164774 -187274 -153843
171 -153843 -102713 -103298 -82215 18489 103927 121084 141100 178587 179503 152438 124437 85108
183 85108 58844 64996 41704 -25979 -56590 -50765 -88425 -129926 -92253 -41894 -62691 -94967
195 -94967 -80325 -64121 -69502 -62910 -37505 -82 44231 56955 37878 54970 103594 106775 89902
208H9902L5548K7838n4225o4731j6751k9588n6724k0423L050k3300j9445P986
220a20863j00J858M4345N5260K9559K7903L0591N200k987Q058l932m274K0023
233I0641k990n1865k7449J4337k2397m6920J5451M0159k5772m9027P78J0242k0900
246g5712j0621K1443K5269J4457J538l870K1585M1792J5673M984M2753L3571l4928
259I7934m3027M711o389m5153k0318P792k3971m1922j4189n173q836J6680L2272
272d9589J6925J6084K2420J994n470J8774K0050K621J2182J3693k0279k5058M884
285B9231j52j8618O687J9591j7793l1352m690j0119k9747n692J8012k17r068N977
299d7950J967j143K2115K9167J6057K4631K9315l378j7832N912L382k2163j0619
$$ plain form
208 89902 125450 153288 99063 34332 17581 -12007 -68731 -89154 -86104 -109404 -128849 -120863
220 -120863 -120963 -119105 -74760 -19500 10059 37962 68553 73753 70766 78824 74892 70618 90641
233 90641 87651 35786 8337 22674 277 -46643 -31192 8967 -16805 -65832 -65054 -54812 -75712
246 -75712 -86333 -64890 -39621 -25164 -23626 -27496 -5911 35881 51554 56538 99291 132862 97934
259 97934 54907 59618 53229 8076 -12242 -4450 -28421 -70343 -84532 -89705 -98541 -81861 -49589
272 -49589 -32664 -16580 5840 7834 2364 21138 41188 43809 55991 69684 49405 24347 29231
285 29231 29079 10461 17148 36739 18946 -12406 -17096 -27215 -56962 -62654 -44642 -44859 -53927 -47950
299 -47950 -45983 -47126 -25011 4156 20213 44844 74159 70781 52949 58861 62243 40080 29461
312B9461N866j9581l5233j4577r450j7685K116J8714L623Q14J3602R37q857J6007
326a4243K4228M73J475J9641K387j7347J233J3931j6J866J1540n725j8487o903
340A4053j0453k1857n268O195j4190j8611L543k80j3606Q943K8957J3215Q045
353a314K3004J2905m878O196J2680l189l513N453j1239k4227q328m388j7693n857
367b4388R983m209j2947M383M339j0613K439J7154K585l960J0078N962o367Q096
381B535J8304L596K151J4243J432j4257j345M600j1821j0980R53j1478k2865q334
395c3266k814j0718J222J6312M414j698J2895J0556l311R056K1577O206k591O904
409C4744J94j5031n171L633n699m203N679n958j7317l693J394j1223l870J1538
$$ plain form
312 29461 35327 15746 -19487 -34064 -43514 -61199 -59083 -40369 -36746 -35932 -22330 -21393 -30250 -14243
326 -14243 9985 10458 11933 31574 33961 16614 17847 31778 31762 33628 45168 39443 20956 14053
340 14053 3600 -18257 -23525 -17330 -31520 -50131 -46588 -46868 -60474 -51531 -22574 -9359 -1314
353 -1314 21690 34595 29717 35913 48593 45404 41891 47344 36105 11878 3550 -838 -18531 -24388
367 -24388 -14405 -18614 -31561 -27178 -22839 -33452 -31013 -13859 -11274 -15234 -5156 806 -5561 2535
381 2535 20839 24435 26586 40829 42261 28004 26659 31259 19438 8458 9411 -2067 -24932 -33266
395 -33266 -36080 -46798 -45576 -29264 -24850 -26548 -13653 -3097 -6408 2648 24225 30431 27840 34744
409 34744 34938 19907 14736 18369 12670 8467 14146 8188 -9129 -12822 -11428 -22651 -26521 -14983
423a4983P3j2120P64N107n183L511J8111R893K952J1334O398o262K988J1017k376
438C1224n584M378o627k1673j0815m65r690o515P659Q51r499J90M790l374M508
453b0642J7180P198j502Q203M687r770q77J3895L942l844N470K259j2106q197
467E896j43m889l670L948m713j3317l278p58j0841j054J6410P447m057P162J0825
482D968l862r46J4099R128p20L409J336j0240p709k46n361m569M604j205j1563
497h877m494J94p781k168J1328M162o286M154P299o865l521J3252R660j452M956
512A3561P264m191m962L117j24l167K509j468j1166o202j063q694n578O824L100
527a0240o165J424N751l789r60J2032O905k764O081Q458o065o625O645M822m730
$$ plain form
423 -14983 -14910 -27030 -26266 -21159 -26342 -22831 -4720 5173 8125 19459 25857 19595 22583 33600 31224
438 31224 25640 30018 23391 1718 -9097 -9562 -19252 -25767 -18108 -17257 -26756 -26566 -21776 -25150 -20642
453 -20642 -3462 3736 2234 10437 15124 5354 4477 18372 22314 18470 23940 26199 14093 5896
467 5896 5753 864 -2806 1142 -3571 -16888 -20166 -20924 -31765 -32819 -16409 -8962 -13019 -5857 4968
482 4968 1106 160 14259 23387 22667 26076 27412 17172 9463 9217 3856 -713 3891 2686 -8877
497 -8877 -13371 -13177 -20958 -23126 -11798 -7636 -13922 -9768 -2469 -9334 -12855 397 10057 8605 13561
512 13561 20825 16634 11672 14789 14665 11498 14007 12539 1373 -4829 -5892 -14586 -20164 -13340 -10240
527 -10240 -16405 -14981 -9230 -13019 -13979 -1947 4958 2194 8275 16733 10668 4043 10688 15510 10780
542A0780q41K564m010n543l525n533j092N280k303r724J752O006q150o672J1186
557i825R513m825j8J0235K206l814L508M976J055K181m24o952k815K390n108p738
573e455L362K819q066m947L637j467l375N174M003k778K665N667l382k250R359
588D966N075n197J520O985l316o716K637K928l545j698k73m586l634o24m244k494
604a2216N831J469o034J481P238k768l563R719Q081m649r57O762j049o385J830
619D790L934k070j534P5m575m143N92j625k433L651K267n157k143L037j679j718
635h731O654M694k533K075N177m343m607P547N494n831j264O379k991j0024k191
650d495L766o20k341o42q50K28q90m422L92R408L647n508J512P727l157p381N217
$$ plain form
542 10780 9939 12503 8493 2950 -575 -6108 -7200 -1920 -4223 -13947 -12195 -6189 -14339 -21011 -9825
557 -9825 -312 -5137 -5155 5080 7286 3472 6980 11956 13011 15192 14768 7816 5001 7391 2283 -5455
573 -5455 -2093 726 -7340 -12287 -8650 -10117 -13492 -8318 -4315 -7093 -4428 1239 -2143 -4393 4966
588 4966 10041 4844 6364 13349 10033 3317 5954 8882 5337 3639 3366 -1220 -4854 -5478 -9722 -12216
604 -12216 -6385 -4916 -10950 -9469 -2231 -4999 -8562 1157 9238 4589 3632 10394 9345 2960 4790
619 4790 8724 6654 5120 5195 620 -3523 -2931 -4556 -6989 -3338 -1071 -6228 -8371 -5334 -7013 -8731
635 -8731 -2077 2617 84 2159 7336 2993 -1614 5933 11427 5596 4332 10711 7720 -2304 -4495
650 -4495 -729 -1349 -3690 -4332 -5182 -4954 -5844 -10266 -9874 -466 3181 -2327 -815 6912 3755 -3626 1591
667A591P548l108k525M101j354o486P9K012k826k78K885k769n071l98K01j050
683g448K312L182m39J734K512l713k236P411M963m651P38P044k948r621O84M779
699D303l257l539K940j5m860j735j21o58K468L343j064J42K844j667l278L704
715d50M857j457M81M629j795n673J935L209l942j596M070j619o202q62J176k865
731f104m26L195q5j393K002N70j979L051M952n69K6L788m59m355J025K373l293
748B319j471L104j705n572N61J812l437j589L858Q1l067Q80J202j281J135L582
764D12j30j3L810N22k919J687L897k053k154K711o17n089p05J110l328j705K109
781b455j271l676J447K489j833M72M553J060j210K048J639j156J167K610j580
$$ plain form
667 1591 9139 6031 3506 7607 6253 -233 -154 1858 -968 -1246 1639 -1130 -6201 -6599 -6398 -7448
683 -7448 -5136 -1954 -2393 -659 1853 -1860 -4096 3315 8278 3627 4365 11409 8461 -1160 -476 4303
699 4303 1046 -2493 447 432 -4428 -6163 -6284 -6942 -4474 -1131 -2195 -2053 791 -876 -4154 -450
715 -450 4407 2950 3431 8060 6265 592 2527 5736 1794 198 4268 2649 -3553 -4415 -3239 -6104
731 -6104 -6530 -3335 -3420 -4813 -2811 -2241 -4220 -1169 3783 3214 3240 7028 6569 2214 3239 5612 2319
748 2319 848 3952 2247 -3325 -2764 -952 -4389 -5978 -2120 -2039 -5106 -4226 -3024 -4305 -3170 412
764 412 282 269 4079 4601 1682 3369 7266 5213 3059 5770 5153 64 -641 469 -2859 -4564 -2455
781 -2455 -3726 -7402 -5955 -3466 -5299 -4827 -274 786 -424 1624 3263 2107 3274 5884 4304
796D304j037K453j010m588O07K622k951l066K223j60m447p21J935j316k83K721
812b714M1j322K339K111j112J690M574K58j685J745K34l247l3J870k686k347J662
829A378j651n190k59K759j670j613L348J360k447O9K489P7Q96L152M98o17J841
846D420J36k784Q70L248j424k331J568n71m732j844K123j633k144J985M37l159
862e835l4K120j75O76L756J799o55J490R72j993N29L156n74k127J317k71m443
879b92j828J832r58k015J769M10l161q04J533q75j98L443J545j579J147J965j275
896F59j21L116J064q77J181L03l232j333J641j659k360J455N00l756j744J555
912c608o25j202K438J916p23O15J586p21R6L059P71j229J449J157k570j543J651
$$ plain form
796 4304 3267 5720 4710 122 729 3351 400 -2666 -443 -603 -5050 -5771 -3836 -5152 -5435 -2714
812 -2714 -2673 -3995 -1656 455 -657 1033 5607 5865 4180 5925 6159 2912 2879 4749 2063 -284 1378
829 1378 -273 -5463 -5722 -2963 -4633 -6246 -2898 -1538 -3985 -3916 -1427 -1350 -454 2698 3196 2579 4420
846 4420 4556 1772 2642 5890 4466 2135 3703 3132 -1600 -3444 -1321 -2954 -5098 -3113 -2676 -5835
862 -5835 -5869 -3749 -3924 -3248 508 2307 1652 3142 4114 2121 2650 5806 5232 3105 4422 4151 -292
879 -292 -2120 -288 -1246 -3261 -1492 -1082 -4243 -5047 -3514 -4389 -4587 -1144 401 -1178 -31 1934 659
896 659 538 3654 4718 3841 5022 5325 2093 760 2401 742 -1618 -163 337 -3419 -5163 -3608
912 -3608 -4233 -5435 -2997 -1081 -1804 -1189 397 -324 -228 2831 3602 2373 3822 4979 2409 866 2517
929B517k91k070P78P72k592j689Q52j040j459J749R22j625K31J972q13o05K647
946B56J833r82J138J913j351j206J580rj798M44O73k568j653R94q36j852J165
963b259J276j928k20K062k29j113J952J643j207K75K037q52q13J790N12j714O09
980A821J096j851j272J171l86k242M71Q12j859r02J553k48j135J633J501j191
996a028K04K242k39q91J619J130j630o7J143j466j318J071M1j724J25P95j550
1013a543r37J610Q8j456J211J421j499n68J858J52j109J517J294j182k64J210
1029A803p75r49J233M89j575k3P63j827j376J319M46j505P40J483j173p70J387
1046c10L37n14J327J171j048n51J105p98j261J163R09j309m19R59j218j345J043
$$ plain form
929 2517 2226 156 934 1706 -886 -2575 -1723 -2763 -4222 -2473 -1551 -3176 -2945 -973 -1786 -2391 256
946 256 2089 1107 2245 4158 2807 1601 3181 3172 1374 1818 2491 -77 -1730 -736 -1572 -3424 -2259
963 -2259 -983 -2911 -3131 -1069 -1298 -2411 -459 1184 -23 252 2289 1437 624 2414 2926 1212 1821
980 1821 2917 1066 -206 965 579 -1663 -1192 -380 -2239 -3141 -1588 -1836 -2971 -1338 163 -1028
996 -1028 -824 1418 1179 288 1907 3037 1407 1340 2483 1017 -301 770 811 -913 -788 7 -1543
1013 -1543 -2480 -870 -782 -2238 -1027 394 -1105 -1673 185 337 -772 745 2039 857 593 1803
1029 1803 1028 79 1312 1801 226 203 966 -861 -2237 -918 -472 -1977 -1237 246 -927 -1697 -310
1046 -310 27 -487 840 2011 963 412 1517 719 -542 621 1530 221 -198 761 -457 -1802 -759
1063g59O62j047N43J237j368q75J354J17j053J128J813j066p00R76j23j122Q05
1080E22J089q52k69M41r80j451O44M58q45J46J488p64j315J024O26q73R44J560
1098A593p22n86P86j32j366N93J241p98p35Q28m57j584N56O83r42O1J451p36j219
1117a485P35N37r38N22J600j57r18J111j23j164O88J267o72p26J011m31j518j02
1135g63R18q27m54P60j25r33M04O46r11O20J560m59p21J006N56j146m3J467l96
1154A159p62N18J63j310m7N98q81k94P91j00j366L65Q09q67j85J210J93n85O70
1173G9P11q62K61J327k61q96P91M43j159m59P87m57j052N24J42j076K23N04m95
1192i25m14J036Q3p23N68R50n66j33J211k16q91J021L94r92j31J121o91r62L74
$$ plain form
1063 -759 -97 -1144 -601 636 -732 -1607 -253 -136 -1189 -61 1752 686 -14 962 839 -283 522
1080 522 1611 759 490 931 -49 -1500 -856 -398 -1243 -1097 391 -373 -1688 -664 -38 -911 33 1593
1098 1593 871 285 1071 939 -427 166 1407 609 -126 702 245 -1339 -783 -100 -1042 -981 470 -266 -1485
1117 -1485 -750 -213 -1151 -629 971 814 -104 1007 884 -280 408 1675 1003 277 1288 857 -661 -763
1135 -763 155 -672 -1126 -366 -491 -1424 -1020 -374 -1285 -665 895 436 -285 721 1277 131 88 1555 1159
1154 1159 397 915 1078 -232 -279 319 -562 -856 -65 -165 -1531 -1166 -357 -1224 -1409 -199 -6 -591 79
1173 79 790 -72 189 1516 1255 359 1150 1593 434 -25 762 305 -747 -223 -81 -1157 -934 -430 -925
1192 -925 -1339 -303 -220 -943 -375 575 9 -124 1087 871 -20 1001 1395 403 272 1393 702 -260 114
1211A14L18j006l90O98l78l44L12j78n90N84R26o62L8J378m4q91L74J227p54j37
1231E95P91j77q13M3K16j112q1Q18n17r15O24J92q54j4Q60m5k64O55K07o72N35
1252G2O26m70Q9J056k8j078L91L44q58n20Q55M1r57J18J85j041M3N93j62k63P11
1273b53L01p47J16P62j25%R10K68r17K97L91o45m57R24J00j046K7M39p64m07M06
1294d20Mm71N75J33p67P2P74k52l02Q96N64p37K30M05k80k97O26M4m07J06K96
1315G92r26n35P86j87p34K41O53o08l27N75q8l21O22L79m15K18N56n68l61Q63
1335F15K68p07J54N21m05p82M61J53n74O9M19m50o57O02L2l88L02L64k69k7M90
1356A91o1m05N95J96l96JP14m09o48M91O2m04o4L98k10l31J76Ko81N31K61l87
$$ plain form
1211 114 432 -574 -964 -266 -644 -988 -676 -854 -1444 -860 66 -596 -558 820 776 -115 259 1486 732 595
1231 595 1386 1209 396 439 655 -457 -538 280 -237 -1152 -528 -336 -1190 -1204 -344 -389 -653 2 209 -463 72
1252 72 698 228 317 1373 1345 267 658 1002 144 -376 479 520 -437 -319 -134 -1175 -1132 -539 -701 -964 -253
1273 -253 48 -699 -583 179 54 54 964 1232 315 612 1003 358 -99 825 925 -121 -94 345 -419 -826 -420
1294 -420 -416 -887 -312 -179 -946 -874 -100 -352 -654 242 806 69 299 704 424 127 753 797 390 496 792
1315 792 -134 -669 117 -70 -804 -563 90 -518 -845 -270 -358 -679 -57 322 -93 125 681 113 -248 615
1335 615 883 176 330 851 446 -336 125 278 -296 -227 192 -258 -915 -313 -281 -669 -367 -3 -272 -299 191
1356 191 130 -275 320 516 120 121 835 426 -222 269 331 -73 -137 261 51 -280 -104 -102 -783 -252 9 -378
1378c78k12N71m3m82N41K77l27K4N07j59l55M82J00o34O7N36l89m50M53J22m78
1399b27n2L36l20k53N04j26k12K19M09n58n5P01j34l75K48M44n83j94N73q0l38
1420g3K80J19m30n2L42k16l73M03J98m37O9L06l15j90L44K05l16K05L45m09k56
1441b51M66Lm95M41K67m02j42K62j06m05L98K01m79J89L00l70k12L15J6k07J70
1462d1M23m32j64K23L4k39K40L08m25q5L97j71l36J45M29l80J3L89l07m09L06
1483h2L55m93J86K88n1m01K53P7l36J41L79l03j25L63k13k28Q2L71k34j18L70
1504B81j25k74J8K70l38N8K73P6l30P7O6l24N7M05k12j49K84pl74n8M98j88j05
1527a21L56q9l99K88J97l19JL28n8k12J63J80n01rK56Rk73K29J7l62J80J82q8
$$ plain form
1378 -378 -590 -19 -62 -544 -3 274 -53 -29 478 319 -36 446 546 -88 -21 515 126 -324 129 251 -227
1399 -227 -279 57 -263 -516 -12 -138 -350 -131 278 -280 -335 366 232 -143 105 549 -34 -228 345 265 -73
1420 -73 207 326 -104 -156 186 -30 -403 0 198 -239 -170 136 -179 -369 -25 180 -136 69 414 5 -251
1441 -251 215 218 -277 164 431 29 -113 149 43 -362 36 237 -242 -53 247 -123 -335 -20 -4 -211 -41
1462 -41 382 -50 -214 9 43 -196 44 352 -73 -158 239 68 -268 -123 306 -74 -61 328 21 -388 -82
1483 -82 273 -220 -34 254 203 -198 55 132 -204 -63 316 13 -112 251 38 -190 -108 263 29 -89 281
1504 281 156 -118 -100 170 -168 -110 163 239 -91 -14 52 -272 -215 190 -22 -171 113 106 -268 -326 172 -16 -121
1527 -121 235 146 -253 35 232 -87 -86 242 184 -28 135 315 -186 -195 61 70 -203 26 43 -319 -139 43 -45
1550d5j71L09J32l54N1K15j96j11L22k5j84j9L39k53j98L75j02j57J08R8k47j07
1572b20J90r7k72K92K50l61R4K71k78o1K70Rl9M6K21k44j82K72M6k57O3J44k34
1595g7r2L72k16j95K23N8k96M8J90N4k36J60K3mJ07P3j24m8J81m4k21M2K29j39
1619F8j32J57j31j93J12J43k01k0J03N8k06K23j2j41J42J51J02j25k0N6l8N8N4
1642B08k6j73K19K3k64p3R8j55N8J60O2l74K39K4k74j2K42J32j10M7J72k48J38
1665A13Q3m4j03J82R4l24J93p3mk88L16m8l10J86k0j40m3O0K37k22J3K23j96q0
1689a95K70L8j75J90J16k51K0J15k0o0p0K49l15o4J16r0o6J49q6J2Q7M1j00M6
1713d3L6J28j12K37m6k37M3J42n3r9Q7Pr0k6J5L2k51J51k3j43R9P9np5N3j0L2
$$ plain form
1550 -45 -216 93 225 -129 -78 137 -59 -170 152 127 -57 -76 263 10 -188 187 85 -72 36 134 -113 -220
1572 -220 -30 -127 -399 -107 143 -218 -124 147 -131 -192 78 87 48 94 315 71 -111 161 207 -50 13 157 -77
1595 -77 -169 203 -13 -208 15 73 -223 -175 15 69 -167 -7 16 12 119 192 68 20 201 157 -64 -22 207 68
1619 68 -64 93 -38 -231 -119 24 -177 -197 -94 -36 -242 -19 -31 -172 -30 121 223 98 78 134 96 154 208
1642 208 182 9 228 251 -13 -86 12 -143 -85 75 137 -237 2 26 -248 -260 -18 114 4 51 223 -25 113
1665 113 196 152 49 231 325 1 194 121 117 -171 145 97 -213 -27 -47 -187 -230 -170 67 -155 -142 81 -115 -195
1689 -195 75 113 -62 128 244 -7 13 128 108 48 -22 227 -88 -152 -36 -126 -192 -43 -129 -117 -30 11 -89 -43
1713 -43 -7 121 9 246 200 -37 6 148 95 -4 83 90 0 -26 -11 21 -230 -79 -102 -245 -146 -67 -72 -147 -94 -104 -72
1740g2J43R3r9j02K2J64j36J4K99r3k26J12j05j05kR1n9p3J41j60N6oK28k77N4
1765i8M1J3nJ06J05j97k8K41j04j25L38j03k91J36J36k26o1R8R1k00J8J84j44
1788g5J0J23j52J1J42K1q3J36M0j55n5L36k24Ll8J06j61n9J52q7j05P8O2j49n0
1813a73J62Rj63J24J14k95J10J25N2Np1k6RL6Q6j50L8J16j41p4NJ82m2j39L9n3
1839a15N2nK9Q9j09Q2n5n8PK09j37j05J67MLm3P6j09K0O9M2j01L7j51J78k7O5
1866A14p7j97K34j03N1Lk1o5R4j3L7p7l1P0l8q0J68j00k0LK08k11%Q1j1j6q6P2
1894a1L6q5p9P5r7J43P6p0j9J45q3m3N3N5p7n4J10m4j10Q8j4q0J20Q2r7q7N2N3
1922C8j13J50q2j68P8P6p8p2J50L0p1L9J12k41K01K5rn8%R5j16OJ19j56K8K6l3
$$ plain form
1740 -72 71 164 65 -37 -15 149 13 27 326 233 7 119 14 -91 -93 -2 -61 -134 7 -153 -97 -103 125 -152 -98
1765 -98 -57 -44 -49 57 162 -35 -63 178 74 -51 287 184 -107 29 165 -61 -122 -24 67 -133 -115 69 -75
1788 -75 -65 58 -94 -83 59 80 -3 133 173 18 -37 299 75 78 40 146 -15 -74 78 -9 -114 -36 26 -123 -173
1813 -173 -11 -2 -165 -41 73 -222 -112 13 65 70 -1 -27 -18 18 104 -46 -8 108 -33 -107 -102 80 38 -101 -62 -115
1839 -115 -63 -68 -39 50 -59 23 -32 -90 -83 126 -11 -116 51 55 58 15 91 -18 2 71 113 12 49 -102 76 49 114
1866 114 37 -160 74 -29 22 25 4 -61 33 20 57 -20 -51 19 -19 -99 69 -31 -51 -48 160 -51 -51 30 19 3 -83 -11
1894 -11 25 -60 -139 -64 -161 -18 58 -12 -31 114 31 -12 41 96 19 -35 75 31 -79 9 -5 -85 35 117 20 -67 -15 38
1922 38 -75 75 -7 -175 -97 -21 -99 -171 -21 9 -62 -23 89 -152 49 74 65 7 7 102 -14 -8 111 -45 -17 9 -24
1949b4Mk1L2p6K3J66q5j10J5P1J55k18J45Lk8m9pN0o2J95r7n0j4j07J6Q9k4J5
1977Gq9N3O0j73J96K5j42Q8l1J0Pl1R8l5j07M4K1O1L0m1l1j34N9J18o1m4L7j18
2005a23O6NO0q6J25q4J84Qo3l1o8J44Q6k50J04k1o0m2J63L7j87Jl8l0k5J35rj18
2033a17J24N8r9o9J10k3O4l7r9J80l8M8j42K6O6j44J93j63J98j27k0n3J04k01
2057a61o2L74j22Rl9m1O5l8lJ22j45J35o9n4Q1M0q6o1L9N9j31pp2J65r0K08j88
2084g2L7L6No1j6K2J5K2k9L2M3j7o6O0N0MJ1n1R7j35Oq4J44p2r6RJ99l2j62J26
2114B5k6j6P5J05k68J15K7l1O7j5K6o4L0n9R0j96K12m0k30J63kj29P6l2J78j54
2140g3L8O1m5m9J4O3q2J23q8J13p8M8N2j15kQ4o7n3J33p5o2m3J37j19L7K36j85
$$ plain form
1949 -24 -20 -41 -9 -85 -62 104 19 -91 -76 -5 150 -68 77 80 52 3 -4 46 -16 179 82 32 18 -89 -73 16 -8 7
1977 7 -82 -29 31 -142 54 79 -63 25 -6 4 11 -20 78 43 -64 -20 1 62 92 51 20 -114 -55 63 2 -42 -5 -123
2005 -123 -57 -52 8 -78 47 -37 147 155 92 61 -7 137 223 -27 77 56 -4 -46 117 154 -33 -32 -70 -100 -125 10 1 -117
2033 -117 7 65 -34 -103 7 -16 48 11 -88 92 54 102 -40 -14 52 -92 101 -62 136 9 -11 -64 40 -161
2057 -161 -223 151 29 38 -1 -42 23 -15 -18 104 -41 94 25 -29 52 92 6 -55 -16 43 -88 -95 -167 -2 -92 116 -72
2084 -72 -35 1 6 -55 -71 -49 -34 -12 -41 -9 34 17 -49 11 61 65 76 25 122 -13 -7 -91 53 -19 -115 -106 93 61 -101 25
2114 25 -1 -17 58 163 -105 10 37 6 73 58 84 20 50 -9 81 -115 97 57 -173 -10 -12 -141 -65 -97 81 -73
2140 -73 -35 26 -19 -68 -54 9 -73 50 -38 75 -3 45 97 -18 -20 64 -3 -56 77 2 -60 -103 34 -85 -48 188 3
2167Cl6O0Lp7n8K06j03n5K23r7j06O4R9p2j8m3r7j0OJ07q9N1R6r2n0P2J18j57
2195e2J8M0j09J23j2M2r5K4l1l5L9jJ06n8J87j65n6L5K4O7o8K4k1M1r4l1J80k83
2223a61K27Mj66P5R6j30K9q3L06k20P2q5J28J6k4j03O2K6k8K5k72J93L3m5J89
2248A64j48m9M1m4M8m9Rk7L0k6P8j3p4Q9k5Mo1K09j95NN3J23j62k1P8j6J4p5P3
2277C3j52J62m3Q1j26Nm3J86k72J94N8j02M0j1j2l3J6m6J44r0j3N7O3r5j18L5
2303h2J57j85N4J04R7j68N0Q5j7m2%P2k04J96q1m7R6k3m1Q8j7k27J65o3m9J54
2329G2k32J74O8j95J5J53j47j6J58j43l7J90l0m0O1N2j41O8Oj3l1M1qm0q0J09
2355A4Pj61J38o9J06r4K25j15pj1L6p0q1J93j21j1J34o4r1J85r5m4jJ22o6j41
$$ plain form
2167 3 -33 27 30 -47 -105 101 -2 -57 166 69 -37 27 126 54 36 -7 -104 -114 -108 -1 -90 -39 57 -35 -85 -13 105 -52
2195 -52 -34 6 -103 20 8 50 -45 -21 -52 -87 -48 -49 57 -1 186 21 -35 0 24 91 23 47 26 67 -27 -58 122 -161
2223 -161 66 70 -96 -21 75 -55 -26 -109 197 -23 49 -36 92 108 84 -19 43 69 41 66 -206 -13 20 -25 164
2248 164 16 -33 8 -36 12 -37 -28 -55 -25 -51 27 14 -60 29 4 8 -53 156 -39 -34 19 142 -20 -41 37 21 35 -40 33
2277 33 -119 43 0 81 -45 -40 -83 103 -169 25 83 -19 21 10 -2 -35 -19 -65 79 -11 -24 33 96 1 -117 -82
2303 -82 75 -110 -56 48 145 -23 27 112 95 53 53 125 -79 117 36 -11 85 62 21 109 92 -135 30 -33 -82 72
2329 72 -160 14 82 -113 -98 55 -92 -108 50 -93 -130 60 30 -10 51 103 -38 30 36 23 -8 33 25 -15 -95 14
2355 14 21 -140 -2 -71 35 -59 166 51 44 33 69 -1 -82 111 -10 -21 113 49 -42 143 48 4 3 125 59 -82
2381h2O3J05m2q4k9m9N1J47j37L6J80p4r5r6k1K79j30q1L8k8L2J59j18k2m0n3
2407i1J36p2l1J2K0o6J07J2q9Q8n4L4LP3m9q5K00k9o6j4P0k48J15J10n3L9j22
2434e0O8m0j59K73Jj88NP0j71J56P6o2N6q2J86r6m7N0Qm2J01j72J7M4O6j05Q5
2461D8j14k1j5J40m4kk4J92j41L1o2k3k3Q4J17l5k2l6J28j34P0Mj10O4O5p8l6
2488B3p0J17J2j37J81j67o3J49p8J44q3m0nO0p3o3L4k2N5N7K5l6k6MN2R0q7n0
2516Cq7K7M0j5J0n4J31j17R6M1r4J4M2K0m3q7J63j97K02K9j14O1K7m7q1k5J47
2543I2p3J8q1P3Q4j72o4R5m9p7P3K4kj06K3J03Np4K18l2j49J04%j23L5J66j47
2570c6j1J63j24p5Q8o1L1Q8j00n3R5kk4Q1m8k7L9p7J61j22k4N1j16O7N4kN8p1
$$ plain form
2381 -82 -19 86 44 -40 -69 -118 -67 80 -57 -21 159 85 -10 -106 -127 152 22 -59 -21 -49 -17 142 24 2 -38 -91
2407 -91 45 -27 -58 -46 -26 -92 15 27 -62 26 -28 6 9 82 33 -52 148 119 53 39 109 -139 -24 86 33 72 -50
2434 -50 18 -22 -181 92 93 -95 -90 -20 -191 -35 41 -21 35 -47 139 43 -4 46 54 12 113 -59 -42 2 68 -37 48
2461 48 -66 -87 -102 38 -6 -8 -32 160 19 50 -12 -35 -58 26 143 108 86 50 178 44 114 118 8 72 137 59 23
2488 23 -47 70 82 -55 126 -41 -104 45 -33 111 28 -12 -17 43 -30 -93 -59 -81 -26 31 56 20 -6 -2 50 140 53 3
2516 3 -84 -57 -17 -32 -22 -76 55 -62 34 75 -19 -5 37 57 14 -73 90 -107 95 124 10 71 98 51 -30 -55 92
2543 92 19 37 -44 29 113 -59 -123 -28 -77 -154 -81 -57 -59 -165 -142 -39 -34 -108 110 78 -71 33 33 -90 -55 111 -36
2570 -36 -47 116 -8 -83 5 -56 -25 63 -37 -90 5 3 -21 60 12 -15 24 -53 108 -14 -38 13 -103 -36 18 16 74 3
2598CJ8O1j29P9L7j61J0L7K2k5k8J36j26k3J9pN2O8KPlm2k9R1j7K1o0J6k5J2j38
2629a22J08jj9QJ09j32J68p4n1j14P0k5K6JN9K0O9j38K33j80j26J01Q1K2k9M2
2655A06j59j9L4J02j87J04j27J69q6lJ25q8L4m4N4o3J68r6j7K9m9jN5j14J06k
2681C1J4j6j09oL6O4j6O0L9r0p5L1K5M3p1M4K8Q8p2q1J13k9o0M7m9R1j63J28n5
2710a0J32r3K4m3j11j7J32k4L7j1o6j27J66r%M6k5J00m0nMO7j90J52m2K5p2J25
2738A25r4K4r2N6j57R7R7Qp0n0J33o9m5K7P9K8j39mJ2j7J14q3QJ58k83J04J30
2765I7j77r7K83j9j19n8M5J13m2k8N2n7L7MO8j27K4l2R3Rr5J12k2qo8p8J66j08
2793c2K0k9R3q2j31J20Q9j30O7o0N0J43j85M3J47j31OQ5n9k4j9j2J5O1M2k0j29
$$ plain form
2598 3 21 82 -47 32 69 -92 -82 -45 -23 -48 -76 60 -66 -89 -70 -77 -25 43 45 52 49 7 -22 69 52 73 13 29 4 16 -122
2629 -122 -14 -15 -34 -26 83 -49 119 45 -6 -120 -50 -75 -49 -48 11 31 100 -38 195 15 -111 -10 71 93 64 106
2655 106 -53 -72 -38 64 -123 -19 -146 23 -63 -66 59 -29 5 -39 15 -48 120 24 7 36 -13 -14 41 -73 33 31
2681 31 45 29 -80 -86 -50 14 -2 58 97 7 -68 -37 -12 31 -40 4 32 120 48 -33 80 51 -9 38 -11 80 -83 45 -10
2710 -10 122 29 53 10 -101 -118 14 -10 27 16 -50 -177 -11 -20 -20 26 1 101 61 56 60 127 -63 89 47 72 0 125
2738 125 31 55 -37 19 -138 -41 56 64 -6 -56 77 8 -37 -10 69 97 -42 -46 -34 -51 63 -20 -12 146 -137 -33 97
2765 97 -80 -177 106 87 -32 -90 -45 68 26 -2 50 -7 30 34 102 -25 -1 -33 60 69 -26 86 64 56 -12 -90 76 -32
2793 -32 -12 -41 52 -30 -161 -41 48 -82 -15 -75 -25 118 -67 -24 123 -8 -2 83 24 0 -19 -31 -16 45 87 67 -62
2820f2J23l5j7P2n8r1R6J10J0j26pp4J27rp6m3J88j65J01j37K35k52R3oO8j76
2846a11K16k42J09j2N8l6j28J35l9O3J9M1o5k9k5R0Pn5on8M5Q7k4r0j7L1P4L1
2874F9j03J18l4j00j44K00k3J17j47j3P1R6r9M0P0j51P8n5J87j10q6P1l3J3j3
2899A9m5J58n1o5j39J81p9j15J8pK13j16l7K8j6J7j7J18q8nJ40j37L5j09K0P4
2925ejK2NN3J7m4J8p4m4M5J00o7QJ5Q9n4n9J10j21j7p4M0n1J12J8n2J0k1M0j5
2955Co8L0Q1k7q9L4J03o4L9m1L6j68J86p7N6j24M2O3KJ13j07j06J35l1k1Nj16
2982a11J31J3j31J83M2l2j53J31l9M4o8rO6j41J06k2m9j4L7o1J20RQO4n1o3n6
3009d6J9R0j60J70j40M2L3O0o3J5m6L3k8L9r3M8L0n8J00ml3O2n2n8L8J6J27q1
$$ plain form
2820 -62 61 26 9 81 23 -68 28 138 148 22 15 -59 68 59 -17 -60 128 -37 64 -73 162 -90 3 -3 65 -111
2846 -111 105 -137 -28 -40 18 -18 -146 -11 -50 13 32 73 8 -21 -46 44 51 -4 -10 -68 -23 64 40 -50 -67 -36 38 69
2874 69 -34 84 50 -50 -194 6 -17 100 -47 -60 11 107 8 48 118 -33 45 -10 177 67 -19 52 19 32 19
2899 19 -26 132 81 16 -123 58 -21 -136 -118 -125 88 -28 -65 -37 -53 -36 -53 65 -23 -28 112 -25 10 -99 -79 -5
2925 -5 -6 16 21 74 91 47 65 -9 -53 -8 92 25 33 48 137 83 24 134 13 -4 -78 -38 -89 23 41 -11 -1 -22 18 3
2955 3 -65 -35 46 19 -70 -36 67 3 42 1 37 -131 55 -22 34 -90 -48 15 17 130 23 -83 52 21 0 5 -111
2982 -111 20 33 -98 85 127 95 -58 73 34 78 10 1 67 -74 32 10 -39 -53 -16 -77 43 52 60 124 73 10 -46
3009 -46 -27 63 -97 73 -67 -25 8 68 5 20 -26 7 -21 18 -75 -27 3 -55 45 41 8 70 18 -40 -2 14 141 60
3037F0j72K61j59P4r0J41j24m3j55K12L2k2M4p7rQ7N4j95M1J62j56J0J3k1J8K5
3063A1n8Q5m5N7o7J79j09j98O5R5k0Q7p3J8m0n7LL2R5p5R3j03m5P6o5Q2o1j6K6
3092b8j34J93L6n6o4o5P5lP4r3J15n5Jnop7O4n2O9Q4p0LJ0j8Qk8K9j6%k0l7K3
3124d3lm0J50l3K2l9Q5o3o2Qp5k2J77p2QK6r8J96k22M0J22k6J24j00j22Q6J2m4
3152hL4J25j11oo0roM7q2J41k4j8P8l9p0k7J83k25J46O2Qk09J68q7N2J6r7n4P7
3181EJ10j63K0Q3l1L4Pp8m6J27q3l4Q3J11J0j84P1j5m3K7k3N7j20K4M8K2km9M6
3210A4qL0j10J21p1q3N0Q8o7n1Q5Q0j06p5J49o9M5m1%J80j5m1j0p4m7j1N4mq0
3239f7R2J5lL3j72R2Q2r3l0J10l7j3p8J23j56P7R3JK5j28R7j42N7P4%mm0n7j4
$$ plain form
3037 60 -112 149 -10 64 -26 115 -9 -52 -207 5 37 15 59 -18 -27 60 114 -81 -40 122 -34 -24 -11 -32 -14 11
3063 11 -47 38 -7 50 -17 162 53 -145 -80 15 -5 82 9 27 -13 -70 -67 -35 60 -15 78 -25 -70 6 -59 23 -38 -54 -28
3092 -28 -162 31 67 11 -53 -118 -43 -46 28 -65 50 -5 -4 -9 -15 -92 -28 -80 -11 73 3 6 16 -2 6 -22 7 -9 -9 -29 -66 -43
3124 -43 -46 -86 64 31 53 14 99 36 -26 -18 -93 -115 62 -10 -2 24 -74 122 -100 -60 62 36 160 60 -62 24 36 -8
3152 -8 26 151 40 34 -26 -35 -41 6 -76 65 41 23 101 62 -8 -35 148 -77 69 131 139 -70 98 11 63 79 -18 -72 5
3181 5 115 -48 -28 55 24 58 65 -13 -59 68 -15 -49 34 145 155 -29 42 27 -16 11 -12 45 -75 -51 -3 19 17 -32 14
3210 14 6 36 -74 47 -24 -107 -57 31 -36 -87 -2 78 -28 -103 46 -23 22 -19 -19 161 146 105 95 21 -26 -37 17 13 -67
3239 -67 25 40 37 70 -102 -10 72 -21 -51 59 22 9 -69 54 -102 -25 68 69 94 -34 63 -79 -22 52 52 48 8 -49 -63
3268f3M3J6m7RJ6M6Qp6M0No9O0N9K9j29m5P0P7l5M5j04m9Q5L3O7j09K04j70l4
3297a8L2k5nJ16q9J3Jj02R1MJ43j78p4K4L9K8m5K8rN1l1K1k6L7M4k5j98J23R5
3326F5M1j47J01j68K05j01J5MJ51j19Ro5r2J34J00l04K68j29J26p6J1N9n5J19
3350A52k21J09r1J78q8O4J8j51l5J21n0K7Q3n5j65N8J2mP7j30O3n1J18j08N3k9
3376d5pQ0j49J57p3q2o9J42No0K07Mj27J03q0j48K01Kon8j02Q3m3k4K24l6j33
3403c4Q7n6k8J39j56Q4r5m0J15l0M7j18J57KP1k13LM8L1J0oM9l2o2OJ3jq1l3R
3433a14R7l6P6K6N1m4l4j24L0J30m1rl2N9no7J26L0pK3p6J22r2o3p4J18r9J47
3461A18r9j6j91J31R8j23P5J15r3J0m4L7o7J14n0p9M9N8m2nJ22j13J36k73R8q6
$$ plain form
3268 -63 -20 -4 -51 -42 -26 20 28 -48 -8 -3 -72 -12 47 76 -53 -98 -28 49 14 59 -45 -94 -9 24 91 -18 186 16 -18
3297 -18 14 -11 -16 100 11 24 25 -77 14 18 161 -17 -91 -67 -28 0 -45 -17 -26 25 -6 15 -11 26 70 45 -153 -30 65
3326 65 106 -41 60 -108 97 -4 11 15 166 47 56 -9 -101 33 133 -171 97 -32 94 18 29 88 33 152
3350 152 -69 40 -51 127 39 103 121 -30 -65 56 6 33 116 61 -104 -46 -34 -38 39 -91 -28 -79 39 -69 -16 -45
3376 -45 -52 28 -121 36 -37 -119 -188 -46 -41 -101 106 110 -17 86 6 -142 59 61 55 -3 -105 -22 -65 -89 135 99 -34
3403 -34 53 -3 -31 108 -48 36 -59 -99 16 -14 33 -85 72 74 145 -68 -65 -17 14 24 18 67 35 -27 -21 -8 -9 -90 -123 -114
3433 -114 -17 -53 23 49 100 56 22 -102 -72 58 17 8 -24 35 30 -37 89 119 112 135 59 181 89 26 -48 70 -29 118
3461 118 19 3 -188 -57 41 -82 -7 108 15 25 -19 18 -49 65 15 -64 -15 43 1 -4 118 5 141 -132 -34 -120
3487a20K01j73J78M9j98qM7J6r9L1M5J21n4q9O2pj2p0R5KO1k9N3o1q6pO6J8J2
3516D4j70N4Q5o4O8p9J51j53P9J2j01O3O4L9j98J87n1k9k2o5MJ58n0L1J2o7j6
3543a4j7k9J45j1J2nr0J10j84No0K11Mp9%n8k5K39q7r0j9M3O5j80J10mQ6Jo7L
3573A5n7N5r5l0P0J09j45l1M1N4Q4k19J10J0N0q6J56j65K1J60j43P4n5J00p4J32
3599A41j25N3j39q6J61m0J42j00k8J23j10M5n7P1r6j0O0J53k42J68K0k98K35k9
3623A2j6N1m5K7m2O8n3k7N9j16N6m8L0M3j13J18J16j86J42r0RR0n3L8j19J1M8
3650A0o8m7J17O9o6o9K06n1O6k62mJ67m1j4k6LN2J05j66J3OJK1R1r6j10R6p5J12
3679D0Ro8n4N5L8j21J49n0Q6r0J9rj4N0rnn6J53n7p4K2k1K9l9J56j75l1J15o1
$$ plain form
3487 -120 81 -92 86 135 -63 -71 -24 -8 -107 -76 -31 90 36 -53 9 2 -10 -80 15 17 78 49 102 41 -45 -52 14 32 44
3516 44 -126 -72 13 -51 17 -62 89 -64 15 27 -74 -11 53 92 -106 81 30 1 -21 -86 -82 76 26 57 69 2 -14
3543 -14 -31 -60 85 74 86 81 -9 101 -83 -78 -138 73 77 -2 -2 -60 -85 154 67 -23 -42 1 66 -114 -4 -8 78 79 12 15
3573 15 -42 13 -82 -112 -42 67 -78 -109 -68 -14 70 -149 -39 -29 21 -65 91 -74 -53 107 -36 38 -17 83 9 141
3599 141 16 69 -70 -156 5 -35 107 7 -21 102 -8 37 -20 51 -45 -55 5 158 -84 84 104 -194 41 12
3623 12 -4 47 2 29 -13 55 2 -25 34 -82 -26 -74 -44 -1 -114 4 120 -66 76 -14 -5 85 32 70 -49 -38 10
3650 10 -58 -105 12 81 15 -54 152 101 167 -95 -99 68 27 13 -13 -10 42 147 -19 -6 0 1 22 113 17 -93 3 -72 40
3679 40 49 -19 -73 -18 20 -101 48 -2 84 -6 13 4 -10 40 31 26 -30 123 66 -8 14 -7 22 -17 139 -36 -67 48 -13
3708a3L5L5L2j63J28M0j91J77j35R3m5K6m4K9p1J23j09P9p1m7J40j73K11j80R7
3733Cj05J66J1r1j5O1Q2j35m0Q7n7K4J23K1j22l5q0Q2K5Q1n6q1J94j58L1N1J7
3760H4kj16l0R6J27j09j08J29j77K47j59k4J38k40J64Q3j06o0J16m7r6J65j43
3783f8J1J7J94j54nk0l3p6J55r3m4R3N5Pm5M9j47J55O5m4nr1R9o9L4Oom1J5J3
3813B7j21K29k05J00l8N2n7J18j61J0N9j01M5J13p3j15R5n9J51n3p3J03j11O0
3837eK1J8j06O1Oq8J03r1J1M5K8m1M3q6K32p6p2j8j0O1j02Q6J9m5Qm3l6J80kj28
3867b7m1J84n4oq9J0O2oo8Ko5J26K6L5m0l5m0O2q8M6j4o8M3jP2qj66K45r1J9q1
3898e6kK8j36K24j10N5Pn9M8K9l0k4R3k01K04l7p3k4K1J23p5M1r1nN0L4o1q4M7
$$ plain form
3708 -13 22 57 89 -74 54 94 -97 80 -55 38 -7 19 -25 4 -67 56 -53 26 -45 -92 48 -125 86 -94 3
3733 3 -102 64 75 -16 -31 30 112 -23 -63 24 -33 -9 114 135 13 -22 -102 -20 5 86 30 -51 143 -15 16 67 84
3760 84 82 -34 -64 32 159 50 -58 71 -106 141 -18 -42 96 -144 20 103 -3 -63 53 6 -90 75 -68
3783 -68 -57 -40 154 0 -5 -25 -58 -134 21 -72 -116 -23 32 39 -6 43 -104 51 116 72 67 -24 75 6 40 46 40 -1 14 27
3813 27 -94 135 -70 30 -8 44 -13 105 -56 -46 13 -88 -43 70 -3 -118 -23 -82 69 16 -57 46 -65 -5
3837 -5 16 34 -72 -11 -5 -93 10 -81 -70 -25 3 -38 5 -81 151 75 3 -15 -25 36 -66 20 39 -6 2 -41 -77 103 101 -27
3867 -27 -68 116 62 56 -33 -23 39 33 -35 -33 -98 28 54 89 49 14 -26 36 -52 -6 -20 -88 -45 -46 26 18 -148 97 6 25 -56
3898 -56 -58 -30 -166 58 -52 3 10 -49 -1 28 -2 -26 67 -134 70 33 -40 -64 -43 80 5 46 -45 -50 0 34 -27 -111 -64
3927f4J7K3r3l6J6N8Q8j5r2PM4P7r9P3n2J19k8j9rP1j35L5R6j00j03J00J18j8
3955G9m6m6j04K34j94K5J39j55J02M1k8m7P4l6p1J43j85p9K59j07J37k12Q3N8
3979F4j92J85l0p5k5K0J39j71N9J06q1r3oJ7K4J18j78P5m5K20j43p5R1N7Q7j69
4005b1kP1j24J19J6o4p1J71j66L8N3p7P3o7N3k7OR0j21O2l2R7j33J11j3mj10J4
4033e8J29j65J53p4L2p7j8Q7L4K3k8k28J06N5q3M8r2R2R1j7nR5k28J78o9KJ66
4060A49j23QL6q8P6o6P9m1J9L5r9j0O5m8Q7o7kj07Mm1K38k14k5J59q3p0J75j03
4088e7Q3m1ML5j0mK1k1r4M3J2K4o7JQ7Q7m4J5j18j33J37J62k28J7J82j15J82k05
4116d5Q1j08R2K7l0O8j27j28K44j49J71L1p2r2j08J20k3N1J6l2q0J01n2J6lK5
$$ plain form
3927 -64 -47 -24 -117 -153 -137 -79 9 -6 -98 -91 -47 30 -69 4 -48 71 43 24 15 86 -49 -14 82 -18 -121 -21 97 79
3955 79 33 -13 -117 117 -77 -52 87 -68 34 75 47 0 74 38 -33 110 -75 -154 105 -2 135 -77 6 64
3979 64 -128 57 27 -48 -73 -53 86 -85 -26 80 -1 -94 -100 -83 -59 59 -119 -44 -89 131 -12 -87 4 61 148 -21
4005 -21 -23 48 -76 43 59 -5 -76 95 -71 -33 20 -57 16 -51 2 -25 -19 71 -50 12 -20 77 -56 55 42 38 -72 -58
4033 -58 71 -94 59 -15 17 -60 -78 9 43 66 38 -190 -84 -29 -112 -64 -156 -64 27 10 5 100 -128 50 -19 -17 149
4060 149 26 34 70 -18 58 -8 71 30 49 84 -15 -25 40 -8 79 12 10 -97 -93 -134 104 -110 -135 24 -59 -129 46 -57
4088 -57 26 -15 -11 24 14 10 31 10 -84 -41 -29 -5 -72 -71 16 103 59 74 -44 -177 -40 122 -106 -89 93 -22 160 -45
4116 -45 36 -72 20 47 17 85 -42 -170 74 -75 96 127 55 -37 -145 -25 -48 3 19 -13 -93 8 -44 -28 -31 -6
4142fj0L5m2K3pO5o7L3n4J13r8mQ3n8J23j51L3q8J18l7J2J7L4qj53J32J1n7r5
4171a03J44n8Q3j76LK34j35J8O2m5L8l2m9rL1j21J98n3n4pMMOO8J38j99j7J7r0
4200a00J30l7j24J40j0Q4j2o1j24J61Mp1J54k18N0K8K6J5n6J60j63J11lj77K6
4225f7J42j02n7L7O4l5L0J47m4j06k0Q9Nm1n4J19p5Kr0L6j3P8j22o9J42JLl0O4
4254C4K8j23N6K2L4o7j14O6l9K40j35kj24J58l6m6j4J36p9p3J23o5Q5l0L5J0j37
4281e7L3P3m5M5k2n2Rk9l3l4J32o5k7jJ33o7n1J29q5P2lj20J61p6j17J0K10j00
4309B3M0pj36Q5m7K7j42Q1J47q7J1j73J54P5p3km0J01j20J98j00n2P8q8J14k5
4335D2j25J25j6K2J2L2j80P4j3L2o4K8J02n8m2O3p1jN1m6J8n9K3l0J30J2L8o7
$$ plain form
4142 -6 -16 19 -23 0 -7 58 -9 24 -30 83 -15 -19 64 6 129 -22 11 -77 41 4 16 33 67 59 -94 38 49 -8 -103
4171 -103 41 -17 66 -110 -107 127 -8 10 72 27 65 33 -16 -25 6 -115 83 30 -24 -31 -27 -23 -17 51 189 -10 -27 -10 -100
4200 -100 30 -7 -131 9 -1 83 71 10 -114 47 51 -20 134 -84 -34 -6 20 35 -21 139 -24 87 84 -93 -67
4225 -67 75 -27 -84 -47 17 -18 12 159 115 9 -11 78 83 42 -12 107 32 34 -56 -20 -33 45 -77 -146 -4 -3 0 -30 34
4254 34 62 -61 -5 17 51 -16 -130 -64 -103 137 2 0 -124 34 -2 -48 -62 74 -5 -78 45 -20 65 35 70 80 -57
4281 -57 -24 49 4 49 27 -25 -16 -45 -78 -112 20 -45 -72 -73 60 -7 -58 71 -14 58 55 -65 96 20 -97 -87 123 23
4309 23 63 56 -80 5 -42 -15 -157 -76 71 -16 -5 -178 -24 51 -22 -24 -64 37 -83 115 15 -37 41 -47 67 42
4335 42 -83 42 26 48 60 92 -88 -14 -27 5 -59 -31 71 13 -29 34 -37 -38 13 -33 -15 -74 -51 -81 49 61 99 32
4363C2j06N2O4K2m1J3j6Q9j9j68K9L3R8k19Q8m7N6J20nj33n9J83rk4O8l1k09M4
4391i5J8%M1kN3j2J8r3R1o0j29J38L9q4K8PO7J3r7N2m7J15k2n5N0n6r1J83M6q8
4421B8M8J34k65J2M1N6l3o4K0J21j60K9j85K78j40M2k7L0P7m9J2k7N0k9k6J29
4447A02j75N9J53j67%J4j09J39K3j57L7J06l2Qm9r4J44J19j51jnO5j33N3P6o4
4473c9K0J1l3M2j6J06j5q7l4R7q4M9Q8j01j5mN9n3Q9m5O1k00K18k19J26K7j15
4500f7J18p2R1m5o6j2Q9j01J06l2nj00J52j83J44J1o6L2O4j20j19J57M0n7N4m3
4526c0J8N7j7Kn8O4k5j8K2J2Kl6Q3j20Q6L5j21O7p1L7ll1j22Q5J24l4m6j6p%O5
4557DK3n8j0J00j94J65nk6r3J48j21L2R2p0M3M8p9k3jQm0J34o8o1Rk7K1R4J01
$$ plain form
4363 32 -74 -22 42 64 23 36 20 109 90 -78 -49 -16 82 -137 -49 -96 -40 80 75 -58 -117 66 57 33 101 70 -139 -95
4391 -95 -77 -77 -36 -38 15 3 21 -72 19 -41 -170 -32 7 -77 -49 -42 25 38 -59 -7 -54 61 39 -16 34 -22 -113 70 116 28
4421 28 76 210 -55 -43 -2 54 21 -43 -23 98 -62 -33 -218 60 -80 -38 -65 -35 42 -7 5 -22 28 -1 -27 102
4447 102 -73 -14 139 -28 -28 -14 -123 16 39 -118 -81 25 -7 1 -48 -142 2 121 -30 -31 -36 29 -104 -51 25 -39
4473 -39 -19 -8 -41 1 -15 91 76 -11 -45 52 -32 17 105 4 -11 -15 44 -9 80 35 96 -104 114 -105 21 48 -67
4500 -67 51 -21 70 25 -41 -53 36 -65 41 9 4 -96 56 -127 17 28 -38 -6 58 -62 -181 -24 16 -41 13 -30
4526 -30 -12 45 28 30 -28 36 11 -7 15 27 29 -7 76 -44 42 77 -44 23 -48 -11 -14 -45 -167 -82 42 8 -38 -54 -61 -61 4
4557 4 27 -31 -41 59 -135 30 25 -1 -94 54 -67 -35 57 -13 30 78 -1 -24 -25 -17 -57 77 9 -52 -43 -70 -49 45 146
4586A46j90J7M9L1j70J99j37J0M2m5j01K46j00m2l1P6j7r2J04M0l4L1M9j22M2
4611AO3r6k4L3%L3J1o6k8J52M3p1O7j93P0J0j4n0pJ00J2j57N5P6J9K7j7J8o0j08
4641a01R5pm0P6o5J2RP0N2N7j09j36rJ25q5J01l0M0j08O3j29R9q3J14q2P7n9j
4669e4N2M8J05j65K0l4k9J68k07J58RJ3l3K7L8j24M6ol7j0K5n9jjO8N9j2j26K7
4698c5OJ42n8o1J61p8l7Oj65j6J23j8j25J25J99k32J24n4J4n3mJ03j12Q6q3N5
4724A3j39J87j54K1Q5j15K21j64O9n3N8qk0n8L1N8O7j99N1J9P3k8J6p0P8K2j52
4751i1Q6J07m9j39J83j80Q5m1K1pR4p9lOM4j09NN3n2j6K9J32o2j57J19N5j29L7
4779e8o1J10L1J0j0p3M5l6N3L8rl1J19j45M4Op4J03l7o5R0q4O8K8o2j3o5J27j27
$$ plain form
4586 146 -44 -27 22 53 -117 82 -55 -45 -3 -48 -149 97 -3 -45 -76 0 -17 -109 -5 35 1 32 81 -41 1
4611 1 64 -32 -56 -23 -23 10 21 -45 -73 79 122 51 118 -75 -5 5 -9 -59 -66 34 46 -111 -56 20 39 66 49 67 7 -101
4641 -101 -6 -13 -53 23 -42 -30 -21 49 101 158 49 -87 -96 29 -56 45 15 55 -53 10 -119 -20 -103 11 -71 6 -53 -54
4669 -54 -2 46 151 -14 6 -28 -57 111 -96 62 71 84 51 78 116 -8 38 32 -5 -15 10 -49 -50 -51 17 76 64 -62 -35
4698 -35 -29 113 55 -6 155 77 40 46 -119 -135 -12 -30 -155 -30 169 -63 61 7 21 -32 -36 67 -45 41 -42 13
4724 13 -126 61 -93 -72 13 -102 119 -45 24 -29 29 21 1 -57 -26 32 99 -100 -49 -30 43 15 31 -39 39 61 -91
4751 -91 -5 102 53 -86 97 -83 2 -39 -18 -25 69 -10 -13 -7 37 -72 -67 -14 -66 -82 -53 79 17 -140 -21 34 -95 -58
4779 -58 -119 -9 22 32 22 -51 -6 -42 11 49 40 9 128 -17 27 33 -41 62 25 -40 50 -34 34 62 0 -13 -78 49 -78
4808g8M3J5o2M1p1J42o6m4k4J88o1p7M5K5o7K4m2P1LJ2Qm8M1k7J15k24J22K8k4
4837HM5Mj41L1J57q8j6JM3M7k39J64j0Q8j18Q9j83R4jJ25o9q2K2P5Mo4J21j49
4865d2lK1L5j69J52r4jO0m6J15L9k1k3n6O0lm8P5q9R0q2o1K4R4PO0n1r8Q6n9l3
4896f1r7J26P4N4j36M0J32j38Q2j6k74K12j08K28j66L5%NK2rM7n4Mm5J4l6J37
4923G2qNj47J47p5M7o7o9O4J5K6L9j55R4L6J56j87k0j13Q7o4K12r0o3P0M5j94
4950a37J65p2N3L7q7P0Qm3pPP1kl5n3kpJ68j39k6r6J07j18R6M7m5kn5P3R3R0j69
4981a0p7R2K8j40J59n6o5j5k6R1K1JJ46j17J3m7m9K7Mn8R9O8l8m2O6J6j56J33
5009F8j26o4R3j8N9pq3MJ36j42J02p5j1J08r1M9P6j34N0m0J56j12J19j80J41l1
$$ plain form
4808 -78 -35 -20 -82 -41 -112 30 -36 -80 -104 84 23 -54 -9 16 -51 -27 -69 2 5 17 25 -23 18 -9 106 -118 4 32 8
4837 8 53 57 -84 -53 104 16 0 1 44 91 -148 16 6 94 -24 65 -118 -24 -25 100 31 -51 -29 46 50 -14 107 -42
4865 -42 -45 -24 11 -158 -6 -100 -101 -41 -87 28 67 46 23 -33 27 24 -24 51 -38 52 -30 -91 -67 27 34 94 43 -55 31 -28 -61
4896 -61 -158 -32 42 96 -40 0 132 -6 76 60 -214 -2 -110 118 -48 -13 -13 -8 14 5 52 -2 2 -43 -29 -65 72
4923 72 64 69 -78 69 -6 41 -26 -95 -31 -16 10 49 -106 -12 24 180 -7 -27 -140 -53 -117 95 5 -58 12 57 -137
4950 -137 28 -44 9 46 -41 29 37 -6 -13 -6 65 63 28 -25 -27 -34 134 -5 -31 -127 -20 -138 -42 5 -40 -42 -97 -24 69 159 -10
4981 -10 -87 5 33 -107 52 -4 -69 -84 -110 -19 2 3 149 32 45 -2 -51 -24 -20 -78 21 89 51 9 75 91 -65 68
5009 68 -58 -122 -29 -47 12 5 -78 -74 62 -80 22 -53 -64 44 -47 2 78 -56 -6 -46 110 -2 117 -63 78 47
5035D7q8j6N3P1kl3j4m5J47k12K9O2K4j09J45p6J56r8j25O5J2m9J27q3J81n6r2
5062B1K2j6K1L3k5j07nnJ78j61kJ8p5J41l2o1j5J98j82oPN6m5K2K9L1m7N5m9K0
5092A9Ol4R8j29Q6q6J38j3n5Q8k40J00P0J10m5j50L3Ok0j22R4PK1M9%l8l4M0N0
5121D9J0j9j48K00j11J1M2m7%P2L1k27j6J26K6P9j15J69k31J35Ql5J01r2k3o3
5147f8PK8Q4r5L3J6n9K28j19J18j52j5O3r8M8L1j18J83r7n5P8j26J81j78J42q2
5173b2k8m3J44l4M1q8L0L8j3o4LJ25o2l9j2l2Q4j5j10J3L7J0k4K2n6J82j06J01
5201H2o9N4J3j16J08Nm9J3k9m5R4m0k8k4O5%Pp5l7J28n9j0on2PJ4m9J01p3J37
5231F7p8Q7q2m%m6M7o4J21k04J43kL6R2p3K8n0r6R4k9J4l3P4m1Pj7R8j1o1Rm4
$$ plain form
5035 47 -41 -57 -4 67 65 32 18 -27 120 -92 -63 -1 23 -86 59 -17 139 41 -84 -19 -7 -56 71 -12 169 113 21
5062 21 43 27 48 81 56 -51 -56 -61 117 -44 -46 -28 -103 38 6 -55 -70 128 -54 -60 -53 3 -42 -20 9 40 -7 48 -1 19
5092 19 25 -9 89 -40 46 -40 98 85 30 118 -122 -22 48 158 113 -37 -4 2 -18 -140 -46 -39 -18 31 31 -7 -41 -1 49
5121 49 59 40 -108 92 -19 -8 34 -13 -13 59 90 -137 -153 -27 -1 78 -37 132 -99 36 44 9 110 18 -5 -68
5147 -68 -61 -33 51 -44 -11 5 -54 174 55 173 21 6 69 -29 19 50 -68 115 18 -37 41 -85 96 -82 60 -22
5173 -22 -50 -93 51 17 58 -30 0 38 25 -39 -36 89 27 -12 -24 -56 28 13 -97 -84 -47 -37 -61 -39 -95 87 -19 82
5201 82 13 67 80 -36 72 77 28 41 12 -33 61 21 -7 -31 34 34 41 -34 -71 57 -2 -12 -18 -70 -63 -49 -98 3 -70 67
5231 67 -11 76 -6 -10 -10 -56 -9 -73 48 -156 -13 -15 21 113 40 68 18 -78 16 -13 1 -32 42 1 8 -9 89 78 17 26 -18
5262a8l6J10p7j9j1K2Q0n8l3kR1l9K8r3j5P0P2M5j64RK0N7J4o5q3J15j66J44K
5291@j5K26k27j04Q4J08n0l6N5N0k42J15J20j20k5m7O7K5j7Q5j77k3J06J01j36
5316g7J01M8o3J0j09J04O6o9q7K23l8j02r2R7p0P4Mp7Jp2K13j38J61j70jm8J28
5343A7p4M0n0q9J47l7J17q4J35q1J5j2n5Rj3L0K3L5j34j9O1P6j20M6R5j02oN5
5371B5N9j29nj1k8l1J02R3l4m9K0n8nP7oN4j11M1j05J59p0J0Q8K0l8r6J0j0J14
5400H6q1O4j54J05PK4k7KJ3j07m7J20O2m6j46J96K3j13k8N7L9j5j18N9J4o6K53
5427A76k76J8J0M6o9N9R3j66M9L4J4J07j54j8R6m5nJ3PK1m4J29m9j91L15k16M2
5454dM9j90O5m4J83j21j3J34j10J4RJ19j8P8j36m3K9O0l4P5o0Kjn2M7m0P5J3K5
$$ plain form
5262 -18 -54 56 -21 -40 -51 -29 51 -7 -40 -42 49 10 38 -55 -70 0 72 117 -47 -38 -18 39 53 -12 -95 20 -146 -2 0
5291 0 -15 211 -16 -120 -36 72 22 -14 41 91 -151 -36 84 -36 -61 -108 -41 -16 -33 52 -125 -148 -42 59 -77
5316 -77 24 72 9 19 -90 14 80 11 -76 147 109 7 -85 12 -58 16 20 -57 -56 -128 85 -53 108 -62 -63 -111 17
5343 17 -57 -17 -67 -156 -9 -46 71 -13 122 41 56 44 -11 -2 -15 15 38 73 -61 -80 -19 57 -63 -17 78 -24 -30 25
5371 25 84 -45 -50 -61 -89 -120 -18 75 41 -8 12 -46 -51 26 20 74 -37 4 -101 58 -12 -2 86 106 68 -28 -18 -28 86
5400 86 5 69 -85 20 27 51 24 26 39 -68 -115 5 67 21 -125 71 94 -19 -47 10 49 34 -84 -25 -11 -77 176
5427 176 -100 -82 -72 -26 -95 -36 57 -109 -60 -26 -12 95 -59 -77 19 -26 -31 -18 -11 10 -34 95 46 -145 170 -46 -4
5454 -4 45 -145 -80 -124 59 -62 -75 59 -51 -37 -28 91 73 151 15 -28 1 61 27 102 42 44 43 -9 38 -2 73 86 111
5483A11k33K4L1nJ63K6j99R3J09n8L1o0j8L3r3MM5Q9j43J68j07Q0j4j6j9ol9P7
5511G4j49R4O7j72RR9O3j96J13M7j79K01l2j49N9J0m6J42rn5J46j69k0N9k8P2
5537E1j37l6J23K9o5Nj0l0J5Q0p7K00j75p3J71k3qn8J61j74R7p3L0j51L7LJ39
5564E1L4n3k1l7p5J25oO0kk2j4n3J6m1JJ54j98l2J20J4j42j5M0J45n2L0o0k1N9
5593EK2Qj10Q8MM5R0q4k09J12P0j25J83j33J6L4m6k1k3Q2j2l3lk0J35o0o2J4Q
5622b5M4n0J06j4j13R7l4j31J84M2o1l1P9OM5j72P2rk6J6k5o9M1K0l5K31k43J28
5650G3n8j2j7L4L7j15k2J18j93J74m9Q9m9N2m3o0Q4j34K67k62PJ10j22M7m9J03
5676A0j2P2j52N4O2j2Ql0q8M2p9K57p5m6j4q5J18Q2j52J28j45N1K5m4J05j78K07
$$ plain form
5483 111 -122 -98 -67 -72 91 117 -82 11 120 62 93 33 15 48 -45 -41 4 93 -50 118 11 91 77 61 42 36 -3 74
5511 74 -75 19 86 -86 -77 22 85 -111 2 49 -130 71 39 -110 -51 -41 -87 55 46 -9 137 -32 -52 7 -21 51
5537 51 -86 -122 1 30 -35 -30 -40 -70 -55 25 -52 148 -27 -100 71 48 40 -18 143 -31 66 -7 23 -128 -91 -88 51
5564 51 85 32 11 -26 -101 24 18 78 76 54 40 -13 3 -38 -37 117 -81 -113 7 21 -121 -136 -96 49 -3 27 -33 -54 5
5593 5 27 35 -75 13 17 62 152 68 -141 -29 41 -84 99 -34 -18 16 -30 -51 -74 8 -4 -37 -40 -60 75 15 -47 -33 -25
5622 -25 19 -31 75 61 -52 45 11 -120 64 106 45 14 93 99 144 -28 44 35 9 25 0 -69 -28 -8 -43 188 -55 73
5650 73 15 3 -14 20 57 -58 -80 38 -155 19 -30 59 10 62 19 -41 43 -91 176 -86 -79 31 -91 -44 -93 10
5676 10 -2 70 -82 -28 34 22 30 0 -88 -46 -125 132 57 11 -3 -88 30 112 -40 88 -57 -6 19 -25 80 -98 109
5703A09m3j1j30J84m5J5r3J16j14M2K2M0l4q8J13j06m8J71j48LM7k7K5q2K2R0
5729C0N7p8p9J73j85L6L2k5mR2k37L10j20O9k9r6P7J24j48j6J15M8j28o7K1J65
5755A37m9j28M5P5j62R8L1m2k5P5p0P2M2Q7o6n8J21j70J01j38j8L6J13j63K0J3
5781b3N7K5J3m9r9O7n9J38o8Km7J1l0K9K6j8L8R0n3n4R6j34J3j2Q6q6J52j12L8
5810C7o8j21K11j3k5k3K1Kl8M2L9j38K2K8k0J04j33K48k29J88k2j17j6j19J96
5835E6n7kJ26j04r7m8o5J67K27k08P6o5o2M4j18J77P3j23J76j59J92k32mo6J57
5860F1K5j2k9j20l7J38mj27J86n6Pk9M2M4k6o9nr3J13M4p9J1MJ9n9J71j64J3J5
5889a6J25j05o9P4M1m9j1L4j55N5J24l6qj58K75m6j81j7N2R0L9n2K8r8L8P9q5
$$ plain form
5703 109 66 55 -75 109 64 79 -14 102 -12 30 52 92 58 -30 83 -23 -71 100 -48 -45 2 -25 0 -82 -60 30
5729 30 87 9 -70 103 -82 -46 -14 -39 -43 49 -188 122 2 71 42 -54 23 147 -1 -17 98 146 18 -49 -28 137
5755 137 88 -40 5 80 -82 16 47 5 -20 55 -15 57 99 186 120 62 183 13 114 -24 -42 -6 107 -56 -36 -23
5781 -23 34 59 72 23 -76 -9 -68 70 2 4 -43 -32 -62 -33 -7 -25 13 103 50 -4 92 -42 -29 -41 45 -41 111 -1 37
5810 37 -31 -152 59 46 21 -2 19 21 -17 25 64 -74 -52 -24 -44 60 -73 175 -54 134 112 -5 -21 -140 56
5835 56 -1 -3 123 19 -78 -126 -191 -24 203 -5 71 6 -56 -12 -130 47 120 -3 173 14 206 -26 -30 -96 61
5860 61 86 74 45 -75 -112 26 22 -105 81 25 32 3 45 89 63 -6 -11 -104 9 53 -26 -15 -11 8 -51 120 -44 -31 -16
5889 -16 109 4 -65 9 50 1 -10 24 -131 -76 48 12 4 -154 121 75 -106 -123 -71 19 58 6 34 -64 -26 53 -32
5916c2MO3J85k56J40j30M0pJ42p4k16J15M1m2O7n7j15Q0J27n4o1J19j30KL2L5
5942A8j04Q5J09k11J42N2k47J61q3K31j78M6j1j9l4o6R6j1o0j6J45R7j06OL3j18
5968d3J71k87K07r1j12J60K8L1j36J64q5M6j34J35o5k7Q1l8k7J10p0No4J29k49
5993a61J21J17j96J69j12pM4l8J31j9n4q2J14P9p1jpo9o1J33O2k04Q2J32j67O3
6019bJl1R8M2q1j6N8O6j36M4Ol1J7q3J11j11R0o8N8j15J93n9j24l1R8J2j16J11
6047AO5m2j10J26Oj07N1nQ9q8p5L2J35k0j1J6j08M8k9L9j39P5J20j07L9O1n4l7
6075b9kJ18j19K7n0L8N1n1J21O5j24p7J42j49l0Q3n4n5J23j04Q6J31K1j34jr6
6101f9L5L6N7j52Q4j4l9P2p8J35j52M4N7k5O0r6J41o7j35jJ86j49J83j30O4m1
$$ plain form
5916 -32 -28 35 220 -36 104 -26 14 7 149 75 -141 -26 15 -27 40 -17 -132 -52 75 21 -40 79 -51 -49 -17 18
5942 18 -86 -1 108 -103 39 91 -156 5 -78 153 -25 21 10 -9 -43 -109 -13 -24 -84 -100 45 142 36 42 75 -43
5968 -43 128 -159 48 -43 -155 5 33 64 -72 92 7 53 -81 54 -11 -38 43 5 -22 88 18 23 -41 88 -161
5993 -161 -40 77 -119 50 -62 -69 -25 -63 68 49 -5 -87 27 106 35 34 27 -42 -103 30 92 -112 -30 102 -65 -2
6019 -2 -1 -32 66 108 27 11 69 135 -1 43 49 18 35 -48 63 -48 42 -26 32 -83 110 51 -73 -104 -6 6 -110 1
6047 1 66 24 -86 40 46 -61 -10 -15 74 -14 -89 -57 78 58 47 63 -45 3 -26 13 -126 -51 69 -38 1 62 8 -29
6075 -29 -31 87 -32 -5 -55 -17 34 -17 104 169 45 -32 110 -39 -69 14 -40 -95 28 -76 10 141 162 28 27 -69
6101 -69 -34 2 59 -93 -9 -23 -62 10 -68 67 -85 -41 16 -9 51 -45 96 29 -106 -107 79 -70 113 -17 47 6
6127FJ4n1J44j34M8Q2k8k1Jo6L6P0k38K11n4j26R9Mm3l5Q5P1j11L4m8M2n9J41
6155G4j03O3m9J20l7Jm7j7N3K2k15J04N7P9j71J88%k33N9P9pl3K9j9N1m4oQ2n5
6184B5j42M8Q7K7r5l9J42j44J61r0R5k21J93M4j48j2O5oK1k6k3J7L2J2M9j48K6
6211e0R3j00N4J7k7j17M3k5J04m3L5p7J60j34J5PJ8L2j2P3m9j07J43L8j6j17O
6238c6R5n4M5l9q9lJ60j08JJ44l4j47J0n8J3J74j73Q4l7J93k65R3R7n2R8Kj28
6265a4q1J49q8q4P3Q6r7Q2l4j19J73K6j35J07kj41O6k0K5R1q9J10q1p7J26L8j97
6292a07P8O6M0o8r6N6r6J88M1k09R2j02J68q9l0j7J0jk6J06J4J4m6o0Q1n0L6o6
6320g3J17J08k4j09k0jN5k0l0q8J35N4M8j54q5J19l7J1p3l9J24O1l2Kj32OJ03
$$ plain form
6127 6 20 -31 113 -21 27 109 81 60 61 -5 31 101 -137 74 20 -106 -7 -3 -46 -81 4 75 -36 -2 -50 -8 -67 74
6155 74 -29 34 -15 105 68 69 22 5 58 80 -135 -31 26 105 -66 122 122 -111 -52 27 20 -13 16 -3 48 4 -2 80 25
6184 25 -117 -69 18 45 -50 -89 53 -91 70 -20 75 -146 47 91 -57 -69 -4 -10 11 -15 -38 -21 11 23 72 -76 -50
6211 -50 43 -57 -3 14 -13 -130 -87 -112 -8 -51 -16 -93 67 -67 -52 -45 -27 5 -7 66 17 -90 53 91 75 -42 -36
6238 -36 59 5 50 11 -78 -81 79 -29 -28 116 82 -65 -55 -113 -100 74 -99 -15 -52 141 -124 -31 66 14 112 114 -14
6265 -14 -95 54 -34 -118 -45 41 -56 26 -8 -127 46 72 -63 44 42 -99 -33 -53 -28 63 -26 84 3 -74 52 90 -107
6292 -107 -29 37 77 9 -87 -31 -127 61 102 -107 -15 -117 51 -38 -68 -85 -75 -76 -102 4 18 32 -14 -74 7 -43 -7 -73
6320 -73 44 152 128 19 -1 -2 53 33 3 -85 50 104 152 -2 -87 32 -5 6 -67 -106 18 79 47 49 -83 -77 26
6347B6j02J27l1Q0j15nLqO6L9q7k2MQ2m6R7q7j9o7J36j9j44J22K7m0o3O7k7J4
6376Hrk7Lk0J03JL1j20P8j06P4nN3K5j14P8Oj5Qn4O1L4j39l2K8n6K54j16j25J46
6406E3j67PK8ON1J90r5k9K0l7PN9q0J70j62Oj11J21j22N9k9L2M6O3Q1k13R9q4
6434c1N3N1j71J67j43P3O0j1j44J11J10k08J21Oj4qK5k0K3p6R7J1k3k22J92Lj3
6461A9j62O4Q0OK1j17J00j52J92o0K6j29Q5j3Q2M1o3K9R4j99jjN5J48j40nN5j
6489E4l4Mn6J06L0j49J94k95Q1LJ33q0J1rK7K0Oj33N9J38m1o3p0l8J19k6L4L6
6517F1j07N5J7po8m5N5P5J2L7m1l2j35J84k0k2P7K3j23l6L5p5K7j6J62l9j37J55
6545G2p3j2q4M9LNL1M8J53k49r0J83l0o3j03K30j14J42j37J38j65k6m1J46l6l6
$$ plain form
6347 26 -76 51 20 100 -15 -20 -17 -25 41 80 -7 -29 -25 57 11 108 21 2 -65 71 52 -92 30 57 17 -46 21 -6 8
6376 8 -1 -28 -25 -45 58 59 90 -30 48 -58 16 11 64 89 -25 53 59 44 52 -2 59 93 -46 -78 -50 -106 148 32 -93 53
6406 53 -114 -107 -79 -73 -22 168 73 44 64 27 34 93 13 183 21 27 -84 37 -85 -26 -55 -23 23 86 167 -46 53 -31
6434 -31 22 73 -98 69 -74 -1 59 48 -96 15 125 -83 38 44 30 22 47 27 50 -26 71 82 59 -163 29 32 19
6461 19 -143 -79 1 7 28 -89 11 -141 51 -9 17 -112 -27 -40 42 83 20 49 143 -56 -57 -58 -3 145 5 0 55 54
6489 54 20 24 -32 74 104 -45 149 -146 -65 -62 71 -9 2 -7 20 40 46 -87 -28 110 69 6 -64 -102 17 -9 25 61
6517 61 -46 9 26 19 -49 -94 -39 36 48 85 44 12 -123 61 41 19 96 119 -4 -40 -5 -80 -53 -69 93 54 -83 72
6545 72 -1 -13 -97 -48 -45 -40 -9 39 192 -57 -147 36 6 -57 -160 70 -44 98 -39 99 -66 -92 -133 13 -23 -59
6571e9q0J88k34J40Nl2K34l59J95l4P7j07j08J4K60j35J45n1p8K2rn0R1N3k57
6596a69J90p3j0O8q6P9n1J97n2O2q8Kl4o6j8N4J13k44J36K6K3q3j11K34j88N6
$$ plain form
6571 -59 -139 49 -185 -45 -40 -72 162 -197 -2 -36 41 -66 -174 -160 100 -35 110 59 -19 3 -6 -56 35 88 -169
6596 -169 21 -52 -62 6 -80 -1 -52 145 93 155 67 69 35 -31 -49 5 118 -126 10 36 59 -24 -135 99 -89 -33
$$ [...]
8191E1
##END NTUPLES=NMR FID
##END=
