##TITLE=1H ikalashn
LR-791-C1
14.11.2024
##JCAMPDX= 6.0         $$ Bruker NMR JCAMP-DX V2.0
##DATA TYPE= NMR FID
##DATA CLASS= NTUPLES
##ORIGIN= UXNMR, Bruker Analytische Messtechnik GmbH
##OWNER= root
$$ TOPSPIN		Version 1.3
$$ 2024-11-14 13:41:37.093 +0400  Irina@DPX200
$$ Compression mode = diff/dup
##.OBSERVE FREQUENCY= 200.131300845
##.OBSERVE NUCLEUS= ^1H
##.DELAY= (6, 6)
##.ACQUISITION MODE= SIMULTANEOUS
##.ACQUISITION SCHEME= undefined
##.AVERAGES= 16
##.DIGITISER RES= 18
##SPECTROMETER/DATA SYSTEM= spect
##.PULSE SEQUENCE= zg
##.SOLVENT NAME= CDCl3
##.SHIFT REFERENCE= INTERNAL, CDCl3, 1, 17.49637
##AUDIT TRAIL= $$ (NUMBER, WHEN, WHO, WHERE, WHAT)
$$ ##TITLE= Audit trail, TOPSPIN		Version 1.3
$$ ##JCAMPDX= 5.01
$$ ##ORIGIN= Bruker BioSpin GmbH
$$ ##OWNER= Irina
$$ $$ F:/spectra/data/iren/nmr/1H/4/audita.txt
$$ ##AUDIT TRAIL=  $$ (NUMBER, WHEN, WHO, WHERE, VERSION, WHAT)
(   1,<2024-11-14 13:41:23.859 +0400>,<Irina>,<DPX200>,<TOPSPIN 1.3>,
      <created by zg
	started at 2024-11-14 13:40:15.937 +0400,
	POWCHK disabled, PULCHK disabled
       configuration hash MD5:
       BE 6D 3F 07 2A EA 11 49 91 17 2B D3 AF B3 58 0D
       data hash MD5: 16K
       8B BC 9B 2F B7 ED 6E AB B0 E8 F5 32 41 9B 7C C5>)
$$ ##END=
$$ 
$$ $$ hash MD5
$$ $$ 52 2F 04 A6 CB A4 52 C7 3B A8 7A 7F 46 4A EA 99
##$RELAX= 
##$RELAX= 
##$RELAX= 
##$RELAX= 
##$RELAX= 
##$RELAX= 
##$RELAX= 
##$RELAX= 
##$RELAX= 
$$ Bruker specific parameters
$$ --------------------------
##$DU= <F:/spectra>
##$EXPNO= 4
##$NAME= <1H>
##$PROCNO= 1
##$TYPE= <nmr>
##$USER= <iren>
##$AMP= (0..31)
100 100 100 100 100 100 100 100 100 100 100 100 100 100 100 100 100 100 
100 100 100 100 100 100 100 100 100 100 100 100 100 100 
##$ANAVPT= -1
##$AQSEQ= 0
##$AQ_mod= 1
##$AUNM= <au_zg>
##$AUTOPOS= <>
##$BF1= 200.13
##$BF2= 200.13
##$BF3= 200.13
##$BF4= 200.13
##$BF5= 200.13
##$BF6= 200.13
##$BF7= 200.13
##$BF8= 200.13
##$BYTORDA= 1
##$CFDGTYP= 0
##$CFRGTYP= 5
##$CHEMSTR= <none>
##$CNST= (0..63)
1 1 145 1 1 1 1 1 1 1 1 1 1 1 1 1 1 1 1 1 1 1 1 1 1 1 1 1 1 1 1 1 1 1 
1 1 1 1 1 1 1 1 1 1 1 1 1 1 1 1 1 1 1 1 1 1 1 1 1 1 1 1 1 1 
##$CPDPRG= <>
##$CPDPRG1= <>
##$CPDPRG2= <>
##$CPDPRG3= <>
##$CPDPRG4= <mlev>
##$CPDPRG5= <mlev>
##$CPDPRG6= <mlev>
##$CPDPRG7= <mlev>
##$CPDPRG8= <mlev>
##$CPDPRGB= <>
##$CPDPRGT= <>
##$D= (0..63)
0 2 0 0 0 0 0 0 0 0.06 0 0.03 0 0 0 0 0.0002 0 0 0 0 0 0 0 0 0 0 0 0 0 
0 0 0 0 0 0 0 0 0 0 0 0 0 0 0 0 0 0 0 0 0 0 0 0 0 0 0 0 0 0 0 0 0 0 
##$DATE= 1731577280
##$DBL= (0..7)
120 120 120 120 120 120 120 120 
##$DBP= (0..7)
150 150 150 150 150 150 150 150 
##$DBP07= 0
##$DBPNAM0= <>
##$DBPNAM1= <>
##$DBPNAM2= <>
##$DBPNAM3= <>
##$DBPNAM4= <>
##$DBPNAM5= <>
##$DBPNAM6= <>
##$DBPNAM7= <>
##$DBPOAL= (0..7)
0.5 0.5 0.5 0.5 0.5 0.5 0.5 0.5 
##$DBPOFFS= (0..7)
0 0 0 0 0 0 0 0 
##$DE= 6
##$DECBNUC= <off>
##$DECIM= 32
##$DECNUC= <off>
##$DECSTAT= 4
##$DIGMOD= 1
##$DIGTYP= 9
##$DL= (0..7)
0 120 120 120 120 120 120 120 
##$DP= (0..7)
150 150 150 150 150 150 150 150 
##$DP07= 0
##$DPNAME0= <>
$$ [...]
##$SW= 21.9926040160658
##$SWIBOX= (0..15)
0 0 2 0 0 0 0 0 0 0 0 0 0 0 0 0 
##$SW_h= 4401.40845070422
##$TD= 16384
##$TD0= 1
##$TE= 300
##$TE2= 300
##$TE3= 300
##$TEG= 300
##$TL= (0..7)
0 120 120 120 120 120 120 120 
##$TP= (0..7)
150 150 150 150 150 150 150 150 
##$TP07= 0
##$TPNAME0= <>
##$TPNAME1= <>
##$TPNAME2= <>
##$TPNAME3= <>
##$TPNAME4= <>
##$TPNAME5= <>
##$TPNAME6= <>
##$TPNAME7= <>
##$TPOAL= (0..7)
0.5 0.5 0.5 0.5 0.5 0.5 0.5 0.5 
##$TPOFFS= (0..7)
0 0 0 0 0 0 0 0 
##$TUNHIN= 0
##$TUNHOUT= 0
##$TUNXOUT= 0
##$USERA1= <user>
##$USERA2= <user>
##$USERA3= <user>
##$USERA4= <user>
##$USERA5= <user>
##$V9= 5
##$VALIST= <valist>
##$VCLIST= <CCCCCCCCCCCCCCC>
##$VD= 0
##$VDLIST= <DDDDDDDDDDDDDDD>
##$VPLIST= <PPPPPPPPPPPPPPP>
##$VTLIST= <TTTTTTTTTTTTTTT>
##$WBST= 1024
##$WBSW= 25
##$XGAIN= (0..3)
0 0 0 0 
##$XL= 0
##$YL= 0
##$YMAX_a= 970136
##$YMIN_a= -602120
##$ZGOPTNS= <>
##$ZL1= 120
##$ZL2= 120
##$ZL3= 120
##$ZL4= 120
##$ABSF1= 10
##$ABSF2= 0
##$ABSG= 5
##$ABSL= 3
##$ALPHA= 0
##$AQORDER= 0
##$ASSFAC= 0
##$ASSFACI= 0
##$ASSFACX= 0
##$ASSWID= 0
##$AUNMP= <proc_1d>
##$AXLEFT= 0
##$AXRIGHT= 0
##$AXTYPE= 0
##$AXUNIT= <>
##$AZFE= 0.1
##$AZFW= 0.1
##$BCFW= 1
##$BC_mod= 2
##$BYTORDP= 1
##$COROFFS= 0
##$CY= 7568.61572265625
##$DATMOD= 1
##$DC= 2
##$DFILT= <>
##$DTYPP= 0
##$F1P= 17.9538593292236
##$F2P= -4.03888763876832
##$FCOR= 0.5
##$FTSIZE= 32768
##$FT_mod= 4
##$GAMMA= 1
##$GB= 1
##$INTBC= 1
##$INTSCL= 1
##$ISEN= 128
##$LB= 0.02
##$LEV0= 0
##$LPBIN= 0
##$MAXI= 945.577
##$MC2= 0
##$MEAN= 0
##$ME_mod= 0
##$MI= -402.1523
##$NCOEF= 0
##$NC_proc= 0
##$NLEV= 6
##$NOISF1= 8.587773
##$NOISF2= 6.764455
##$NSP= 1
##$NTH_PI= 0
##$NZP= 0
##$OFFSET= 17.49637
##$PC= 1
##$PHC0= 121.4716
##$PHC1= 2.52035
##$PH_mod= 0
##$PKNL= yes
##$PPARMOD= 0
##$PPDIAG= 0
##$PPIPTYP= 0
##$PPMPNUM= 100
##$PPRESOL= 1
##$PSCAL= 0
##$PSIGN= 0
##$REVERSE= no
##$SF= 200.13
##$SI= 32768
##$SIGF1= 18.5376
##$SIGF2= -6.396296
##$SINO= 400
##$SIOLD= 32768
##$SREGLST= <1H.CDCl3>
##$SSB= 3
##$STSI= 0
##$STSR= 0
##$SW_p= 4401.40845070422
##$SYMM= 0
##$S_DEV= 0
##$TDeff= 0
##$TDoff= 0
##$TI= <>
##$TILT= no
##$TM1= 0
##$TM2= 0
##$TOPLEV= 0
##$USERP1= <user>
##$USERP2= <user>
##$USERP3= <user>
##$USERP4= <user>
##$USERP5= <user>
##$WDW= 1
##$XDIM= 8192
##$YMAX_p= 0
##$YMIN_p= 0
$$ End of Bruker specific parameters
$$ ---------------------------------
##NTUPLES= NMR FID
##VAR_NAME=  TIME,          FID/REAL,        FID/IMAG
##SYMBOL=    X,             R,               I
##VAR_TYPE=  INDEPENDENT,   DEPENDENT,       DEPENDENT
##VAR_FORM=  AFFN,          ASDF,            ASDF
##VAR_DIM=   8192,          8192,            8192
##UNITS=     SECONDS,       ARBITRARY UNITS, ARBITRARY UNITS
##FACTOR=    0.0002272,     1,               1
##FIRST=     0,             0,               0
##LAST=      1.8609952,     -67,             2
##MIN=       0,             -602120,         -602120
##MAX=       1.8609952,     970136,          970136
$$ Real data points
##PAGE= N=1
##DATA TABLE= (X++(R..R)), XYDATA
$$ [...]
$$ plain form
2434 -334 4261 -1975 -3482 3582 1550 -4119 697 4185 -2883 -2690 4426 749 -4334 1935 4028
2449 4028 -2978 -1803 4401 -488 -4326 2613 3152 -3828 -1070 4306 -1478 -4129 3108 2208 -4297
2464 -4297 247 4242 -2205 -3072 3694 1051 -4297 900 4118 -2620 -2204 4162 391 -4122 1673
2479 1673 3508 -2945 -1373 4169 -880 -4030 2280 2211 -3998 -786 4326 -1604 -3638 3181 1971
2494 1971 -4115 212 3935 -2093 -2747 3537 1143 -3892 1265 3756 -2886 -2048 4450 226 -3920
2509 -3920 2052 3009 -3444 -1208 3844 -667 -3621 2572 2100 -4130 -618 4014 -1570 -2946 3631
2524 3631 1590 -4039 705 3702 -2195 -2338 3671 1040 -3851 1312 3327 -3123 -1955 3914 -86
2539 -86 -3788 2125 2404 -3448 -1214 3471 -1103 -3276 2833 1964 -3819 -345 3828 -2028 -2963 3269
$$ packed form
2434c34M595o236j507P064k032n669M816L488p068J93P116l677n083O269K093
2449D028p006J175O204m889l838O939N39o980K758N376n784k651P237r00o505
2464d297M544L995o447q67O766k643n348N197L218o738M16O366l771m513N795
2479A673J835o453J572N542n049l150O310o9o209L212N112n930k034O819j210
2494A971o086M327L723o028o54O284k394n035N157K491o642Q38O498m224m146
2509c920N972R57o453K236N052m511k954O193m72o230L512M632n584j376O577
2524C631k041n629M744K997n897j43O009k631m891N163K015o450J168N869m000
2539h6l702N913K79n852K234M685m574k173O109q69n783L474M173n856r35O232
$$ plain form
2555 3269 1573 -3620 774 3317 -2623 -2088 3697 504 -3755 1719 3312 -3076 -1713 3478 -537
2570 -537 -3748 2259 2342 -3353 -741 3514 -1511 -3349 3144 1704 -3574 455 3892 -1917 -2505 3123
2586 3123 792 -3562 874 3269 -2556 -1808 3340 9 -3836 1506 2582 -3279 -1240 3488 -858
2601 -858 -3826 2359 2006 -3393 -144 3650 -1454 -2890 3151 1621 -3558 665 3590 -1721 -2065 3393
2617 3393 535 -3828 1206 3072 -2542 -1402 3671 -176 -3402 1722 2166 -3317 -955 3386 -768
2632 -768 -3250 2248 1882 -3442 -53 3267 -1638 -2635 2892 1183 -3468 588 3002 -2181 -1966 3159
2648 3159 546 -3487 1548 2195 -2908 -1492 3257 -372 -3188 1992 2140 -3521 -885 3474 -1113
2663 -1113 -2673 2675 1554 -3345 355 3133 -1471 -2207 3215 819 -3504 690 2781 -2386 -1988
$$ packed form
2555C269j696n193M394K543n940N35N785l193m259N474J593o388J363N191m015
2570e37l211O007Q3n695K612M255n025j838O493j440n278M029L437n809n88N628
2586C123k331m354M436K395n825P48N148l331l845N342J076n861K039M728m346
2601h58k968O185l53n399L249L794n104j436O041j530n179M223K925n311l44N458
2617C393k858m363N034J866n614J140N073l847l226N124M44n483K362M341m154
2632g68k482N498l66n324L389L320m905r97N527j709m651M056K414n183K15N125
2648C159k613m033N035O47n103J416M749l629k816N180J48n661K636M359m587
2663a113j560N348j121m899L700K778m604p36N422k396m323M194K091n167L98
$$ plain form
2678 -1988 3191 149 -3256 1414 2142 -2964 -1368 3092 -577 -2844 2094 2170 -2908 -121 3345 -1216
2694 -1216 -2406 2691 1203 -3231 270 2759 -2010 -2189 2846 393 -3262 825 2346 -2455 -1609
2709 -1609 2985 -197 -3219 1890 2262 -2667 -998 2889 -980 -2941 2365 1874 -3030 185 2996
2724 2996 -1568 -2442 2668 793 -3029 563 2676 -1928 -1802 2548 340 -3210 1180 2353 -2321
2739 -2321 -1454 2796 -574 -3017 2085 1956 -2708 -272 3032 -1032 -2361 2152 1459 -2851 261 2843
2755 2843 -1424 -2187 2621 671 -3116 694 2572 -1996 -1622 2580 98 -2994 1118 2235 -2499
2770 -2499 -1041 2844 -198 -2518 1993 1742 -2621 -149 2966 -972 -2229 2221 1122 -2886 236
2785 236 2544 -1587 -2080 2620 539 -3063 615 2206 -2418 -1321 2834 -25 -2808 1421 1894 -2379
$$ packed form
2678a988N179l042l405M670P28n106J596M460l669k267M938P6n078K787L466m561
2694a216j190N097j488m434L501K489m769j79N035k453l655M087J521m801Q46
2709a609M594l182l022N109L72m929J669L887l869j961N306m91m904L215K811
2724B996m564q74N110j875l822L592K113m604J26M350k208l550M390J173m674
2739b321Q67M250l370k443N102j29m664K436L304m064j329M513o93m310L112K582
2755B843m267p63M808j950l787L810J878m568L74M202k482l092M112J117m734
2770b499J458L885l042k320M511k51m363K472L115l938j257M450j099m008L122
2785B36K308m131m93M700k081l602L678J591m624J097M155k859k783M229M73m273
$$ plain form
2801 -2379 -316 2940 -731 -2191 2143 1512 -2431 -167 2571 -1184 -2025 2225 919 -2738 567
2816 567 2410 -1800 -1777 2582 105 -2857 1003 2091 -2216 -907 2558 -9 -2253 1383 2057 -2490
2832 -2490 -421 2724 -945 -2127 1826 1354 -2552 122 2414 -1498 -2163 2176 859 -2632 487
2847 487 2185 -1699 -1352 2371 109 -2712 1054 1875 -2121 -778 2667 -158 -2373 1722 1748 -2194
2863 -2194 -551 2511 -923 -2310 1895 1063 -2118 286 2315 -1512 -1788 1942 649 -2217 1024
2878 1024 2049 -1742 -1102 2339 30 -2265 1133 1859 -1907 -778 2375 -484 -2199 1466 1437 -2417
2894 -2417 -85 2425 -1160 -1734 1620 529 -2622 195 2150 -1337 -1709 2080 209 -2480 901
2909 901 1953 -1927 -917 2310 105 -1992 1279 1688 -2103 -356 2355 -635 -1953 1871 1232 -2310
$$ packed form
2801b379K063L256l671j460M334o31l943K264K738l755q41M250j306l657L305
2816E67J843m210K3M359k477k962L860J088m307J309L465k567k244L636O74m547
2832b490K069L145l669j182L953m72l906K674K292l912o65M339j317l491L119
2847D87J698l884L47L723k262k821L766Q21l996J343L445k825k215M095K6l942
2863b194J643L062l434j387M205q32l181K404K029l827k76L730j293k866L241
2878A024J025l791O40L441k309k295L398P26l766J129L153k859j715L665k9l854
2894b417K332K510l585n74L354j091l151K817J955l487l72L789j871k689L381
2909I01J052l880J010L227k205k097L271M09l791J747K711k990j318L824o39l542
$$ plain form
2925 -2310 -325 2032 -1269 -1828 1700 587 -2488 293 2152 -1448 -936 2319 223 -2182 1014
2940 1014 1639 -1735 -796 2250 -383 -2022 1210 1254 -1988 -528 2202 -876 -1778 1612 1014 -2241
2956 -2241 224 1862 -1144 -1326 1844 797 -2122 639 1736 -1606 -1010 2060 -90 -2033 1423
2971 1423 1696 -1770 -504 1944 -603 -1991 1346 1301 -2064 -116 2016 -1024 -1797 1730 823 -2018
2987 -2018 100 2128 -1622 -1214 1853 170 -1845 856 1876 -1580 -894 1802 -28 -1740 1317
3002 1317 1185 -1984 -507 1882 -632 -1892 1399 1022 -1946 346 1739 -922 -1428 1668 639 -1933
3018 -1933 767 1639 -1293 -898 2063 345 -2093 605 1347 -1456 -626 1895 -189 -1799 1108 1201
3034 1201 -1865 -347 1819 -683 -1465 1333 666 -1987 439 1552 -1068 -1256 1953 313 -1978 489
$$ packed form
2925b310J985K357l301n59L528j113l075K781J859l600N12L255k096k405L196
2940A014O25l374R39L046k633j639L232M4l242J460K730l078r02L390n98l255
2956b241K465J638l006j82L170j047k919K761J097l342N96L070k150j943L456
2971A423K73l466J266K448k547j388L337m5l365J948K132l040p73L527r07k841
2987b018K118K028l750M08L067j683k015K701J020l456O86K696j830j712L057
3002A317j32l169J477K389k514j260L291l77k968K292J393k661n06L096j029k572
3018a933K700Q72k932L95K961j718k438K698P42k803Q30K521k084j610K907R3
3034A201l066J518K166k502p82K798o67k653K426J113k620j88L209j640k291K467
$$ plain form
3050 489 1614 -1188 -732 1866 -138 -1732 1125 1377 -1591 -663 1808 -404 -1811 1248 1085 -2074
3066 -2074 -229 1771 -985 -1485 1293 689 -1770 248 1675 -1085 -964 2169 484 -1705 890 1536
3082 1536 -1213 -815 1843 186 -1859 985 1100 -1733 -419 1799 -598 -1641 1347 880 -1820 -335
3098 -335 1778 -881 -1481 1615 380 -1607 381 1647 -1206 -924 1699 288 -1662 799 1430 -1471
3114 -1471 -803 1425 -254 -1475 1213 982 -1765 -339 1563 -605 -1442 1301 775 -1613 227 1558
3130 1558 -908 -1163 1742 632 -1459 782 1562 -1181 -839 1533 -181 -1605 654 1308 -1360 -537
3146 -537 1618 -441 -1749 995 621 -1495 -198 1534 -835 -1188 1463 683 -1553 322 1685 -1025
3162 -1025 -1106 1159 125 -1499 523 1540 -1217 -709 1572 68 -1634 853 1075 -1610 -302 1630
$$ packed form
3050D89J125k802M56K598k004j594K857K52k968R28K471k212j407L059j63l159
3066b074J845K000k756n00K778o04k459K018J427k760J21L133j685k189K595O46
3082A536k749L98K658j657k045K844J15k833J314K218k397j043K988m67k700J485
3098c35K113k659o00L096j235j987J988J266k853K82K623j411j950K461O31k901
3114a471O68K228j679j221K688k31k747J426J902k168q37K743n26k388J840J331
3130A558k466k55K905j110k091K241P80k743L42K372j714j424K259O54k668Q23
3146e37K155k059j308K744l74k116J297J732k369l53K651p80k236J875J363k710
3162a025q1K265j034j624K022J017k757N08K281j504j702K487K22k685J308J932
$$ plain form
3178 1630 -199 -1394 1103 792 -1725 62 1405 -647 -1123 1548 501 -1415 224 1698 -1019
3193 -1019 -814 1440 161 -1454 447 1193 -1273 -516 1606 -356 -1413 817 685 -1564 -350 1483
3209 1483 -447 -1214 1201 730 -1650 211 1286 -771 -1148 1392 548 -1643 484 1410 -904 -685
3225 -685 1420 154 -1242 439 968 -1169 -429 1358 -364 -1360 1221 886 -1305 -309 1250 -676
3241 -676 -1023 1191 678 -1663 210 1323 -916 -794 1589 335 -1324 569 1316 -1128 -552 1384
3257 1384 -192 -1615 732 1035 -1342 -464 1344 -382 -1285 1198 731 -1254 29 1585 -484 -905
3273 -905 1315 475 -1265 310 1277 -864 -815 1244 -37 -1369 492 917 -1231 -670 1375 -85 -1071
3290 -1071 898 985 -1214 -56 1589 -496 -1150 1063 500 -1355 222 1400 -587 -804 1056 223
$$ packed form
3178A630j829j195K497l11k517J787J343k052m76K671j047j916J639J474k717
3193a019K05K254j279j615J901P46k466P57K122j962j057K230j32k249J214J833
3209A483j930p67K415m71k380J861J075k057l77K540q44k191K127R26k314K19
3225f85K105j266j396J681N29k137P40J787j722r96K581l35k191R96J559j926
3241f76l47K214n13k341J873J113k239J22K383j254j659J893P47k444N76J936
3257A384j576j423K347L03k377Q78J808j726r03K483m67j985J283J556k069m21
3273i05K220q40j740J575R67k141M9K059j281j332J861M25k148N61K045j460r86
3290a071J969Q7k199J158J645k085o54K213n63j855J577J178j987k17J860q33
$$ plain form
3306 223 -1232 154 1113 -1248 -681 1007 -189 -1365 422 837 -1128 -310 1291 -108 -1236 799
3322 799 996 -1012 -100 1393 -534 -1023 1190 713 -1473 22 1184 -808 -781 1378 90 -1410 597
3339 597 1006 -1257 -616 1202 -133 -1121 825 920 -1168 -367 1328 -253 -990 867 395 -964 179
3356 179 1389 -706 -1007 1030 192 -1117 183 1089 -848 -897 1252 61 -1196 406 820 -1251 -564
3373 -564 1076 -149 -1201 603 830 -1105 -210 1384 -237 -1175 1087 699 -1173 235 1272 -767
3389 -767 -916 1255 53 -1180 231 946 -884 -846 895 112 -1190 818 1026 -1162 -482 969 -75
3406 -75 -974 833 1100 -1059 -65 1437 -744 -848 877 270 -1160 16 1027 -768 -788 930 146
3423 146 -1225 210 1108 -1014 -386 1089 13 -934 577 913 -1005 -184 1239 -139 -918 828 844
$$ packed form
3306B23j455J386R59k361N67J688j196j176J787M15j965Q18J601j399j128K035
3322G99J97k008R12J493j927m89K213m77k186J495J162j992K7K159j288j500K007
3339E97M09k263O41J818j335r88J946R5k088Q01J695j581p37J857m72j359J143
3356A79J210k095l01K037q38j309J300R06j937m9K149j191j257J602M14k071O87
3373e64J640j225j052J804K27j935Q95J594j621r38K262l88j872J408J037k039
3389g67j49K171j202j233J411P15j830L8J741p83j302K008K08k188O80J451j044
3406g5q99J807K67k159R94J502k181j04J725o07j430J176J011j795k0J718p84
3423A46j371J435Q98k122O28J475j076r47J511L36j918Q21J423j378p79J746J6
$$ plain form
3440 844 -1146 -131 1025 -535 -1024 950 254 -1047 44 1177 -691 -769 900 -11 -1348 662
3456 662 694 -860 -413 1273 -115 -1130 823 805 -1099 -32 1012 -130 -984 708 794 -1085 149
3473 149 929 -472 -899 1047 156 -1028 417 951 -642 -772 999 67 -952 264 888 -720 -469
3490 -469 1038 36 -757 700 498 -826 -230 1238 -505 -823 831 197 -1351 87 988 -911 -467
3507 -467 1319 426 -1241 183 823 -950 -489 1083 -239 -890 378 863 -899 -412 1067 -211 -892
3524 -892 750 576 -950 -241 915 -330 -841 779 319 -1117 287 1063 -738 -577 899 195 -661
3541 -661 398 955 -468 -367 1050 -302 -1013 658 563 -901 -284 1259 -269 -822 725 680 -920
3558 -920 -12 860 -613 -766 751 254 -936 263 967 -725 -428 969 -20 -909 503 640 -839
$$ packed form
3440H44j990J015J156j560m89J974o96j301J091J133j868p8J669r11j337K010
3456F62L2j554M47J686j388j015J953j8j904J067J044j142q54J692Q6j879J234
3473A49P80j401m27J946q91j184J445N34j593j30J771r32j019J216O24j608K51
3490d69J507j002p93J457k02j324N96J468j743l18J654o34j548J438R01j899M44
3507d67J786q93j667J424O40j773M61J572j322o51J268M85j762M87J479j278o81
3524h92J642j74j526P09J156j245n11J620m60j436J404P76j801J61J476p04q56
3541f61J059N57j423J01J417j352p11J671r5j464O17J543j528n53J547m5j600
3558i20R08Q72j473j53J517m97j190J199P04j692K97J397r89q89J412J37j479
$$ plain form
3575 -839 -309 937 -371 -767 579 483 -1003 -220 911 -422 -856 778 191 -921 403 920 -586
3592 -586 -600 726 75 -996 351 736 -593 -393 1186 -110 -949 557 834 -813 -105 1064 -196
3609 -196 -670 697 649 -1055 25 936 -329 -559 829 234 -905 270 827 -465 -677 844 154
3626 154 -970 167 677 -914 -264 1073 -46 -812 491 430 -683 -83 742 -263 -709 578 244
3643 244 -769 -72 745 -474 -562 751 471 -820 -208 767 -582 -511 805 5 -1118 442 433 -803
3661 -803 -506 1002 -100 -796 605 609 -764 -261 720 -258 -785 619 364 -738 -7 771 -482 -458 837
3680 837 417 -797 412 720 -574 -599 975 69 -549 366 729 -816 -114 732 -404 -718 460 471
3698 471 -638 -240 677 -557 -771 459 233 -703 -6 633 -453 -678 777 108 -901 580 575 -687
$$ packed form
3575h39N30J246j308l96J346r6j486P83J131j333m34J634n87j112J324N17j506
3592e86j4J326o51j071J347L85j329K00J579j296q39J506K77j647P08J169j260
3609a96m74J367m8j704J080R11j265k30J388n95j139J175N57j292k12J521o90
3626A54j124J137N10j591O50J337j119p66J303o1j113O00Q25j005m46J287l34
3643B44j013O97Q17j219q8J313k80j291O12R75j349P1J316q00j123J560rj236
3661h03K97J508j102o96J401Mj373N03R81r78n27J404k55j102P31P78j253K4J295
3680H37m20j214J209L08j294k5J574r06o18R15L63j545P02Q46j136l14J178J1
3698D71j109L98R17j234k14J230k26r36O97O39j086k25J455o69j009J481nj262
$$ plain form
3716 -687 -562 623 -28 -616 593 555 -888 1 667 -126 -980 586 338 -673 74 684 -407 -620
3734 -620 855 342 -476 109 653 -674 -387 927 -314 -757 285 558 -575 -343 697 -149 -609 203
3752 203 384 -638 -270 625 -384 -524 579 301 -481 34 903 -523 -517 846 410 -546 213 303 -508
3771 -508 -521 769 -231 -798 208 515 -337 -218 618 -284 -969 181 480 -675 -186 704 -315 -705
3789 -705 743 379 -717 233 592 -240 -404 418 -64 -519 280 503 -478 -424 729 -218 -619 289 507
3808 507 -508 -252 309 -229 -729 411 632 -576 -146 642 -240 -507 543 143 -480 76 589 -620
3826 -620 -572 484 28 -695 275 617 -493 -300 458 -251 -563 126 527 -509 78 523 -156 -644 592
3845 592 353 -585 124 704 -258 -522 522 290 -747 -111 559 -318 -364 631 130 -560 228 318 -699 -231
$$ packed form
3716f87J25J185o51n88J209l8j443Q89O66p93q54J566k48j011P47O10j091k13
3734f20J475n13q18N85N44j327K87J314j241m43J042K73j133K32J040q46m60Q12
3752B03J81j022L68Q95j009j40J103k78p82N15Q69j426OJ363m36r56P59R0q11
3771e08j3J290j000n67J006L07q52J19Q36r02o85J150K99j155M89Q90j019l90
3789g05J448l64j096R50L59q32j64Q22m82m55P99K23r81N4J153r47m01R08K18
3808E07j015K56N61n38n00J140K21j208M30P88q82k67J050m00o23N56N13j209
3826f20M8J056m56p23R70L42j110J93P58p09l12O89M01j036N87M45o79m88J236
3845E92k39r38P09N80r62k64J044k32j037O36O70q77m6R95n01o90P88R0j017M68
$$ plain form
3865 -231 532 -187 -698 369 340 -680 -133 672 -306 -671 684 273 -814 150 178 -209 -372 498 -39
3884 -39 -358 317 283 -496 -195 626 104 -567 224 474 -502 -58 495 -23 -546 542 233 -644 -109 585
3904 585 -132 -427 395 279 -384 136 469 -165 -342 464 -42 -612 162 606 -589 -138 326 -25 -256 218
3924 218 262 -529 -285 429 -216 -560 433 430 -287 51 587 -341 -396 454 126 -550 56 524 -262 -488 490
3945 490 81 -557 -38 391 -358 -395 547 -122 -390 323 410 -469 -250 430 -105 -406 265 427 -585 -104
3965 -104 384 -437 -370 437 208 -651 279 482 -492 -229 495 68 -591 274 260 -376 -72 459 -42 -341 267
3986 267 223 -498 -162 599 -280 -240 523 236 -494 51 654 -215 -322 433 124 -321 51 264 -302 -123 510
4007 510 -253 -328 361 526 -521 -133 609 -141 -298 237 323 -457 142 359 -205 -345 433 129 -408 -237
$$ packed form
3865b31P63p19n11J067k9j020N47Q05r78l65J355m11j087R64K8l87j63Q70n37
3884c9l19O75l4p79L01Q21n22o71P91K50r76M44N53n18n23J088l09q77N35O94
3904E85p17k95Q22j16o63N20L33o34j77Q06n06n70P74M44j195M51M64l51k31M74
3924B18M4p91K44P14o45l44R93lp17L38N36r28n5Q50l28o76O06M68p86k26R78
3945D90m09o38N19M29p49l7R42o69k68P13Q7q79K19O80n35l01O71J62j012M81
3965a04M88q21O7Q07k29q59R30K03r74K63P24m27o59Q65j4o36L04N31n01k99O08
3986B67m4p21L36P61q79M0P63k87p30N45O03q69j07P55l09m45L72K13n66J79O33
4007E10p63p5O89J65j047L88P42p50j57N35Q6p80N99K17n64j40P78l04n37J71
$$ plain form
4027 -237 259 -370 -601 222 -96 -494 378 344 -443 -144 564 -149 -444 352 421 -464 -144 353 166 -444 309
4048 309 329 -218 -5 618 -76 -437 301 206 -668 109 470 -587 -129 342 74 -497 189 279 -439 -18 709
4069 709 -137 -416 167 362 -493 -31 364 -50 -387 165 206 -307 -123 312 -133 -13 267 38 -422 195
4089 195 438 -455 -168 345 -150 -423 365 84 -367 39 403 -85 -181 448 136 -384 7 219 -17 -97 254
4110 254 -62 -371 -19 315 -198 -147 547 -45 -209 185 195 -371 -119 411 -139 -424 242 480 -450 -198 328
4131 328 -12 -396 262 267 -458 -12 381 -196 -124 196 339 -206 -16 438 -206 -121 365 -40 -238 314 380 -197
4153 -197 -325 304 -57 -286 143 -61 -301 -103 401 -17 -302 174 157 -146 -98 263 -170 -249 401 286 -351
4174 -351 -28 438 -308 -301 414 58 -272 -19 184 -133 -235 261 -306 -490 276 346 -422 -243 240 16 -36
$$ packed form
4027b37M96o29k31Q23l18l98Q72l4p87K99P08p13k95P96O9q85L20M97j87o10P53
4048C09K0n47K13O23o94l61P38r5q74P77L61j057M58M71k68n71O86R0p18M21P27
4069G09q46k79N83J95q55M62L95m14l37N52M1n13J84M35m45J20K80k29m60O17
4089A95K43q93K87N13m95k73P88k81m51M06L64m88r6O29l12n20L91K12k36q0L51
4110B54l16l09L52L34n13N1O94n92j64L94J0n66K52N30n50k85O66K38r30K52N26
4131C28l40l84O58Np25M46L93n77P2L20J43n45J90M54o44Q5M86m05j98N52O6n77
4153a97j28O29l61k29M29k04k40J98N04m18k85M76j7l03M8L61m33p9O50j15o37
4174c51L23M66p46PP15l56l30K53K03l17j02M96n67j84P66P0p68J79M83k24n2
$$ plain form
4195 -36 225 201 -136 122 216 1 -290 70 171 -386 121 192 -83 -162 297 110 -158 82 154 -494 -368 228
4217 228 -41 -246 274 291 -167 -204 357 -237 -209 79 117 -527 106 260 -139 -226 398 7 -101 46 343 -282
4239 -282 -377 357 -257 -150 98 211 -265 77 459 -25 -386 90 220 -211 -104 390 -338 -346 229 29 -157
4260 -157 6 346 88 61 458 144 -196 242 493 -143 -302 493 -169 -121 99 132 -314 -150 271 -316 -258
4281 -258 462 343 -216 -9 281 80 -316 181 150 -279 67 200 -234 -174 425 -182 -157 234 279 -119 -96 182
4303 182 -55 -252 -26 93 -219 -241 534 -192 -248 238 65 -167 -168 110 81 -267 230 225 -139 52 132 -406 -115
4326 -115 357 131 -203 -51 80 -130 -220 88 161 -269 137 82 -333 -183 295 -122 -59 390 181 -215 55
4347 55 290 -138 -450 382 -130 -196 83 286 -30 -372 271 -64 -128 157 112 -198 -111 393 -146 -94 226 264
$$ packed form
4195c6K61k4l37K58R4k15k91L60J01n57N07P1k75p9M59j87k68K40P2o48J26N96
4217B28k69k05N20J7m58l7N61n94K8K88L8o44O33J54l99q7O24l91j08J47K97o25
4239b82r5P34o14J07K48J13m76L42L82m84l61M76J30m31J07M94p28qN75k00j86
4260a57J63L40k58k7L97l14l40M38K51o36j59P95o62M8K20L3m46J64M21n87N8
4281b58P20j19n59K07K90k01l96M97l1m29L46J33m34O0N99o07K5L91M5l98K3K78
4303A82k37j97K26J19l12k2P75p26n6M86j73k32jK78k9l48M97nl64J91Q0n38K91
4326a15M72k26l34J52J31k10r0L08P3m30M06n5m15J50M78m17O3M49k09l96K70
4347E5K35m28l12Q32n12o6K79K03l16l42O43l35o4K85m5l10Q7N04n39N2L20L8
$$ plain form
4369 264 -84 -4 40 33 -137 167 153 -477 135 141 -160 -73 367 -108 -91 108 136 -316 -32 126 -124 -321 31
4392 31 66 -232 66 574 85 -112 57 200 -240 -43 268 -16 -335 185 155 56 68 273 -5 -124 375 164
4414 164 -101 -138 288 -228 -212 294 157 -36 237 45 -138 60 221 -243 216 229 159 93 -78 262 13 -258
4436 -258 191 198 -277 10 87 22 64 186 67 -164 65 -49 -374 91 219 -38 -289 341 -46 -93 -231 300
4458 300 116 -429 65 152 -359 -169 226 -196 20 520 55 4 58 109 13 -286 486 85 58 204 187 -291
4480 -291 15 3 69 -123 95 191 -54 154 94 24 -205 59 177 -41 17 242 -82 -75 225 234 -213 60 118 -149
4504 -149 -35 265 88 -347 -163 118 -69 -190 46 147 -442 306 215 -78 -67 341 -218 -292 89 -72 -92
4525 -92 -58 -18 -28 -244 223 458 -244 76 332 -138 -81 172 63 -102 -114 204 -187 -93 145 45 -236 -120
$$ packed form
4369B64l48Q0M4pj70L04j4o30O12Ol01Q7M40m75J7J99K8m52K84J58k50j97L52
4392C1L5k98K98N08m89j97J69J43m40J97L11k84l19N20l0r9J2K05k78j19M99k11
4414A64k65l7M26n16J6N06j37j93K73j92j83J98J61m64M59J3p0o6j71L40k49k71
4436b58M49Pm75K87P7o5M2J22j19k31K29j14l25M65J28k57k51O30l87m7j38N31
4458C00j84n45M94Q7n11J90L95m22K16N00m65n1N4N1r6k99P72m01k7J46j7m78
4480b91L06j2O6j92K18R6k45K08o0p0k29K64J18k18N8K25l24PL00Rm47K73N8k67
4504a49J14L00j77m35J84K81j87j21K36J01n89P48r1k93J1M08n59p4L81j61k0
4525i2L4M0j0k16M67K35p02L20K56m70N7K53j09j65j2L18l91R4K38j00k81J16
$$ plain form
4547 -120 -155 -89 -44 -2 -51 -457 129 -34 -286 -25 97 -256 -134 279 -132 -44 103 54 -52 -218 167 23
4569 23 -202 22 79 112 43 229 167 -208 80 292 -63 -178 243 -52 -329 86 153 -254 -30 255 -140 37
4591 37 186 -36 -236 -1 74 38 -38 105 76 -69 96 137 30 67 75 -29 -365 131 112 -55 -75 149 -143 -224
4615 -224 -5 87 -92 -82 -39 -128 -224 197 64 -284 -136 4 -149 -65 260 140 -87 178 24 47 -57 94
4637 94 143 -231 163 -53 -322 -124 50 -226 -74 192 194 -236 -41 249 -73 65 276 274 -61 -116 -16 -100 -254
4660 -254 214 134 -134 160 252 -39 220 209 153 -224 -21 297 -258 -142 148 99 -351 -170 203 -63 -29 109
4682 109 327 -75 29 214 -409 178 -67 -247 104 15 40 26 169 162 49 -83 105 1 -445 96 119 -89
4704 -89 12 -214 -110 -300 38 -269 -141 -217 -36 -95 -272 -71 152 -216 -32 -34 -129 -73 -81 30 -423 44 113
$$ packed form
4547a20l5O6M5M2m9m06N86j63k52K61J22l53J22M13m11Q8J47m9j06j66L85j44
4569B3k25K24N7L3o9J86o2l75K88K12l55j15M21k95k77M15O7m07K24K85l95J77
4591C7J49k22k00K35P5l6p6J43k9j45J65M1j07L7Qj04l36M96j9j67k0K24k92q1
4615b24K19R2j79J0M3q9r6M21j33l48J48J40j53Q4L25j20k27K65j54K3j04J51
4637I4M9l74L94k16k69J98J74k76J52K66Km30J95K90l22J38K11kl35n5J00q4j54
4660b54M68q0k68K94R2k91K59j1n6l77K03L18n55J16K90m9m50J81L73k66L4J38
4682A09K18m02J04J85o23N87k45j80L51q9K5j4J43pj13j32J88j04m46N41K3k08
4704h9J01k26J04j90L38l07J28p6J81n9j77K01K23l68J84kr5N6qJ11m53M67O9
$$ plain form
4727 113 -298 -122 -42 -8 -534 156 65 -21 -36 98 -240 -96 184 21 -9 171 129 -117 -278 99 69 -243 -194
4750 -194 124 -141 35 152 4 -187 67 230 -54 -184 168 0 -224 344 225 -180 148 290 -49 -143
4770 -143 35 113 -112 178 95 -10 22 46 -137 35 18 275 -224 29 258 -283 -257 67 -62 147 150 79 25
4793 25 -129 230 -16 -63 -140 72 60 1 112 0 26 -16 158 -124 -141 229 283 -261 185 237 -340 -121 -23 -77
4817 -77 -4 16 131 -34 -82 148 175 -114 -76 -54 86 193 307 58 -114 180 79 -64 134 168 69 87 282
4840 282 367 -160 16 422 -131 -13 153 -217 -134 97 -79 -64 -91 253 -92 -261 185 158 6 -108 85 -162
4862 -162 48 -4 259 -180 184 284 56 -70 191 148 -176 -224 150 -119 112 -41 115 8 166 311 -144
4883 -144 68 293 -53 -137 -123 150 -34 -52 133 66 -179 -112 4 62 -40 -91 -128 -20 25 104 -5 -224 170
$$ packed form
4727A13m11J76Q0L4n26O90r1q6j5J34l38J44K80j63l0J80m2k46j61L77l0l12M9
4750a94L18k65J76J17j48j91K54J63k84j30L52j68k24N68j19m05L28J42l39r4
4770a43J78P8k25K90q3j05L2K4j83J72j7K57m99K53K29n41K6L24j29K09Lp1n4
4793B5j54L59k46m7p7K12j2n9J11j12K6m2J74k82j7L70N4n44M46N2n77K19R8n4
4817g7P3K0J15j65m8K30K7k89L8K2J40J07J14k49j72K94j01j43J98L4r9J8J95
4840B82Q5n27J76M06n53J18J66l70Q3K31j76J5k7L44l45j69M46k7j52j14J93k47
4862a62K10n2K63m39L64J00k28j26K61m3l24m8L74k69K31j53J56j07J58J45m55
4883a44K12K25l46q4J4K73j84j8J85o7k45O7J16N8j02n1l7J08M5P9j09k19L94
$$ plain form
4906 170 88 58 88 279 -328 71 165 -8 -144 210 115 -90 202 92 -116 10 261 2 -17 132 8 -64
4928 -64 -73 68 98 -263 333 79 -71 -14 352 9 -237 260 145 -70 33 281 126 -84 128 -5 69 97
4950 97 201 -94 -143 77 253 -112 -17 479 29 66 174 77 -79 2 -54 -17 58 465 -22 -98 260 294 -159 6
4974 6 359 -164 -12 -55 -146 90 165 240 -359 88 167 152 -109 -46 182 -290 -30 255 51 -75 97 -262 -50
4997 -50 36 325 -157 -306 233 189 -328 -99 191 -139 -90 119 203 -46 26 3 -399 -113 63 -47 -229 185
5019 185 190 87 -97 133 -112 -192 184 23 -29 23 306 -99 -141 86 172 -318 -36 42 -69 -222 42 84 -297
5042 -297 141 146 -10 -86 147 -48 -127 193 274 -119 75 -24 74 111 96 134 -121 104 -80 -228 -48 31 -41 -227
5066 -227 103 -59 -142 -34 44 104 -106 178 263 -87 -62 226 27 -33 193 103 -161 144 133 15 -330 17 147
$$ packed form
4906A70q2l0L0J91o07L99R4j73j36L54r5k05K92j10k08J26K51k59j9J49j24p2
4928f4rJ41L0l61N96k54j50N7L66l43k46M97j15k15J03K48j55k10K12j33P4K8
4950I7J04k95m9K20J76l65R5M96m50L7J08r7j56Q1n6L7P5M07m87p6L58L4m53J65
4974FL53n23J52m3r1K36P5P5n99M47P9j5k61O3K28m72K60K85k04j26J72l59K12
4997e0Q6K89m82j49N39m4n17K29K90l30M9K09Q4k49P2k3m02K86J76j10j82M14
5019A85Nj03j84K30k45q0L76j61n2N2K83m05m2K27Q6m90K82P8j11j53K64M2l81
5042b97M38Nj56p6K33j95p9L20Q1l93J94r9R8L7j5L8k55K25j84j48J80P9p2j86
5066b27L30j62q3J08P8O0k10K84Q5l50K5K88j99o0K26r0k64L05j1j18l45L47J30
$$ plain form
5089 147 -116 135 153 -38 40 297 42 -26 141 116 7 -276 59 -6 -198 171 166 -149 -395 125 33 -145 41
5112 41 -4 -285 -37 -84 -70 -117 258 14 -284 -74 72 211 -189 1 104 -312 -34 113 -81 -148 156 -4
5134 -4 38 87 174 -139 -179 267 -10 -89 68 -21 -193 -95 352 62 -217 129 100 -201 -222 314 -187 -382 230 78
5158 78 -255 208 199 -188 -195 65 -150 -289 9 195 -130 11 49 -20 -10 -53 -60 -272 286 195 -147 -52 -72 222 -334
5183 -334 197 -143 77 -87 146 44 141 -31 43 -156 -100 245 87 -221 -187 239 -63 -206 30 -85 -222
5204 -222 221 4 49 -194 -18 166 -61 57 -105 138 -92 228 -42 -69 78 -9 -186 174 81 98 -243 283
5226 283 19 -387 211 40 -114 52 69 -120 -287 106 196 -183 -103 320 50 -148 149 159 29 -44 245 -83
5248 -83 57 213 130 -138 -80 256 -247 -53 26 29 -202 -27 314 -183 -211 170 -184 -174 234 70 -283 81 30
$$ packed form
5089A47k63K51J8j91P8K57k55o8J67k5j09k83L35o5j92L69nl15k46N20r2j78J86
5112D1m5k81K48m7J4m7L75k44k98K10J46J39m00J90J03m16K78J47j94o7L04j60
5134dM2M9Q7l13m0M46k77p9J57q9j72R8M47k90k79L46k9l01k1N36n01j95O12j52
5158G8l33M63rl87pK60k15j39K98J86l25J41L8o9J0m3pk12N58r1l42R5k0K94n56
5183c34N31l40K20j64K33j02R7j72P4j99N6L45j58l08L4M26l02j43K36j15j37
5204b22M43k17M5k43J76J84k27J18j62K43k30L20k70k7J47q7j77L60r3J7l41N26
5226B83k64m06N98j71j54J66J7j89j67L93R0l79Q0M23k70j98K97J0j30p3K89l28
5248h3J40J56q3k68N8L36n03J94P9Lk31J75L41m97k8L81l54J0M08j64l53L64n1
$$ plain form
5271 30 -217 -329 171 -49 -445 -76 307 17 -205 274 288 -296 350 103 12 168 180 190 -281 -87 96 -163
5293 -163 -65 50 -39 -414 106 52 -340 -108 112 -177 -466 69 -203 -274 87 171 205 -257 70 31 -69 263
5315 263 407 -7 -221 107 -30 -99 73 -148 -97 136 240 -50 -165 431 -48 -214 -180 268 -88 7 138
5336 138 151 -153 22 -12 -163 -123 323 -21 -269 90 9 -39 -27 475 -4 -20 81 237 -118 -171 188 2 -395
5359 -395 108 87 -284 -45 45 0 -47 195 119 -345 -67 -10 -40 -317 -6 -79 -357 132 16 -342 -200 174 238
5382 238 -3 386 109 -158 93 291 -28 -109 216 68 -421 -16 275 -138 -55 -5 107 -206 -168 275 153
5403 153 40 23 108 -110 222 92 -409 -207 287 -120 -224 -53 178 -235 109 317 19 -13 362 99 -43
5424 -43 66 360 -171 -46 349 55 -268 297 284 -151 -297 461 136 -119 297 96 -364 36 429 -43 -76
$$ packed form
5271C0k47j12N00k20l96L69L83k90k22M79J4n84O46k47r1J56J2J0m71J94J83k59
5293a63R8J15q9l75N20n4l92K32K20k89k89N35k72p1L61Q4L4m62L27l9j00L32
5315B63J44m14k14L28j37o9J72k21N1K33J04k90j15N96m79j66L4M48l56R5J31
5336A38J3l04J75l4j51M0M46l44k48L59q1m8J2N02m79j6J01J56l55n3L59j86l97
5359c95N03k1l71K39R0m5m7K42p6m64K78N7l0k77L11p3k78M89j16l58J42L74O4
5382B38k41L89k77k67K51J98l19q1L25j48m89M05K91m13Q3N0J12l13L8M43j22
5403A53j13j7Q5k18L32j30n01K02M94m07j04J71K31m13L44K08k98l2L75k63j42
5424d3J09K94n31J25L95k94l23N65j3m35j46P58l25k55M16k01m60M00L93m72l3
$$ plain form
5445 -76 249 28 -235 3 168 -23 -126 108 34 -203 12 319 -113 -90 381 45 -329 81 160 -127 -284
5466 -284 195 194 -241 202 102 -144 -116 14 -99 -221 24 145 -321 278 221 -101 -88 271 -339 -119 48 333
5488 333 91 -128 212 67 -65 146 -3 -262 -27 174 -194 -283 267 63 -143 244 319 143 -180 362 449
5509 449 -300 182 312 -371 -18 242 -100 -188 94 148 -89 -169 308 -38 -84 172 -32 -284 -154 261 24
5530 24 -90 203 169 -40 -88 238 30 -331 179 326 -137 -115 -23 -209 17 -89 -74 -85 229 21 -130 18
5552 18 147 -64 -286 -91 92 -207 0 375 -56 -293 114 -122 -201 -9 218 -221 -93 274 19 -85 126
5573 126 252 -167 -146 141 -58 -252 -6 193 91 -174 -21 18 -331 85 144 68 68 351 -110 -288 165 9
5595 9 -287 44 92 -79 -112 399 213 -249 83 159 -212 -27 81 127 -146 -129 71 -184 -208 207 110 -95 197
$$ packed form
5445g6L25k21k63K38J65j91j03K34p4k37K15L07m32K3M71l36l74M10P9k87j57
5466b84M79jm35M43j00k46K8J30j13j22K45J21m66N99n7l22J3L59o10K20J67K85
5488C33k42k19L40j45j32K11j49k59K35K01l68q9N50k04k06L87P5j76l23N42Q7
5509D49p49M82J30o83L53K60l42q8K82N4k37q0M77l46m6K56k04k52J30M15k37
5530B4j14K93l4k09m8L26k08l61N10J47m63K2R2j86K26j06J5j1L14k08j51J48
5552A8J29k11k22J95J83k99K07L75m31k37M07k36p9J92K27m39J28L67k55j04K11
5573A26J26m19K1K87j99j94K46J99j02k65J53L9l49M16N9p6%K83m61j78M53j56
5595Ik96L31M8j71l3N11j86m62L32P6l71J85J08M6k73J7K00k55k4M15r7k05K92
$$ plain form
5618 197 53 -95 111 290 -134 -186 192 -5 -213 -291 4 -149 -246 181 89 -270 -106 350 -303 -154 212
5639 212 26 -280 184 234 -297 -195 249 26 -93 232 23 -309 157 45 -100 -283 127 147 -108 51 -115
5660 -115 -176 64 362 48 -446 123 62 -333 -125 46 -144 -348 154 130 -165 -84 164 -48 -271 181 104 -182
5682 -182 109 277 40 -256 23 -86 47 56 -41 -85 -115 134 179 -219 57 173 -74 -183 311 -150 -160 183
5704 183 -89 -340 36 430 -131 -269 46 169 -127 214 305 -230 -20 -1 152 -47 -265 45 -340 -95 11
5725 11 118 -340 234 124 -148 3 45 -35 -129 -90 87 -196 -59 454 -8 -80 239 -41 -371 57 518 -372
5747 -372 -144 237 -64 -376 -27 438 -188 -18 232 -68 -351 69 356 -285 -129 78 -67 -163 179 96 -410
5768 -410 11 200 -109 -198 280 219 -271 199 73 -260 -288 153 135 -230 76 328 -201 -128 319 -51 -400 90
$$ packed form
5618A97j44j48K06J79m24n2L78j97k08p8K95j53r7M27r2l59J64M56o53J49L66
5639B12j86l06M64N0n31J02M44k23j19L25k09l32M66j12j45j83M10K0k55J59j66
5660a15o1K40K98l14m94N69o1l95K08J71j90k04N02k4k95Q1K48k12k23M52p7k86
5682a82K91J68k37k96K79j09J33Rr7m4l0K49M5l98K76J16k47j09M94m61j0L43
5704A83k72k51L76L94n61j38L15J23k96L41R1n35K10J9J53j99k18L10l85K45J06
5725A1J07m58N74j10k72J51M2q0r4L9J77k83J37N13m62p2L19k80l30M28M61q90
5747c72K28L81l01l12L49M65o26J70K50l00k83M20K87o41J56K07j45r6L42q3n06
5768d10M21J89l09q9M78o1m90M70j26l33k8M41j8l65L06K52n29P3M47l70l49M90
$$ plain form
5790 90 90 -145 -263 325 -45 -241 347 9 -191 99 334 -239 -40 81 112 -367 213 -106 -149 -276 231 -40
5812 -40 -358 291 286 -343 13 160 -162 -188 152 318 -203 101 224 140 -378 169 154 -402 32 436 26 -312
5834 -312 225 -1 -201 -24 238 -63 -116 444 -101 -415 94 327 -251 -153 40 -312 -156 73 -109 -405 54
5855 54 226 -143 -313 144 278 -262 102 209 -206 -43 178 -19 -374 327 254 -154 19 20 42 -358 179 -39
5877 -39 -359 -154 231 -132 -74 327 117 -260 -81 522 -186 -289 68 -67 -129 76 180 -311 -272 353 169
5898 169 3 -96 84 -297 -2 51 101 -72 185 65 -294 -163 283 66 -167 378 17 -411 203 240 -234
5919 -234 -189 372 -120 -368 259 84 -212 -397 276 -147 10 288 68 -443 -258 378 -103 -252 85 261
5939 261 -459 -75 353 51 -129 478 -22 -394 71 152 66 -234 103 106 -196 97 397 152 -166 251 42
$$ packed form
5790I0%k35j18N88l70j96N88l38k00K90K35n73J99J21L1m79N80l19m3j27N07k71
5812d0l18O49no29L56J47l22k6L40J66n21L04J23q4n18N47j5n56M34M04m10l38
5834c12N37k26k00J77K62l01n3N60n45l14N09K33n78R8J93l52J56K29j82k96M59
5855E4J72l69j70M57J34n40L64J07m15J63K21j97l55P01p3m08J73JK2m00N37k18
5877c9l20K05L85l63N8M01k10l77J79O03p08j03L57j35o2K05J04m91L9O25j84
5898A69j66r9J80l81K95N3N0j73K57j20l59J31M46k17k33N45l61m28O14L7m74
5919b34M5N61m92k48O27j75k96j85O73m23J57K78k20n11J85O36m81j49L37J76
5939B61p20L84M28l02j80O07n00l72M65Q1q6l00L37Ll02K93L00k45l18M17k09
$$ plain form
5960 42 -135 178 288 22 -187 439 -83 22 366 43 -262 -99 239 -204 -171 370 49 -475 35 198 36
5981 36 -141 121 -125 -128 239 110 -327 -100 341 -310 -388 141 -40 -356 22 309 -135 -159 165 225 -128 173
6003 173 331 -65 -44 250 93 -195 119 331 -190 -203 197 -141 -401 357 117 -309 -205 417 -126 -337 253
6024 253 146 -198 106 76 -146 -134 254 101 -341 -172 80 -60 -341 252 -125 -421 73 208 -149 -134 170
6045 170 81 -175 103 369 -293 -94 301 -291 -127 276 107 -315 61 417 -119 -95 153 327 -179 -115 443
6066 443 -78 -239 292 -225 -31 -19 176 -73 -156 327 -71 -205 138 475 -317 -72 188 -195 -391 236 -43
6087 -43 -370 177 480 -366 -87 254 -161 -259 131 393 -5 -45 147 -352 -198 107 344 -256 -124 407 222
6108 222 -280 131 164 -369 -160 119 -18 -150 192 46 -218 -136 221 -222 -215 24 168 -247 154 222 0 -109
$$ packed form
5960D2j77L13J10k66k09O26n22J05L44l23l05J63L38m43L3N41l21n24N10J63j62
5981C6j77K62k46lL67j29m37K27M41o51p8N29j81l16L78K87m44k4L24O0l53L01
6003A73J58l96K1K94j57k88L14K12n21j3M00l38k60P58k40m26J04O22n43k11N90
6024B53j07l44L04l0k22J2L88j53m42J69K52j40k81N93l77k96M94J35l57J5L04
6045A70q9k56K78K66o62J99L95n92J64M03j69m22L76L56n36K4K48J74n06O4N58
6066D43n21j61N31n17J94J2J95k49q3M83l98j34L43L37p92K45K60l83j96O27k79
6087d3l27N47L03q46K79L41m15r8L90K62l98m0J92m99J54L05K37o00J32N31j85
6108B22n02M11L3n33K09K79j37j32L42j46k64Q2L57m43PK39J44m15M01O8k22j09
$$ plain form
6130 -109 348 -162 -207 405 39 -287 -130 298 20 -385 -3 136 -297 28 118 -254 -146 447 -16 -343 23
6151 23 90 -14 -218 156 -145 2 176 362 -5 -321 217 -3 -282 217 269 -254 -44 441 -69 -402 -21
6172 -21 -50 -277 -299 226 -216 -416 276 -18 -380 183 178 -171 -108 244 44 -384 269 158 -201 -140 374 175
6194 175 -252 71 193 -354 -47 149 26 -341 31 219 -532 -182 155 -113 -281 126 -1 -250 -281 493
6214 493 -247 -187 197 -123 -171 300 183 -142 -119 350 -34 -356 289 -31 -250 148 334 -313 -207 119 -53
6235 -53 -256 60 107 -50 -293 498 12 -279 -189 190 -417 -160 270 43 -217 222 281 -266 -224 170 232 130
6257 130 354 79 -311 -87 328 -69 -74 327 267 -234 -103 164 -160 12 385 175 -383 -172 133 -338 110
6278 110 301 88 -64 168 -95 -136 -259 143 -312 -61 281 -72 -235 -198 297 -86 -517 251 40 -145 70
$$ packed form
6130a09M57n10m5O12l66l26J57M28k78m05L82J39m33L25R0l72J08N93m63l27L66
6151B3O7j04k04L74l01J47J74J86l67l16N38k20k79M99N2n23K10M85n10l33L81
6172b1k9k27k2N25m42k00O92k94l62N63nl49O3L52k00m28O53j11l59O1N14j99
6194A75m27L23J22n47L07J96j23l67L72J88p51L50L37k68j68M07j27k49l1P74
6214D93p40O0L84l20m8M71j17l25K3M69l84l22O45l20k19L98J86o47J06L26j72
6235e3k03L16M7j57k43P91m86k91R0L79o07K57M30k27k60M39N9n47M2L94O2j02
6257A30K24k75l90K24M15l97nM01o0n01J31K67l24J72L73k10n58K11L05m71M48
6278A10J91k13j52K32k63m1j23M02m55K51L42l53j63L7M95l83m31P68k11j85K15
$$ plain form
6299 70 339 -196 -4 203 204 -328 330 286 -116 152 190 153 -405 57 138 -510 14 383 126 32 401 24 -288
6322 -288 34 62 88 -185 156 -96 -335 387 345 -181 176 -42 42 -238 163 346 -46 147 424 -68 -389
6343 -389 209 70 -121 -69 98 -84 -269 230 -101 68 -55 43 -41 53 274 -94 -472 -84 393 -47 -148
6364 -148 287 -59 -185 339 349 -353 -147 230 -249 19 196 -94 73 -102 -40 241 -225 114 184 15 -50
6385 -50 185 -189 44 338 -185 -224 -228 158 43 -124 17 -152 -169 232 212 -295 -75 317 -50 -151 332 -45
6407 -45 -334 -20 81 33 -250 137 108 -320 105 243 -27 20 193 200 -173 202 459 58 27 144 -161 -157 270
6430 270 218 -201 -97 329 -75 -289 507 151 -211 90 243 119 -218 156 -37 -79 -48 -1 -156 -263 384
6451 384 55 118 -219 77 -343 -287 167 -60 -238 232 52 -85 50 129 19 -9 277 48 -244 200 390
$$ packed form
6299G0K69n35J92K07Jn32O58m4m02K68L8l7n58M62Q1o48N24L69k57r4L69l77l12
6322b88L22K8K6k73L41k52k39P22m2n26L57k18Q4k80M01J83l92J93K77m92l21
6343c89N98j39j91N2J67j82j85M99l31J69j23R8q4R4K21l68l78L88M77m40j01
6364a48M35l46j26N24J0p02K06L77m79K68J77k90J67j75O2K81m66L39P0j69o5
6385e0K35l74K33K94n23l9mL86j15j67J41j69j7M01k0n07K20L92l67j01M83l77
6407d5k89L14J01m8k83L87k9m28M25J38k70M7J73Pl73L75K57m01l1J17l05MM27
6430B70n2m19J04M26m04k14P96l56l62L01J53j24l37L74j93m2L1M7j55j07O47
6451C84l29O3l37K96m20N6M54k27j78M70j80j37J35P9j10k8K86k29k92M44J90
$$ plain form
6472 390 7 48 239 113 76 91 285 -131 -169 -25 -161 -116 151 -138 -45 -13 378 -43 -6 104 145 -299 -52
6495 -52 254 45 -121 262 107 -87 195 305 -62 -15 407 -53 -145 149 136 -196 -154 243 -23 -134 236 78
6517 78 -430 -291 81 -152 -218 132 -21 -61 18 202 -378 -32 252 154 -253 221 -89 -16 5 43 -116 -168 87
6540 87 190 -65 -222 131 31 -184 13 -15 -236 147 168 94 -230 145 90 -194 81 -45 -103 -114 150 123 -195
6563 -195 156 175 -122 -138 39 51 -249 202 -49 -268 -100 332 -47 -34 172 177 -186 -72 254 -282 -412 299
6585 299 -19 -273 -33 85 129 -89 215 219 -82 106 273 -201 -1 228 89 -274 231 27 -255 -11 214
6606 214 -305 -248 129 285 -132 226 104 -117 -451 292 401 -230 207 73 -128 -132 389 151 -200 185 183 -303
6628 -303 -155 194 -186 13 234 75 -222 -167 -52 98 -113 205 -69 -89 -278 329 -78 -121 485 70 -319
$$ packed form
6472C90l83M1J91j26l7J5J94m16l8J44j36M5K67k89R3L2L91m21L7J10M1m44K47
6495e2L06k09j66L83j55j94K82J10l67M7M22m60r2K94j3l32M2L97k66j11L70j58
6517G8n08J39L72k33o6L50j53m0P9J84n80L46K84r8m07M74l10P3K1L8j59n2K55
6540H7J03k55j57L53j00k15J97k8k21L83K1p4l24L75n5k84K75j26n8j1K64k7l18
6563a95L51J9k97j6J77J2l00M51k51k19J68M32l79J3K06Nl63J14L26n36j30P11
6585B99l18k54K40J18M4k18L04Ml01J88J67m74K00K29j39l63N05k04k82K44K25
6606B14n19N7L77J56m17L58j22k21l34P43J09o31M37j34k01mN21k38l51L85km86
6628c03J48L49l80J99K21j59k97N5J15J50k11L18k74k0j89O07m07m3O06m15l89
$$ plain form
6649 -319 -64 252 -1 6 45 -89 -295 214 257 -322 -32 258 5 -11 21 -1 -234 -62 275 -185 42 206
6671 206 118 -100 254 254 131 -249 208 267 43 323 194 -213 -271 223 244 -213 115 97 -261 107 82 -37 -227
6694 -227 356 138 -72 -91 65 -302 -332 287 207 -206 -78 353 -187 -92 -3 39 -357 -82 137 -222 167 244
6716 244 -5 -10 93 -126 -292 -124 226 8 -63 153 54 63 -10 413 -295 -203 128 169 65 33 -21 -254 -109 192
6740 192 39 -168 168 370 -362 -143 277 -26 -208 251 121 -302 214 108 18 -40 205 -123 -154 -82 308
6761 308 5 -142 104 95 -242 122 36 -101 -103 138 -28 -70 147 130 -95 -12 46 -6 32 -74 -36 0 -38 -46 16 -235
6787 -235 382 30 -172 71 289 4 -195 130 256 -298 231 369 -350 -195 206 -38 -106 62 112 -257 -170
6808 -170 291 -133 -45 133 -39 -164 130 163 -282 -164 182 -135 -229 -25 289 -97 154 504 161 -22 -179
$$ packed form
6649c19K55L16k53PL9j34k06N09M3n79K90K90k53j6L2k2k33J72L37m60K27J64
6671B06q8k18L54%j23l80M57N9k24K80j29m07n8M94K1m57L28j8l58L68k5j19j90
6694b27N83k18k10j9J56l67l0O19q0m13J28M31n40R5Q9M2l96K75K19l59L89P7
6716B44k49nJ03k19j66J68L50k18p1K16r9Rp3M23p08R2L31M1j04l2n4k33J45L01
6740A92j53k07L36K02p32K19M20l03j82M59j30m23N16j06r0n8K45l28l1P2L90
6761C08l03j47K46rl37L64q6j37kK41j66m2K17j7k25Q3N8n2L8j06L8L6l8qO2k51
6787b35O17l52k02K43K18k85j99L25J26n54N29J38p19J55M01k44o8J68N0l69Q7
6808a70M61m24Q8J78j72j25K94L3m45J18L46l17r4K04L14l86K51L50l43j83j57
$$ plain form
6829 -179 258 -258 -156 146 116 -229 -10 -265 -87 -354 280 -81 -14 20 -55 -193 -167 66 -14 -112 220 71
6851 71 -179 117 23 -298 25 113 -157 -329 95 193 -240 183 99 -147 -222 144 106 -189 -22 87 -58 -139 240
6874 240 194 -124 69 64 -13 51 59 -148 -75 -69 98 -149 155 173 244 -16 126 187 7 78 425 -209 -156 -15 365
6899 365 -45 -58 90 -142 -278 113 87 -261 246 -48 -146 -102 162 51 -279 -53 140 97 -49 139 -57 -78
6921 -78 157 247 -120 -138 90 -202 -114 25 269 -145 -167 315 -287 -43 345 27 100 -55 56 -121 -165 416
6943 416 27 68 84 121 -138 -378 34 -26 -167 206 141 -408 156 330 -23 -160 258 31 -138 -41 34 -286
6965 -286 48 234 152 -300 214 219 -336 -55 82 145 -295 48 76 -418 51 295 -2 -284 -139 304 -364 -24
6987 -24 374 -121 -40 96 -90 -104 38 178 -145 9 326 -4 -243 275 140 -159 -31 175 -371 -244 242
$$ packed form
6829a79M37n16J02L02l0l45K19k55J78k67O34l61O7L4p5j38K6K33q0r8L32j49
6851G1k50K96r4l21L23Q8k70j72M24R8m33M23q4k46p5L66l8k95J67J09j45q1L79
6874B40m6l18J93np7O4Qk07P3OJ67k47L04J8P1k60J42O1j80P1L47o34N3J41L80
6899C65m10j3J48k32j36L91k6l48N07k94r8M4K64j11l30K26J93m3j46J88j96k1
6921g8K35R0l67j8K28k92Q8J39K44m14k2M82o02K44L88l18P3j55J11j77m4N81
6943D16l89M1J6L7k59k40M12o0j41L73o5n49N64J74l53j37M18k27j69R7P5l20
6965b86L34J86q2m52N14Nn55K81J37O3m40L43K8m94M69K44k97k82J45M43o68L40
6987b4L98m95Q1J36j86j4J42J40l23J54L17l30k39N18j35k99J28K06n46J27M86
$$ plain form
7008 242 214 -245 -39 145 -231 -22 148 -29 -162 154 320 -146 -150 177 73 -78 128 361 26 -83 -109
7029 -109 132 -317 -189 274 -139 -38 256 -78 -243 -106 75 -109 40 57 -126 -303 70 -153 -41 31 96
7050 96 -244 -219 88 245 -469 156 173 -170 -186 115 139 -354 113 81 -5 -243 418 -23 -313 273 29 -271
7072 -271 15 266 -30 -134 340 67 -31 86 251 60 -147 88 245 63 158 86 -221 -153 158 -6 -397
7093 -397 200 59 -247 -183 264 -80 -140 15 45 -134 137 227 189 -197 58 -40 -231 61 211 -35 -214 16
7115 16 -39 -449 35 115 -59 -20 -12 190 -162 13 -74 -147 30 175 -32 -198 45 -67 -373 -17 52 -117 -214
7138 -214 9 -115 -136 12 112 -16 -17 174 -121 -132 71 24 -281 -173 230 69 -25 302 27 -89 -181 58
7160 58 -52 -123 20 -89 -434 144 365 63 -390 168 116 -356 39 109 -366 -175 89 -218 -238 114 127 -266
$$ packed form
7008B42k8m59K06J84l76K09J70j77j33L16J66m66mL27j04j51K06K33l35j09k6
7029a09K41m49J28M63m13J01K94l34j65J37J81j84J49J7j83j77L73k23J12P2O5
7050I6l40K5L07J57p14O25J7l43j6L01K4m93M67l2q6k38O61m41k90N86k44l00
7072b71K86K51k96j04M74k73r8J17J65j91k07K35J57j82R5p2l07O8L11j64l91
7093c97N97j41l06O4M47l44o0J55L0j79K71R0l8l86K55r8j91K92J50k46j79K30
7115A6n5m10M84Q0j74L9QK02l52J75q7p3J77J45k07j66K43j12l06L56O9j69r7
7138b14K23j24k1J48J00j28jJ91k95j1K03m7l05J08M03j61r4L27k75j16r2K39
7160E8j10p1J43j09l45N78K21l02m53N58n2m72L95P0m75J91K64l07k0L52J3l93
$$ plain form
7182 -266 121 93 43 -161 84 140 -254 112 364 -6 -164 226 -86 -297 -223 176 -193 -43 109 -59 -183
7203 -183 207 190 -71 2 184 15 -231 272 292 -212 127 318 4 -127 146 115 -257 67 238 -80 51
7224 51 -22 -43 -37 23 396 -172 -129 -7 -90 -222 222 232 -164 -64 52 -132 -238 64 164 -74 192 353 -198
7247 -198 -237 21 -8 -118 -55 225 -82 -340 67 30 -28 -58 171 -70 4 24 119 -70 41 75 -235 27 48 -174
7271 -174 -234 109 256 -178 -144 254 380 -125 129 -83 -84 -257 209 5 -129 131 118 -425 234 385 -374 44
7293 44 69 -94 -113 -31 513 -114 -15 116 112 -33 305 140 -83 -69 244 -138 -283 146 -148 -164 -14 195 48
7316 48 -136 178 61 -23 -121 146 -38 -220 254 -258 -125 168 258 -389 97 16 -106 30 241 240 -93 69
7338 69 281 -30 341 103 -87 -57 79 133 -184 -11 334 11 -251 49 127 -189 -29 205 74 -282 113
$$ packed form
7182b66L87k8n0k04K45N6l94L66K52l70j58L90l12k11P4L99l69J50J52j68j24
7203a83L90j7k61P3J82j69k46N03K0n04L39J91l14j31K73l1l72L24J71l18J31
7224E1p3k1OO0L73n68M3J22q3j32M44J0l96J00J16j84j06L02J00k38K66J61n51
7247a98l9K58k9j10O3K80l07k58M07l7n8l0K29k41P4K0R5j89J11L4l10K62K1k22
7271a74o0L43J47m34L4L98J26n05K54k12jj73M66k04j34K60j3n43O59J51p59M18
7293D4K5j63j9Q2N44o27R9J31mj45L38j65k23J4L13l82j45M29k94j6J50K09j47
7316D8j84L14j17q4r8K67j84j82M74n12J33K93R0o47M86q1j22J36K11jl33J62
7338F9K12l11L71k38j90L0J36N4l17J73L45l23k62L00P8l16J60K34j31l56L95
$$ plain form
7359 113 -145 69 30 411 -97 -20 154 -30 -250 99 -67 -140 -332 374 64 -15 -41 32 -272 -185 217 194 45
7382 45 -66 393 -92 212 239 -34 -232 244 44 -215 -70 26 214 -71 -49 -94 124 26 127 -173 -116 159
7404 159 127 36 391 49 -66 51 107 -61 -540 61 41 -144 -400 220 -276 -10 198 103 -236 -356 121 -10
7426 -10 -22 104 218 -174 70 171 -55 71 319 -195 -28 -95 135 -262 -187 65 232 -14 377 310 -478 -102
7448 -102 263 -18 -255 364 136 -155 231 132 -116 13 275 319 172 -196 -4 -200 -83 105 -219 -90 -134
7469 -134 16 -49 199 -51 -86 -142 45 -13 210 -67 137 177 -174 161 -85 70 246 29 12 73 -75 -131 -107
7492 -107 46 64 -41 -152 261 111 -181 146 35 -12 15 93 -96 16 137 27 31 -57 203 -286 -81 3 -190
7515 -190 -277 -133 -14 -192 158 121 -108 -162 -21 126 -63 -145 37 109 -226 56 92 -29 -118 265 -9 -144
$$ packed form
7359A13k58K14l9L81n08P7J74j84k20L49j66p3j92P06l10p9k6P3l04Q7M02k3j49
7382D5j11M59m85L04K7k73j98M76k00k59J45R6J88k85K2m5K18r8J01l00N7K75
7404A59l2r1L55l42j15J17N6j68m79O01k0j85k56O20m96K66K08r5l39j20M77j31
7426a0j2J26J14l92K44J01k26J26K48n14J67o7K30l97P5K52J67k46L91o7p88L76
7448a02L65k81k37O19k28k91L86r9k48J29K62M4j47l68J92j96J17J88l24J29m4
7469a34J50o5K48k50l5n6J87n8K23k77K04M0l51L35k46J55J76k17j7O1j48n6K4
7492a07J53J8j05j11M13j50k92L27j11m7K7P8j89J12J21j10Mq8K60m89K05Q4j93
7515a90q7J44J19j78L50l7k29n4J41J47j89q2J82P2l35K82L6j21q9L83k74j35
$$ plain form
7537 -144 189 -18 32 -92 209 -318 5 295 235 -60 -177 249 -154 55 109 -181 -18 71 107 31 -485 284
7559 284 -105 120 313 73 -133 -34 48 -84 158 182 128 19 86 131 -8 75 -41 -71 -366 113 169 -300 -180
7582 -180 117 -99 29 -90 151 -310 -61 86 -125 -68 113 196 -74 -281 169 -5 -46 118 -149 118 79
7603 79 97 -136 -174 90 -107 87 153 77 -32 16 6 -129 -163 -143 113 -210 -128 183 -63 76 -86 -14 7 -79
7627 -79 111 -173 -7 -77 30 -344 278 193 -55 -161 -17 4 -63 157 162 -206 -117 39 -108 -86 109 -114 30
7650 30 -47 106 -105 -414 295 -40 1 -98 142 -80 -49 231 153 -80 169 324 50 -327 85 -141 -249 -110
7672 -110 22 -246 -59 -33 -223 -18 148 55 -2 -166 176 -98 -48 116 57 -128 -225 90 -99 47 -88 -15
7694 -15 -149 143 4 -322 59 199 22 -294 77 -115 -156 -88 321 -286 -358 227 110 -38 -79 89 -198 156
$$ packed form
7537a44L33k07N0j24L01n27L23K90o0k95j17M26m03K09N4k90J63Q9L6p6n16P69
7559B84l89K25J93k40k06R9Q2j32K42K4n4j09O7M5j39Q3j16l0k95M79N6m69J20
7582a80K97k16J28j19K41m61K49J47k11N7J81Q3k70k07M50j74m1J64k67K67l9
7603G9J8k33l8K64j97J94O6p6j09M8j0j35l4K0K56l23Q2L11k46J39j62P2K1q6
7627g9J90k84J66p0J07l74O22q5k48j06J44K1o7K20Nl68Q9J56j47K2J95k23J44
7650C0p7J53k11l09P09l35M1r9K40k22L1K80p8k33K49J55k74l77M12k26j08J39
7672a10J32k68J87K6j90K05J66r3n7j64L42k74N0J64n9j85r7L15j89J46j35P3
7694a5j34K92j39l26L81J40j77l16L71j92m1O8M09o07p2N85j17j48m1J68k87L54
$$ plain form
7716 156 100 109 42 153 200 -124 -136 -25 80 43 85 133 -208 23 286 -191 -60 106 207 -69 161 354 -145
7739 -145 -240 24 -10 -177 184 37 -139 -102 134 106 -97 -13 37 -143 112 40 -9 -70 -76 211 -161 -83 -1 51 -338
7764 -338 87 116 -37 -155 251 34 -60 189 28 60 65 339 53 52 306 102 -122 118 220 -180 -205 -36 -48
7787 -48 -180 138 -71 -84 -167 -262 -213 97 54 -139 -194 -45 304 77 -253 358 -378 100 311 224 -265 144 -1
7810 -1 -101 -295 157 271 -377 42 39 56 -142 52 280 -70 -285 116 -26 -316 143 -155 -214 182 126 13
7832 13 -295 2 -28 -148 4 228 -70 3 127 177 -207 151 116 -65 -144 -162 -11 -97 153 -60 -175 73 171
7855 171 -119 -208 4 326 -271 2 -111 -86 0 70 -167 -135 77 -100 -84 10 82 -284 63 152 70 -345 -73
7878 -73 309 -67 -195 260 232 -56 -48 256 -242 43 19 -124 -147 -410 154 32 -144 305 68 98 36 121 -96
$$ packed form
7716A56n6Ro7J11M7l24j2J11J05l7M2M8l41K31K63m77J31J66J01k76K30J93m99
7739a45r5K64l4j67L61j47j76L7K36k8k03Q4N0j80K55p2m9o1oK87l72P8Q2N2l89
7764c38M25K9j53j18M06k17r4K49j61L2NK74k86jK54k04k24K40J02m00k5J69j2
7787d8j32L18k09j3q3r5M9L10m3j93n5J49L49k27l30O11p36M78K11q7m89M09j45
7810aj00j94M52J14o48M19lJ7j98J94K28l50k15M01j42k90M59k98n9L96n6j13
7832A3l08K97l0j20J52K24k98P3J24N0l84L58l5j81p9j8J51q6K50k13j15K48R8
7855A71k90q9K12L22n97K73j13K5Q6P0k37L2K12j77J6R4P2l66L47Q9q2m15K72
7878g3L82l76j28M55k8k88QL04m98K85k4j43k3k63N64j22j76M49k37L0o2Q5k17
$$ plain form
7901 -96 -53 395 -43 -210 -27 -56 -23 -136 75 200 88 131 192 -196 -28 73 -50 32 249 67 -195 476
7923 476 367 -142 -150 60 -106 -261 127 43 -32 49 0 41 -283 195 27 -63 66 372 -151 -202 -74 -37 -46 -65
7947 -65 -168 -274 -30 135 152 -146 22 132 -37 -22 205 -102 -206 37 -36 148 -68 -101 96 -16 -25 23 -134
7970 -134 -82 145 -120 138 -159 165 -257 172 51 -157 -31 83 57 -148 -95 -101 -13 -266 114 -180 -217 -13
7992 -13 -149 -307 -129 222 -105 -189 33 286 30 -126 -12 -215 -144 -5 50 124 -17 28 -14 -70 -58 218 90
8015 90 -227 91 46 -237 175 -90 -196 128 252 -103 -10 89 -83 -16 0 -252 -170 74 79 -80 -184 188 -169
8038 -169 209 190 240 -13 10 97 -135 -119 -146 -37 -148 133 177 -136 -51 119 -54 -141 -182 23 35 -129 98 154
8062 154 -98 -131 223 -67 120 73 -237 -188 74 -140 85 -28 -178 -5 -11 113 -265 -52 -204 -149 -87 -149 -88
$$ packed form
7901i6M3M48m38j67J83k9L3j13K11J25j12M3O1l88J68J01j23Q2K17j82k62O71
7923D76j09n09qK10j66j55L88q4p5Q1m9M1l24M78j68r0J29L06n23n1J28L7rj9
7947f5j03j06K44J65J7k98J68J10j69J5K27l07j04K43p3J84k16l3J97j12rM8j57
7970a34N2K27k65K58k97L24m22M29j21k08J26J14k6k05N3oQ8k53L80k94l7K04
7992a3j36j58J78L51l27q4K22K53k56j56J14k03P1J39N5P4j41M5m2n6J2K76j28
8015I0l17L18m5k83M12k65j06L24J24l55R3R9j72O7J6k52Q2K44Nj59j04L72l57
8038a69L78j9N0k53K3Q7k32J6k7J09j11K81M4l13Q5J70j73q7m1K05J2j64K27N6
8062A54k52l3L54k90J87m7l10M9K62k14K25j13j50J73oJ24l78K13j52N5O2o2O1
$$ plain form
8085 -88 -204 -55 -131 217 83 -100 91 -68 -200 -21 139 -145 -342 -49 50 -129 -145 10 -53 -141 91 -127
8107 -127 -314 317 25 34 -42 -88 79 -10 170 77 -189 70 193 -309 66 115 80 187 -83 -3 89 -143 20
8130 20 -176 -253 5 51 -5 -302 -69 -168 -87 92 -149 -110 -86 -32 -92 -133 -211 209 -303 -60 -20 -227 -57 34 -128
8155 -128 -36 197 19 -25 10 256 30 -126 -89 -90 69 116 -56 34 -12 -106 -66 -28 230 3 -52 26 -40 -28 -134
8180 -134 -38 -93 -24 -66 40 -14 -145 102 98 -227 -67
$$ packed form
8085h8j16J49p6L48j34j83J91j59j32J79J60k84j97K93R9j79j6J55o3q8K32k18
8107a27j87O31k92Rp6m6J67q9J80r3k66K59J23n02L75M9l5J07k70Q0R2k32J63
8130B0j96p7K58M6n6k97K33r9Q1J79k41L9K4N4o0m1p8M20n12K43M0k07J70R1j62
8155a28R2K33j78m4L5K46k26j56L7jJ59M7j72R0m6r4M0L8K58k27n5P8o6J2j06
8180a34R6n5O9m2J06n4j31K47ml25J60
8191f7
$$ Imaginary data points
##PAGE= N=2
##DATA TABLE= (X++(I..I)), XYDATA
$$ plain form
0 0 0 0 0 0 0 0 0 0 0 16 -16 16 -16 32 -32 48 -48 64 -80 96 -113 144 -164 193 -225 271 -310 357 -416 475
30 475 -545 617 -701 791 -895 1009 -1131 1265 -1411 1577 -1755 1949 -2162 2392 -2645 2922
46 2922 -3221 3555 -3917 4315 -4755 5236 -5776 6372 -7045 7802 -8669 9663 -10825 12199
60 12199 -13855 15896 -18487 21895 -26596 33527 -44781 66160 -121101 556671 970136
71 970136 -378406 -287245 360993 207866 -412663 -270234 -62905 -141651 -237881 -199140 -226778
82 -226778 -113882 -146096 -298924 -62352 396420 193673 -128312 240699 513199 4028
92 4028 -163285 330122 322770 -168439 -45038 277915 23994 -178001 63033 -5653 -301514
103 -301514 -122412 129718 -98752 -259682 -94199 -64018 -113046 -5374 -73546 -216303
$$ packed form
0@%%%%%%%%%J6l2L2l2M8o4Q0r6J12j44J76k09K57l08L57m18M96n81O67p73Q91
30D75j020J162j318J492j686J904k140K396k676K988l332L704m111M554n037N567
46B922o143O776p472Q232r070R991j1012J2148j3417J4847j6471J8332k0488K3024
60A2199k6054K9751l4383M0382m8491O0123p8308J10941j87261O77772M13465
71I70136j348542R1161O48238j53127o20529J42429K07329p8746r6230L8741k7638
82b26778J12896l2214j52828K36572M58772k02747l21985L69011K72500n09171
92D028j67313M93407p352m91209J23401L22953k53921k01995K41034o8686k95861
103c01514J79102K52130k28470j60930J65483L0181m9028J07672o8172j42757
$$ plain form
113 -216303 35138 260935 32522 6015 350603 267123 -63744 157729 387073 -25919
123 -25919 -250349 127551 166453 -245892 -244232 -359 -142379 -293527 -133914 -80752 -122087
134 -122087 25159 52894 -90497 55752 241916 9965 -107358 201096 224957 -86032
144 -86032 14466 266119 25169 -183157 74792 144906 -119298 -91426 79252 -63831
154 -63831 -145843 13066 -64763 -246680 -79430 46998 -156100 -145495 113994 53236 -103770
165 -103770 92548 213221 25423 43849 224729 101942 -27189 133187 110694 -134758
175 -134758 -69756 87342 -111976 -233878 -14203 2004 -202202 -100482 78123 -58189
185 -58189 -107701 92247 72054 -77581 56267 159212 -16011 -22180 159854 72157 -73285
$$ packed form
113b16303K51441K25797k28413k6507L44588q3480l30867K21473K29344m12992
123b5919k24430L77900L8902m12345J660K43873j42020j51148J59613N3162m1335
134a22087J47246K7735j43391J46249J86164k31951j17323L08454K3861l10989
144h6032J00498K51653k40950k08326K57949P0114k64204K7872J70678j43083
154f3831q2012J58909p7829j81917J67250J26428k03098J0605K59489o0758j57006
165a03770J96318J20673j87798J8426J80880j22787j29131J60376k2493k45452
175a34758O5002J57098j99318j21902K19675J6207k04206J01720J78605j36312
185e8189m9512J99948k0193j49635J33848J02945j75223o169J82034q7697j45442
$$ plain form
196 -73285 74323 125859 -67823 -38445 123596 -9567 -130820 35719 41920 -163900 -99776
207 -99776 55893 -91437 -168926 36703 51851 -113876 -9015 140455 9157 -26990 151354
218 151354 118286 -23070 84928 146072 -34712 -50152 87922 -18178 -142794 716
228 716 32110 -146349 -95403 65214 -55774 -144558 46978 85002 -86346 -22122 128894
239 128894 11351 -67922 81562 84703 -45052 31824 112501 -18763 -34134 98057 20494
250 20494 -97131 34465 82092 -98583 -91443 62319 -36057 -160175 -14320 49592 -94787
261 -94787 -59788 85178 5778 -63924 76288 94909 -25873 45521 140126 10378 -38907
272 -38907 87200 34320 -103269 -7554 65443 -83633 -98008 48241 -15436 -133971 -8830
$$ packed form
196g3285J47608N1536j93682K9378J62041j33163j21253J66539O201k05820O4124
207i9776J55669j47330p7489K05629J5148j65727J04861J49470j31298l6147J78344
218A51354l3068j41356J07998O1144j80784j5440J38074j06100j24616J43510
228G16L1394j78459N0946J60617j20988q8784J91536L8024j71348O4224J51016
239A28894j17543p9273J49484L141j29755P6876Q0677j31264j5371J32191p7563
250B0494j17625J31596M7627j80675P140J53762r8376j24118J45855O3912j44379
261i4787L4999J44966p9400o9702J40212J8621j20782P1394R4605j29748m9285
272c8907J26107n2880j37589R5715P2997j49076j4375J46249o3677j18535J25141
$$ plain form
283 -8830 64640 -67119 -49148 89546 16120 -74270 45617 73734 -51820 804 112417
294 112417 8559 -49521 80569 63505 -72392 756 93170 -32082 -73397 51653 5218
305 5218 -120512 -31301 38309 -83491 -78970 58467 5639 -85810 30376 83696 -33998
316 -33998 -4330 116763 42625 -32775 70570 69528 -59882 -14782 72516 -35591 -83995
327 -83995 39328 17454 -107463 -34391 53730 -51453 -73914 53031 26041 -72050 9754
338 9754 63255 -43589 -30710 82762 21866 -51896 56483 80104 -46176 -14062 92585
349 92585 5629 -65009 43373 45801 -79694 -41787 39334 -53505 -89264 24748 8506 -85577
361 -85577 -5667 62134 -39138 -39063 84653 43515 -44976 48045 92174 -28911 -27465 73893
$$ packed form
283h830P3470j31759J7971J38694p3426r0390J19887K8117j25554N2624J11613
294A12417j03858n8080J30090j7064j35897P3148R2414j25252m1315J25050m6435
305E218j25730Q9211O9610j21800M521J37437n2828r1449J16186N3320j17694
316c3998K9668J21093p4138p5400J03345j042j29410M5100Q7298j08107m8404
327h3995J23323k1874j24917P3072Q8121j05183k2461J26945k6990r8091Q1804
338I754N3501j06844J2879J13472o0896p3762J08379K3621j26280L2114J06647
349I2585q6956p0638J08382K428j25495L7907Q1121r2839l5759J14012j6242r4083
361h5577P9910O7801j01272P5J23716m1138q8491R3021M4129j21085J446J01358
$$ plain form
373 73893 8999 -67518 25521 44249 -66174 -36057 48773 -33236 -78556 31382 28399 -74304
385 -74304 -14676 63174 -32455 -62042 49025 31865 -55992 17802 78498 -15380 -21453 75158
397 75158 27031 -49361 34685 63611 -45281 -32127 56179 -16129 -85089 7657 24568 -73616
409 -73616 -35661 50074 -20484 -57671 41488 37569 -48055 12852 78769 -9512 -28610 68080
421 68080 33223 -55988 14732 62404 -35322 -38626 54323 5754 -68279 9889 37825 -55209
433 -55209 -33390 50614 -13870 -64591 27014 32271 -60495 -12777 67555 -6995 -40679 56395
445 56395 45892 -43340 8697 66129 -15914 -31603 52878 14812 -61512 4990 36507 -57026
457 -57026 -45762 46693 -3515 -67383 15840 42748 -47434 -25983 55534 3771 -37636 41473
$$ packed form
373G3893o4894p6517R3039J8728j10423L0117Q4830q2009m5320J09938k983j02703
385g4304N9628P7850r5629k9587J11067j7160q7857P3794O0696r3878o073R6611
397G5158m8127p6392Q4046K8926j08892J3154Q8306p2308o8960R2746J6911r8184
409g3616L7955Q5735p0558l7187R9159l919q5624O0907O5917q8281j9098R6690
421F8080l4857q9211P0720M7672r7726l304R2949m8569p4033P8168K7936r3034
433e5209K1819Q4004o4484n0721R1605N257r2766M7718Q0332p4550l3684R7074
445E6395j0503q9232N2037N7432q2043j5689Q4481l8066p6324O6502L1517r3533
457e7026J1264R2455n0208o3868Q3223K6908r0182K1451Q1517n1763m1407P9109
$$ plain form
469 41473 40413 -40730 309 55917 -19933 -39790 50861 28323 -55648 -81 49691 -35426
481 -35426 -49029 37859 10584 -55659 5994 36296 -43606 -32711 42979 -3366 -47545 33708
493 33708 46622 -38593 -9933 59372 -4981 -43272 39937 38112 -43105 -5345 47281 -26367
505 -26367 -48726 31439 12262 -54471 3260 42538 -36196 -37104 42326 5022 -51268 21760
517 21760 49596 -32192 -19852 52228 1828 -45366 28122 39693 -35501 -7856 48402 -15975
529 -15975 -45413 30401 20067 -50606 -2080 47753 -26127 -43696 33441 12717 -49465 7161
541 7161 45381 -22506 -20457 45846 4798 -43588 24755 42721 -33203 -14057 52615 -2302
553 -2302 -49777 17522 27163 -40800 -12833 40190 -13796 -35752 28319 10717 -48123 5814
$$ packed form
469D1473j060q1143M1039N5608p5850j9857R0651k2538q3971N5567M9772q5117
481c5426j3603Q6888k7275o6243O1653L0302p9902J0895P5690m6345m4179Q1253
493C3708J2914q5215K8660O9305o4353l8291Q3209j825q1217L7760N2626p3648
505b6367k2359Q0165j9177o6733N7731L9278p8734r08P9430l7304n6290P3028
517B1760K7836q1788J2340P2080n0400m7194P3488J1571p5194K7645N6258o4377
529a5975k9438P5814j0334p0673M8526M9833p3880j7569P7137k0724o2182N6626
541G161L8220o7887K049O6303m1048m8386O8343J7966p5924J9146O6672n4917
553b302m7475O7299R641o7963K7967N3023n3986k1956O4071j7602n8840N3937
$$ plain form
565 5814 46548 -23872 -28742 48317 17661 -48248 8451 45503 -23017 -22801 42423 7042 -39884
578 -39884 14718 25409 -38517 -13390 41846 -11325 -40809 27353 21318 -47399 -8372 44206
590 44206 -15723 -33552 38348 21860 -41884 4462 44098 -20044 -25674 41615 14032 -40214
602 -40214 9433 31293 -32217 -21667 36675 -3733 -39841 20437 24000 -42522 -14861 40321
614 40321 -10719 -36027 31860 27551 -36420 -2025 41751 -15168 -29211 36376 19155 -36932
626 -36932 5986 36928 -24719 -28342 31900 6009 -37249 11622 26708 -32770 -17729 32690
638 32690 -11175 -38755 26751 29167 -36573 -7230 45788 -7608 -36419 28114 27510 -30218 -58
651 -58 37105 -14512 -25471 28610 6475 -38466 9329 30853 -31051 -24757 33400 -1620 -42255
$$ packed form
565E814M0734p0420m870P7059l0656o5909N6699L7052o8520K16O5224l5381m6926
578c9884N4602J0691o3926K5127N5236n3171k9484O8162o035o8717L9027N2578
590D4206n9929j7829P1900j6488o3744M6346L9636o4142n630O7289k7583n4246
602d0214M9647K1860o3510J0550N8342m0408l6108O0278L563o6522K7661N5182
614D0321n1040k5308O7887m309o3971L4395M3776n6919j4043O5587j7221n6087
626c6932M2918L0942o1647l623O0242k5891m3258M8871J5086n9478J5041N0419
638C2690m3865k7580O5506K416o5740K9343N3018n3396k8811O4533o04n7728L0160
651e8L7163n1617j0959N4081k2135m4941M7795K1524o1904O294N8157l5020m0635
$$ plain form
664 -42255 14902 31500 -29215 -12827 39622 -3532 -35117 24293 27483 -30676 -3247 41538
676 41538 -8205 -29948 25460 16160 -33635 2008 32242 -20750 -24686 28456 1192 -42412
688 -42412 7816 31019 -27447 -19533 36161 3066 -36136 14028 27374 -25481 -6661 39781
700 39781 -1420 -27593 25348 21096 -34243 -5313 35690 -11722 -29079 23186 10790 -36412
712 -36412 -1804 25571 -22104 -19855 32098 3428 -36492 12358 29608 -27857 -16650 38971
724 38971 6349 -29685 18073 27239 -25815 -9022 32329 -6271 -25983 24325 15325 -35232
736 -35232 -4154 29377 -19403 -28387 26462 10213 -35285 2523 27356 -22778 -19442 33073
748 33073 7551 -28660 17173 30213 -24137 -13203 33904 -18 -28436 19411 22860 -28465
$$ packed form
664d2255N7157J6598o0715J6388N2449m3154l1585N9410L190n8159K7429M4785
676D1538m9743k1743N5408r300m9795L5643L0234n2992l936N3142k7264m3604
688d2412N0228K3203n8466P914N5694l3095l9202N0164J3346n2855J8820M6442
700C9781m1201k6173N2941m252n5339K8930M1003m7412j7357N2265j2396m7202
712c6412L4608K7375m7675K249N1953k8670l9920M8850J7250n7465J1207N5621
724C8971l2622l6034M7758R166n3054J6793M1351l8600j9712N0308r000n0557
736c5232L1078L3531m8780q984N4849j6249m5498L7808K4833n0134L336N2515
748C3073k5522l6211M5833J3040n4350J0934M7107l3922k8418M7847L449n1325
$$ plain form
760 -28465 -9444 27602 -12451 -29032 21052 14140 -30765 -1305 26492 -18878 -23672 25972
772 25972 8625 -28928 11749 30791 -20945 -16696 32434 4556 -29712 15016 29246 -20516
784 -20516 -12391 27106 -4851 -27998 14644 14190 -27984 -3448 26459 -17160 -28152 23148 12256
797 12256 -31355 3357 33464 -13174 -20608 25842 8787 -27004 10443 27166 -18061 -11116
809 -11116 29595 -2330 -31462 13675 21661 -26254 -10754 28472 -6707 -28784 14364 12731
821 12731 -27438 -1206 27891 -12617 -20628 25477 9817 -30236 6032 31354 -13915 -16116
833 -16116 28501 7246 -27998 6817 21373 -20550 -11922 25633 -3556 -27511 13147 14855
845 14855 -27711 -6962 28744 -7320 -23709 20426 14513 -27285 -1039 28029 -10206 -17692
$$ packed form
760b8465J9021L7046m0053j6581N0084o912m4905K9460K7797m5370m794M9644
772B5972j7347l7553M0677J9042n1736M249M9130k7878l4268M4728J4230m9762
784b0516Q125L9497l1957k3147M2642m54m2174K4536K9907m3619j0992N1300j0892
797A2256m3611L4712L0107m6638p434M6450j7055l5791L7447J6723m5227O945
809a1116M0711l1925k9132M5137P986m7915J5500L9226l5179k2077M3148j633
821A2731m0169K6232K9097m0508q011M6105j5660m0053L6268K5322m5269k201
833a6116M4617k1255l5244L4815J4556m1923Q628L7555k9189k3955M0658J708
845A4855m2566K0749L5706l6064j6389M4135n913m1798K6246K9068l8235p486
$$ plain form
857 -17692 24705 10292 -25908 4719 23133 -17767 -14527 25855 2175 -26719 10628 18908
869 18908 -24780 -12282 26507 -3077 -25454 15615 17523 -24201 -5703 25688 -7629 -18953
881 -18953 22506 12985 -24995 2763 25190 -16089 -19152 24336 7943 -26694 5447 21932
893 21932 -19117 -15567 22526 737 -23285 13616 19070 -22352 -7804 25863 -5934 -23698
905 -23698 18550 17726 -23031 -3355 24793 -10007 -20950 18522 10110 -23277 3867 22669 -16323
918 -16323 -17259 21721 3041 -25650 9198 22620 -17631 -12072 23737 -478 -23529 13100 18727
931 18727 -18964 -4491 24241 -7205 -22363 15904 11689 -23637 -277 24207 -12079 -19727
943 -19727 18733 6567 -25065 4671 23816 -13195 -13060 22559 2651 -23598 9572 19898
$$ packed form
857a7692M2397j4413l6200L0627J8414m0900L240M0382k3680k8894L7347Q280
869A8908m3688J2498L8789k9584k2377M1069J908m1724J8498L1391l3317j1324
881a8953M1459r521l7980K7758K2427m1279l063M3488j6393l4637L2141J6485
893B1932m1049L550L8093k1789k4022L6901N454m1422J4548L3667l1797j7764
905b3698M2248q24m0757J9676K8148l4800j0943L9472q412l3387K7144J8802l8992
918a6323r36L8980j8680k8691L4848J3422m0251N559L5809k4215k3051L6629N627
931A8727l7691J4473K8732l1446j5158L8267m215l5326K3360K4484l6286p648
943a9727L8460j2166l1632K9736J9145l7011J35L5619j9908k6249L3170J0326
$$ plain form
955 19898 -17289 -7016 25176 -3189 -23654 13119 14284 -23038 -4708 24380 -7525 -21251
967 -21251 15240 8997 -24455 36 22649 -11094 -14320 21814 6080 -23361 6875 21973
979 21973 -14536 -10224 24822 2740 -22926 8651 16049 -20060 -8884 21922 -4363 -21075
991 -21075 12688 11119 -23518 -4191 22300 -8202 -16952 19290 10496 -22202 1855 22139 -11050
1004 -11050 -13032 22054 6906 -20746 6702 17420 -17145 -10852 21067 -1094 -21940 10499
1016 10499 13716 -22257 -9088 20584 -5867 -19611 15285 13183 -20133 -1342 21239 -8446
1028 -8446 -14240 20622 9766 -19620 5585 20504 -14779 -13902 20141 2855 -22357 6859 16413
1041 16413 -18653 -11916 18171 -3847 -20453 11979 13912 -18761 -3568 21610 -6615 -17402
$$ packed form
955A9898l7187J0273L2192k8365k0465L6773J165l7322J8330K9088l1905j3726
967b1251L6491o243l3452K4491K2613l3743l226L6134j5734k9441L0236J5098
979B1973l6509M312L5046k2082k5666L1577P398l6109J1176L0806k6285j6712
991b1075L3763j569l4637J9327K6491l0502q750L6242q794l2698K4057K0284l3189
1004a1050j982L5086j5148k7652K7448J0718l4565O293L1919k2161k0846L2439
1016A0499L217l5973J3169K9672k6451j3744L4896k102l3316J8791K2581k9685
1028h446n794L4862j0856k9386K5205J4919l5283Q77L4043j7286k5212K9216R554
1041A6413l5066O737L0087k2018j6606L2432J933l2673J5193K5178k8225j0787
$$ plain form
1053 -17402 17682 12701 -17959 2399 22014 -9472 -15030 17515 5925 -20191 4879 17671
1065 17671 -15444 -13499 16854 -1333 -22435 7513 15240 -16815 -7491 19977 -3514 -18925
1077 -18925 13114 14419 -16444 -516 22355 -5358 -15707 15493 8704 -19139 2101 19465
1089 19465 -11682 -14155 16618 1808 -22727 4011 16555 -14772 -10817 18756 114 -19916
1101 -19916 8671 14452 -14935 -3250 21666 -3337 -16052 14675 11267 -18763 -636 21176
1113 21176 -6998 -15750 15047 6548 -21006 287 15926 -11992 -12136 16802 1695 -20342 6097
1126 6097 15124 -14955 -7705 20962 1097 -16773 10971 13912 -15830 -3954 19318 -3867 -14990
1139 -14990 13448 8697 -19490 -1761 17147 -9760 -14541 15342 5852 -19144 2048 15363
$$ packed form
1053a7402L5084m981l0660K0358J9615l1486n558L2545j1590k6116K5070J2792
1065A7671l3115J945L0353j8187k1102K9948P727l2055R324K7468k3491j5411
1077a8925L2039J305l0863J5928K2871k7713j0349L1200o789k7843K1240J7364
1089A9465l1147k473L0773j4810k4535K6738J2544l1327L955K9573j8642k0030
1101a9916K8587N781k9387J1685K4916k5003j2715L0727l408l0030J8127K1812
1113B1176k8174q752L0797q499k7554K1293J5639k7918j44K8938j5107k2037K6439
1126F097R027l0079P250K8667j9865j7870K7744K941k9742J1876K3272k3185j1123
1139a4990K8438m751k8187J7729J8908k6907m781K9883r490k4996K1192J3315
$$ plain form
1151 15363 -12512 -10412 17443 2965 -16581 8405 14725 -14219 -6923 18171 -1362 -15519
1163 -15519 11895 11876 -16804 -3610 17381 -7473 -16058 13579 8524 -18149 -295 16153 -9993
1176 -9993 -13116 14965 4879 -16042 6131 15490 -12789 -8430 17499 -29 -17490 9606 14729
1189 14729 -14673 -6428 16847 -3595 -16416 10587 9843 -15493 -1238 16600 -8383 -14264 13936
1202 13936 6750 -17280 2816 17180 -9694 -11690 14427 3058 -16107 5813 14323 -11678
1214 -11678 -6707 16074 -2205 -17136 8972 12245 -14841 -4430 17289 -3852 -15600 10172
1226 10172 8763 -15030 201 16595 -6653 -11657 13572 4517 -17138 3112 15419 -10112
1238 -10112 -9294 15111 1039 -17360 5197 12491 -13039 -6146 16851 -1519 -15621 9011 10598
$$ packed form
1151A5363k7875K100K7855j4478j9546K4986O320k8944P296K5094j9533j4157
1163a5519K7414j9k8680J3194K0991k4854q585K9637n055k6673J7854J6448k6146
1176i993l123K8081j0086k0921K2173R359k8279M359K5929j7528j7461K7096N123
1189A4729k9402Q245K3275k0442j2821K7003p44k5336J4255J7838k4983n881K8200
1202A3936p186k4030K0096J4364k6874j996K6117j1369j9165K1920Q510k6001
1214a1678M971K2781j8279j4931K6108L273k7086J0411K1719k1141j1748K5772
1226A0172j409k3793J5231J6394k3248n004K5229r055k1655K0250J2307k5531
1238a0112Q18K4405j4072j8399K2557P294k5530O893K2997j8370j4102K4632J587
$$ plain form
1251 10598 -14589 -2619 16981 -3915 -12519 11706 6649 -16109 742 15266 -8320 -10697
1263 -10697 14461 3623 -17090 2596 12867 -11338 -8649 14922 848 -14686 7264 11187
1275 11187 -13510 -4474 16936 -1502 -13642 10621 10226 -14399 -2819 14660 -5163 -11453 11718
1288 11718 5490 -15314 1235 12554 -10791 -10176 14705 2922 -15506 4506 13025 -11052 -7906
1301 -7906 14385 1128 -12878 8577 10907 -12405 -3362 14895 -3906 -12773 11069 8761 -14447
1314 -14447 -1620 13329 -8159 -12167 11011 4098 -14438 2897 13123 -10225 -9199 14106
1326 14106 2016 -14075 7115 13734 -10282 -5637 14398 -1065 -13138 8694 9570 -12661 -2605
1339 -2605 13668 -6040 -13525 10094 6312 -14458 233 13437 -7772 -10605 11611 2913 -14259
$$ packed form
1251A0598k5187J1970J9600k0896q604K4225n057k2758J6851J4524k3586k377
1263a0697K5158j0838k0713J9686J0271k4205K689K3571j4074j5534K1950L923
1275A1187k4697R036K1410j8438j2140K4263l95k4625J1580J7479j9823o290K3171
1288A1718o228k0804J6549J1319k3345O15K4881j1783j8428K0012Q519k4077L146
1301g906K2291j3257j4006K1455K330k3312R043J8257j8801q867K3842k308k3208
1314a4447J2827J4949k1488m008K3178o913j8536J7335J0226k3348J026K3305
1326A4106j2090j6091K1190O619k4016M645K0035j5463j2073K1832Q76k2231J0056
1339b605J6273j9708p485K3619l782k0770J4691J3204k1209k833K2216q698j7172
$$ plain form
1352 -14259 4667 13738 -8912 -6897 14414 1449 -13700 6264 12101 -10070 -4008 13399 -2898
1365 -2898 -13075 7563 6745 -13462 -1549 13789 -5950 -12439 10028 5304 -14091 899 13506
1378 13506 -6148 -8071 12502 2819 -13131 4542 11881 -9085 -5507 14024 244 -13338 5688
1391 5688 9049 -11693 -4193 12831 -3136 -11726 8059 5389 -13893 -1291 12962 -5727 -9463
1404 -9463 11700 5111 -13425 1901 12603 -7039 -6854 12785 2613 -12476 4549 9962 -10634
1417 -10634 -5510 12968 -1229 -12212 6871 7691 -12436 -3691 12216 -4059 -10532 9944 6417
1430 6417 -12604 -164 12478 -6169 -8624 11621 4896 -11538 2598 10659 -8193 -6692 11630
1443 11630 855 -11596 5722 9154 -11304 -5628 11582 -1921 -11576 7375 8029 -10951 -2183
$$ packed form
1352a4259J8926R071k2650K015K1311j2965j5149J9964N837k2171O062J7407j6297
1365b898j0177K0638q18k0207J1913J5338j9739o489K2467m724j9395J4990J2607
1378A3506j9654j923K0573r683j5950J7673P339k0966L578J9531j3780j3582J9026
1391E688L361k0742P500J7024j5967q590J9785k670j9282J2602J4253j8689l736
1404i463K1163o589j8536J5326J0702j9642J85J9639j0172j5089J7025N413k0596
1417a0634N124J8478j4197j0983J9083Q20k0127Q745J5907j6275o473K0476l527
1430F417j9021J2440J2642j8647k455K0245o725j6434J4136Q061j8852J501J8322
1443A1630j0775j2451J7318L432k0458N676J7210j3503r655J8951O54j8980Q768
$$ plain form
1456 -2183 11333 -4762 -9673 10049 6004 -11383 1573 12033 -6985 -8772 10374 3337 -11550
1469 -11550 3437 10283 -8377 -6370 10833 -883 -11569 6354 8926 -10521 -3551 11869 -3194
1482 -3194 -11324 7470 7051 -10616 -742 11648 -4635 -9204 8955 4401 -11206 2600 11284
1495 11284 -6906 -7182 10419 1249 -11823 4080 9932 -8378 -4853 11314 -979 -11446 5749
1508 5749 7607 -10020 -2592 11470 -3126 -10184 7600 5326 -10919 -36 11351 -4894 -7813
1521 -7813 9537 3329 -11271 2209 10218 -6601 -6136 10362 1034 -11129 3850 7647 -9028
1534 -9028 -3835 11079 -1418 -10576 6196 6239 -10628 -2205 11162 -3301 -8580 8427 4716 -10697
1548 -10697 434 10374 -5566 -6435 10412 2851 -11034 2969 9050 -8000 -5378 10710 501
$$ packed form
1456b183J3516j6095m911J9722m045j7387J2956J0460j9018j787J9146p037j4887
1469a1550J4987O846j8660K007J7203j1716j0686J7923K572j9447O970J5420j5063
1482c194q130J8794m19j7667R874J2390j6283m569J8159m554j5607J3806Q684
1495A1284j8190k76J7601r170j3072J5903N852j8310L525J6167j2293j0467J7195
1508E749J858j7627P428J4062j4596p058J7784k274j6245J0883J1387j6245k919
1521g813J7350o208j4600J3480Q009j6819M65J6498r328j2163J4979L797j6675
1534i028N193J4914j2497r158J6772M3j6867Q423J3367j4463n279J7007l711j5413
1548a0697J1131R940j5940q69J6847p561j3885J4003O081j7050K622J6088j0209
$$ plain form
1561 501 -10461 4334 7203 -9656 -3809 10106 -2062 -9405 7175 5699 -10159 -1227 10418
1574 10418 -4121 -7827 9055 4715 -9530 1200 9746 -6228 -6781 9362 2247 -9988 3535
1587 3535 8106 -8371 -5575 9317 -974 -10123 5615 7251 -9172 -2937 9862 -2883 -8906
1600 -8906 7255 6107 -9073 90 10033 -4535 -7281 8479 3735 -9603 2331 9073 -6917
1613 -6917 -6422 8683 346 -10288 3559 8111 -7877 -4386 9297 -1470 -9392 5747 6375 -8581
1627 -8581 -1257 10338 -3103 -8242 7504 4826 -9054 1065 10069 -4801 -6958 8028 2154
1640 2154 -9950 2101 8437 -6518 -5163 8723 -270 -9825 3952 6953 -7828 -2648 9714
1653 9714 -1566 -8657 5870 5797 -8303 -554 9974 -2921 -7077 7282 3435 -9497 1312
$$ packed form
1561E01j0962J4795K869j6859N847J3915j2168p343J6580j476j5858Q932J1645
1574A0418j4539l706J6882m340j4245J0730Q546j5974n53J6143p115j2235J3523
1587C535M571j6477K796J4892j0291r149J5738J636j6423O235J2799j2745o023
1600h906J6161j148j5180R163R943j4568k746J5760m744j3338J1934O742j5990
1613f917M95J5105q337j0634J3847M552j5988L491J3683j0767p922J5139O28j4956
1627h581P324J1595j3441n139J5746k678j3880J0119R004j4870k157J4986n874
1640B154j2104J2051O336j4955J355J3886q993r555J3777L001j4781N180J2362
1653I714j1280p091J4527p3j4100P749J0528j2895m156J4359l847j2932J0809
$$ plain form
1666 1312 8819 -5377 -6001 8210 1483 -10057 1898 7244 -6683 -4595 8909 -88 -8777 4315
1680 4315 6118 -7800 -1880 9719 -1493 -7402 6957 5114 -9033 -857 9040 -3588 -6783
1693 -6783 7451 2838 -9101 784 7426 -6178 -5343 8257 1181 -9031 3247 6845 -7572
1706 -7572 -3814 9064 -561 -7747 5482 5728 -7731 -1740 8860 -2548 -6876 7121 4397 -8643
1720 -8643 -50 8057 -4621 -6516 7197 2331 -8550 1624 7160 -6278 -5270 7842 577
1733 577 -8190 4116 7033 -6688 -3079 8348 -1117 -7581 5756 5518 -7530 -1034 8494 -3568
1747 -3568 -7410 6508 3777 -8278 489 7711 -5017 -5951 6762 1397 -8217 2708 7227 -6361
1761 -6361 -4014 8211 -136 -8454 4096 6599 -6545 -1777 8275 -1811 -7441 5332 4275
$$ packed form
1666A312P507j4196o24J4211o727j1540J1955N346j3927K088J3504q997q689J3092
1680D315J803j3918N920J1599j1212n909J4359j843j4147Q176R897j2628l195
1693f783J4234m613j1939R885O642j3604Q35J3600p076j0212J2278L598j4417
1706g572L758J2878r625p186J3229K46j3459N991J0600j1408m328J3997k724j3040
1720h643Q593Q107j2678j895J3713m866j0881J0174N536j3438J008J3112p265
1733E77q767J2306K917j3721L609J1427r465o464J3337k38j3048O496R528j2062
1747c568l842J3918k731j2055Q767P222j2728r34J2713n365r614J0925M519j3588
1761f361K347J2225q347q318J2550K503j3144M768J0052j0086n630J2773j057
$$ plain form
1774 4275 -7671 96 8430 -3714 -6630 6392 2485 -8508 990 7614 -4744 -5010 7133 705
1788 705 -8304 3073 6437 -5881 -2768 8206 -404 -7602 4669 5718 -6766 -1312 8577 -1847
1802 -1847 -6548 5197 3236 -8071 -96 7735 -3921 -5736 6510 2037 -8369 1269 6745 -5168
1816 -5168 -3989 7901 857 -7627 3648 6232 -6339 -2604 8240 -419 -6839 4741 4536 -7214
1830 -7214 -1599 7303 -2491 -5929 5874 2958 -7955 80 6786 -4428 -5498 6994 2386 -7732
1844 -7732 1898 6100 -5366 -3693 7593 470 -6626 4227 5707 -6848 -2376 7852 -1464 -6440
1858 -6440 4950 4643 -7057 -950 6873 -3546 -5671 5931 2896 -7469 941 6688 -5169 -5036
1872 -5036 6782 1818 -6660 2665 6607 -4878 -3387 7244 -353 -6756 4291 5285 -6261 -1792
$$ packed form
1774D275j1946P767Q334j2144k916J3022l907j0993R498O624j2358k66J2143o428
1788G05r009J1377L364j2318L113J0974q610p198J2271J049j2484N454R889j0424
1802a847m701J1745j961j1307P975P831j1656j815J2246m473j0406R638N476j1913
1816e168J179J1890p044q484J1275K584j2571L735J0844q659o420J1580k05j1750
1830g214N615Q902r794l438J1803k916j0913Q035O706j1214j070J2492m608j0118
1844g732R630M202j1466J673J1286p123p096J0853J480j2555M472J0228r316m976
1858f440J1390l07j1700O107P823j0419k125J1602l035j0365Q410N747j1857J33
1872e036J1818m964q478R325L942j1485J491J0631p597o403J1047R94j1546M469
$$ plain form
1886 -1792 6850 -2477 -6765 4471 3765 -6642 -220 6729 -3781 -5784 5860 2318 -7079 1692
1900 1692 7169 -4233 -4083 6548 849 -6963 2892 6103 -5185 -2301 7160 -1134 -7000 4101
1914 4101 4497 -6586 -1481 7033 -2398 -6582 4570 2780 -7063 466 6779 -3556 -4733 6229
1928 6229 1405 -7308 2230 6959 -4299 -3448 6906 429 -7112 2861 4844 -5515 -1850 6885
1942 6885 -1559 -6141 4510 3623 -6969 -970 7159 -2558 -5520 5292 2741 -7093 580 6451
1956 6451 -3518 -3766 6427 1466 -7092 2285 5906 -4755 -3024 6831 211 -6408 3290 4381 -6083
1971 -6083 -1946 6367 -1589 -5766 4619 3165 -6727 -620 6491 -3054 -4782 5838 2571 -6320
1985 -6320 911 6318 -4076 -3742 6885 1132 -6196 2649 5433 -5431 -3360 6173 -396 -5879
$$ packed form
1886a792Q642r327m288J1236p06j0407O422O949j0510k003J1644l542r397Q771
1900A692N477j1402J50J0631n699p812R855L211j1288K884R461q294n866J1101
1914D101L96j1083N105Q514r431m184J1152j790r843P529O313j0335j177J0962
1928F229m824q713R538M729j1258Q51J0354o477p541R973J983j0359L665Q735
1942F885q444m582J0651q87j0592N999Q129r717k962J0812k551r834P673N871
1956F451r969k48J0193m961q558R377L621j0661J731R855o620o619R698J091j0464
1971f083M137Q313p956m177J0385j454r892O107P111r545j728J0620l267q891
1985f320P231N407j0394L34J0627n753p328Q845K784j0864K071R533o569n483
$$ plain form
1999 -5879 3749 4162 -6083 -1725 6203 -2289 -5796 4996 3298 -6248 97 6103 -3040 -4492 5534
2014 5534 2058 -5740 1944 5689 -4559 -3541 6218 42 -6214 3066 5259 -5216 -2533 6115
2028 6115 -1202 -5994 3847 3819 -5713 -626 6210 -2543 -5156 4876 2843 -6035 658 6404 -3036
2043 -3036 -4323 5255 1542 -6028 2183 5669 -4041 -3054 5804 -427 -6650 3012 4471 -5387 -2084
2058 -2084 6230 -1313 -5907 3821 3284 -5725 -151 6436 -2235 -4561 5223 2096 -6274 1028 5965
2073 5965 -3322 -3429 5793 917 -6377 2049 5001 -4983 -2543 6031 -549 -6043 2814 3786 -5714
2088 -5714 -1628 5933 -1230 -4729 4288 2901 -5888 -83 6237 -2554 -3950 5758 2204 -5976 1050
2103 1050 5275 -4004 -3346 5654 663 -6129 1973 4052 -5271 -2435 6031 -655 -5424 3331 3842
$$ packed form
1999e879R628M13j0245M358P928q492l507J0792j698r546O345O006r143j452J0026
2014E534l476p798P684L745j0248J018R759o176o256R280K193j0475K683Q648
2028F115p317m792R841k8r532N087O836q753k613J0032k033q878O693N746r440
2043c036j287R578l713p570Q211L486r710R87Q858o231o223R662J459r858L303
2058b084Q314p543m594R728n37r009N574O587q671k326R784l127q370P302M937
2073E965r287j07R222m876p294Q426K952r984K440Q574o580n494Q857R72r500
2088e714M086P561p163l499R017j387q789N805O320q791j396R708l554q180P026
2103A050M225r279O58R000m991o792Q102K079r323K836Q466o686m769Q755N11
$$ plain form
2118 3842 -5473 -1408 5783 -1763 -4755 4843 2958 -5455 455 5772 -3388 -3983 5282 1627 -5643
2133 -5643 1376 4946 -4669 -3335 5314 487 -5728 2774 4327 -5008 -2339 5543 -1130 -5286 4121
2148 4121 3498 -5157 -380 5748 -2189 -4465 4851 2545 -5522 822 5229 -3539 -3806 5045 916
2163 916 -5815 1823 4706 -4350 -2703 5415 -468 -5540 3141 4236 -4747 -1297 5795 -1212 -4781
2178 -4781 3853 3430 -4927 143 5639 -2528 -4191 4424 1476 -5636 1020 5294 -3496 -3709 5113
2193 5113 345 -5707 1760 4607 -4060 -2015 5541 -737 -5212 3314 3614 -4694 -682 6045 -1539
2208 -1539 -4586 4197 2526 -5515 293 5565 -2221 -3724 4682 1262 -5854 1030 4573 -3991 -2611
2223 -2611 5087 73 -5471 2315 3899 -4574 -1697 5592 -342 -4752 3424 3165 -5005 -666 5361
$$ packed form
2118C842r315M065P191p546k992R598j885q413N910N317r160n95R265l655p270
2133e643P019L570r615J334Q649m827o215Q502J553r335K669P882o673m156R407
2148D121o23q655M777O128p937k276R316k306q067O344M407q768k67Q851m129
2163I16o731P638K883r056J647Q118n883n072Q681J095q983L450P092p007l569
2178d781Q634m23q357N070N496q167j663Q615k948p112O656M274q790k13Q822
2193E113m768o052P467K847q667K045P556o278m475Q526L00q308M012O727p584
2208a539l047Q783j671q041N808N272p786j503Q406l420p116O884L543q564J380
2223b611P698n014n544P786J584q473K877P289n934m410Q176k59q170M339O027
$$ plain form
2238 5361 -1831 -3915 4360 1842 -5556 295 4638 -3022 -3349 4754 1307 -5552 1197 4134 -4026
2253 -4026 -2713 5031 34 -4671 2795 3669 -4725 -1541 5411 -1259 -4464 3806 3174 -4741 -521
2268 -521 5268 -2399 -4097 4162 1968 -5248 806 4710 -3617 -3056 4738 685 -4900 1912 4433
2283 4433 -4234 -2322 4988 -203 -4878 3098 3814 -4373 -1018 5106 -1474 -4375 3743 2733 -4790
2298 -4790 91 4749 -2708 -3920 4104 1301 -5146 1212 4444 -3662 -3120 4530 184 -4927 2232
2313 2232 4057 -3613 -1475 5093 -740 -4583 3090 3252 -4485 -487 5034 -1692 -4184 3502 2109
2328 2109 -4848 228 4789 -3001 -3314 4183 796 -5144 1312 4327 -3345 -2654 4697 167 -4859
2343 -4859 2368 3529 -3986 -1477 5048 -911 -4224 3144 2726 -4780 -288 4954 -1688 -3984 3683
$$ packed form
2238E361p192k084Q275k518p398N851M343p660l27Q103l447o859O749K937q160
2253d026J313P744m997m705P466Q74q394L184O952o670l205Q270o32p915M220
2268e21N789p667j698Q259k194p216O054L904q327N61P794m053n585O812K521
2283D433q667J912P310n191m675P976P16q187L355O124o580k901Q118j010p523
2298d790M881M658p457j212Q024k803o447O358L232q106N42P650m346n111P159
2313B232J825p670K138O568n833l843P673J62p737L998N521o726k492P686j393
2328B109o957N076M561p790l13P497l387n940O456L015p672O91P351m530n026
2343d859P227J161p515K509O525n959l313P368m18p506M492N242o642k296P667
$$ plain form
2358 3683 1564 -5027 604 4563 -2772 -2934 4538 707 -4876 1751 4180 -3416 -1866 4922 -62
2373 -62 -4424 2592 3169 -4203 -1110 4768 -1433 -4069 3821 2208 -5012 -435 4255 -2154 -3406 3865
2389 3865 1532 -4907 799 4017 -3215 -2529 4637 800 -4387 1975 3609 -3525 -1908 4846 -285
2404 -285 -4310 2650 2874 -4206 -554 4604 -1822 -4102 3352 1955 -4773 162 4343 -2547 -3333 3833
2420 3833 1272 -4277 1152 3881 -3196 -2081 4315 206 -4148 2453 3820 -3763 -1536 4285 -874
2435 -874 -4002 2799 2576 -4096 -318 4099 -2015 -3784 3625 1785 -4250 701 4321 -2423 -2647 3775
2451 3775 548 -4227 1494 3866 -3274 -1695 4294 -196 -4246 2210 3339 -3808 -1017 4356 -1183
2466 -1183 -4301 2734 2099 -4192 -119 4224 -1763 -3299 3454 1448 -4308 766 4044 -2317 -2236 4042
$$ packed form
2358C683k119o591N631L959p335j62P472l831n583O627K429p596J550O788m984
2373f2m362P016N77p372L093N878o201k636P890j613p220M577M690o409j252P271
2389C865k333o439N706L218p232O86P166l837n187O362J634p134J617O754n131
2404b85m025O960K24p080L652N158o426k280P454j397o728M935M181o890p86P166
2420C833k561n549N429K729p077J115O396m109m354O601J367p583K227N821n159
2435h74l128O801k23o672L778M417o114j769P409j840o035M951L620o744k24O422
2451C775l227m775N721K372p140J579N989m490m050O456J129p147K791N373n539
2466a183l118P035o35o291M073M343n987j536O753k006n756N074L278o361Q1O278
$$ plain form
2482 4042 520 -4143 1663 3433 -3249 -1786 4234 -398 -4433 2048 2540 -3895 -1155 4217 -1136
2497 -1136 -3596 2720 1783 -4060 22 3969 -2175 -2758 3469 1380 -4092 913 3919 -2606 -2103 3856
2513 3856 599 -3954 1720 2869 -3579 -1452 4128 -393 -3999 2488 2314 -3841 -641 3837 -1542
2528 -1542 -3401 3319 1618 -3747 363 3818 -2216 -2313 3799 934 -3770 1297 3257 -2879 -2239 3886
2544 3886 -51 -4155 2009 2716 -3546 -1485 3607 -951 -3545 2660 2333 -3647 -572 3651 -1568
2559 -1568 -2811 3261 1425 -3652 836 3778 -2427 -2540 3407 580 -3633 1516 3115 -2704 -1557
2574 -1557 3384 -497 -3544 1984 2454 -3649 -735 3520 -1360 -3583 2339 1851 -3179 297 3734
2589 3734 -1725 -2645 3115 997 -3380 1062 3168 -2457 -1803 3107 145 -3581 1532 2893 -2935
$$ packed form
2482D042l522m663N806J770o682J463O020m632m035O481M92o435K740N372n353
2497a136k460O316r37n843M082L947o144n83O227k089n472N005L006o525N03N959
2513C856l257m553N674J149o448K127N580m521l606O487j74o155L200M478n379
2528a542j859O720j701n365M110L455o034r7O112k865m704N067J960o136O40O125
2544C886l937m104O164P07o262K061N092m558k594O205l27n980L075M223n219
2559a568j243O072j836n077M488K942o205j13N947k827m213N149J599n819J147
2574a557M941l881l047N528M70o103K914M255m880k223N922m88n030L476L437
2589C734n459r20N760k118m377M442K106n625O54M910k962l726N113J361n828
$$ plain form
2604 -2935 -1150 3437 -709 -3530 2080 2029 -3413 -307 3886 -1074 -2936 2881 1429 -3647 507
2619 507 3576 -1695 -2239 3337 622 -3387 1029 2829 -2636 -1599 3322 132 -3702 1608 2294 -2886
2635 -2886 -1017 3574 -788 -3078 2504 1648 -3482 -39 3670 -1435 -2670 2844 1331 -3340 507
2650 507 3184 -2080 -1903 3375 434 -3338 1193 2617 -2734 -1556 3404 -440 -3185 1509 2047 -2914
2666 -2914 -878 3278 -580 -2345 2691 1663 -3236 74 3488 -1605 -2446 3061 1141 -3192 451
2681 451 2561 -2248 -1808 3126 426 -3316 1275 2456 -2778 -1395 3048 -614 -2915 2086 1998 -2951
2697 -2951 -351 3411 -1268 -2460 2645 1374 -2964 525 3022 -1968 -2030 2408 805 -2888 906
2712 906 2864 -2550 -1673 2724 -331 -3029 1398 2298 -2646 -1003 3059 -898 -2763 2274 1790 -2833
$$ packed form
2604b935J785M587m146k821N610n1n442L106M193m960j862N817j452n076M154
2619E07L069n271n44N576k715m009M416J800n465J037M921l190l834N310O86n180
2635b886J869M591m362k290N582q56n130L443L709n105j235N514j513m671L847
2650E07K677n264J77N278k941l772M531J424n351J178M960l844k745M694N38m961
2666b914K036M156l858j765N036j028m899L310L414n093q41N507j920m333L643
2681D51K110m809M40M934k700l742M591J181n234J383M443l662k301N001q8m949
2697b951K600L762m679j192N105j271m338L489K497m990o2M438j603l693L794
2712I06J958n414Q77M397l055k698M427R00m944J643M062l957j865N037m84m623
$$ plain form
2728 -2833 -143 3145 -1211 -2346 2523 958 -2803 596 3127 -1802 -1901 2436 225 -3268 902
2743 902 2398 -2452 -1074 2937 -303 -3249 1443 2119 -2315 -528 3052 -800 -2691 2275 1466 -2859
2759 -2859 322 2883 -1516 -2098 2637 652 -3022 494 2688 -1819 -1427 2917 131 -2960 996
2774 996 2035 -2386 -1089 3044 -154 -2569 1655 1703 -2529 -347 3195 -580 -2317 2331 1237 -3062
2790 -3062 82 2592 -1479 -1645 2647 712 -3024 575 2426 -1941 -1388 2799 -71 -2760 1502
2805 1502 1786 -2216 -684 2815 -471 -2434 2020 1802 -2730 -244 2596 -1093 -2020 2133 1043 -2937
2821 -2937 246 2470 -1703 -1996 2358 472 -2676 803 2057 -2087 -1442 2886 -169 -2435 1536
2836 1536 2065 -2280 -577 2767 -720 -2095 1813 1375 -2410 -71 2571 -1374 -1890 1839 809 -2298
$$ packed form
2728b833K690L288m356j135M869j565l761L399K531m929r9M337k211l493M170
2743I02J496m850J378M011l240k946M692O76m434J787L580l852j891M966q09m325
2759b859L181K561m399n82M735j985l674L516K194m507L92M344k786l091L956
2774I96J039m421J297M133l198k415M224M8m232K182L542l775j737M648j094m299
2790c062L144K510m071j66M292j935l736L599J851m367N53M187k870k689M262
2805A502K84m002J532L499l286j963M454k18m532K486K840l689r27M153j090l980
2821b937L183K224m173k93M354j886l148L479J254m144O45M328l055k266L971
2836A536N29m345J703L344l487j375L908m38l785K339K642l945n16L729j030l107
$$ plain form
2852 -2298 518 2386 -1785 -1373 2142 173 -2473 974 1908 -2091 -904 2619 -202 -2340 1515
2867 1515 1722 -2001 -354 2396 -827 -2041 1731 1178 -2318 286 2295 -1237 -1670 1910 589 -2654
2883 -2654 661 2041 -1897 -1097 2126 203 -2656 1105 1927 -1593 -407 2679 -284 -2224 1679
2898 1679 1447 -2155 -409 2198 -830 -1935 1805 752 -2565 405 2175 -1412 -1555 2188 355
2913 355 -2590 689 2233 -1746 -1101 2549 -114 -2074 1250 1623 -2210 -361 2281 -336 -2001 1695
2929 1695 1121 -1953 99 2031 -1057 -1792 1765 627 -2404 238 1962 -1418 -1084 1915 653 -2015
2945 -2015 1020 1796 -1696 -810 2091 -100 -1790 1460 1220 -2158 -424 2107 -454 -1836 1782 979
2961 979 -2112 -202 1763 -1257 -1405 1737 467 -1952 709 1804 -1888 -1044 1900 256 -2007 942
$$ packed form
2852b298K816J868m171M12L515j969k646L447R34l999J187L523k821k138L855
2867A515K07l723J647K750l223j214L772n53l496K604K009l532m33L580j321l243
2883b654L315J380l938Q00L223j923k859L761Q22l520J186L086k963j940L903
2898A679k32l602J746K607l028j105L740j053l317K970J770l587j43L743j833
2913C55k945L279J544l979O45L650k663j960L324L73l833J849K642k617j665L696
2929A695n74l074K052J932l088p35L557j138l031K642J724l380L34K999j262k668
2945b015L035P76l492Q86K901k191j690L250k40l378J734K531k561j382L618q03
2961I79l091J910J965l020j48L142j270k419K661J095l692Q44K944j644k263K949
$$ plain form
2977 942 1617 -1833 -581 2154 -442 -1664 1122 1222 -1847 -238 1724 -795 -1759 1707 859 -2024
2993 -2024 148 1978 -1179 -1407 1891 283 -1695 829 1663 -1462 -793 1847 12 -1931 996 1412
3009 1412 -1733 -346 1853 -494 -1909 1229 988 -2117 -62 1968 -934 -1578 1558 549 -1864
3024 -1864 183 1649 -1361 -1013 2206 255 -1779 656 1375 -1447 -692 1799 -372 -1750 1076 1410
3040 1410 -1622 -245 1895 -804 -1626 1098 841 -1870 238 1782 -893 -1551 1664 669 -2119 640
3056 640 1667 -1090 -657 2167 78 -1658 793 1643 -1492 -515 1812 -254 -1775 1119 936 -1609
3072 -1609 -42 1710 -729 -1448 1524 575 -1882 101 1776 -1139 -1055 1647 341 -1608 860 1697
3088 1697 -1229 -931 2006 39 -1634 1031 1188 -1597 -672 1629 -609 -1621 1329 819 -1881 -20
$$ packed form
2977I42O75l450J252K735k596j222K786J00l069J609J962k519r64L466q48k883
2993b024K172J830l157k28L298j608j978K524Q34l125O69K640j835j943K927M16
3009A412l145J387K199k347j415L138k41l105K055K030k902o44L136j009k413
3024a864K047J466l010L48L219j951k034K435P19k822P55K491k171j378K826L34
3040A410l032J377K140k699q22K724k57k711K108J544k675o58L215r95k788K759
3056F40J027k757M33K824k089j736K451Q50l135R77K327k066j521K894j83k545
3072a609J567J752k439p19K972r49k457J983J675k915Q4K702j306j949K468Q37
3088A697k926K98K937j967j673K665J57k785R25K301k238j012K950n10k700J861
$$ plain form
3104 -20 1800 -647 -1077 1397 527 -1488 239 1717 -1107 -983 1766 276 -1805 801 1418 -1125
3120 -1125 -736 1709 -361 -1631 954 1027 -1541 -316 1732 -571 -1390 1240 857 -1728 -83 1523
3136 1523 -1105 -1068 1323 519 -1474 526 1462 -1322 -871 1388 -15 -1545 830 1093 -1481 -515 1508
3153 1508 -687 -1784 1149 975 -1514 -192 1706 -697 -1461 1418 830 -1297 494 1486 -955 -901
3169 -901 1482 460 -1826 536 1475 -1227 -911 1515 48 -1751 789 1051 -1485 -782 1521 -472
3185 -472 -1434 1001 953 -1492 -151 1427 -734 -1075 1032 469 -1674 181 1270 -995 -841 1468 148
3202 148 -1866 413 1242 -1295 -707 1669 -126 -1514 861 747 -1421 -628 1629 -550 -1178 1081
3218 1081 873 -1577 -60 1316 -435 -1151 1372 629 -1533 204 1365 -773 -654 1435 31 -1269
$$ packed form
3104b0J820k447m30K474q70k015J727J478k824J24K749j490k081K606O17k543
3120a125L89K445k070j270K585P3k568J225K048k303q19K630l83k585J645J606
3136A523k628L7K391q04j993K000R36k784M51K259j403j530K375K63k574R66K023
3153A508k195j097K933j74k489J322J898k403p64K879n88k127J791R92k441N4
3169i01K383j022k286K362R39k702L16K426j467j799K540K62k536P03K303j993
3185d72r62K435m8k445J341J578k161l41K107n63k143J855J089k265J54K309j320
3202A48k014K279Q29k537N88K376j795j388K375j14k168P93K257k179o28K259
3218A081k08k450J517J376j751p16K523p43k162J737J161k138J19K089j404j300
$$ plain form
3234 -1269 854 1219 -1320 -558 1106 -374 -1391 920 958 -1385 -143 1308 -499 -1038 1103 608
3250 608 -1267 59 1169 -859 -846 1202 312 -1532 579 1314 -1132 -664 1383 -64 -1456 590
3266 590 773 -1115 -575 1448 -151 -1393 1177 826 -1490 -57 1428 -501 -1071 1074 526 -1431
3282 -1431 219 1340 -968 -1055 1422 67 -1461 587 950 -1175 -636 1270 -209 -1374 739 967
3298 967 -1334 -237 1461 -440 -1025 1095 573 -1214 73 1436 -749 -1006 1286 360 -1368 387
3314 387 1100 -819 -739 1291 35 -1576 564 932 -801 -442 1438 -75 -1091 762 926 -979 -64
3331 -64 1437 -429 -1048 1040 665 -1217 14 1369 -749 -852 1150 297 -1206 200 991 -1120 -523
3348 -523 1269 -205 -1547 351 930 -1232 -307 1320 -325 -1054 1179 571 -974 -234 1366 -521
$$ packed form
3234a269K123L65k539P62J664j480j017K311L8k343J242J451j807n39K141m95
3250F08j875J326J110k028J3K048q90j844K111P35k446M68K047j447j392K046
3266E90J83j888N40K023j599j242K570l51k316J433J485j929n70K145n48j957
3282a431J650J121k308q7K477j355j528K048L63k125N39J906j479j165K113K28
3298I67k301J097J698j901n85K120n22j787J287J363k185k57K292r26j728J755
3314C87P13j919Q0K030j256j611K140L68j733L59J880j513j016J853J64j905R15
3331f4J501j866o19K088l75j882J231J355k118j03K002q53j503J406P91k111N97
3348e23J792j474j342J898N79k162R25J627j645p29K233o08j545P40J600j887
$$ plain form
3364 -521 -1300 1202 403 -1111 80 1138 -1145 -615 1254 284 -1236 512 1276 -938 -417 1312 -282
3381 -282 -1313 704 936 -961 -233 1195 -383 -957 843 808 -1187 -402 1032 -667 -819 1199 226
3398 226 -1143 393 1254 -898 -590 1114 51 -1353 618 1100 -1012 -367 1086 -37 -941 745
3414 745 944 -927 -66 1124 -336 -922 869 683 -1280 213 1123 -791 -857 1075 190 -1048 366
3431 366 1057 -839 -831 1017 -163 -1228 542 779 -1042 -362 1193 -197 -1150 535 531 -1137 -36 1261
3449 1261 -548 -1203 958 266 -1397 -56 1000 -707 -695 949 43 -1096 273 913 -946 -489 1076
3466 1076 -44 -950 835 534 -916 -354 1057 -13 -1079 790 431 -1153 -84 1064 -246 -640
3482 -640 927 478 -1114 296 865 -909 -596 857 -152 -1310 188 501 -1021 -246 956 -361
$$ packed form
3364e21p79K502p99j514J191J058k283N30J869r70j520J748P64k214N21J729j594
3381b82j031K017K32j897P28J428j578n74J800l5j995P85J434j699j52K018r73
3398B26j369J536Q61k152L08J704j063j404J971M82k112O45J453j123r04J686
3414G45J99j871Q61J190j460n86J791j86j963J493R10j914o6J932q85j238J414
3431C66O91j896QJ848j180j065J770K37j821O80J555j390r53J685mj668J101J297
3449A261j809o55K161o92j663J341J056j707J2J644r06j139J369O40j859M57J565
3466A076j120r06J785l01j450N62J411j070j066J869l59j584J069J148j310l94
3482f40J567m49j592J410N69j774L13J453j009j158J498L13j522P75J202j317
$$ plain form
3498 -361 -878 649 613 -804 -67 942 -367 -764 920 316 -1148 91 1048 -512 -967 639 331
3515 331 -1125 377 823 -563 -529 846 234 -906 484 696 -1039 -221 1227 -163 -836 776 656
3532 656 -1217 -202 949 -602 -879 683 622 -867 125 1019 -759 -802 982 253 -971 313 660
3549 660 -583 -465 688 53 -861 561 749 -725 -374 977 -382 -734 608 579 -839 -154 1050
3566 1050 -338 -551 790 292 -1019 277 769 -483 -554 842 -89 -880 638 1072 -500 -130 1154
3583 1154 -142 -1019 748 624 -658 -290 869 -417 -876 907 392 -1038 -63 644 -841 -474 1128
3600 1128 49 -902 374 666 -844 -608 987 110 -803 546 719 -754 -201 869 -131 -770 602
3617 602 558 -608 -334 1036 -166 -678 653 113 -910 119 1071 -638 -643 897 144 -912 273 784
$$ packed form
3498c61n17J527l6j417P37J009j309l97J684o04j464J239R57j560m55J606l08
3515C31j456J502M46j386L4J375o12j140J390K12j735Q18J448j390o73J612j20
3532F56j873J015J151j551k77J562o1j489R92Q94j778m3J784p29j224J284L47
3549F60j243J18J153o35r14J422J88j474L51J351j359l52J342k9j418O85J204
3566A050j388k13J341m98j311J296M92j252p1J396r31p91J518M34j572L70J284
3583A154j296q77J767j24j282L68J159j286m59J783n15j430R75P07j485L67J602
3600A128j079r51J276K92j510K36J595q77r13J349J73j473N53J070j000o39J372
3617F02m4j166K74J370j202n12J331n40j023J029R52j709nJ540p53j056J185N11
$$ plain form
3635 784 -604 -270 897 -235 -801 578 676 -731 140 751 -217 -1055 783 575 -1037 -86 836 -317
3653 -317 -702 653 380 -786 182 906 -677 -706 820 -5 -915 486 899 -691 -211 880 -277 -770
3671 -770 399 550 -756 -392 845 -268 -647 612 440 -933 160 801 -347 -455 595 347 -792
3688 -792 225 775 -541 -424 1080 27 -563 437 340 -824 -302 991 -307 -674 535 470 -934
3705 -934 113 1066 -398 -812 729 312 -783 124 932 -573 -601 664 125 -973 210 800 -517
3722 -517 -304 792 -144 -863 417 419 -752 48 755 -87 -1010 436 621 -968 20 875 -571 -563 713
3741 713 226 -984 -1 541 -475 -74 709 -133 -798 344 818 -733 -454 911 -31 -801 272 344
3759 344 -619 -227 709 -192 -626 461 334 -584 -52 797 -518 -629 775 215 -815 229 389 -315
$$ packed form
3635G84j388L34J167j132n66J379R8j407Q71O11r68q38J838k08j612R51R22j153
3653c17l85J355k73j166R68P24j583k9J526q25r10J401M13j590M80J091j157m93
3671g70J169J51j306L64J237j113l79J259j72j373J093O41j148j08J050k48j139
3688g92J017N50j316J17J504j053n90J000r7j164N22J293j298l67J209o5j404
3705i34J047R53j464m14J541m17j095R07Q08j505k8J265n39j098J183N90j317
3722e17K13J096r36p19J280Kj171Q00P07q42r23J446J85j589R88Q55j446QJ276
3741G13m87j210R83N42j016M01P83q42o65J142M74j551K79J365r42p70J073P2
3759C44r63L92R36r01m34J087j27r18N32Q49j315j11J404n60j030J044J60p04
$$ plain form
3777 -315 -279 816 18 -897 333 573 -634 -466 590 -131 -513 383 248 -673 -232 551 -292 -364 577
3796 577 550 -873 -111 626 -466 -378 815 220 -753 211 602 -597 -642 737 -231 -679 480 437 -641
3815 -641 -270 724 -350 -554 390 540 -849 -6 768 -102 -340 663 107 -708 -21 658 -411 -575 498
3834 498 -54 -787 289 405 -431 -293 698 -97 -526 235 280 -567 79 730 -284 -552 472 543 -579
3853 -579 10 785 -218 -333 509 82 -432 172 589 -337 -313 499 -20 -704 200 622 -401 -285 594 -243
3873 -243 -729 351 354 -701 -134 760 -101 -612 403 289 -743 -76 622 -374 -362 660 165 -598 157
3892 157 626 -322 -308 567 186 -616 280 224 -748 -163 588 -102 -615 281 477 -609 -42 543 -236 -445
3912 -445 320 102 -555 -27 459 -259 -566 473 134 -475 -168 678 -455 -241 666 123 -255 215 231 -518
$$ packed form
3777c15L6J095p98r15J230K40j207J68J056p21l82Q96j35r21M41P83q43p2R41
3796E77k7j423P62P37j092Q8J193n95r73R64L91j199m5J379r68m48J159m3j078
3815f41L71R94j074k04R44J50j389Q43P74q70k38J003n56q15O87O79j069j64J073
3834D98n52p33J076J16q36J38R91p95m29P61M5q47O46O51j014k68J024P1j122
3853e79N89P75j003j15Q42m27n14O04M17r26K4Q12n19o84R04M22j023J16Q79q37
3873b43m86J080Lj055N67Q94q61n11J015j14j032O67O98r96J2J022m95p63P55
3892A57M69r48J4Q75l81q02Q96n6r72N85P51o90n13Q96J96j086N67N85p79k09
3912d45P65k18o57N28M86p18l07J039l39o09L07Q46j133K14R07n43l78M70J6p49
$$ plain form
3932 -518 -171 665 -238 -380 397 576 -611 -54 568 35 -337 328 399 -504 157 472 -293 -384 410 142
3952 142 -570 -48 299 -470 73 508 -147 -108 179 480 -493 41 560 -307 -609 630 533 -585 -21 349
3972 349 -188 -274 500 216 -693 62 607 -505 -458 281 -31 -495 136 551 -283 -39 318 -226 -507 298
3992 298 525 -506 -67 565 -71 -518 358 408 -410 3 360 -550 -241 359 159 -479 71 277 -348 -200
4012 -200 331 39 -273 137 315 -464 -163 570 -555 -628 318 411 -419 -170 511 -341 -465 276 141 -431
4032 -431 68 352 -91 -148 222 -163 -566 79 455 -611 -151 646 -323 -490 242 20 -458 -16 482 -100
4052 -100 -365 403 361 -477 -42 519 -68 -218 473 214 -279 -105 363 -121 -289 251 -73 -520 106 320
4072 320 -404 -411 525 -31 -317 118 140 -461 -40 331 -253 -221 375 128 -178 82 400 -175 -375 285 91
$$ packed form
3932e18L47Q36r03j42P77J79j187N57O22n33l72O65P1r03O61L15p65r1P94k68
3952A42p12N22L47p69N43M35o55L9K87L01r73N34N19q67l02J239r7j118N64L70
3972C49n37q6P74k84r09P55N45j112M7P39l12m64O31M15q34K44L57n44k81Q05
3992B98K27j031M39O32o36m47Q76N0q18M13L57r10L09O00k00o38N50K06o25J48
4012b00N31k92l12M10J78p79L01P33j125p3R46R3q30K49O81q52j24P41j35n72
4032d31M99K84m43n7L70l85m03O45L76j066M60P97r69j67P32k22m78M42M98n82
4052a00k65P68m2q38M35N61n87j50O91k59m93J74M68m84j68N40l24m47O26K14
4072C20p24pR36n56k86M35K2o01M21L71n84L2N96k47l06K60L18n75k00O60j94
$$ plain form
4093 91 -538 -159 260 -209 -412 515 155 -574 299 327 -512 -193 407 -126 -186 164 204 -379 -60 417 -144
4114 -144 -524 456 -4 -514 28 378 -174 -544 319 127 -495 187 405 -238 -233 427 200 -225 177 358 -369
4135 -369 46 334 20 -418 212 143 -461 83 198 -213 -498 373 65 -420 190 277 -221 -130 468 164 -140
4156 -140 294 332 -407 -90 312 28 -231 352 113 -529 -114 548 159 -408 230 221 -392 199 -38 -140 -403
4177 -403 409 197 -402 -107 181 -123 -271 224 165 -188 200 126 -292 -283 165 -61 -348 274 145 -318 -159
4198 -159 217 -207 -277 144 250 -382 -210 336 -167 -196 143 19 -397 -79 103 -85 -121 328 89 -233 40
4219 40 343 -396 -135 58 -99 -553 252 49 -386 -132 454 -177 -384 342 232 -397 131 320 -200 -100
4239 -100 97 -138 -62 24 238 -229 -202 448 118 -149 -54 153 -61 -46 173 -60 -336 251 257 -333 239 64
$$ packed form
4093I1o29L79M19m69k03R27l60p29Q73K8q39L19O00n33o0L50M0n83L19M77n61
4114a44l80R80m60n10N42L50n52l70Q63j92o22O82K18o43NO60k27m25M02J81p27
4135c69M15K88l14m38O30o9o04N44J15m11k85Q71l08m85O10Q7m98R1N98l04l04
4156a40M34L8p39L17M02k84k59N83k39o42M15O62l89n67O38ro13N91k37j02k63
4177d03Q12k12n99K95K88l04j48M95n9l53L88p4m18RM48k26k87O22j29m63J59
4198a59L76m24p0M21J06o32J72N46n03k9L39j24m16L18J82j88l6M49k39l22K73
4219D0L03p39K61J93j57m54Q05k03m35K54N86o31k07P26j10o29N28J89n20J00
4239a00J97k35P6Q6K14m67K7O50l30k67R5K07k14J5K19k33k76N87On90N72j75
$$ plain form
4261 64 -336 -264 428 179 -286 132 258 -309 -313 127 -125 -397 -42 207 -387 -178 405 132 -254 247 190 -173
4283 -173 -117 297 90 -329 256 215 -359 27 392 -119 -374 222 256 -431 204 315 -5 -123 207 95 -484
4304 -484 179 246 -86 -2 111 192 -236 226 209 20 -69 329 -27 -225 208 94 -285 -83 253 17 -219 121
$$ packed form
4261F4m00P2O92k49m65M18J26n67mM40k52k72L55K49n94K09N83k73l86N01n7l63
4283a73N6M14k07m19N85m1n74L86L65n11k55N96L4o87O35J11l20j18L30j12n79
4304d84O63O7l32Q4J13Q1m28M62j7j89q9L98l56j98M33j14l79K02L36k36k36L40
$$ [...]
8191B
##END NTUPLES=NMR FID
##END=
