##TITLE=1H ikalashn
LR-791-BO-C2
18.11.2024
##JCAMPDX= 6.0         $$ Bruker NMR JCAMP-DX V2.0
##DATA TYPE= NMR FID
##DATA CLASS= NTUPLES
##ORIGIN= UXNMR, Bruker Analytische Messtechnik GmbH
##OWNER= root
$$ TOPSPIN		Version 1.3
$$ 2024-11-18 15:01:46.937 +0400  Irina@DPX200
$$ Compression mode = diff/dup
##.OBSERVE FREQUENCY= 200.131300845
##.OBSERVE NUCLEUS= ^1H
##.DELAY= (6, 6)
##.ACQUISITION MODE= SIMULTANEOUS
##.ACQUISITION SCHEME= undefined
##.AVERAGES= 64
##.DIGITISER RES= 18
##SPECTROMETER/DATA SYSTEM= spect
##.PULSE SEQUENCE= zg
##.SOLVENT NAME= CDCl3
##.SHIFT REFERENCE= INTERNAL, CDCl3, 1, 17.49637
##AUDIT TRAIL= $$ (NUMBER, WHEN, WHO, WHERE, WHAT)
$$ ##TITLE= Audit trail, TOPSPIN		Version 1.3
$$ ##JCAMPDX= 5.01
$$ ##ORIGIN= Bruker BioSpin GmbH
$$ ##OWNER= Irina
$$ $$ F:/spectra/data/iren/nmr/1H/4/audita.txt
$$ ##AUDIT TRAIL=  $$ (NUMBER, WHEN, WHO, WHERE, VERSION, WHAT)
(   1,<2024-11-18 15:01:15.531 +0400>,<Irina>,<DPX200>,<TOPSPIN 1.3>,
      <created by zg
	started at 2024-11-18 14:57:02.609 +0400,
	POWCHK disabled, PULCHK disabled
       configuration hash MD5:
       BE 6D 3F 07 2A EA 11 49 91 17 2B D3 AF B3 58 0D
       data hash MD5: 16K
       7E 85 07 D1 50 AD F3 44 2D 91 2D EB 40 C0 9D 5E>)
$$ ##END=
$$ 
$$ $$ hash MD5
$$ $$ 15 37 64 A2 9F 94 99 06 7F 67 9C C8 DD DF 67 67
##$RELAX= 
##$RELAX= 
##$RELAX= 
##$RELAX= 
##$RELAX= 
##$RELAX= 
##$RELAX= 
##$RELAX= 
##$RELAX= 
$$ Bruker specific parameters
$$ --------------------------
##$DU= <F:/spectra>
##$EXPNO= 4
##$NAME= <1H>
##$PROCNO= 1
##$TYPE= <nmr>
##$USER= <iren>
##$AMP= (0..31)
100 100 100 100 100 100 100 100 100 100 100 100 100 100 100 100 100 100 
100 100 100 100 100 100 100 100 100 100 100 100 100 100 
##$ANAVPT= -1
##$AQSEQ= 0
##$AQ_mod= 1
##$AUNM= <au_zg>
##$AUTOPOS= <>
##$BF1= 200.13
##$BF2= 200.13
##$BF3= 200.13
##$BF4= 200.13
##$BF5= 200.13
##$BF6= 200.13
##$BF7= 200.13
##$BF8= 200.13
##$BYTORDA= 1
##$CFDGTYP= 0
##$CFRGTYP= 5
##$CHEMSTR= <none>
##$CNST= (0..63)
1 1 145 1 1 1 1 1 1 1 1 1 1 1 1 1 1 1 1 1 1 1 1 1 1 1 1 1 1 1 1 1 1 1 
1 1 1 1 1 1 1 1 1 1 1 1 1 1 1 1 1 1 1 1 1 1 1 1 1 1 1 1 1 1 
##$CPDPRG= <>
##$CPDPRG1= <>
##$CPDPRG2= <>
##$CPDPRG3= <>
##$CPDPRG4= <mlev>
##$CPDPRG5= <mlev>
##$CPDPRG6= <mlev>
##$CPDPRG7= <mlev>
##$CPDPRG8= <mlev>
##$CPDPRGB= <>
##$CPDPRGT= <>
##$D= (0..63)
0 2 0 0 0 0 0 0 0 0.06 0 0.03 0 0 0 0 0.0002 0 0 0 0 0 0 0 0 0 0 0 0 0 
0 0 0 0 0 0 0 0 0 0 0 0 0 0 0 0 0 0 0 0 0 0 0 0 0 0 0 0 0 0 0 0 0 0 
##$DATE= 1731927674
##$DBL= (0..7)
120 120 120 120 120 120 120 120 
##$DBP= (0..7)
150 150 150 150 150 150 150 150 
##$DBP07= 0
##$DBPNAM0= <>
##$DBPNAM1= <>
##$DBPNAM2= <>
##$DBPNAM3= <>
##$DBPNAM4= <>
##$DBPNAM5= <>
##$DBPNAM6= <>
##$DBPNAM7= <>
##$DBPOAL= (0..7)
0.5 0.5 0.5 0.5 0.5 0.5 0.5 0.5 
##$DBPOFFS= (0..7)
0 0 0 0 0 0 0 0 
##$DE= 6
##$DECBNUC= <off>
##$DECIM= 32
##$DECNUC= <off>
##$DECSTAT= 4
##$DIGMOD= 1
##$DIGTYP= 9
##$DL= (0..7)
0 120 120 120 120 120 120 120 
##$DP= (0..7)
150 150 150 150 150 150 150 150 
##$DP07= 0
##$DPNAME0= <>
$$ [...]
##$SW= 21.9926040160658
##$SWIBOX= (0..15)
0 0 2 0 0 0 0 0 0 0 0 0 0 0 0 0 
##$SW_h= 4401.40845070422
##$TD= 16384
##$TD0= 1
##$TE= 300
##$TE2= 300
##$TE3= 300
##$TEG= 300
##$TL= (0..7)
0 120 120 120 120 120 120 120 
##$TP= (0..7)
150 150 150 150 150 150 150 150 
##$TP07= 0
##$TPNAME0= <>
##$TPNAME1= <>
##$TPNAME2= <>
##$TPNAME3= <>
##$TPNAME4= <>
##$TPNAME5= <>
##$TPNAME6= <>
##$TPNAME7= <>
##$TPOAL= (0..7)
0.5 0.5 0.5 0.5 0.5 0.5 0.5 0.5 
##$TPOFFS= (0..7)
0 0 0 0 0 0 0 0 
##$TUNHIN= 0
##$TUNHOUT= 0
##$TUNXOUT= 0
##$USERA1= <user>
##$USERA2= <user>
##$USERA3= <user>
##$USERA4= <user>
##$USERA5= <user>
##$V9= 5
##$VALIST= <valist>
##$VCLIST= <CCCCCCCCCCCCCCC>
##$VD= 0
##$VDLIST= <DDDDDDDDDDDDDDD>
##$VPLIST= <PPPPPPPPPPPPPPP>
##$VTLIST= <TTTTTTTTTTTTTTT>
##$WBST= 1024
##$WBSW= 25
##$XGAIN= (0..3)
0 0 0 0 
##$XL= 0
##$YL= 0
##$YMAX_a= 226572
##$YMIN_a= -350877
##$ZGOPTNS= <>
##$ZL1= 120
##$ZL2= 120
##$ZL3= 120
##$ZL4= 120
##$ABSF1= 10
##$ABSF2= 0
##$ABSG= 5
##$ABSL= 3
##$ALPHA= 0
##$AQORDER= 0
##$ASSFAC= 0
##$ASSFACI= 0
##$ASSFACX= 0
##$ASSWID= 0
##$AUNMP= <proc_1d>
##$AXLEFT= 0
##$AXRIGHT= 0
##$AXTYPE= 0
##$AXUNIT= <>
##$AZFE= 0.1
##$AZFW= 0.1
##$BCFW= 1
##$BC_mod= 2
##$BYTORDP= 1
##$COROFFS= 0
##$CY= 7568.61572265625
##$DATMOD= 1
##$DC= 2
##$DFILT= <>
##$DTYPP= 0
##$F1P= 17.9538593292236
##$F2P= -4.03888763876832
##$FCOR= 0.5
##$FTSIZE= 32768
##$FT_mod= 4
##$GAMMA= 1
##$GB= 1
##$INTBC= 1
##$INTSCL= 1
##$ISEN= 128
##$LB= 0.02
##$LEV0= 0
##$LPBIN= 0
##$MAXI= 945.577
##$MC2= 0
##$MEAN= 0
##$ME_mod= 0
##$MI= -402.1523
##$NCOEF= 0
##$NC_proc= 0
##$NLEV= 6
##$NOISF1= 8.587773
##$NOISF2= 6.764455
##$NSP= 1
##$NTH_PI= 0
##$NZP= 0
##$OFFSET= 17.49637
##$PC= 1
##$PHC0= 322.1802
##$PHC1= 4.635242
##$PH_mod= 0
##$PKNL= yes
##$PPARMOD= 0
##$PPDIAG= 0
##$PPIPTYP= 0
##$PPMPNUM= 100
##$PPRESOL= 1
##$PSCAL= 0
##$PSIGN= 0
##$REVERSE= no
##$SF= 200.13
##$SI= 32768
##$SIGF1= 18.5376
##$SIGF2= -6.396296
##$SINO= 400
##$SIOLD= 32768
##$SREGLST= <1H.CDCl3>
##$SSB= 3
##$STSI= 0
##$STSR= 0
##$SW_p= 4401.40845070422
##$SYMM= 0
##$S_DEV= 0
##$TDeff= 0
##$TDoff= 0
##$TI= <>
##$TILT= no
##$TM1= 0
##$TM2= 0
##$TOPLEV= 0
##$USERP1= <user>
##$USERP2= <user>
##$USERP3= <user>
##$USERP4= <user>
##$USERP5= <user>
##$WDW= 1
##$XDIM= 8192
##$YMAX_p= 0
##$YMIN_p= 0
$$ End of Bruker specific parameters
$$ ---------------------------------
##NTUPLES= NMR FID
##VAR_NAME=  TIME,          FID/REAL,        FID/IMAG
##SYMBOL=    X,             R,               I
##VAR_TYPE=  INDEPENDENT,   DEPENDENT,       DEPENDENT
##VAR_FORM=  AFFN,          ASDF,            ASDF
##VAR_DIM=   8192,          8192,            8192
##UNITS=     SECONDS,       ARBITRARY UNITS, ARBITRARY UNITS
##FACTOR=    0.0002272,     1,               1
##FIRST=     0,             0,               0
##LAST=      1.8609952,     -86,             74
##MIN=       0,             -350877,         -350877
##MAX=       1.8609952,     226572,          226572
$$ Real data points
##PAGE= N=1
##DATA TABLE= (X++(R..R)), XYDATA
$$ [...]
1051h63N64K22k12m13j71J35L09O02L86p3o24K7J62L18K49k1p8m52j79K50M82
$$ -863 -299 -77 -289 -702 -873 -738 -429 173 559 486 -138 -111 51 369 618 597 519 67 -112 138 620
1072F20K21m18k46k36k33q2N20K22m67p76J2L40J3L13K58J3l16k77L85M28J22
$$ 620 841 423 177 -59 -292 -374 146 368 -99 -875 -863 -523 -510 -197 61 74 -242 -519 -134 294 416
1093D16M7m03j73j39K46N47J54l93l70J29n8M6K72J82l08p27lJ00K78J21k7q9
$$ 416 463 60 -113 -252 -6 541 695 302 -68 61 3 49 321 503 195 -532 -535 -435 -157 -36 -63 -152
1115a52l48j56M53L03M8r6j70K0m5K7N96L3j86l01P3K08J2J74K65k10p25o4K49
$$ -152 -500 -656 -203 100 148 52 -118 -98 -143 -116 480 513 327 26 99 307 319 493 758 548 -177 -241 8
1138HJ40l4j88k08k26k29M21M09N0m52j16J57MK7L58J51k20j76j53N37O8L08J7
$$ 8 148 114 -74 -282 -508 -737 -316 93 143 -309 -425 -268 -264 -237 121 272 52 -124 -277 260 328 636 653
1161F53j82m37K4J58N2k7j80j78j06l12L00L24j74k47k12PN5L02K03o9j56j53
$$ 653 471 34 58 216 268 241 61 -117 -223 -535 -235 89 -85 -332 -544 -537 -482 -180 23 -46 -202 -355
1183c55L54K28P9J46J85k27l52K13K58Q0l17Q2k86k45k66L05K26k56k53j75K03
$$ -355 -1 227 306 452 637 410 58 271 529 609 292 374 88 -157 -423 -118 108 -148 -401 -576 -373
1204c73j27J33L68j13l54j1J74L67k7J44K82K6l77K02L98N8l83J48N1n96k06L66
$$ -373 -500 -367 1 -112 -466 -477 -303 64 37 181 463 489 112 314 712 770 387 535 586 -10 -216 150
1226A50J89m31l83L7J68j97O3L37n5m42p8L83K43j54K31J85q4k37J49O79J12l54
$$ 150 339 -92 -475 -438 -270 -467 -404 -67 -122 -564 -642 -259 -16 -170 61 246 162 -75 74 753 865 511
1248E11j00K19k40j94lK08k27m77J2O0j49k70L73Ok15k35M09K51j51j05K84M9
$$ 511 411 630 390 196 193 401 174 -303 -291 -231 -380 -650 -277 -271 -486 -721 -312 -61 -212 -317 -33 16
1270A6j01Q2N13J90l87m0L87o7j17j66L85j83p33M0K95l83k86R9L79m72k75M28
$$ 16 -85 -3 510 700 313 273 660 593 476 310 695 512 -221 -181 114 -269 -555 -456 -77 -549 -824 -396
1292c96K38j73j01K85L9j18p9O64J08j31j93K35K31k41M5K21k5m62j44J84j98
$$ -396 -158 -331 -432 -147 -108 -226 -305 359 467 336 143 378 609 368 413 634 609 147 3 187 -11
1313a1k75lJ14k83l30R7O09j68k03P1K49J6k98L44M18Pm22J94N06j05j44J44J40
$$ -11 -286 -289 -175 -458 -788 -691 -82 -250 -453 -382 -133 -117 -415 -71 347 354 -68 126 632 527 383 527 667
1336F67k51k79K00J26m21k71J84j28m36J00J45J15j92p3K49k0l4K49L21m7k92
$$ 667 416 137 337 463 42 -229 -45 -173 -609 -509 -364 -249 -441 -514 -265 -285 -319 -70 251 204 -88
1357h8J03M25pl5P0J24k58j51K86J29l52m04Q6J28m36Q5J34j47k03k2J62J64k13
$$ -88 15 440 433 398 468 592 334 183 469 598 246 -158 -72 56 -380 -295 -161 -308 -511 -533 -371 -207 -420
1380d20K59K43j02j74J41K62J67j55J70M8j33r3R2K51k14k22m8N1j59j40ol8j51
$$ -420 -161 82 -20 -194 -53 209 376 221 391 439 306 213 305 556 342 120 72 123 -36 -176 -182 -220 -371
1403c71k75K31J00o9P5J78J25k22J43K09K22j93ML11l19LJ88Q8j87j32j6k5rK0
$$ -371 -646 -415 -315 -384 -309 -131 -6 -228 -85 124 346 153 157 468 149 152 340 428 241 109 93 68 59 79
1427G9or1k14j35n9J93M5Kj62J78p3K45mQ3P6J15oj25k9J12K3m6O1q7Kj68J42
$$ 79 73 -18 -232 -367 -426 -233 -188 -186 -348 -170 -243 2 -2 81 157 272 266 141 112 224 247 201 262 175 177 9 151
1454A51p5O7k92k0r9J02j79J69kj60P6O4J00R6O9j6O3oN2J2k3L1k8q8O3J5jJ0
$$ 151 76 143 -149 -169 -268 -166 -345 -176 -178 -338 -262 -198 -98 -2 67 51 114 108 160 172 149 180 152 64 127 142 141 151
1482A51p2l7k9LO1j09r5oj83o6J54K50j20k02K99J37j52J21nL5l4q3k3J09O9p3
$$ 151 79 42 13 16 77 -32 -127 -133 -316 -382 -228 22 -98 -300 -1 136 -16 105 100 135 101 18 -5 104 173 100
1508A00l7L9j34p1K03l2o8oM2j08j08l6K01j18n9J8J39j69RL15o1ql2NK3Q6q3
$$ 100 63 102 -32 -103 100 68 0 -6 36 -72 -180 -216 -15 -133 -192 -174 -35 -204 -195 120 59 51 19 24 47 133 50
1535E0PJ86k28m2P9P4P9q1jN8k60p3K05j01k57RJ70k5k0M8M0M1o9K6J67jj69J39
$$ 50 57 243 15 -27 52 126 205 124 123 181 -79 -152 53 -48 -305 -296 -126 -151 -171 -123 -83 -42 -111 -85 82 81 -88 51
1563E1R1k07P2j12K81j40NJ70Jn8Pl7K3j49O0j81O9j10R0m8J2p5M8J45m2J01k23
$$ 51 142 -65 7 -105 176 36 41 211 212 154 161 124 147 -2 58 -123 -54 -164 -74 -122 -110 -185 -137 8 -34 67 -156
1590a56R8P1Jj85K53J1j86J65J50Mj59J41K1m8j28m2J07k36Np6Q5M9j4Ko3N4p9
$$ -156 -58 13 14 -171 82 93 -93 72 222 226 67 208 229 181 53 11 118 -118 -113 -189 -104 -55 -69 -67 -130 -76 -155
1617a55j8J79j4o4J17Q9j58J90p5J08L5p0Lj25N7lo2Q9k5p5j0j29k1j51M1l0q8
$$ -155 -173 6 -8 -72 45 134 -24 166 91 199 234 164 167 42 99 96 34 123 98 23 13 -116 -137 -288 -247 -277 -365
1644c65J75j5l3K08J7Mn2M0P1J3J2J46m6j41Q7N9P1rj7k49J11k21Q7j69J9J3n3
$$ -365 -190 -205 -238 -30 -13 -9 -61 -21 50 63 75 221 175 34 121 180 251 242 225 -24 87 -134 -47 -216 -197 -184 -237
1671b37k0L2k4R8J70q8K7M2J19L9n5M3J16o1k7pJ55n7m9km0k00N6J4l4l7q9j31
$$ -237 -257 -225 -249 -151 19 -69 -42 0 119 158 103 146 262 201 174 167 322 265 216 214 174 -26 30 44 10 -27 -116 -247
1699b47J8p6J51k6l8K5J60j6L7R9J9K1j19j6J34J45j38nK4Q7j12L8j27M9j91j64
$$ -247 -229 -305 -154 -180 -218 -193 -33 -49 -12 87 106 127 8 -8 126 271 133 128 152 239 127 165 38 87 -104 -268
1725b68K37k9j77N9m5P3r2O5R6m6J80m4J44m5j00K48j18M0J9j05R1j26l6P7P8
$$ -268 -31 -60 -237 -178 -223 -150 -242 -177 -81 -127 53 9 153 108 8 256 138 178 197 92 183 57 21 98 176
1750A76n2j52r2r7N6j19pP7j3lM9L6QL7J14P4K21k11J11l8j6j4J12k6k52J98j5
$$ 176 124 -28 -120 -217 -161 -280 -287 -210 -223 -226 -177 -141 -133 -96 18 92 313 102 213 175 159 145 257 231 -21 177 162
1777A62j02j09J10M0j30j06j1L1rl0j13J12k30L19J16j53J15M1J18O8m6p2L3j8
$$ 162 60 -49 61 101 -29 -135 -146 -115 -124 -154 -267 -155 -385 -66 50 -103 12 53 171 239 193 121 154 136
1801A36j10J38l0q8j91Q4J96j99MN7q8o0k9Q3j09p4J86QN2o4OJ58RJ3R9J7o5j38
$$ 136 26 164 134 46 -145 -61 135 -64 -60 -3 -91 -151 -180 -97 -206 -280 -94 -86 -34 -98 -92 66 75 88 187 204 139 1
1829AL5l7R7n3O4rJ4j77J47j11K8j64J62K6j17N8l8k1L4Q4r6J35j41J21J13j5
$$ 1 36 -1 96 43 107 98 112 -65 82 -29 -1 -165 -3 23 -94 -36 -74 -95 -61 23 -73 62 -79 42 155 140
1855A40j18N3K2Q5j68k0J00k17J5L4o3M5k7L3m3R7o8O9k4n7J57r1N6l6Q3P8j06
$$ 140 22 75 97 182 14 -6 94 -123 -108 -74 -137 -92 -119 -86 -129 -32 -100 -31 -55 -112 45 -46 10 -26 57 135 29
1882B9Q5K2r2l2r0K59j12kl7p9J64Nm00K31L9K7j58J28J02p9j21P8R0j34j2N4
$$ 29 114 136 44 12 -78 181 69 67 30 -49 115 120 -280 -49 -10 17 -141 -13 89 10 -111 -33 57 -77 -89 -35
1908c5M5k6J69j29Q7l3l0R2L6j85K7J7O7k73RJ69k0KjQ6q0p0R4K25k48j06R3L0
$$ -35 10 -16 153 24 111 78 48 140 176 -9 18 35 102 -171 -162 7 -13 -11 -12 74 -6 -76 18 243 -5 -111 -18 12
1936A2k4j14N8J10J0j37J50J03j45j21J84N2j29o1R1P5k80N5J46K2k27K36J0j2
$$ 12 -12 -126 -68 42 52 -85 65 168 23 -98 86 138 9 -52 39 114 -166 -111 35 57 -170 66 76 64
1960F4j57K8J60m6j86jJ34j7p7J47l9P0j83P4J44r5kp1J99r4j01K27r1j60J50
$$ 64 -93 -65 95 49 -137 -138 -4 -21 -98 49 10 80 -103 -29 115 20 18 -53 146 52 -49 178 87 -73 77
1985G7o1Q5Ll2J9l5J7j38J48o7k8R4j24K4K8j36K2J34o3Q4j41P2L1J8N7k2j51
$$ 77 16 101 104 72 91 56 73 -65 83 16 -12 82 -42 -18 10 -126 -104 30 -33 51 -90 -18 13 31 88 66 -85
2012h5N6R1j16R5%p8j17K00n8j33J98n6r0o0k3J8pN5N1m9J23p2M2n7J40l9k12
$$ -85 -29 62 -54 41 41 -37 -154 46 -12 -145 53 -3 -93 -153 -176 -158 -165 -110 -59 -108 15 -57 -15 -72 68 29 -183
2039a83K14Q5j12l5J61j91K33j82J48j52j6o9L3n7L2k2q2K7J4J27q1N0MO9J9k1
$$ -183 31 116 4 -31 130 -61 172 -10 138 -14 -30 -99 -66 -123 -91 -113 -195 -168 -154 -27 -108 -58 -54 15 34 13
2065A3L8j9Q9j89K32j45N4q7J05j02m4J12p6Lq1R3MK6o2j63J84j63J71L7q1M4
$$ 13 51 32 121 -68 164 19 73 -14 91 -11 -55 57 -19 -16 -97 -4 0 26 -36 -199 -15 -178 -7 30 -51 -7
2091gP0n9N6n0Q1N8p7o0N4j48K23j8j45Mjq7K30k13O0k15J82o6o4K8lQ4Q3j9p1
$$ -7 63 4 60 10 91 149 72 12 66 -82 141 123 -22 -18 -19 -106 124 -89 -29 -244 -62 -128 -192 -164 -167 -83 0 -19 -90
2120i0Q7J6O7o0J38j47J24p9lJ6o4k4J31j52m0r9K15k8r6Q7o0n0R5k5J1l5M1J4
$$ -90 -3 13 80 20 158 11 135 56 53 69 5 -19 112 -40 -80 -179 36 8 -88 -1 -61 -111 -16 -41 -30 -65 -24 -10
2148a0l8Q0J12J8r8JkK6J1k9j63J56n2Kp6K9K6j22L3m8J08j19m1J54n6L1j19K20
$$ -10 -48 32 144 162 64 65 63 89 100 71 -92 64 12 14 -62 -33 -7 -129 -96 -144 -36 -155 -196 -42 -98 -67 -186 34
2176C4o2K6R6p9P8J12J4j49J67j89j9J42j41p5O0j42J13r1J42j39o0M8K7j7Q1
$$ 34 -28 -2 94 15 93 205 219 70 237 48 29 171 30 -45 15 -127 -14 -105 37 -102 -162 -114 -87 -104 -23
2201b3j61J80PJ2Q2k9j6m6J0J2L1q8J19o2n6r6J57o7O1n4j0l3o4J63p0J36k90
$$ -23 -184 -4 3 15 97 68 52 6 16 28 59 -29 90 28 -28 -124 33 -34 27 -27 -37 -70 -134 29 -41 95 -195
2228a95J87j4M6k1q3J91j08N1o4N7L7P4q0q2K00j21j00J07nj61J05j54J03q6Q1
$$ -195 -8 -22 24 3 -80 111 3 54 -10 47 84 158 78 -4 196 75 -25 82 77 -84 21 -133 -30 -116 -35
2253c5nn3J13l3j14J01K9l4j01J46%M5o3O2m7Q0N0j62N1J5M6J8j18n0J17Jn8m9
$$ -35 -40 -93 20 -13 -127 -26 3 -31 -132 14 14 59 -4 58 11 91 141 -21 30 45 91 109 -9 -59 58 59 1 -48
2281d8k2J35m7q1M4lk0M8P8j08k0l2J29o4L1L3j65M5J55n5o4J15j34M0Q1m3j15
$$ -48 -70 65 18 -63 -19 -22 -42 6 84 -24 -44 -76 53 -11 20 53 -112 -67 88 33 -31 84 -50 -10 71 28 -87
2308h7n0J60l9k2n8J54r2O8J7n0Q4o3J8p0J21q2K2N9P9q0L5j00n5O3n9J54q1j19
$$ -87 -137 23 -16 -38 -96 58 -34 34 51 1 85 22 40 -30 91 9 31 90 169 89 124 24 -31 32 -27 127 46 -73
2336g3J37j10J14m9j12J77n0on6o8J90J9p6Nn4L5l1o5jL7j6J44n9J3lq4j27J65
$$ -73 64 -46 68 19 -93 84 34 28 -28 -96 94 113 37 42 -12 23 -8 -73 -74 -37 -53 91 32 45 42 -42 -169 -4
2364dr6Q6K1r8J18j22R2kk2p2J8R6p6O0p0j27K21On6jJ35r6q7k5K19m0K3r0M2
$$ -4 -100 -14 7 -91 27 -95 -3 -5 -27 -99 -81 15 -61 -1 -71 -198 23 29 -27 -28 107 11 -76 -101 118 78 101 11 53
2393E3o3M2Q9o2q3N8p6p3O0P3k8o5O9P3j08O7qj05J03q1J19j35J9J47j41R4pr
$$ 53 -10 32 121 59 -24 34 -42 -115 -55 18 -10 -75 -6 67 -41 26 18 -87 16 -65 54 -81 -62 85 -56 38 31 22
2421B2j30Q7P4j56R3J47j80l7OJ04j20k1J33j17J88j84n3P9K3J9R0j04J00R0j85
$$ 22 -108 -21 53 -103 -10 137 -43 -80 -74 30 -90 -111 22 -95 93 -91 -144 -65 -42 -23 67 -37 63 153 -32
2446c2j43J82L7K2q1pm2K9J46j74R7J1o8q5J26l1o6Q4J13p3j46LJ88j79J0J0K5
$$ -32 -175 7 44 66 -15 -22 -64 -35 111 -63 34 45 -23 -108 18 -13 -79 5 118 45 -101 -98 90 -89 -79 -69 -44
2473d4N0o2P4Mm0Q3j14J10Pl4l7k1Q2r9M9p7N9m0J38k7j47O2j12J98j18M6n1M2
$$ -44 6 -56 18 22 -18 65 -49 61 68 34 -3 -24 58 -41 8 -69 -10 -50 88 61 -86 -24 -136 62 -56 -10 -61 -19
2501a9p1J23O3k3Jk7J15j65PJ0m3j0j01P0O7j34J5J18O4m4j16R6jl0L0q0J76l3
$$ -19 -90 33 96 73 74 47 162 -3 4 14 -29 -39 -140 -70 -3 -137 -122 -4 60 16 -100 -4 -5 -35 -5 -85 91 58
2529E8j27R8r0p1J05%J21r3r8N1M1qm8N9R2j62q2J67K6m7k6O2j41N9J9ol0Q6j28
$$ 58 -69 29 -61 -132 -27 -27 94 1 -97 -46 -5 -13 -61 -2 90 -72 -154 13 39 -8 -34 28 -113 -54 -35 -41 -71 15 -113
2558a13J86j85n0J25O1j27J92q0j2M2l2m6J42n7j06J0Q3n4j49J30o9N2M3k4p3
$$ -113 73 -112 -162 -37 24 -103 89 9 -3 39 7 -39 103 46 -60 -50 33 -21 -170 -40 -109 -57 -14 -38 -111
2583a11J0J46m9J8Q1n6N5P6j45k2Q7j90J37Q1q1j39J61j03Qn2j5N1N1j27J65j12
$$ -111 -101 45 -4 14 95 39 94 170 25 3 90 -100 37 118 37 -102 59 -44 -36 -88 -103 -52 -1 -128 37 -75
2609g5N5n0J09m5N1p5L6o2P5M9J5j30J26j06njQQ2p6j15M2K46j87p4L1J00r1m6
$$ -75 -20 -70 39 -6 45 -30 6 -56 19 68 83 -47 79 -27 -32 -33 -25 57 -19 -134 -92 154 -33 -107 -76 24 -67 -113
2637a13P2p2K29j61R2J5On1K0J86j92P1q9K4M4l8J6j39O8N2q5J09n5m9o7oJ60
$$ -113 -41 -113 116 -45 47 62 68 17 37 223 31 102 13 37 81 43 59 -80 -12 40 -45 64 9 -40 -107 -113 47
2664D7j90j9K59j90J14No5R1K9j89J6R3k6o6K23j32O0l2j37L4J23o7p1k0K1R5
$$ 47 -143 -162 97 -93 21 26 -39 52 81 -108 -92 1 -25 -91 132 0 60 28 -109 -75 48 -19 -90 -110 -89 6
2690Fk9P0o9M1j46J00J68j83M6K5n3R9r0nL3l5J30k0n2n3J12j16K0k3j31M0O0
$$ 6 -23 47 -22 19 -127 -27 141 -42 4 29 -24 75 -15 -20 13 -22 108 88 36 -17 95 -21 -1 -24 -155 -115 -55
2717e5J06l5m8P6P2r3j24L7p5J54o8J87r2r8M8J20n0k6OLl7l8O2k9n7K5J03k6
$$ -55 51 16 -32 44 116 23 -101 -64 -139 15 -53 134 42 -56 -8 112 62 36 42 45 8 -30 32 3 -54 -29 74 48
2745D8l5q0L8j45K23P3j94N5K8l9K7J8J52j09j64J16P0l3o6j09R0J8J66k07K4
$$ 48 13 -67 -29 -174 49 122 -72 -17 11 -28 -1 17 169 60 -104 12 82 49 -17 -126 -36 -18 148 -59 -35
2770c5n5N2oj5R6j12P4rq8P9j5O3j07J46j10m3J20k5p6R7l2kp4Q6K9p4l3P2J9
$$ -35 -90 -38 -44 -59 37 -75 -1 -10 -98 -19 -34 29 -78 68 -42 -85 35 10 -66 31 -1 -3 -77 9 38 -36 -69 3 22
2799B2m4K6O8r6O6nj%l1P5q8kr8J10m4J9R3k3j63J35J18k54L7N6m3q8J24j03K52
$$ 22 -22 4 72 -24 42 37 36 36 5 80 -8 -10 -108 2 -42 -23 70 47 -116 19 137 -117 -80 -24 -67 -155 -31 -134 118
2828A18p9j33n4O8J33k29J77OJ7j23J03R5j7j30J15n5J7q8R7r3P4M8o5p9Q0L4
$$ 118 39 -94 -148 -80 53 -176 1 7 24 -99 4 99 82 -48 67 12 29 -59 38 -55 19 67 2 -77 3 37
2854C7J5p6J05p0j49J39K8Q2r7L4r1R7q2Q6Qk29J10k6J84k6L0q7o5l7N3P9p3J07
$$ 37 52 -24 81 11 -138 1 29 111 14 48 -43 54 -28 58 66 -163 -53 -79 105 79 109 22 -43 -80 -27 52 -21 86
2882H6j1k09J55L5l1m0J00j3n1O4p3l1J03m8J9j86N6Q5m2N9P9j05L7M0j36NR9
$$ 86 75 -134 21 56 25 -15 85 72 21 85 12 -19 84 36 55 -131 -75 10 -32 27 106 1 38 78 -58 -53 46
2909D6j2q0L6q9O7O8%L2L4k2J0j32K5rR8l8j6j3N0j38J32k43J45MQ0o3J2r1Q7
$$ 46 34 -46 -10 -99 -32 36 36 68 102 80 90 -42 -17 -26 72 34 18 5 55 -83 49 -194 -49 -45 35 -28 -16 -107 -20
2938b0L0r3O7J06P9j17l8J52n5L6j35p5J34o5J01Pj08J09j82J5n2J01N3o5J10
$$ -20 10 -83 -16 90 169 52 14 166 111 147 12 -63 71 6 107 114 6 115 -67 -52 -104 -3 50 -15 95
2963I5j62N8m0J10j95P9P6j39K45j89P4Pk8j51J13R5q2J5K4m8J01p8l2N3K1j00
$$ 95 -67 -9 -49 61 -134 -55 21 -118 127 -62 12 19 -9 -160 -47 48 -34 -19 5 -43 58 -20 -52 1 22 -78
2989g8R7K2m1lN5l3J20j97J20m6j0N2j4J56j69J38j23J32n2l9j01R4k1j29J4J10
$$ -78 19 41 0 -3 52 19 139 -58 62 16 6 58 44 200 31 169 46 178 126 87 -14 80 59 -70 -56 54
3015E4r2k0Q8k0l2J11r7K6L5m0N1j27J32r0rJ11l1j06J35j21Po6J27r9p9P6O4
$$ 54 -38 -58 30 10 -22 89 -8 18 53 13 64 -63 69 -21 -30 81 50 -56 79 -42 -35 -101 26 -73 -152 -76 -12
3042a2j7L9l9L2J4Jj2J01K0j06J8k6rJ44j99J26lj37J2k2N2o%M6l6l6L0m9N5O4
$$ -12 -29 10 -29 3 17 18 6 107 127 21 39 13 4 148 -51 75 72 -65 -53 -75 -23 -29 -29 17 -19 -55 -25 -74 -19 45
3072D5p8J32j39R5o3j26O8J2L5N6n2q7R2L6j1k0p3M5k9J18j4k7j5R9k06Q2N3L
$$ 45 -33 99 -40 55 -8 -134 -66 -54 -19 37 -15 -102 -10 26 15 -5 -78 -33 -62 56 42 15 0 99 -107 -25 28 31
3100C1n3L5N1p2P8j03n7P1NK3j30O0J18j8J7n1Q4j45P6j06m0J79l2n1L7q0N8k4
$$ 31 -22 13 64 -8 70 -33 -90 -19 -14 9 -121 -61 57 39 56 5 89 -56 20 -86 -126 53 21 -30 7 -73 -15 -39
3128c9J8J4J0P8l6j19J44j55K07j16j15R1q1ON4Q1n7r3L5J15P0nj07m2L4Q2p0
$$ -39 -21 -7 3 81 45 -74 70 -85 122 6 -109 -18 -99 -93 -39 42 -15 -108 -73 42 112 107 0 -42 -8 74 4
3155Dj41M7J05j43J40n7r7P2O9n2J71n0j65Q1O0P5j39M9m9j33J96k14J24j49J68
$$ 4 -137 -90 15 -128 12 -45 -142 -70 -1 -53 118 68 -97 -16 44 119 -20 29 -20 -153 43 -171 -47 -196 -28
3180b8N7j12L3J75j96J29o0m3O9np0R0j44J86j4N1j35lJ0J00q6j36O9J95j50Q6
$$ -28 29 -83 -50 125 -71 58 -2 -45 24 19 -51 39 -105 81 67 118 -17 -20 -10 90 4 -132 -63 132 -18 68
3206F8J42j99K39k64L8nM0q1J0j16K00j22N9m9P2j2j41K16j57J67j67k8L4J19
$$ 68 210 11 250 -14 24 19 59 -22 -12 -128 72 -50 9 -40 32 20 -121 95 -62 105 -62 -90 -56 63
3230F3m4Lr6J04m9Mm9J9n4M8J33q5l3j0%L8O1p8P2J8J5n8N3m9Mj5p2P3L3j51L9
$$ 63 19 22 -74 30 -19 -15 -64 -45 -99 -51 82 -3 -36 -46 -46 -8 53 -25 47 65 80 22 75 26 30 15 -57 16 49 -102 -63
3261f3R7j14M5J02o0o5J5P2P9j10Oo5J6Q3N5m4q4O4j31J06o5J26j21q9J19M9J01
$$ -63 34 -80 -35 67 7 -58 -43 29 108 -2 4 -61 -45 38 93 49 -35 29 -102 4 -61 65 -56 -145 -26 23 124
3288A24j72k4o1J16J1l3j1o6J47p5J57j71M6J00l5m6L6r7L7Q1q1m4K1N0N0r9r
$$ 124 -48 -72 -133 -17 -6 -39 -50 -116 31 -44 113 -58 -12 88 53 7 43 -54 -17 64 -17 -61 -40 10 60 -39 -48
3315d8Q5n1O3o0J0l1R9k2j77Q6J2j6%k5J51j26Q2j95J33K0j01J53J9p3K0q4ML0
$$ -48 37 -14 49 -11 -1 -32 67 45 -132 -46 -34 -50 -50 -75 76 -50 32 -163 -30 -10 -111 42 61 -12 8 -76 -72 -42
3343d2J10k7l3n9n0O9K8Q7j65J08m4O6l9l7M3p5Q0K1R6j05O9r4m8R8n3O2j38R0
$$ -42 68 41 8 -51 -101 -32 -4 83 -82 26 -18 48 9 -28 15 -60 20 41 137 32 101 7 -41 57 4 66 -72 18
3371A8j58J94j65J62k7J06k70J10R7n6N1j59K6J05j08O2q2J06M2oj07k8K0m1R1
$$ 18 -140 54 -111 51 24 130 -140 -30 67 11 62 -97 -71 34 -74 -12 -94 12 54 48 -59 -87 -67 -108 -17
3396a7P0j17J37K3q7j9Q4L4r4q9Q2J47j81K38k43K7R4j08m3J12l7L9l8p1m4J47
$$ -17 53 -64 73 96 9 -10 74 108 14 -75 7 154 -27 211 -32 -5 89 -19 -62 50 13 52 14 -57 -101 46
3422D6M1p9pK4q2J4QL1J15p8j42J28n0K3j35J72k6L0RJ23p3Q0j14j65O4m4J0N1
$$ 46 87 8 1 25 -57 -43 -35 -4 111 33 -109 19 -31 -8 -143 29 3 33 42 165 92 172 58 -107 -43 -87 -77 -26
3450b6J05j14l9K6RRJ0Q2Oj32mQ4o3l7J32p7J09k9m0k0r4J08j0j32R7rL0J5K4
$$ -26 79 -35 -74 -48 -39 -30 -20 62 68 -64 -68 16 -47 -84 48 -29 80 51 11 -9 -103 5 -5 -137 -40 -49 -19 -4 20
3479B0j7n8Q8j01K8R5j75J01n1M9J9l3j7J24K0m7o0J20j67J20p6Q5M0j25l7L5
$$ 20 3 -55 33 -68 -40 55 -120 -19 -70 -21 -2 -35 -52 72 92 45 -15 105 -62 58 -18 67 107 -18 -55 -20
3505b0l0J42k4p2M2j7m4L2RK0N1q5j0j42J17J08m0n3J29j20O3Mk5K3p1%pP2n9
$$ -20 -50 92 68 -4 38 21 -23 9 18 38 89 4 -6 -148 -31 77 37 -16 113 -7 56 60 35 58 -13 -13 -20 52 -7
3534gj4r5J55r0PM2J2j02l5L9o7K57j1q3k7RJ0n4L9nJ4m0J26m8l8J3M6j2l9N0
$$ -7 -21 -116 39 -51 -44 -2 10 -92 -127 -88 -155 102 91 8 -19 -10 0 -54 -15 -20 -6 -46 80 32 -6 7 53 41 2 52
3564E2o6o4l0J40J9J0r3n2N3m1P1P0j33J61m8k3L9j15J33Jj29p4R6Q2l1m2j18
$$ 52 -14 -78 -108 32 51 61 -32 -84 -31 -72 -1 69 -64 97 49 26 65 -50 83 84 -45 -119 -23 59 28 -14 -132
3591a32J92j92j1O4P7j3M1M4rj55J5K2P7J21k72J64m5O2J7m1lR4j39j4O7r3R0
$$ -132 60 -132 -143 -79 -2 -15 26 70 61 -94 -79 -57 20 141 -131 33 -12 50 67 26 23 117 -22 -36 31 -62 28
3618B8p3R0q5J14n2m2O0M0j08M1J7k6O2q1K3J0l6N4Kn6Q4k2pj25R2P1k21J43l0
$$ 28 -45 45 -40 74 22 -20 40 80 -28 13 30 4 66 -15 8 18 -18 36 38 -18 66 44 37 -88 4 75 -146 -3 -33
3647c3r6J41p0Q6m0M4N1j03J46k5Kj90J18L8o4j8m5J27k4p3N0J20j56rkJ7J03
$$ -33 -129 12 -58 28 -12 32 83 -20 126 101 103 -87 31 69 5 -13 -58 69 45 -28 22 142 -14 -23 -25 -8 95
3674I5k5n1j17O1L3R3q7Nj0rP5j00R9k32J09R0j16J59O4k01J9K1J9J7n9P9k8R
$$ 95 70 19 -98 -37 -4 89 2 7 -3 -12 63 -37 62 -170 -61 29 -87 72 136 -65 -46 -25 -6 11 -48 31 3 12
3702A2j10J6j14Q7O3j0lM2J02r9K8J2q6R4L0q4o4lJ04pk0N9j01m2M4p9L6R8N0
$$ 12 -98 -82 -196 -109 -46 -56 -59 -17 85 -14 14 26 -60 34 64 -20 -84 -87 17 10 -10 49 -52 -94 -50 -129 -93 5 55
3731E5o7l3J50n4q2J6J2nO8n0k42J48J07q4J00j83J32P4r1j0Q0J3qN9j96J16n0
$$ 55 -12 -45 105 51 -31 -15 -3 -8 60 10 -232 -84 23 -61 39 -144 -12 62 -29 -39 41 54 46 105 -91 25 -25
3758b5o0N0J46m7j16P1j28Q8R6k1J05j00K7r9LM0o1N6O0kj27m4J3J3R2o5Lq9P9
$$ -25 -85 -35 111 64 -52 19 -109 -21 75 54 159 59 86 -13 -10 30 -31 25 85 83 -44 -88 -75 -62 30 -35 -32 -121 -42
3787d2Mq7J83j10l7M0K5jq6R3q2J51J3n3k0N0n9P8m1n8N8ro8R9Q3J0r0l1K2l7
$$ -42 -38 -125 58 -52 -89 -49 -24 -25 -111 -18 -100 51 64 11 -9 41 -18 60 19 -39 19 10 -58 41 124 134 44 13 35 -2
3817bm3j30J01J3J65r7o7J3O3j1j3O0o3Lj6L7o9K5QJ8j04%J00n5Q7j14J6k0J49
$$ -2 -45 -175 -74 -61 104 7 -60 -47 16 5 -8 52 -11 -8 -24 13 -56 -31 -23 -5 -109 -109 -9 -64 23 -91 -75 -95 54
3846E4l2k6o7L7J83k07Q4j2l8O3j04J15mm0l9Kn7J11j2R0p5J1K2q6J7m0M4k3P9
$$ 54 22 -4 -71 -34 149 -58 26 14 -24 39 -65 50 46 6 -33 -31 -88 23 11 101 26 37 59 -27 -10 -50 -6 -29 50
3875E0L8n5mpJ8r6J20n8o8R8j74J04L3L9j20J19p9L7L1j02P7o9MM0Oj0pj3MO4
$$ 50 88 33 29 22 40 -56 64 6 -62 36 -138 -34 -1 38 -82 37 -42 -5 26 -76 1 -68 -64 -24 -18 -28 -35 -48 -44 20
3905B0N3j66J62r7JJ00j30L6J46k02L4M2J6k0l9m0O2L3q8R6Rl2N8k2J6r1KJ33
$$ 20 73 -93 69 -28 -27 73 -57 -21 125 -77 -43 -1 15 -5 -44 -84 -22 11 -77 19 28 -4 54 32 48 -43 -41 92
3933I2q8m2Q1oj04l6J23m4P4o2K0L1j8m0k3l3L7N4j54R3m8K09j03P9j18r7LJ36
$$ 92 4 -38 43 37 -67 -103 20 -24 50 -12 8 39 21 -19 -42 -75 -38 16 -138 -45 -93 116 13 92 -26 -123 -120 16
3961A6L8p7pN4n3NK1k4J74j26J03j33jkj12J84m3j31K5O8q5J06j1O0p8L1Mj57
$$ 16 54 -23 -30 24 -29 -24 -3 -27 147 21 124 -9 -10 -12 -124 60 17 -114 -89 -21 -106 0 -11 49 -29 2 6 -151
3989a51K33q1l2j10J22J6l2l0N9Qn1l2j8N9o7qK0N7j03J76l4M2J05p0p2n1P0R
$$ -151 82 1 -31 -141 -19 -3 -35 -65 -6 2 -49 -81 -99 -40 -107 -115 -95 -38 -141 35 1 43 148 78 6 -45 25 34
4017C4O0l3j9R7l3m7o7j56K43q5l5J36j92J01j34R8K4j59J01Q7O6k19K67k44J48
$$ 34 94 61 42 139 106 59 -8 -164 79 -6 -41 95 -97 4 -130 -32 -8 -167 -66 21 87 -132 135 -109 39
4042C9j2j48J87m7j13J6n4M3J01P4j45k8J11K2k2Rlj08R0j03j9J12m7q2M0j0M9
$$ 39 27 -121 66 19 -94 -78 -132 -89 12 86 -59 -87 24 46 24 33 30 -78 12 -91 -110 2 -45 -127 -87 -97 -48
4069d8Q0M3k17J22P1n2J21kn9j4p8J1O0n8K9M5m7k1j17K4P4k0m7J12J31j38L4
$$ -48 32 75 -142 -20 51 -1 120 118 59 45 -33 -22 38 -20 9 54 7 -14 -131 -107 -33 -53 -100 12 143 5 39
4096C9j22M9k1R5k2p9r1J61q2K8K0J0pn7J69j50R3j46J66j00L9m7P0n9K50k25
$$ 39 -83 -34 -55 40 18 -61 -152 9 -73 -45 -25 -15 -22 -79 90 -60 33 -113 53 -47 -8 -55 15 -44 206 -19
4122a9%J14k4O4q6ol5J47j39L9m4lP5q1q1p5O2K5p3J82kr6J25r2J5Ok1N8j9j13
$$ -19 -19 95 71 135 49 43 8 155 16 55 11 8 83 2 -79 -154 -92 -67 -140 42 40 -56 69 -23 -8 -2 -23 35 16 -97
4152i7o0J22%J16o9n1O6l1P9j29Q9q6p8J68rJ6l7o4PpJ59n6l8K9L5j87J94j4o1
$$ -97 -157 -35 -35 81 12 -39 27 -4 75 -54 35 -51 -129 39 30 46 9 -55 -48 -55 104 48 10 39 74 -113 81 67 6
4181Fp5R2Q3j66Q4o5l5J11K1K5j52J48j66O6PP8n1p2QO0pJ4j1N3j18P0L6j00N8
$$ 6 -69 23 106 -60 24 -41 -76 35 56 81 -71 77 -89 -23 -16 62 11 -61 -53 7 0 14 3 56 -62 8 44 -56 2
4210BR3Rj69J01J5K2p0L0l4P0M9j09L8J7m8Nn7J73k2j74o7J99l0j2J14j13j05
$$ 2 95 104 -65 36 51 73 3 33 -1 69 118 9 47 64 16 21 -36 137 115 -59 -126 73 43 31 145 32 -73
4237g3K0J27K5j36M1k5j2J6L2j9k8p3J33j05N4l5J03p1m1L1M0l7L8%J37r7o4J10
$$ -73 -53 74 99 -37 4 -21 -33 -17 15 -4 -32 -105 28 -77 -23 -58 45 -26 -67 -36 4 -33 5 5 142 45 -19 91
4265I1j55J06J7j23N8J03N6l46K65n6K3n6N6l7k1Q0o6Q1r0M8q8K24j85qJ52j91
$$ 91 -64 42 59 -64 -6 97 153 -193 72 16 39 -17 39 2 -19 61 -5 76 -14 34 -54 170 -15 -23 129 -62
4291f2K48k11N3j0r8M9M5o3q6L7P9Qm9J21n8pL4j54J02N5j13J9N6L4K7p6O5J09
$$ -62 186 -25 28 18 -80 -31 14 -49 -135 -98 -19 -11 -60 61 3 -4 30 -124 -22 33 -80 -61 -5 29 56 -20 45 154
4319A54j79L3N8J7n9L0J09n2j25l0P1K1r9J31k7l0q3M5N6n5O5j73J8P5M2j0m9
$$ 154 -25 8 66 83 24 54 163 111 -14 -44 27 48 -51 80 53 23 -60 -15 41 -14 51 -122 -104 -29 13 3 -46
4346d6KP9j36J87J4j66K29k09lO0j1L3j9m4Mm0L3OJ8l9K4j4oJ24j92J26k0P6m4
$$ -46 -44 35 -101 86 100 -66 163 -46 -49 11 0 33 14 -30 -26 -66 -33 -27 -9 -48 -24 -38 -44 80 -112 14 -6 70 26
4375B6m9Qo5J11n5R4K3qo9n6mjL7m8O3o4NN0r5J40j61J49K1L7j29J8J8K06k72
$$ 26 -23 -15 -80 31 -24 70 93 85 16 -40 -44 -45 -8 -56 7 -57 -52 -2 -97 43 -118 31 52 89 -40 -22 -4 202 -70
4404g0J0L0o9J4J58j04p0P3j21J97j02KM6o6J22j39K59j60O0j28O2L9JK9ON5q2
$$ -70 -60 -30 -99 -85 73 -31 -101 -28 -149 48 -54 -52 -6 -72 50 -89 170 10 70 -58 4 43 44 73 79 134 52
4431E2Oj48K3Q1j6j7O5j16O9K8Lr0pJ22j74m8J56Q7j4o0j4k2J77r3j29R0J9l0
$$ 52 58 -90 -67 14 -2 -19 46 -70 -1 27 30 -60 -67 55 -119 -167 -11 76 62 2 -12 -34 143 50 -79 11 30 0
4459@k1J3o0R6N9q6nl9L9P1q9r1J49l3p0K9m2N0N8r2N8l1J59k0k23O6N2O0j58
$$ 0 -21 -8 -68 28 87 1 -4 -43 -4 67 -22 -113 36 3 -67 -38 -80 -30 28 -64 -6 -37 122 102 -121 -55 -3 57 -101
4488a01J43o1K8J9%k8N9j52M5P8j31n6J58k9R3l2j8m8n5O3P6p8j2Jk4K6m1o3J85
$$ -101 42 -19 9 28 28 0 59 -93 -48 30 -101 -157 1 -28 65 33 15 -33 -88 -25 51 -27 -39 -38 -62 -36 -77 -140 45
4517D5p0J04k0kp6Q4L9j34N4q7j0J9J13k26K04K8p5j2k3O3O9p9q7K43j74M2j13
$$ 45 -25 79 59 57 -19 65 104 -30 24 -63 -73 -54 59 -167 37 65 -10 -22 -45 18 87 8 -79 164 -10 32 -81
4544h1Q3k4O6j39J92j48Q9jj42Q8o0QP7R6r5m7QM4L7j15R8j8N6j43R5rpj19P0
$$ -81 2 -22 44 -95 97 -51 38 37 -105 -17 -77 -69 8 104 9 -38 -30 14 51 -64 34 16 72 -71 24 15 8 -111 -41
4573d1MRQ9k9j7Q6m0q6J01j18J1K9N8oj40j9K30j55M0J39q2l4O9r5J71j93J4Q8
$$ -41 -37 -28 61 32 15 101 61 -25 76 -42 -31 -2 56 50 -90 -109 121 -34 6 145 63 29 98 3 174 -19 -5 83
4601H3j05L9Kr0J28j25J23j03k1P7j1qj7k8K1K6o3N8r3pK00j72J19NlJ5Ql3q3
$$ 83 -22 17 19 -71 57 -68 55 -48 -69 8 -3 -11 -28 -56 -35 -9 -72 -14 -107 -114 86 -86 33 38 35 50 58 25 -58
4630e8J10L5j17Pr4K63j21r3RJ77j62J18k8j13pL1J45j40P1J6p9L2p4J3KP0N9
$$ -58 52 87 -30 -23 -117 146 25 -68 -59 118 -44 74 46 -67 -74 -43 102 -38 33 49 -30 2 -72 -59 -57 13 72
4657G2k27J76Mj05O9j10j4J01P4K8j27K7j4K7R8j11P7k19K06N2l5p8Q7j50J55
$$ 72 -155 21 25 -80 -11 -121 -135 -34 40 68 -59 -32 -46 -19 79 -32 45 -174 32 84 49 -29 58 -92 63
4682F3r1R5p4J33j93J9rJ80o7J4n5m9Q2q3J09o5r2J39l9j7J14j5j20m4%NMj1P9
$$ 63 -28 67 -7 126 -67 -48 -57 123 56 70 15 -34 48 -35 74 9 -83 56 17 0 114 99 -21 -65 -65 -60 -56 -67 12
4711A2o3o0k1J38p0NL3l1N8J7N9l2l6L3j98K03Q5r3j14J58j78K4J12O0l8j11N5
$$ 12 -51 -111 -132 6 -64 -59 -26 -57 1 18 77 45 9 42 -156 47 132 39 -75 83 -95 -71 41 101 63 -48 7
4738GO1p1P7j05j0J02J0Jj56O0r1l3K36o4m2Kj0J41k05K1N5Q1p8kR1j75M0J5O
$$ 7 68 -3 74 -31 -41 61 71 72 -84 -24 -115 -148 88 24 -18 -16 -26 115 -90 -69 -14 67 -11 -13 78 -97 -57 -42 -36
4767c6N3j17L3J19q9M3m3J4R1K4p1j63J42j0L3j6q8J15o6P6L5k6J2q5k6J00k2
$$ -36 17 -100 -67 52 -37 6 -37 -23 68 92 21 -142 0 -10 23 7 -81 34 -32 44 79 53 65 -20 -46 54 32
4794C2J04m3o6K3r7M0N8m6K8j15J13o5J16j02N4j26J31r4J42q2Q6L9j45o9P1N1
$$ 32 136 93 27 50 -47 -7 51 5 33 -82 31 -34 82 -20 34 -92 39 -55 87 5 91 130 -15 -84 -13 38
4820C8j12J1Q0j00o9M7J07J8k6J4j34J43M0j31J38L6j48J01L7j06lR6p2L0L3p8
$$ 38 -74 -63 17 -83 -152 -105 2 20 -6 8 -126 17 57 -74 64 100 -48 53 90 -16 -19 77 5 35 68 -10
4846a0q9J90j30k6M4J40k15m3J39Q1j67j0J62j2j42K9m0J06J9nj01P2j28J38M6
$$ -10 -99 91 -39 -65 -21 119 -96 -139 0 81 -86 -96 66 54 -88 -59 -99 7 26 21 -80 -8 -136 2 48
4871D8r2J65j06L7j4k3r1m0O6J25r5J0o7J13j59Q2P1j6J4k2J3k7KJ86j20m8lJ2
$$ 48 -44 121 15 52 38 15 -76 -116 -50 75 -20 -10 -77 36 -123 -41 30 14 28 6 19 -8 -6 180 60 12 9 21
4899B1k7J2J4J17j23L9j6j02L3j7J02%k08J04J3L5M3j03K6j0LM4j46J95o7n7J00
$$ 21 -6 6 20 137 14 53 37 -65 -32 -49 53 53 -155 -51 -38 -3 40 -63 -37 -47 -44 0 -146 49 -18 -75 25
4926B5J5j53R3J1J6o4LP8LnN3n1k7Q8j1l0K4M7j05K1m1l4l0J63Kj21O4Q3j00n0
$$ 25 40 -113 -20 -9 7 -57 -54 24 27 22 75 24 -3 85 74 44 68 115 10 31 -10 -44 -74 89 91 -30 34 117 17 -33
4956c3K4j8N5j30m7K33j05K0P5rk35K42r0o4J33p5K1k2M9p0P8n8j26R8N0q7J96
$$ -33 -9 -27 28 -102 -149 84 -21 -1 74 65 -170 72 -18 -82 51 -24 -3 -25 24 -46 32 -26 -152 -54 -4 -91 105
4983A05j60Q4Qr8O4p2O4J49q6O7n6j72J20r2J51r8P8j49r1L71j28J3l6k4m3K7
$$ 105 -55 29 37 -61 3 -69 -5 144 58 125 69 -103 17 -75 76 -22 56 -93 -184 187 59 72 36 12 -31 -4
5009d%q5N8j1R3n5N0J8r9K5Qj2L1r0J59n4j8o1O5N3r7P1m3P1k00J21J0o9J34M5
$$ -4 -4 -89 -31 -42 51 -4 46 64 -35 -10 -2 -14 17 -73 86 32 14 -47 18 71 -26 45 2 73 -127 -6 4 -65 69 114
5039A14j52k7k8P7M6j27K9J45k0k5J15j49Mq1O8J8j35J08%NPL0n1roJQQ4j76Q6
$$ 114 -38 -65 -93 -16 30 -97 -68 77 57 32 147 -2 2 -79 -11 7 -128 -20 -20 -15 -8 22 -29 -38 -44 -43 -35 49 -127 -41
5069d1l8M7k0K18j56RL1j23N9L9mj40J67p7M4jj03J63n0p1J13n6J2j6J13j09k3
$$ -41 -79 -32 -52 166 10 19 50 -73 -14 25 21 -119 48 -29 15 14 -89 74 24 -47 66 10 22 6 119 10 -13
5096a3j5m2N4om7J08M9j61Q7o4O2l0j15J67q4j11K03p9l5K4o4O5n6J98m2pl8R2
$$ -13 -28 -70 -16 -22 -69 39 88 -73 14 -50 12 -18 -133 34 -50 -161 42 -37 -72 -48 -112 -47 -103 95 53 46 8 100
5124A00k18J52m4k8k4Q1p6O4k4L4rN4j41J36r4R0pQp4r2J83k08J67J07r2J1l7
$$ 100 -118 34 -10 -38 -62 19 -57 7 -17 17 8 62 -79 57 -37 53 46 54 -20 -112 71 -137 30 137 45 56 19
5151A9p1k6R5lj26k7J8J14O3K5j08j3KK0n8J57j69O6r2N8J9O1n2mP6r7J54k4j03
$$ 19 -52 -78 17 14 -112 -139 -121 -7 56 81 -27 -40 -38 -18 -76 81 -88 -22 -114 -56 -37 24 -28 -32 44 -53 101 77 -26
5180b6Q6j6n4n7j23K19P5j62O3N0m6k5l9J11q0N4RM0j09Rj9L9l2mK57k30K1m3
$$ -26 60 44 -10 -67 -190 29 104 -58 5 55 9 -16 -55 56 -24 30 39 79 -30 -21 -40 -1 -33 -37 220 -10 11 -32
5208c2p3N2J00m3KJ52k55J36l3m7k3J19j69J28n3J04k44K26j69J33K2k2N2j17
$$ -32 -105 -53 47 4 6 158 -97 39 6 -41 -64 55 -114 14 -39 65 -179 47 -122 11 33 11 63 -54
5232e4J46pj28Oj0J23q8J7P9Mj19K6K18k24J93k00M6N4K9r5k1qO0l5j1k8J2P0
$$ -54 92 85 -43 -37 -47 76 -12 5 84 88 -31 -5 213 -11 182 -18 28 82 111 16 -5 -13 47 12 1 -27 -15 55
5260E5j81J49p2j9NJ46j36j2J00p7l9J17j7nn3k7KQ5L5o2k16K98j70R6N5lj05
$$ 55 -126 23 -49 -68 -63 83 -53 -65 35 -42 -81 36 19 14 -39 -66 -64 21 56 -6 -222 76 -94 2 57 54 -51
5287e1O3J7k4%n6K28j70j04K23j13j0k2K2L0O0n1j33J1L0J7l5j6q3J80o7p2J76
$$ -51 12 29 5 5 -51 177 7 -97 126 13 3 -19 3 33 93 42 -91 -80 -50 -33 -68 -84 -167 13 -54 -126 50
5314E0m8J41j59j91J21L5N4j49J15mJ03q0r3J18L5o3j0J28j53M1P1OK4p8n4j14
$$ 50 2 143 -16 -207 -86 -51 3 -146 -31 -35 68 -12 -105 13 48 -15 -25 103 -50 -9 62 68 92 14 -40 -154
5340a54M3P8o3J04j9J11n0q9J21k2P9j60Q7j06Q7k00J48L5L3m9j18J08N7k8j10
$$ -154 -111 -33 -96 8 -11 100 50 -39 82 60 139 -21 66 -40 47 -153 -5 30 63 14 -104 4 61 33 -77
5365g7R2q2p6J91nj65J59p1J8o8Q2J8r3P5k0m8J68j68L9N8L3j13P2%j22K4J25
$$ -77 15 -67 -143 48 43 -122 37 -34 -16 -84 -2 16 -77 -2 -22 -70 98 -70 -31 27 60 -53 19 19 -103 -79 46
5392D6q3K0R2j08J87j12p3L9J2N7o0O2K8k15J66o6N3N5p4n0%n2j3Q4N7l4J8q5
$$ 46 -37 -17 75 -33 154 42 -31 8 20 77 17 79 107 -108 58 -8 45 100 26 -24 -24 -76 -89 -5 52 18 36 -49
5420d9m7O2j14J53j18L3Q4J8nr9qJ25j59J03k0n8L3J04jl6k6J64j61J1Q6j1l8
$$ -49 -96 -34 -148 5 -113 -80 4 22 17 -82 -90 35 -124 -21 -41 -99 -66 38 37 1 -25 139 -22 -11 75 64 26
5447B6l4n1J04m8oP7rr8J7O1p8L7L2N7q5P6n8k0J6l1Mn8J00k8j26Q4j1K5M3r5
$$ 26 -8 -59 45 -3 -9 68 59 -39 -22 39 -39 -2 30 87 2 78 20 0 16 -15 -11 -69 31 3 -123 -39 -50 -25 18 -77
5477g7Q4l9J04j60J50qol7L4R5j98J38j25R5r0j4J1J0O6o7o8J45M1o0J3m9j68
$$ -77 7 -32 72 -88 62 54 48 11 45 140 -58 80 -45 50 -40 -54 -43 -33 33 -34 -102 43 84 24 37 -12 -180
5504a80K77j00K6K7O3p9j24L3L8k6R1r7J01M2o8l3M3m2j48J04l5J59k2j40J49
$$ -180 97 -3 23 50 113 34 -90 -57 -19 -45 46 -51 50 92 24 -9 34 -8 -156 -52 -87 72 50 -90 59
5529E9M0j5q0j3pLj9q0R6m6n7R7K01k31J26j43K8J57k8m5r4J32q4jj2l2mJ08J
$$ 59 99 84 4 -9 -16 -13 -32 -112 -16 -62 -119 -22 179 -52 74 -69 -41 116 88 43 -51 81 -3 -4 -16 -48 -52 56 57
5558E7K9l3M9j20N7o6j11J08l4J46n8L1q1M1j15P3L8j80N8O9N4p7L2K6j29J27
$$ 57 86 53 102 -18 39 -27 -138 -30 -64 82 24 55 -26 15 -100 -27 11 -169 -111 -42 12 -65 -33 -7 -136 -9
5584in1M0P8j5j27M3l5J22l9m5K7k9J11j9m2O3M3k8o9J64k34M1J77j95kkQ6j36
$$ -9 -60 -20 58 43 -84 -41 -76 46 7 -38 -11 -40 71 52 10 73 116 88 19 183 -51 -10 167 -28 -30 -32 54 -82
5612h2P8N5K8j66j2M0Q3j6m3l1J38j33l5N2J6K12j64m1l6oL4k2J21n0j17M3n0
$$ -82 -4 51 79 -87 -99 -59 24 8 -35 -66 72 -61 -96 -44 -28 184 20 -21 -57 -63 -29 -51 70 20 -97 -54 -104
5639a04R7M3q4J6Q3j23J08r6P2RJ10l8j12k2J04j54L6J95m4m2l7j8J33r0qL8j81
$$ -104 -7 36 -48 -32 51 -72 36 -60 12 21 131 93 -19 -41 63 -91 -55 140 96 54 17 -1 132 42 34 72 -109
5666a09J42p6J4n8N6N9j65Lk1J27k3J13j46K9L0l3N7L5M8j05K%M3P4r8J1J04r1
$$ -109 33 -43 -29 -87 -31 28 -137 -134 -155 -28 -51 62 -84 -55 -25 -58 -1 34 82 -23 -21 -21 22 96 -2 9 113 22
5694B2l0j5q4j2J20qp7JL3J47o3K0l8j24Q6K8P6j03j08O3K0k3J21m6l4p1p1J40
$$ 22 -8 -23 -107 -119 1 -7 -84 -83 -50 97 34 54 16 -108 -22 6 82 -21 -129 -66 -46 -69 52 6 -28 -99 -170 -30
5722c0J30q5R7j38M8O5k11J15J33n9j53P8j6J37k05kJ44K2L0j6o6L3j14N3M1J34
$$ -30 100 15 112 -26 22 87 -124 -9 124 65 -88 -10 -26 111 -94 -96 48 70 100 84 18 51 -63 -10 31 165
5748A65j06o4nMJ10n6j16J77Jk22J89j7n4k8K8j9N3m0MN7L1l9J0j32J25M0j02
$$ 165 59 -5 -10 -6 104 48 -68 109 110 -112 77 60 6 -22 6 -13 40 0 4 61 92 53 63 -69 56 96 -6
5775fl5k4PqM0n8O8k4L6K7k5M9j67J69l3o3NK00j47N1l9q5K3J09k43K08o0K9l1
$$ -6 -41 -65 -58 -66 -26 -84 -16 -40 -4 23 -2 47 -120 49 16 -47 -42 158 11 62 23 -62 -39 70 -173 35 -25 4 -27
5804b7k3j7O8l1J02m1r4J39r1lj24J56N1j22L8J0M2j21L33k85N5r0K6K1J5q0J20
$$ -27 -50 -67 1 -30 72 31 -63 76 -15 -18 -142 14 65 -57 -19 -9 33 -88 245 -40 15 -75 -49 -28 -13 -93 27
5831B7j13l6K42j52J3p1J38p5J9q4Q5J39j90J18r0K0J3j1n1K5j9P6J6q1J18n2
$$ 27 -86 -122 120 -32 -19 -90 48 -27 -8 -92 -7 132 -58 60 -30 -10 3 -8 -59 -34 -53 23 39 -42 76 24
5857B4r6L9o8oJ58P5n6K8k3j14P8J1j11P4J0j7M7p7OLj1O9q8J2N7j49J38m7j7
$$ 24 -72 -33 -101 -107 51 126 70 98 75 -39 39 50 -61 13 23 6 53 -24 -18 -15 -26 43 -45 -33 24 -125 13 -34 -51
5886e1J42k20M9J44j26P5J7m5J4j6jLL9K5k6O3j13k2N1J0L6j30mJ20j00J28j63
$$ -51 91 -129 -80 64 -62 13 30 -15 -1 -17 -18 -15 24 49 23 86 -27 -49 2 12 48 -82 -86 34 -66 62 -101
5913a01K7K11j49mnL6p6J05p9M6R9r0Rj4%j11L7Q0n3k5J00k0Lj5j03N8r9J32J66
$$ -101 -74 137 -12 -16 -21 15 -61 44 -35 11 110 20 29 15 15 -96 -59 21 -32 -57 43 23 26 11 -92 -34 -133 -1 165
5942A65r0o1r7Q8O3j30M0J31q3o0M6p1R5p8J08l3N6p7J46o5r8R6m0J1j48J30N
$$ 165 75 14 -83 5 68 -62 -22 109 26 -34 12 -59 36 -42 66 33 89 12 158 93 -5 91 51 62 -86 44 49
5969D9N8q9j25N1P9l7kn8O1j09J02Pj6l8nQ0q4J55nj26k5k5J12m5J42k02NJ7R9
$$ 49 107 18 -107 -56 23 -14 -16 -74 -13 -122 -20 -13 -29 -67 -72 8 -76 79 74 -52 -77 -102 10 -35 107 -95 -90 -73 26
5998B6n5J11j25P2L6J10j88K8J2j93J78m0O4M9n8J12j88n8n3K23q7N1r4O3M0q9
$$ 26 -29 82 -43 29 65 175 -13 15 27 -166 12 -28 36 85 27 139 -49 -107 -160 63 -24 27 -67 -4 36 -53
6024e3N7K5j17M7j5k8J66j61J31j53R3k7k0J4k6L3N0J1pl7l5J21J6n6K2M2p2p2
$$ -53 4 29 -88 -41 -56 -84 82 -79 52 -101 -8 -35 -55 -41 -67 -34 16 27 20 -17 -52 69 85 29 51 93 21 -51
6052e1O6o7M8m9J81j49NK5J42r6O2m2K8J3l9K8j43j0N1M5j11J07j18PJ20j09Q1
$$ -51 15 -52 -4 -53 128 -21 -16 9 151 55 117 75 103 116 77 105 -38 -48 3 48 -63 44 -74 -67 53 -56 25
6079B5n9r8J63r7R0j81J86n4pj12P4L8k2J0N6lk2m7J68n7j08K67j64m5o4Q0j0
$$ 25 -34 -132 31 -66 24 -157 29 -25 -32 -144 -70 -32 -54 -44 12 9 -13 -60 108 51 -57 210 46 1 -63 17 7
6106GJ6j06J1lJ14j68J41N4p6MJ33Ok36J21p3Q2j65P9L0oJ43kj06n1N5o3J0P3
$$ 7 23 -83 -72 -75 39 -129 12 66 -10 -6 127 133 -103 18 -55 27 -138 -59 -29 -35 108 106 0 -51 4 -59 -49 24
6134B4O0j05J23p0n4mp0Q8p1J50j39P2J65k44L0m9J89m7M2k19K33m0r6L5r4J50
$$ 24 84 -21 102 32 -22 -26 -96 -8 -79 71 -68 4 169 -75 -45 -94 95 48 90 -129 104 64 -32 3 -91 59
6160E9N1j39k3O6L3j01L9j9J3kj1K8R7j51p0J32NQ5m1q8jk9j2P2j05J61q4o0Q
$$ 59 110 -29 -52 14 47 -54 -15 -34 -21 -23 -34 -6 91 -60 -130 2 7 92 51 -37 -38 -67 -79 -7 -112 49 -35 -95 -87
6189h7M7l0J35M2j07N8j49J94j57K6j4m2J11J2p7R6l1q5O7rj39JR1R4r0J6J7O
$$ -87 -40 -70 65 107 0 58 -91 103 -54 -28 -42 -84 27 39 -38 58 27 -58 9 0 -139 -138 -47 47 -43 -27 -10 -4
6217dM9o9Lm0qN3p9M8N2r7J16K0p4L4P4l8j67J33j14J26j66J69j58J30q4k7N1
$$ -4 45 -24 -21 -61 -69 -16 -95 -47 5 -92 24 44 -30 4 78 40 -127 6 -108 18 -148 21 -137 -7 -91 -118 -67
6244f7L9Q1j21Q7roj11P4L7J62k02N6L1n7m4P2kj04J56j6r3P0q4N5M7k03K00p9
$$ -67 -28 53 -68 19 10 4 -107 -33 4 166 -36 20 51 -6 -50 22 20 -84 72 56 -37 33 -51 4 51 -152 48 -31
6272c1O4o4RJ4o7M8J51j15J51k17R0j6m2L3r2J11M7m7m9q8N4J07K8p9n6L3q6J7
$$ -31 33 -31 -22 -8 -75 -27 124 9 160 -57 33 17 -25 8 -84 27 74 27 -22 -110 -56 51 79 0 -56 -23 -109 -92
6300i2j6K40j83J29q7K9K5K7L8j34j8J10L9p1kL6l0O2k0p8K9m5P4M0l7n9oL7L4
$$ -92 -108 132 -51 78 -9 20 45 72 110 -24 -42 68 107 36 34 70 40 102 82 4 33 -12 62 102 65 6 0 37 71
6329G1L7n7j32J68o1k9p3J16j25N5o3K0O4J02m1j96J38j03J17N6K8k07j7J03M7
$$ 71 108 51 -81 87 26 -3 -76 40 -85 -30 -93 -73 -9 93 52 -144 -6 -109 8 64 92 -115 -132 -29 18
6354A8o2J07p6n1O6N9l2r5K10k55K13p7L9k8p0K9k8J56k46J19N1N2j87M1P0qN4
$$ 18 -44 63 -13 -64 2 61 29 -66 144 -111 102 25 64 36 -34 -5 -33 123 -123 -4 47 99 -88 -47 23 15 69
6381F9j02J24j44K2m9L6OJ25j85O3N1p3Q2J07j47L5k9rM5j1J0k6Q3j07J27n2n9
$$ 69 -33 91 -53 -31 -80 -44 -38 87 -98 -35 16 -57 25 132 -15 20 -9 -18 27 16 26 0 83 -24 103 51 -8
6408hQ8m9n1QJ03j61R5m2p1N9J00J4j0j7M2m5n5j7NjL6M5q5mP5l8j03L9L3J01
$$ -8 80 31 -20 -12 91 -70 25 -17 -88 -29 71 85 75 58 100 55 0 -17 -12 -13 23 68 -17 -21 54 16 -87 -48 -15 86
6438H6r4n6n8J51j81Q1P8q9K25j78j0QK3l4J39j68j23J96K4op7P2L0N5l6j03M3
$$ 86 -8 -64 -122 29 -152 -71 7 -82 143 -35 -45 -37 -14 -48 91 -77 -200 -4 20 14 -63 9 39 94 58 -45 -2
6465bR7k24J52kP2LOq7n5nM9R2j51n5J05Q3j42M6n4K7lJ56p5m7l4J16j12n2J04
$$ -2 95 -129 23 21 93 96 102 15 -40 -45 4 96 -55 -110 -5 78 -64 -18 -72 -45 -48 108 33 -14 -48 68 -44 -96 8
6494H%L4mp2K2r5J33L7o9n4J09o6LP4L0q0q8J28O0J4j17N6m6j52K75j54K9N3l5
$$ 8 8 42 38 -34 -12 -107 26 63 -6 -60 49 -17 -14 60 90 10 -78 50 110 124 7 63 17 -135 140 -14 15 68 33
6523C3o5J38q4n0J36j13j14J28Q1l0q9k4J15m6m1j3Q2J6o2N5k82J72M3J1n5o4
$$ 33 -32 106 22 -28 108 -5 -119 9 90 60 -29 -53 62 16 -25 -38 44 60 -2 53 -229 -57 -14 -3 -58 -122
6549a22J79j75NK27o3l3Kp1N6m8J04J23j49j05O2J56k58J15Q3r3J08k50K95j17
$$ -122 57 -118 -113 114 51 18 20 -51 5 -43 61 184 35 -70 -8 148 -110 5 88 -5 103 -147 148 31
6573C1n4OOK7J37j77O5j1o2n8PqR5oJ17j5l6J6r9L8r0k0L0n3N2R0k1j80J17k9
$$ 31 -23 -17 -11 16 153 -24 41 30 -32 -90 -83 -91 4 -2 115 100 64 80 -19 19 -71 -91 -61 -114 -62 28 7 -173 -56 -85
6603h5J4J8J7m4K7P6n2J36r7J2o7K0K2J08R1j12j72J65l7o5L6K9N4j54J24o5q3
$$ -85 -71 -53 -36 -80 -53 23 -29 107 10 22 -45 -25 -3 105 196 84 -88 77 40 -25 11 40 94 -60 64 -1 -84
6630h4K5J21j49J19r3OL1JJ53p4p0j04J15J8qj3jk9L9r2N5J10j56K0L6J16J9o6
$$ -84 -59 62 -87 32 -61 -55 -24 -23 130 56 -14 -118 -3 15 7 -6 -7 -36 3 -89 -34 76 -80 -60 -24 92 111 45
6658D5j24M5m5N2K4m5lk7J40j5r0P2J3Mj27R8J86l00k1J58l2K0P1p6j03J18nN6
$$ 45 -79 -34 -79 -27 -3 -48 -51 -78 62 47 -43 29 42 46 -81 17 203 -97 -118 40 8 28 99 23 -80 38 33 89
6686H9j89J00k1L3o3J6O9j03o0J99j25P9n4n5J42n6n0%J01L6r2M8p4N3l7K4j43
$$ 89 -100 0 -21 12 -51 -35 34 -69 -129 70 -55 24 -30 -85 57 1 -49 -49 52 88 -4 44 -30 23 -14 10 -133
6713a33K19j3j74O1j1OK4NR4q2J5K7l2Q6j12n6oR2j49K16q4J36j30j68K16J9M4
$$ -133 86 73 -101 -40 -51 -45 -21 -16 78 -4 11 38 6 92 -20 -76 -82 10 -139 77 -7 129 -1 -169 47 66 110
6740A10j61j50J18N0QJ22j54N4n3j2l2j31R8J38J3o0P5P1MJ6j42k2J6m3J35mp4
$$ 110 -51 -201 -83 -33 -25 97 -57 -3 -56 -68 -100 -231 -133 5 18 -42 33 104 108 124 -18 -40 -24 -67 68 64 -10
6767a0M6Q9p5o6n8J35K7r3J07m9j36P3N1k4J8j4q8l5J43o4k1mj1J58j11kk4j3
$$ -10 36 125 50 -16 -74 61 88 -5 102 53 -83 -10 41 17 35 21 -67 -102 41 -23 -44 -48 -59 99 -12 -14 -38 -51
6795e1m3J51o0M7o1m8L0L3L4k4j13J23J52j85j7n2J40N9j13j1M2n9N4l5N1n2J57
$$ -51 -94 57 -3 44 -17 -65 -35 -2 32 8 -105 18 170 -15 -32 -84 56 115 2 -9 33 -26 28 -7 44 -8 149
6822A49j34Jm2Q9J10j61J14r4o4lp1J42q9Q7J13l04J17K4Ok3QJ05j40J00j68Q4
$$ 149 15 16 -26 63 173 12 126 32 -32 -35 -106 36 -53 34 147 -157 -40 -16 -10 -33 -25 80 -60 40 -128 -44
6848d4J55j94J6QJ28r1l2Q2m6K6M8O3k23J56q1K7L2p7O1m4L7J2m9J1J42j09l5
$$ -44 111 -83 -67 -59 69 -22 -54 28 -18 8 56 119 -104 52 -29 -2 30 -47 14 -30 7 19 -30 -19 123 14 -21
6875b1O6j85J58p1j7pP9K9l8O7j91R0j3m1J00r5J72k6j57%Q7pP9q6J08j43Q5p7
$$ -21 45 -140 18 -53 -70 -77 2 31 -7 60 -131 -41 -54 -95 5 -90 82 56 -101 -101 -14 -21 58 -28 80 -63 22 -55
6903e5K5n2J40n1j01O1R6r5M0O7m4m0Q6o0Pk8M6q3jN2p0N6j7N3n1O8q6P9oL6j5
$$ -55 -30 -82 58 7 -94 -33 63 -32 8 75 31 -9 77 17 24 -4 42 -41 -42 10 -60 -4 -21 32 -19 49 -37 42 36 72 57
6934E7j5n2Ok1J9m2N8K0j17R5k0n3J07l3k9o6m2P9P2j02Q1qM6qo1m5J5RP2M2k4
$$ 57 42 -10 -4 -25 -6 -48 10 30 -87 8 -12 -65 42 9 -20 -86 -128 -49 23 -79 2 -6 40 32 -29 -74 -59 -50 22 64 40
6965D0LM7k65J68L1j04m1J07R5j47L4m3J26k2M7J7o4J04J2j49k7L9L0N3j72J72
$$ 40 43 90 -175 -7 24 -80 -121 -14 81 -66 -32 -75 51 29 76 93 29 133 145 -4 -31 8 38 91 -81 91
6991I1j00l1K6J24l29L37j48O6l1kk6L1j44P3K23r7j92J13MJ5P2Pq0l0O5m1j4
$$ 91 -9 -40 -14 110 -219 118 -30 36 5 3 -23 8 -136 -63 160 63 -129 -16 -12 3 75 82 2 -28 37 -4 -18
7018a8J51j31J08r9q3P3O5j44J58j09rJ33l4p6j00J58j4M7j17J1K7M3R4j22R2
$$ -18 133 2 110 11 -72 1 66 -78 80 -29 -38 95 61 -15 -115 43 29 76 -41 -30 -3 40 134 12 104
7043A04j74J13q8N3j21J45l4N1j19J5k8Q0j4J4O3j50Pj23J64O0j32J6J27KQ5q1
$$ 104 -70 43 -45 8 -113 32 -2 49 -70 -55 -83 -3 -17 -3 60 -90 -83 -206 -42 18 -114 -98 29 31 116 35
7069C5k1K8n2k5j09J23O6N6m3j02Q3k4K1K2%k6J6j71J89k5L9j31N9J3L5j26l8
$$ 35 14 42 -10 -35 -144 -21 45 101 58 -44 39 15 36 58 58 32 48 -123 66 41 80 -51 8 21 56 -70 -108
7096a08J35K0jp8J01l6n1l4O9j11Q6k4p6n%o1K11n2n3J44j21Q6l1Q2j5o2O0k8
$$ -108 27 47 46 -32 69 33 -18 -52 17 -94 -8 -32 -108 -113 -113 -174 37 -15 -68 76 -45 41 10 92 77 15 75 47
7124D7RJ5K3j9j33J66j69P5NL5Mn5qoK2J4k5k1j4J25o7n6N3p0R2j60J60j43R4
$$ 47 56 71 94 75 -58 108 -61 14 19 54 58 3 -5 -11 11 25 0 -21 -35 90 23 -33 20 -50 42 -118 42 -101 -7
7153gK6j73J10Q1L3j06J17m6j6j25K27j37j3Kn5J14p7J98j24Oo8J31n2m9J6J14
$$ -7 19 -154 -44 37 70 -36 81 35 19 -106 121 -16 -29 -27 -82 32 -45 153 29 35 -33 98 46 -3 13 127
7179A27j19M9j9o4M1l7L0P8L8j06%rrK1k0P1j01J29j78n0K43j13j12R5j6jO6j0
$$ 127 8 57 38 -26 15 -22 8 86 124 18 18 9 0 21 1 72 -29 100 -78 -128 115 2 -110 -15 -31 -32 34 24
7207B4k5mJ45j10l2m%O1O3q2Rj24J51Qqn2p2j1P7j78J93N4p1J0k0%Q5K1j73J21
$$ 24 -1 -5 140 30 -2 -6 -6 55 118 36 45 -79 72 80 72 20 -52 -63 14 -164 29 83 12 22 2 2 87 108 -65 56
7237E6M3j02OM2q2M7K5O3q5l3j57K87r7j7M5j47J11J1pn1N1L6m3p1Q0j6Pn1Q9
$$ 56 99 -3 3 45 -37 10 35 98 13 -20 -177 110 13 -4 41 -106 5 16 9 -42 9 45 2 -69 11 -5 2 -49 40
7266D0M5n1q0K6R0J8j46J77j15o8J12J91l46J11l1qJ6P5O4r2l5N9o2oN7m0M1l4
$$ 40 85 34 -46 -20 70 88 -58 119 4 -64 48 239 -107 4 -27 -35 -19 56 120 28 -7 52 -10 -16 41 1 42 8
7294HO1j05k3j3J6j06L3O0r0K10j35P7k19K75k34Q8J99p2p7M9k6n6%Q7P4p1j02
$$ 8 69 -36 -59 -72 -56 -162 -129 -69 -159 51 -84 -7 -226 49 -185 -97 102 30 -47 2 -24 -80 -80 7 81 10 -92
7321i2J02p7N0L7j13Q6N0j14M4P0j85K07k2n9k7o5J43p7R6m6p9J46l9J80j46j13
$$ -92 10 -67 -17 20 -93 -7 43 -71 -27 43 -142 65 43 -16 -43 -108 35 -42 54 8 -71 75 36 216 70 -43
7347d3M6n1O1M8o3j91J31O4l6R6p8k9J42l0k2k3l8J11j94N7J48j27J08l4o5J3
$$ -43 3 -48 13 61 -2 -193 -62 2 -34 62 -16 -45 97 67 45 22 -16 95 -99 -42 106 -21 87 53 -12 1
7373AJ22j18J00J7K2o7m4J8O0l9n8J53k01J35k06J74j08k9J28jo5k0qN4L6p7o
$$ 1 123 5 105 122 144 77 33 51 111 72 14 167 -34 101 -105 69 -39 -68 60 59 -6 -26 -34 20 56 -21 -27
7400b7k6n8R9r7M9Jj10J03RQ9j09o7R6q8K14m9o7L7M2K0j41J20n5o1M0Ll1J70
$$ -27 -53 -111 -12 -109 -60 -59 -169 -66 -57 32 -77 -144 -48 -136 78 29 -38 -1 41 61 -80 40 -15 -76 -36 -33 -64 106
7428A06l2j76J39o0J05r3l9L1m0J50Q3k11PO1j7J02o9j3N8r8m0M4j9j06l8J04
$$ 106 74 -102 37 -23 82 -11 -50 -19 -59 91 174 -37 -30 31 14 116 47 34 92 -6 -46 -2 -21 -127 -165 -61
7454f1Q2j8kj03O5N7N8%j68J02n0l8R4M4j7j9l7J6j35O0K9J40k6o8k9N8r0j8J09
$$ -61 21 3 1 -102 -37 20 78 78 -90 12 -38 -76 18 62 45 26 -11 5 -130 -70 -41 99 73 5 -24 34 -56 -74 35
7483C5n7J04Qm4m7Q2j0n2l7j6L5N2m7K3o7Q7n4o4J6K19j89q2J01L2r3N0k4N5J11
$$ 35 -22 82 90 46 -1 81 71 19 -18 -34 1 53 6 29 -38 49 -5 -69 -53 166 -23 -105 -4 28 -65 -15 -39 16 127
7512A27j15o2K4r2J55j45J81r4n5K0P6O8j3p6pJ12k1j39JJ37M5k7j78J87m8J4
$$ 127 12 -50 -26 -118 37 -108 73 -21 -76 -56 20 88 75 -1 -8 104 83 -56 -55 82 127 100 -78 109 61 75
7538G5q8L9J2Q4j87K3qR1L0l9L6o6q1J10o9J6K2P6j16j54J93J4o2P6k7rK4l4l1
$$ 75 -13 26 38 122 -65 -42 -50 41 71 32 68 2 -79 31 -38 -22 0 76 -40 -194 -1 13 -49 27 0 -9 15 -19 -50
7567e0J55j19L6M5l7O9k07M2P9r2M3K7M2n9P2k2l7M8K1O2q6K0l3j34R9J25j29
$$ -50 105 -14 22 67 30 99 -108 -66 13 -79 -36 -9 33 -26 46 24 -13 35 56 118 32 52 19 -115 -16 109 -20
7594b0R9j22J82q5q1Rl6M9J17j04nk1n5q7O9J03k1J79q0j08N1%q1Q4o2m2J53m3
$$ -20 79 -43 139 54 -27 -18 -54 -5 112 8 3 -18 -73 -160 -91 12 -9 170 90 -18 33 33 -48 36 -26 -68 85 42
7622D2O8j17P2q6r6J45K7j4n3O1K9k0ll5qj3O6j55NP9L3r2P0M0M8Pp3m0j44Q5
$$ 42 110 -7 65 -21 -117 28 55 41 -12 49 78 58 55 20 12 -1 65 -90 -85 -6 27 -65 5 45 93 100 27 -13 -157 -72
7652g2Q8m0l4N9m6Q8K2j44P5K9j7kKp8%L0l5K0l9J34J4j29J27k2j34J66K5no2
$$ -72 16 -24 -58 1 -45 43 65 -79 -4 25 8 6 8 -70 -70 -40 -75 -55 -94 40 54 -75 52 30 -104 62 87 82 20
7681B0k2l3L7p5J13p9J01m1Mm5qM0j4N6k1J5P6J0j70k3J42p9j25P5P0K3j02P7
$$ 20 -2 -35 2 -73 40 -39 62 21 25 -20 -28 12 -2 54 33 48 124 134 -36 -59 83 4 -121 -46 24 47 -55 22
7709B2r9J45j43QRnJ12n0k9nJ3j24K17o2N8o7L3j18K8J42j40O6p1R3l1L8j22J87
$$ 22 -77 68 -75 -67 -58 -63 49 -1 -30 -35 -22 -146 71 9 67 0 33 -85 -57 85 -55 11 -60 33 2 40 -82 105
7737A05p5M4O1j10Jj01J89j30l5P0jj37P9P4j06M6M3Km9lJ6m2p4J30n2j2J18j28
$$ 105 30 74 135 25 26 -75 114 -16 -51 19 18 -119 -40 34 -72 -26 17 19 -30 -33 -17 -59 -133 -3 -55 -67 51 -77
7765g7n7K1J41o5L4p3J10j09N7m3O0L3m0K4m3OK3Q9K4j15m2n0K5J29n0j3R5j26
$$ -77 -134 -113 28 -37 -3 -76 34 -75 -18 -61 -1 32 -8 16 -27 -21 2 91 115 0 -42 -92 -67 62 12 -1 94 -32
7793c2LL0L6p9l6P2P7j65lJ30p5N8K4M0l3j26K4o1K6J48j04K8n0Q6k9P4o4j9q9
$$ -32 -29 1 37 -42 -78 -6 71 -94 -97 33 -42 16 40 80 47 -79 -55 -116 -90 58 -46 -18 -68 18 -11 63 -1 -20 -109
7822a09N0J53R3j79R7j90J7j0J27k4l6j8l1J22r9N2o5K6k0L6N2l5J18j74J07k3
$$ -109 -59 94 187 8 105 -85 -68 -78 49 25 -11 -29 -60 62 -37 15 -50 -24 -44 -8 44 9 127 -47 60 37
7848C7o3j20J69O3n2j24N5%J07j26R3q1J35J7j46k6J32j11P0m7P4N7k32J37OP5
$$ 37 -26 -146 23 86 34 -90 -35 -35 72 -54 39 -42 93 110 -36 -62 70 -41 29 -18 56 113 -119 18 24 99
7874I9j75l4J20J16k18J82m0k3J01j71O3j63K59k00M0N8j4n6O8k4J46j89J96j81
$$ 99 -76 -110 10 126 -92 90 50 27 128 -43 20 -143 116 -84 -44 14 0 -56 12 -12 134 -55 141 -40
7898d0RR0j37Q7J00j36R4j13J7R0k41L03p7O2j87Q5R7m1p6Qj05J27K3j20J00k6
$$ -40 -31 59 -78 9 109 -27 67 -46 -29 61 -180 123 46 108 -79 6 103 62 -14 -6 -111 16 39 -81 19 -7
7924gj07K51j41l3R4n5Prk6j9Q1j22L6N4J7mJ1kj94K74l3n9m2O8O9j37l8R2M1
$$ -7 -114 137 -4 -37 57 2 9 0 -26 -45 36 -86 -50 4 21 17 28 26 -168 106 73 14 -28 40 109 -28 -66 26 67
7953F7j09mk6J19o4J8j18J52j13M3k1k3Mo7P8k4O2o5J1K4m1Q1l6R5j14o2J07j7
$$ 67 -42 -46 -72 47 -17 1 -117 35 -78 -35 -56 -79 -75 -142 -64 -88 -26 -91 -80 -56 -97 -16 -52 43 -71 -133 -26 -43
7981d3M4m7%P9Pj13R8j01lJ04o9o3N7LJ06k7lP0j32RJJ5K6k9m2K7m6J07j31K2
$$ -43 1 -46 -46 33 40 -73 25 -76 -79 25 -44 -107 -50 -47 59 32 29 99 -33 -24 -23 -8 18 -11 -53 -26 -72 35 -96 -74
8011g4Q2r1k2N7Kl9J2K1j2P1j6%j35k7J42J5K3kj43Q4RK8pJ7JM3r9R8j14L1J40
$$ -74 8 -83 -105 -48 -46 -85 -73 -52 -64 7 -9 -9 -144 -171 -29 -14 9 7 -136 -52 -43 -15 -22 -5 -4 39 -60 38 -76 -45 95
8042I5n4Nl3j20R1K0N3p0J1Q1r4q7K49m8j30Q3op2J9L3j12Q1j33J94n5j06m6m4
$$ 95 41 46 13 -107 -16 4 57 -13 -2 79 -15 -102 147 99 -31 52 46 -26 -7 26 -86 -5 -138 56 1 -105 -151 -195
8070a95K05j47o2K34j85J39K5M5j9o8n7M1L4K8P5n9J13j62rNj7J37lj47N3jj4
$$ -195 10 -137 -199 35 -150 -11 14 59 40 -28 -85 -44 -10 18 93 34 147 -15 -24 -19 -36 101 98 -49 4 3 -11
8097a1L3%Q6j28J73m5j02J13q1j25R1O4oj66P5m0L1O4j70J25r1L4n6J95q2MJ4
$$ -11 22 22 108 -20 153 108 6 119 38 -87 4 68 62 -104 -29 -69 -38 26 -144 -19 -110 -76 -132 63 -19 -15 -1
8124akj29Q2J7Q7j07N3Q1nk25K3J79Lq8pM5J5oKrl9r6J62p5M4J15k1j86J40l7
$$ -1 -3 -132 -50 -33 54 -53 0 81 76 -149 -126 53 56 -32 -39 6 21 15 17 8 -31 -127 35 -40 4 119 98 -88 52 15
8154A5O7r1qJ60j03n8J5P0K9q7M5n3NO0j36L9J05o5p7O7qk8R4j43QJ3J45m6l4
$$ 15 82 -9 -17 143 40 -18 -3 67 96 9 54 1 6 66 -70 -31 74 9 -68 -1 -9 -37 57 -86 -78 -65 80 34 0
8183@Q6j35o5L0P4JL7j14
$$ 0 86 -49 -114 -84 -10 -9 28 -86
8191h6
$$ Imaginary data points
##PAGE= N=2
##DATA TABLE= (X++(I..I)), XYDATA
0@%%%%%%%%%%%%%%%%%%%%%%%o4J28j28J28j28J28j28J29j93K56k56K56l20L84
$$ 0 0 0 0 0 0 0 0 0 0 0 0 0 0 0 0 0 0 0 0 0 0 0 0 -64 64 -64 64 -64 64 -64 65 -128 128 -128 128 -192 192
37A92l86M50n12N76o40P04p81Q45r59J072j168J277j410J559j714J884k077K295
$$ 192 -194 256 -256 320 -320 384 -397 448 -511 561 -607 670 -740 819 -895 989 -1088 1207
55A207k543K818l136L511l949M472n119N929o982Q420j0505J3828j9925L4828
$$ 1207 -1336 1482 -1654 1857 -2092 2380 -2739 3190 -3792 4628 -5877 7951 -11974 22854
69B2854j34549k39182J92277K23193J05022l9829p5368j27501o6056R5313K00740
$$ 22854 -111695 -350877 -158600 64593 169615 129786 54418 -73083 -139139 -43826 156914
80A56914O9658j10228j62164r0346j1300R6339J68395Q9283j17255j96017p1290
$$ 156914 226572 116344 -45820 -136166 -147466 -51127 117268 206551 89296 -106721 -178011
91a78011Q5662J15223P5671R951r2842j62710p0635J15262J89946Q7229o1078
$$ -178011 -92349 22874 98545 108496 15654 -147056 -217691 -102429 87517 174746 113668
102A13668j40908j22073o624J39889J66253K9225j18032j21078k9605M3671Q1101
$$ 113668 -27240 -149313 -155937 -16048 150205 179430 61398 -59680 -89285 -45614 35487
113C5487R1982K2577j07317j54859n2074Q2798J18677O5340j6230r4985j14034
$$ 35487 127469 150046 42729 -112130 -164204 -81406 37271 102611 86381 -8604 -122638
124a22638k0784J10367J29450K1256q5986j05803o1870J6208J05925J31924L5224
$$ -122638 -143422 -33055 96395 117651 31665 -74138 -136008 -119800 -13875 118049 153273
135A53273j00404j25145k4332P9218R7085M6322l0375r4817r5536j3763P8377
$$ 153273 52869 -72276 -96608 -17390 79695 126017 95642 825 -94711 -108474 -30097
146c0097R2687L2238m1281q2390p3729n276Q2680J02180K0592q1510j01879l3669
$$ -30097 62590 94828 53547 -28843 -102572 -107848 -25168 77012 97604 16094 -85785 -119454
158a19454N2113R2064O8901l801p7967q8402j6939P1823R6353M2393l8841q3987
$$ -119454 -67341 24723 93624 89823 11856 -76546 -93485 -21662 74691 117084 78243 -5744
170e744o4594N255P0198P2797R359o3829q3078l9218K9189P0304O0655O261n6405
$$ -5744 -70338 -65083 5115 77912 87271 23442 -59636 -98854 -69665 639 61294 67555 11150
183A1150p6364k8839M7986Q2369M4190k9245p4408n9028L510O6663Q0334L0182
$$ 11150 -65214 -94053 -46067 36302 80492 51247 -23161 -82189 -78679 -12016 68318 98500
195I8500m3126p5031m0921K3198O2385N0191j930n7142p1704k7749L9027O8134
$$ 98500 55374 -19657 -60578 -37380 25005 75196 73266 16124 -55580 -83329 -44302 23832
207B3832L7874j7970n5152n1939r732M5085O5636K7960l4177o3449l8497J3940
$$ 23832 61706 43736 -11416 -63355 -73087 -28002 37634 65594 31417 -32032 -70529 -56589
219e6589N5398N7910J5088m4270o5104k4210L7561O1426L5499j1306m9295n4818
$$ -56589 -1191 56719 71807 27537 -37567 -61777 -24216 37210 72709 61403 12108 -42710
231d2710j6400L9314N7723J8856l3366n2316l2982M790M2290N3437J8366l6937
$$ -42710 -59110 -19796 37927 56783 23417 -28899 -61881 -57091 -14801 38636 57002 20065
243B0065n7118k2905K4757M5635L3852Q53l8201n1185j4502M0971N8499K3936
$$ 20065 -37053 -59958 -35201 10434 44286 45139 6938 -44247 -58749 -17778 40721 64657
255F4657k1004m2158l5222m585L4997M7438J0965l8762n1091k0046J7519L7721
$$ 64657 43653 1495 -33727 -38312 -3315 44123 55088 16326 -34765 -54811 -37292 429
267D29L4098N633l3225m6156j3905L0210M3329K0366j1826l4611l5395o231L4802
$$ 429 34527 40160 6935 -39221 -53126 -22916 20413 40779 28953 -5658 -41053 -47284 -12482
280a2482M7482J5147k5495l8841k0041R967L4842L5117M264l4263m3834j4115
$$ -12482 35000 50147 24652 -14189 -34230 -24263 10579 45696 49960 15697 -28137 -42252
292d2252K1013L4005J9726p748l1971l3026m206L0629L8302J2675j7999l2189
$$ -42252 -21239 12766 32492 24744 -7227 -40253 -44459 -13830 24472 37147 19148 -13041
304a3041k3244K375K9187L3417O139k5674l3318j1105J7901L3723K5458j670k9787
$$ -13041 -36285 -33910 -4723 28694 34833 9159 -24159 -35264 -17363 16360 41818 40148 10361
317A0361l3168o940K3227K9569R828j5570l0369k3227J901K7513L0366N918k0957
$$ 10361 -22807 -29747 -6520 23049 32877 17307 -13062 -36289 -34388 -6875 23491 29409 8452
330H452k7909j2883R942K5912K2671l96k5001k7816n718K0099K9023J5972p324
$$ 8452 -19457 -32340 -22398 3514 26185 25789 788 -27028 -32746 -12647 16376 32348 25024
343B5024k4115k1611J96K4115K6236N020j9696k8335j5841O478K2855K0456n0
$$ 25024 909 -20702 -20506 3609 29845 34865 15169 -13166 -29007 -22529 326 20782 20732
356B0732k1338k3661n852J5697K4318J4082o013k1621k0870k525J8194K3493R222
$$ 20732 -606 -24267 -30119 -14422 9896 23978 17965 -3656 -24526 -27051 -8857 14636 23858
369B3858j1639k1331j2455P070K2783K0845K004j8287k3613r811J0192K0065J2124
$$ 23858 12219 -9112 -21567 -14497 8286 29131 31135 12848 -10765 -20576 -10384 9681 21805
382B1805o820k0910j8721j748J6151K1342R179r737j9954j3431L372J7035J7098
$$ 21805 14985 -5925 -24646 -26394 -10243 11099 20278 10541 -9413 -22844 -19472 -2437 14661
395A4661L310j2845j8549q478R599K0748J5344j269j5926j6227l461J2050J7739
$$ 14661 17971 5126 -13423 -21901 -12302 8446 23790 22521 6595 -9632 -13093 -1043 16696
408A6696P418j0395k0627j4815J738J4881J5503L608j1077j6560q287P328J7010
$$ 16696 24114 13719 -6908 -21723 -19985 -5104 10399 14007 2930 -13630 -21917 -14589 2421
421B421J2937q23j3742j5392m823R960J7341J0190m463j3957j0567J499J3250
$$ 2421 15358 14535 793 -14599 -19422 -9462 7879 18069 13606 -351 -10918 -9419 3831
434C831J5131M302j0777j7805r902L825J2620J0329q87j2690j4821m178R995J5839
$$ 3831 18962 23264 12487 -5318 -15220 -11395 1225 11554 10667 -2023 -16844 -21022 -11027 4812
448D812Q548m162j2130j0973j789R884J4769O203p502j3267o859M381J2328J2460
$$ 4812 13360 9198 -2932 -13905 -15694 -5810 8959 15162 7660 -5607 -12466 -8085 4243 16703
462A6703K601r967j4278n364P250J1293M887m523j1700j2030l173R328J4024N397
$$ 16703 19304 9337 -4941 -10305 -3055 8238 13125 8602 -3098 -15128 -18301 -8973 5051 10448
476A0448p035j1318o192K415R818J1654L266q865j2572m252O376J0811Q518Q19
$$ 10448 3413 -7905 -14097 -11682 -1864 9790 13056 4191 -8381 -12633 -6257 4554 13072 13891
490A3891q291j0900k731Q901J1487K878p179j1320q159l86P481R397J740p695
$$ 13891 5600 -5300 -8031 870 12357 15235 8056 -3264 -11423 -11809 -4328 5069 6809 -886
504h86r833l440M392R896Q953R79q931j0389k024P527R915M978k288q169p745
$$ -886 -10719 -14159 -9767 129 9082 10061 1130 -9259 -11283 -3756 6159 11137 8849 680 -7065
519g065J36Q910J0048J943o552r443n617J112P278O912j296r580q627q75N573
$$ -7065 -6929 1981 12029 13972 7420 -2023 -7640 -6528 750 7662 6366 -3214 -11841 -12716 -7143
534g143P600N394p6p212p748j3Q152Q535K204m451p436n533J304Q825Q559M95
$$ -7143 457 5851 5775 -1437 -9185 -9198 -1046 7489 9693 5242 -2194 -7727 -6423 2402 10961 11456
550A1456p092p185k086L265O020M477k017q890q277o26O067O491K426k855o156
$$ 11456 4364 -2821 -4907 -1642 4378 8855 6838 -2052 -10329 -10955 -4888 1603 4029 1174 -4982
565d982m352J957P561O825Q32m797o360l674K533P474N892j035o388n605n10M229
$$ -4982 -9334 -7377 184 7009 7841 3044 -3316 -6990 -4457 3017 8909 7874 1486 -4119 -4629 -400
581d00O548L805l310q322n597J161M774L894Q37l462o449l867L565Q017M620j121
$$ -400 6148 9953 6643 -1679 -7276 -6115 -1341 2553 3390 -72 -6521 -10388 -6823 1194 5814 4693
597D693m018m094k013K887O710L972k919o639l595R75M272N309K885k997p067
$$ 4693 675 -3419 -5432 -2545 4165 8137 5218 -1421 -5016 -4041 231 5540 8425 5428 -1639
612a639l768K836M575K671o03m111o380l023M066O808K412k402l120k493q48L430
$$ -1639 -5407 -2571 2004 4675 4072 -39 -6419 -9442 -5376 1432 3844 1442 -1678 -4171 -5019 -1589
628a589O594K625m547o093j494K051K605L761K615l255o843j429N061M313O05
$$ -1589 5005 7630 3083 -3010 -4504 -2453 152 3913 6528 3273 -3570 -4999 62 4375 4980
643D980j002k452n462l377L992O254M83m370k781p62l83K918O352K319n186n571
$$ 4980 3978 1526 -3936 -7313 -3321 2933 3416 -954 -3735 -4497 -4880 -1962 4390 6709 1523 -4048
659d048O56L229J019J553K272k542o704j280O356N009j003k060q71k780l035K862
$$ -4048 -3392 -163 856 2409 4681 2139 -4565 -5845 511 5520 4517 2457 1586 -1194 -4229 -1367
675a367O012k12n961l462P85N70J196M379K868l989n848Q44N184K069n29J3j934
$$ -1367 4645 4433 -1528 -4990 -4205 -3635 -2439 1940 4808 819 -5029 -4185 999 3068 2539 2552 618
692F18m474j164M930M520r03k304q99j306j138L073N010p17n984l202J316P86
$$ 618 -3856 -5020 -90 4430 3527 1223 324 -982 -2120 953 5963 5246 -738 -3940 -2624 -1838
708a838O2K480K300l883n180J318N917J803j389p6p39l827j835M855M949j951
$$ -1838 -1776 704 3004 -879 -6059 -4741 1176 2979 1590 1514 775 -3052 -4887 -32 4917 2966
724B966m498n10J829j98J021M062J443m777m582J169L220J01o47J96j848l984
$$ 2966 -1532 -2042 -213 -411 610 4672 6115 1338 -3244 -2075 1145 1246 599 795 -1053 -5037
740e037j88M704L163j344j956k77j029o19K572L570n47m131j826J434J612J377
$$ -5037 -5225 -521 2642 1298 -658 -935 -1964 -2583 -11 3559 3012 -1119 -2945 -1511 101 1478
756A478J959O60l038k913J181L100N17j164o53j988k831n04L275K579j357k592
$$ 1478 3437 4097 1059 -1854 -673 2427 2944 1780 1127 -861 -3692 -4196 -921 1658 301 -2291
772b291m67M53N04J782K533k37l189j888J250K160R27Q17%k106j727J108L080
$$ -2291 -2758 -2305 -1801 -19 2514 2277 -912 -2800 -1550 610 1537 2354 2354 248 -1479 -371 2709
789B709J361j270j630j431j476l6J774J290j203k508j075M90J349J595J278l57
$$ 2709 4070 2800 1170 -261 -1737 -1773 1 1291 88 -2420 -3495 -3005 -1656 -61 1217 860
805H60k157j099J036K049J179j50p60j231r02R58K267J425o17j565j547l98O83
$$ 860 -1297 -2396 -1360 689 1868 1718 958 -273 -1175 -217 2050 3475 2858 1293 -254 -652 31
822C1J173L88j305k189j273lJ488J552L55j214r92j64P42J722J412J60j558j373
$$ 31 1204 1592 287 -1902 -3175 -3178 -1690 -138 217 -997 -1989 -2153 -1411 311 1723 1883 325 -1048
840a048J92J388J300O38j30r91j372l90J497J570n11j697j432r41m74R44J419
$$ -1048 -856 532 1832 2470 2340 1349 -23 -413 1084 2654 2143 446 -986 -1927 -2401 -1457 -38
857c8r4j660j278N37J339R21Q42L18o90j345K71J793J163j68n37m97p45k58J330
$$ -38 -132 -1792 -3070 -2533 -1194 -273 569 887 197 -1148 -877 916 2079 1911 1374 877 132 -126 1204
876A204J495l60j703j335j16l4K56R28k80j805j493L08J637R77K15J1k70r87K06
$$ 1204 2699 2339 636 -699 -815 -849 -593 335 55 -1750 -3243 -2935 -1298 -321 -106 -95 -365 -1352 -1146
895a146J997J125k92q82j14m80J26Q97J228j68j655r46J24M76J7L66m10j434j564
$$ -1146 851 1976 1684 802 688 208 334 1231 2459 2291 636 -310 -186 290 307 673 263 -1171 -2735
914b735K55J405Q43o39k36k97k08K36J644J395k61j210j36L36J87N55P82M7j396
$$ -2735 -2480 -1075 -232 -871 -1107 -1404 -1612 -1376 268 1663 1402 192 56 392 579 1134 1916 1963 567
933E67q48K14Q96J07o1l87q45j214k41J131O94o35r36k70K44L53R80J092P6q31
$$ 567 -281 -67 829 936 875 488 -357 -1571 -1812 -681 13 -622 -1558 -1828 -1584 -1231 -251 841 917 86
953H6n08O04Q22L66K35k22p17p87N7R46M34l49o19n77n57k7M70N47m80j020o20
$$ 86 -422 182 1004 1370 1605 1383 666 -121 -64 882 1316 967 348 -229 -786 -813 -343 204 -276 -1296 -1916
974a916K85M86O02O12j25n90p9O04Q71O29j21k57n08l64K43O10M35o44m39o17
$$ -1916 -1631 -1145 -543 69 -56 -646 -725 -121 750 1379 1258 1001 493 129 372 982 1417 773 334 -283
994b83j01K86N55L1m33p25q46K87M16M48J36j59o31j20N74R15N18Q6l20l15j66
$$ -283 -384 -98 457 488 55 -670 -1516 -1229 -813 -365 -229 -388 -1019 -1139 -565 350 868 954 634 319 153
1015A53M31M24J74m77n57l58R0J76L98K60o34o15l36K21J38L07K6m97n36O2N29
$$ 153 584 1008 1182 705 148 -210 -120 56 454 714 80 -535 -871 -650 -512 -205 -179 -676 -1212 -1150 -621
1036f21N85L54J62l16l36N1P72M94K0m78k55k39j59K57M47j43m42m96K3P8K24
$$ -621 -36 318 480 164 -172 -121 651 1145 1165 687 432 193 34 291 738 595 153 -343 -320 -242 -18
1057a8J15K49o09o73n9N01N00j03j64l5j05%M52P09N0m25l87N9rK55L16R1o17
$$ -18 97 346 -263 -936 -995 -494 6 -97 -261 -296 -401 -401 51 760 810 385 -2 57 48 303 619 710 93
1080I3n77J31M10J91P8k11k48k97l62N39M47j13m57j27m3J71L31M02R9l68l15
$$ 93 -484 -353 57 248 326 115 -133 -430 -792 -253 194 81 -376 -503 -546 -375 -44 358 457 89 -226
1101b26K83K59Q2R2K49n85o02K62M88J41oj77k44k04r7L12L50l63l68k36J6k8
$$ -226 57 316 398 490 739 154 -448 -186 302 443 437 260 16 -188 -285 27 377 14 -354 -590 -574 -602
1123f02L40L05R0m23k58L10L38J91m6j4j90k27O8M60K92k81p2j50j04l2K93L42
$$ -602 -262 43 133 -290 -548 -238 100 291 245 231 41 -186 -118 342 634 353 281 131 27 -5 288 630
1145F30m34m87k53K68K1J57j05Q6k84j91L36J38K61k0M1k17k64L11L60J43r2k69
$$ 630 196 -291 -544 -276 -255 -98 -203 -117 -401 -592 -256 -118 143 123 164 -53 -317 -6 354 497 405 136
1167A36J66k27J28L19J11k99l61k24O2N9M4L0k17m38l4M08O5J33n3R9j29k52K42
$$ 136 302 75 203 522 633 334 -27 -251 -189 -130 -86 -56 -273 -711 -745 -337 -272 -139 -192 -93 -222 -474 -232
1190b32M00L2J2m0N4p3J99L84J05m30k39M2K27m27NJ83k28o56n1M59rj8o0R6j26
$$ -232 168 200 212 172 226 153 352 736 841 411 172 214 441 14 19 202 -26 -682 -733 -274 -283 -301 -361 -265 -391
1215c91j61K43N10j12n9n2K28r9O5M25K63l19l81J35J53j49r5l6po47j39K67K18
$$ -391 -552 -309 201 89 30 -22 206 107 172 597 860 541 160 295 448 299 204 168 161 -486 -625 -358 -140
1238a40m54o3K53J4m20L52N45p8k63o0M32J31j10K45M86k78m70L61K16j65j24
$$ -140 -594 -657 -404 -390 -810 -458 87 9 -254 -314 118 249 139 384 870 592 122 483 699 534 410
1259D10k6K24n95m57M00N0l97l25J68K24l27j6M70J09k98o0L51K36k65K79L44
$$ 410 384 608 13 -444 -44 6 -391 -716 -548 -324 -651 -667 -197 -88 -386 -446 -95 141 -124 155 499
1280D99n6l81J99M06m0k00O7J02k68m93K17J92l84l35J4Q7j98j64L30K34k46j97
$$ 499 443 62 261 667 627 427 494 596 328 -165 52 244 -140 -475 -461 -374 -572 -736 -406 -172 -418 -615
1302f15M07K80O2j95M46ll66K67L45K0k95R1J71j37l66L3L10j87o24QJ22k52j63
$$ -615 -208 72 134 -61 385 382 16 283 628 648 353 444 615 478 112 145 455 268 -356 -348 -226 -478 -641
1325f41Q5L72k86l52L07L69k0j27L38K33k02NL35K92m02j18J74K21k52p9K07n5
$$ -641 -556 -184 -470 -822 -515 -146 -166 -293 45 278 76 81 416 708 306 188 362 583 331 252 459 404
1347D04m50m5P4q5l07J11Q8k55k27J29L73N0j65K03J35r3K34K27J29j55p1Q6J3
$$ 404 -46 -91 -17 -102 -409 -298 -210 -465 -692 -563 -190 -140 -305 -102 33 -60 174 401 530 375 304 390 403
1370D03r9k0J24j6l01k31K88o0l03L4r6q1l14J37J23K31l04J29J25J47J04J19
$$ 403 304 284 408 392 91 -140 148 88 -215 -181 -277 -358 -672 -535 -412 -181 -485 -356 -231 -84 20 139
1392A39J46M6r1N7J49K2l7o7q8q2j41J48o1j47j25J10j00k52J10Qjj60QJ18R6
$$ 139 285 331 240 297 446 468 431 364 276 194 53 201 140 -7 -132 -22 -122 -374 -264 -256 -257 -417 -409 -291 -195
1417a95l2K74J18P9l2KJ35l6M2j77J44k01m0k0O9j14k00Q0M0j28j2N1q3j77K4
$$ -195 -227 47 165 244 212 214 349 313 355 178 322 121 81 61 130 16 -184 -104 -64 -192 -204 -153 -236 -413 -389
1442c89R5L8M7Q9L9L1J09O5J65k9J95K7q4j87R6k25J21j40j01J90k25k1J27M1
$$ -389 -294 -256 -209 -120 -81 -50 59 124 289 260 455 482 398 211 307 82 203 63 -38 152 -73 -94 33 74
1466G4j76k8K1j00M8j2R2qj5J2m2J68N4R1j1mP8j89L29j47k35k9M3K9j94J48O4
$$ 74 -102 -130 -109 -209 -161 -173 -81 -89 -104 -92 -134 34 88 179 168 164 242 53 382 235 0 -29 14 43 -151 -3 61
1493F1Rj16P8r1k0j1j3R3j90R0j2O1O4o8J84r1N7KK89j27m3r0M0j83j9J36j4J1
$$ 61 70 -46 32 -59 -79 -90 -103 -10 -200 -110 -122 -61 3 -65 119 28 85 87 376 249 206 116 156 -27 -46 90 76 87
1521H7q5Nm2n4J34j31J17l9j93n1J57j6l8q0J88Jj13K13K5J5m4M5P6j73J8J40
$$ 87 2 7 -35 -89 45 -86 31 -8 -201 -252 -95 -111 -149 -229 -41 -40 -153 60 85 100 56 101 177 4 22 162
1547A62m8Kk82J64j7J06l5P0q3M8j98K09o8j23m7J45k18l0K00J3L3jJ37Mm7m7
$$ 162 114 116 -166 -2 -19 87 52 122 39 87 -111 98 30 -93 -140 5 -213 -243 -43 -30 3 2 139 143 96 49
1573D9K3r4J4L5J73j87n6J93j39q5J86o8J5J4j5k27m0n4RJ49K5K4m6N3N4M6qJ79
$$ 49 72 -22 -8 27 200 13 -43 150 11 -74 112 44 59 73 58 -169 -209 -263 -254 -105 -80 -56 -102 -49 5 51 43 222
1601B22r7n5PJ10n1j05j5J31R0j63p0R6L5m7j81O9qL3j61N1P5l18J53M9JO8J23
$$ 222 125 70 77 187 136 31 16 147 237 74 4 100 135 88 -93 -24 -32 1 -160 -109 -34 -352 -199 -150 -149 -81 42
1628D2p0L7O2O2JJ16q6r2P4M7m2k6K3n2o5J25j06j28J37k34O8j40p1J36O8l9N7
$$ 42 -28 9 71 133 134 250 164 72 146 193 151 125 148 96 31 156 50 -78 59 -175 -107 -247 -318 -182 -114 -153 -96
1655i6k4K5J52o1K11P9r7J13m5k8n6J5l4K2o0m9n2j49lJ43k06m7L4l2P7m5RK5
$$ -96 -120 -95 57 -4 207 286 189 302 257 229 173 188 154 176 116 67 15 -134 -137 6 -200 -247 -213 -245 -168 -213 -204 -179
1683a79m8P4P8O3K02j67K71j60o9J42M3o5rj27LLm6j2n7l2q7J2l0J3k06J81J37
$$ -179 -227 -153 -75 -12 190 23 294 134 65 207 250 185 176 49 52 55 9 -3 -60 -92 -179 -167 -197 -184 -390 -209 -72
1710g2k23J62M5J09oP0k2M6K13kj09m7L2r6QO8j23l4K4j61J42o3On6m5q3P0k33
$$ -72 -295 -133 -88 21 15 85 63 109 322 320 211 164 196 100 108 176 53 19 43 -118 24 -39 -33 -89 -134 -217 -147 -380
1738c80J40NP2J10j17P8O0J28J28j6P6k23R6l1J35j16j79J14n9l1k4l0m3n8L7
$$ -380 -240 -235 -163 -53 -170 -92 -32 96 224 208 284 61 157 126 261 145 -34 80 21 -10 -34 -64 -107 -165 -128
1763a28L4J29j89n3R0J15k13J00R9m6J49Q7R7o4j23K26j22m6Nm1L7j58j54N1R2
$$ -128 -94 35 -154 -207 -117 -2 -215 -115 -16 -62 87 174 271 207 84 310 188 142 147 106 143 -15 -169 -118 -26
1788b6j32N5Oo5N9j13R6M9%n4J9J11j37O4Q3R9P5j5Q9kj23P4j08N3l21J86J5j18
$$ -26 -158 -103 -97 -162 -103 -216 -120 -71 -71 -125 -106 5 -132 -68 15 114 189 174 263 261 138 212 104 157 -164 22 37 -81
1816h1J19K2j26q1JP7m8R0N7n4o7l4Q8N1j49K28j3qL1k2M2l1j00R6Pj41j11M3
$$ -81 38 60 -66 -147 -146 -69 -117 -27 30 -24 -91 -125 -37 14 -135 93 80 72 103 81 123 92 -8 88 95 -46 -157 -114
1844a14k8K2J8L7N3l3o2n1J34L3l8J04r3P0l6QJ58m2pM4o0J28j26m6j13J58o5
$$ -114 -142 -120 -102 -65 -12 -45 -107 -158 -24 9 -29 75 -18 52 16 24 182 140 133 177 117 245 119 73 -40 118 53
1871E3j52R4j21L2L3J3o4P5r4J15P3j47J50j17P0j14J45M8k24n9J60j5J61m2M1
$$ 53 -99 -5 -126 -94 -61 -48 -112 -37 -131 -16 57 -90 60 -57 13 -101 44 92 -132 -191 -31 -46 115 73 114
1896A14l0j86P0J15j34p9N7Q6j13q6K17k7P1j36K17j51L8j6P3j3r0k4J27J38k41
$$ 114 84 -102 -32 83 -51 -130 -73 13 -100 -186 31 4 75 -61 156 5 43 27 100 87 -3 -27 100 238 -3
1921cNL9J40j38N7L0o2j08R3j31p9J4M3K0l4O3M7J91k30p7J23N0N6j67q1R9P1
$$ -3 2 41 181 43 100 130 68 -40 53 -78 -157 -143 -100 -80 -114 -51 -4 187 -43 -120 3 53 109 -58 -139 -40 31
1948C1j51J39l0j87J89O7J6j08J15n3m1Q0j02J37p0p0J36r2nJ0J09q3M8j20O5
$$ 31 -120 19 -11 -198 -9 58 74 -34 81 28 -13 67 -35 102 32 -38 98 6 1 11 120 37 85 -35 30
1973C0j5J7j06J43j06j5M7l8k2L7J7J29j64rJ07o3P8j42J51m3j5o5O1P7o0p3O6
$$ 30 15 32 -74 69 -37 -52 -5 -43 -65 -28 -11 118 -46 -55 52 -11 67 -75 76 33 18 -47 14 91 31 -42 24
2000B4Oq1n1Q8k6J1J13j64J39j16J09m8N8O2lJ0N4%n0N8j45O1l7K4J10p4n6L9
$$ 24 30 -51 -102 -14 -40 -29 84 -80 59 -57 52 4 62 124 121 131 185 185 135 193 48 109 72 96 206 132 76 115
2028A15j53L7O0j38j52J12l8M3j47J94r6N6P4N2Nj0j6Q8k1m1j21LK07J5j37j57
$$ 115 -38 -1 59 -79 -231 -119 -157 -114 -261 -67 -163 -107 -33 19 24 14 -2 86 65 24 -97 -94 113 128 -9 -166
2054a66J77O4l3N5p4m0J9k4J2j26L9K3ll8N2K20j05p5Q2L0l2Q4k9m8L2Q7j98j9
$$ -166 11 75 42 97 23 -17 2 -22 -10 -136 -97 -74 -77 -115 -63 157 52 -23 59 89 57 141 112 64 96 183 -15 -34
2082c4N7m4J3k9r3J76j20J37j65Q6j16j0k3J57o1K4Mj5O5j3K25p8m0Q4ok43K01
$$ -34 23 -21 -8 -37 -130 46 -74 63 -102 -16 -132 -142 -165 -8 -69 -45 -41 -56 9 -4 221 143 103 187 181 -62 139
2109A39j28P9L8k12O6J6J10j85O2K7J23j70q5J69j01N6nk0J54n1K6J5M1m4j6M3
$$ 139 11 90 128 -84 -18 -2 108 -77 -15 12 135 -35 -120 49 -52 4 -1 -21 133 82 108 123 164 120 104 147
2135A47o4j0l9L3J1m8q1j04p1J19k6O1mO3j18J50j38N8j9R7J27r9k5p5J42j0N6
$$ 147 83 73 34 67 78 30 -51 -155 -226 -107 -133 -72 -76 -13 -131 19 -119 -61 -80 17 144 45 20 -55 87 77 133
2162A33R2p7q3n8J23Rj90q9R1J6M5k05J49J1o3J16J9j26N9L8q2P9j46K04k3q7
$$ 133 225 148 65 7 130 139 -51 -140 -49 -33 12 -193 -44 -33 -96 20 39 -87 -28 10 -72 7 -139 65 42 -45
2188d5J93j14J0p5J38K8k9n3q8j25J16r3o1J37P8qj33R1j2j9J08Q4k28J34M8q6
$$ -45 148 34 44 -31 107 135 106 53 -35 -160 -44 -137 -198 -61 17 9 -124 -33 -45 -64 44 128 -100 34 82 -4
2214dP3kk6R5o6q9P4M0O0o0j14J6M4rj31k1J00j6m8J01p9r2O3R1M6n4K5j21J39
$$ -4 69 67 41 136 70 -19 55 95 155 95 -19 -3 41 32 -99 -120 -20 -36 -84 17 -62 -154 -91 0 46 -8 17 -104 35
2243C5rq4R0lLqJ17j48N8l7Rk7J1jj43J67j12k1N7m1M7O8M6m6k6M2J6k4j7J12
$$ 35 26 -58 32 29 32 24 141 -7 51 14 23 -4 7 6 -137 30 -82 -103 -46 -87 -40 28 74 28 2 44 60 36 19 131
2273A31o4L1%mQq1j7J0L1j9Q0j46m1N2j06J05Jj8l5R6j49K25k09P3J25k0r8n3
$$ 131 67 98 98 94 102 21 4 14 45 26 106 -40 -81 -29 -135 -30 -29 -47 -82 14 -135 90 -119 -46 79 59 -39 -92
2301i2J33N8k09j9K43j49L5L3n6q1P6M1O5n1m0J05p3j44J47kJ74j40j2nKm0N2
$$ -92 41 99 -110 -129 114 -35 0 33 -23 -104 -28 13 78 27 -13 92 19 -125 22 20 194 54 42 37 39 -1 51
2328E1j7R6j05K0M6j29R0j26J40K2n5M2j53J72k31J88k9k3j34R8J08q7L3n1R6
$$ 51 34 130 25 45 91 -38 52 -74 66 88 33 75 -78 94 -137 51 22 -1 -135 -37 71 -16 17 -34 62
2353F2j77J83m8o9q0J50Qj2mM8j28J79p4j20J77lR7j73j0J13j11p4J06m7K6m4
$$ 62 -115 68 20 -49 -129 21 29 17 13 61 -67 112 38 -82 95 92 189 16 6 119 8 -66 40 -7 19 -25
2379b5M5J7k6J30p8n0P5j60O1l7QJ4M6k8q5J03k28J46j8L1%J15j37OO3p5Q2m0
$$ -25 20 37 11 141 63 13 88 -72 -11 -48 -40 -26 20 -8 -93 10 -218 -72 -90 -59 -59 56 -81 -75 -12 -87 -5 -45
2407d5M2j16J98k44J77on7Q4l7k9p4Q2j21J02n7J25K5J18j0j75J78m6NK7p3m3
$$ -45 -3 -119 79 -165 12 6 -51 33 -4 -33 -107 -25 -146 -44 -101 24 49 167 157 -18 160 114 119 146 73 30
2433C0N8N8j63N4l5Q3n1j17N5J4J5j52J44QJ9k7n5K2K6K2l8J17q6k0R6n4O9k21
$$ 30 88 146 -17 37 2 85 34 -83 -28 -14 1 -151 -7 1 20 -7 -62 -40 -14 8 -30 87 1 -19 77 23 92 -129
2461a29Q3J13n2Q6j60J4K2J2K9j18M6k7J72m0j04j36K48J4kn7R5K0L1j37M8r5
$$ -129 -46 67 15 101 -59 -45 -23 -11 18 -100 -54 -81 91 51 -53 -189 59 73 71 14 109 129 160 23 71 -24
2487b4J29l6r3J30j29j6Q3r0oN9K1q5l9P3P3p7j10J34m3P1k4m2J7kR5k4kM4P0
$$ -24 105 69 -24 106 -23 -39 44 -46 -52 7 28 -57 -96 -23 50 -27 -137 -3 -46 25 1 -41 -24 -26 69 45 43 87 157
2516A57j97J47L2m7q0M8n2m4k4K01k05k6N4J58j46J02j20J09m8j9J1J59k25K2
$$ 157 -40 107 139 92 12 60 8 -36 -60 141 -64 -90 -36 122 -24 78 -42 67 19 0 11 170 -55 -33
2540c3J13n4Q8j60J1j2m2N8n0R2o1k6M3m6l4R0P9j38kR6l5q5J87o0N6q0%J26L
$$ -33 80 26 114 -46 -35 -47 -89 -31 -81 11 -50 -76 -33 -79 -113 -23 56 -82 -84 12 -23 -108 79 19 75 -5 -5 121 124
2569A24j02P3l6N5Kj08j6K4J41q6j9j15O7j37K5J14k6M7o6J4N6K4p7L3L0j4J9
$$ 124 22 95 59 114 116 8 -8 16 157 71 52 -63 4 -133 -108 6 -20 27 -39 -25 31 55 -22 11 41 27 46
2596D6K1j5nk1J1j0O3r3k3P1o1L0L7j93K4J9k1R0r0R5K4M3L0k3O0k3j17j6J27
$$ 46 67 52 47 26 37 27 90 -3 -26 45 -16 14 51 -142 -118 -99 -120 -30 -120 -25 -1 42 72 49 109 86 -31 -47 80
2625H0P7nj69J39j09j9J75k0J6j11n3O7m6J21j6j65J04k5kL0l4L0n3J2Q4j47m5
$$ 80 157 152 -17 122 13 -6 169 149 165 54 1 68 22 143 127 -38 66 41 39 69 35 65 12 24 108 -39 -84
2652h4J06k6k7J74m7k22R5Q0K9j27j4N0N9j63K8PL1l5O7j6oL9m6L1J26pM2j03
$$ -84 22 -4 -31 143 96 -126 -31 49 78 -49 -63 -13 46 -117 -89 -82 -51 -86 -19 -35 -41 -2 -48 -17 109 102 144 41
2680D1N9l7N9k8j69J73j9j32L1kJ09l4J4n7M8j39J43j41Q8m3p1R1m6P9p6L1j00
$$ 41 100 63 122 94 -75 98 79 -53 -22 -24 85 51 65 8 56 -83 60 -81 7 -36 -107 -16 -62 17 -59 -28 -128
2707a28J32q6N1LP3o2o6J62q8M0j0O5j20K7N6o7Q0P4k96J83j5P0J3j58P6L4pJ6
$$ -128 4 -82 -31 -28 45 -17 -83 79 -9 31 21 86 -34 -7 49 -18 62 136 -160 23 8 78 91 -67 9 43 36 52
2735E2M5Ko5Lm7PNL9J2r7P4o3N2l9JP2j80O0J26k17J94q5N0k1mj9r3K8J40m9J7
$$ 52 97 99 34 37 -10 -3 2 41 53 -44 30 -33 19 -20 -19 53 -127 -67 59 -158 36 -49 1 -20 -24 -43 -136 -108 32 -17 0
2766@L4k8rm1J35l9p5K6L9JM2j34q9K83j93J80r1O0p5j1lj6J84j72L4m4J69j85
$$ 0 34 6 -3 -44 91 52 -23 3 42 43 85 -49 -138 145 -48 132 41 101 26 15 12 -4 180 8 42 -2 167 -18
2794a8R1j61J43q2L5Q4j70k1N1L7J40j29L4j66N5P7O9j14O1n7J06j38K72k61l5
$$ -18 73 -88 55 -27 8 92 -78 -99 -48 -11 129 0 34 -132 -77 0 69 -45 16 -41 65 -73 199 -62 -97
2819i7J34m4M5j59K13k00K25j6n9Q5j85J44j47J70o2n0kJ07r3K5R2j24k0R7r6
$$ -97 37 -7 38 -121 92 -108 117 101 42 127 -58 86 -61 109 47 -3 -5 102 9 34 126 2 -18 79 -17
2844a7J6J10j11L1j26N3j01Q6j7O0lJ7q0K54j95K5o1%N3n0M1qj7j27J20P5om4
$$ -17 -1 109 -2 29 -97 -44 -145 -59 -76 -16 -19 -2 -82 172 -23 2 -59 -59 -6 -56 -15 -23 -40 -167 -47 28 22 -22
2872b2P4p5q2J67J4J7j21Q9M2m1l7j11Q8J6M2J19k12j3J57j37R4O4o2m3P1l7M4
$$ -22 52 -23 -105 62 76 93 -28 61 103 62 25 -86 2 18 60 179 -33 -46 111 -26 68 132 70 27 98 61 105
2899A05p4PK2j4lp5J23q9n1K2j47J45P2L3j07r6N6pm4lJ97r4L0l6K00j52j8m7
$$ 105 31 38 60 46 43 -32 91 2 -49 -27 -174 -29 43 76 -31 -127 -71 -78 -122 -125 72 -22 8 -28 172 20 2 -45
2927d5L3p7J58J6j67K05l6N2l1j44L4m0K19k20J43p1m2j1J65r4K4o2n3J76j75
$$ -45 -12 -89 69 85 -82 123 87 139 108 -36 -2 -42 177 -43 100 29 -13 -24 141 47 71 9 -44 132 -43
2952d3K9O3n0m8K7oN6n2k5Nk3Q1o4o3J14l7n4M0oj43K69J5l7l1j06K21j85M7N1
$$ -43 -14 49 -1 -49 -22 -28 28 -24 -49 -44 -67 14 -50 -113 1 -36 -90 -50 -56 -199 70 85 48 17 -89 132 -53 -6 45
2981D5p8P8L5l5n7J14j41N2m3JL6nN2K1r9qJ5j3l4Q1j22J50p4K6L0j62N3J13p9
$$ 45 -33 45 80 45 -12 102 -39 13 -30 -29 7 2 54 75 -24 -32 -17 -30 -64 17 -105 45 -29 -3 27 -135 -82 31 -48
3010d8J01j24n2L6m6K7J05q9k6j4J6o2J05J04j54J04j36J48N6L3j74J82j75J43
$$ -48 53 -71 -123 -87 -133 -106 -1 -90 -116 -130 -114 -176 -71 33 -121 -17 -153 -5 51 84 -90 92 -83 60
3034F0O0j90MK7lJ70j07Q9j70J49k2J6L7o9K7j89J14m6K4j02J35p1o5M0M5Ljj13
$$ 60 120 -70 -66 -39 -42 128 21 110 -60 89 67 83 120 51 78 -111 3 -43 -19 -121 14 -57 -122 -82 -37 -34 -35 -148
3062a48J49q8J12o6J6j49J99rj13J80j88J47r7m0R2k8kJ17n5n2N1p2oO3n7J22
$$ -148 1 -87 25 -41 -25 -174 25 16 -97 83 -105 42 -55 -95 -3 -31 -33 84 29 -23 28 -44 -50 13 -44 78
3088G8K0n3RO5j72J44m5q2nP6m1M2K8o6O7j04J0m5M2k3kN2p3j06J40k2k1J3Q2
$$ 78 98 45 54 119 -53 91 46 -36 -41 35 -6 36 64 -2 65 -39 -29 -74 -32 -55 -57 -5 -78 -184 -44 -66 -87 -74 8
3117Hl9J7K8J2Om1M3n1m2O8k12L02r3P1q2m8o1K65j3j25k0L0O8p8N7n4pJ09j6
$$ 8 -31 -14 14 26 32 -9 34 -17 -59 9 -203 99 6 77 -5 -53 -114 151 138 13 -7 23 91 13 70 16 9 118 102
3146A02j60j5J05PP9j35m9R2P1k5n7J9j07J26j43J28o3K1j40K55j55n5J45o0p2
$$ 102 -58 -73 32 39 118 -17 -66 26 97 72 15 34 -73 53 -90 38 -25 -4 -144 111 -44 -99 46 -14 -86
3171h6O2M9Q4j77m7J2Q7J14k45K72r7pj37J29m3P2r6M7P0r8P4R8j06K3p1j6J32
$$ -86 -24 25 109 -68 -115 -103 -16 98 -147 125 28 21 -116 13 -30 42 -54 -7 63 -35 39 137 31 54 -17 -33 99
3198I9j11J14r8N7p4MK0J12j14q5NJ29j60J54N6j47j29K0O6M6q0l5J51Nj11kJ57
$$ 99 -12 102 4 61 -13 -9 11 123 9 -76 -71 58 -102 52 108 -39 -168 -148 -82 -36 -116 -151 0 5 -106 -108 49
3225D9m6K1l6j1J25n7o8o9J56j35J3N4j1J10m2J9m6P1o2k8l0J87o1o0k3J1OL2
$$ 49 3 24 -12 -23 102 45 -23 -92 64 -71 -58 -4 -15 95 53 72 26 97 35 7 -23 164 103 43 20 31 37 69
3253F9L0r6j4j1Rlj27O2R2n9M2j16J65J6j44P1L9rj3o1M7p2O1m8J38n0n0p6L6
$$ 69 99 3 -11 -22 -13 -16 -143 -81 11 -48 -6 -122 43 59 -85 -14 25 16 3 -58 -11 -83 -22 -70 68 18 -32 -108 -72
3282g2M2J09n3k7J19j42j50J67o7Q8J3J0o1J82r3o6R7k09K47k12J01q4J2J15q8
$$ -72 -30 79 26 -1 118 -24 -174 -7 -74 14 27 37 -24 158 65 -1 96 -113 134 -78 23 -61 -49 66 -22
3307b2R6o9r5R4j06Q2k8O5N1j49N8j04N8R5j7l3N6N0p3R1n0j5q6M8l0k8K2J20
$$ -22 74 5 -90 4 -102 -20 -48 17 68 -81 -23 -127 -69 26 9 -24 32 82 9 100 50 35 -51 -3 -33 -61 -39 81
3335H1o8j30J50M2J58k01Q9qr2K0Lo7O6k6J01j31MJ05m9O5j7M8j79kN8q3J12o0
$$ 81 13 -117 33 75 233 32 121 113 21 41 44 -23 43 17 118 -13 -9 96 47 112 95 143 -36 -38 20 -63 49 -11
3363a1k9j6j25J49q8J65q7p7J25r2O1j02N2qL6Lj8j4N4K0Q4o6P7n6J27k12J15
$$ -11 -40 -56 -181 -32 -120 45 -42 -119 6 -86 -25 -127 -75 -83 -47 -44 -62 -76 -22 -2 82 16 93 37 164 -48 67
3390F7J7p0n8J62Lr7q8J11j9P5l3l7J17j75j9j5K0o6J09K9m7L0r1J77n8J1K6j77
$$ 67 84 14 -44 118 121 24 -64 47 28 103 70 33 150 -25 -44 -59 -39 -105 4 33 -14 16 -75 102 44 55 81 -96
3418i6OJ54j02J7P9l4K5j34Q3rm0M4Ol1M6lm9J32p7J41j58J26o2q0J60p3j0n6
$$ -96 -90 64 -38 -21 58 24 49 -85 -2 -11 -51 -7 -1 -32 14 11 -38 94 17 158 0 126 64 -16 144 71 61 5
3446EO0j03J70j34J35j43O7k0m7K2Q2k3p2n5o0L3Q0P0j15K7R9j23M9P6l8J4j8
$$ 5 65 -38 132 -2 133 -10 57 37 -10 12 94 71 -1 -56 -116 -83 -3 67 -48 -21 78 -45 4 80 42 56 38
3473C8j8j64N3Q9Rn8n4pQ0K4L8n3p1J53j45L1J22k2n8K8J0M0q7O7j19P3J00o5
$$ 38 20 -144 -91 -2 7 -51 -105 -112 -32 -8 30 -23 -94 59 -86 -55 67 45 -13 15 25 65 -22 45 -74 -1 99 34
3501C4J17j25J09q9M4j04k1O8L8n7q3J08r0K3m1J46j35M0j56J99j34J0kjP8p6
$$ 34 151 26 135 46 90 -14 -35 33 71 14 -69 39 -51 -28 -69 77 -58 -18 -174 25 -109 -99 -101 -102 -24 -100
3527a00N7N8L0q5P1j21J27p5R1k4j03k6L6L4k2P7k1O9j9j53K01j03MN1j4P4r7
$$ -100 -43 15 45 -40 31 -90 37 -38 53 29 -74 -100 -64 -30 -52 25 4 73 54 -99 102 -1 3 54 40 114 17
3554A7m8J74j11p3N9Q3r5J00j32P3o1l5nn9J51q3o6O5j21j28K15K6M1p4m1R6k7
$$ 17 -31 143 32 -41 18 101 6 106 -26 47 -14 -49 -54 -113 38 -45 -111 -46 -167 -295 -80 -54 -13 -87 -128 -32 -59
3581e9J01rp0K6N5PM2q8L2J0j21J16P0r8%jMj25J02O4k5Q8r1J7J14p4q4K6K2L5
$$ -59 42 33 -37 -11 44 51 93 5 37 47 -74 42 112 14 14 13 17 -108 -6 58 33 121 30 47 161 87 3 29 51 86
3611H6j07j04J74j11j0m7O4m1M2N4k8K4q2J3%M3P7r3k%O0j04L4K7n4J29j6J42
$$ 86 -21 -125 49 -62 -72 -119 -55 -96 -54 0 -28 -4 -86 -73 -73 -30 47 -46 -48 -48 12 -92 -58 -31 -85 44 28 170
3639A70j32J1j33J08Q9m5Q9m6j04J12j19J22o1j7r1K1RP2p3j6L1J11j64PJ18K1
$$ 170 38 49 -84 24 113 68 157 111 7 119 0 122 61 44 -47 -26 -17 55 -18 -34 -3 108 -56 -49 69 90
3665I0j04M5r0R4j07N8P6k06J26j04O8N5M6p7qQ1n8j77J57O0o1N8m3P3J35j30
$$ 90 -14 31 -59 35 -72 -14 62 -144 -18 -122 -54 1 47 -30 -38 43 -15 -192 -35 25 -36 22 -21 52 187 57
3691E7K6j5l1N7Lj3N2j2p7NJQ1j27J46j34M3K3l0J19k36pJ8J16p1k4P2n9j3J6
$$ 57 83 68 37 94 97 84 136 124 47 52 53 134 7 153 19 62 85 55 174 -62 -69 -51 65 -6 -30 42 -17 -30 -14
3720a4rn8L5lQ0q4PJ13j51l0P0Q7j4j17O2m4m1N4J13r0M5O2k6r8J56j41K9k2J27
$$ -14 -23 -81 -46 -49 31 -53 -46 67 -84 -114 -44 43 29 -88 -26 -70 -111 -57 56 -34 11 73 47 -51 105 -36 -7 -29 98
3749I8p9O7J23j66K9k6Mj26R2L2q5QP0M3j07j4J15n8P0p1kp9M4J11m8j45l9K6
$$ 98 19 86 209 43 72 46 50 -76 16 48 -37 -29 41 84 -23 -37 78 20 90 19 17 -62 -18 93 45 -100 -139 -113
3777a13MM7N1o5rM1j07J73K2l6m8J06np6r4J35o1J03m6m9L4k7J12Or5J8R5j25
$$ -113 -109 -62 -11 -76 -85 -44 -151 22 44 8 -40 66 61 -15 -109 26 -35 68 22 -27 7 -20 92 98 3 21 116 -9
3805iJ2k0J30q0l2K5n3J84k22qQ2n0r8N7J71r4P9j45J27n8O1Nm3j46K2P9j22J35
$$ -9 3 -17 113 33 1 26 -27 157 -65 -73 9 -41 -139 -82 89 -5 74 -71 56 -2 59 64 21 -125 -103 -24 -146 -11
3833a1O3r1J20j22JP2M0j34J28q8J06K5p3r2l5J60qp4L9J41k32J53m5km5J30j03
$$ -11 52 -39 81 -41 -40 32 72 -62 66 -22 84 109 36 -56 -91 69 61 -13 26 167 -65 88 43 41 -4 126 23
3860B3j1N1k9%n7l5P8n9P6l1J9j39L9P6no8J48l6Mo3k2M6l0P0p2O1Kq7N6Kn7P5
$$ 23 12 63 34 34 -23 -58 20 -39 37 6 25 -114 -75 1 -4 -72 76 40 44 -19 -41 5 -25 45 -27 34 36 -51 5 7 -50 25
3892B5Q5j15k0k9M8O6p5j1j16J76k8j43J38K7J43n3j2k5n4J9o5J67j79O4L5k09
$$ 25 110 -5 -25 -54 -6 60 -15 -26 -142 34 6 -137 1 28 171 118 106 81 27 46 -19 148 -31 33 68 -141
3918a41K05k74J35o3P9M3Rj79J53J13j63oN9o0J69j07Oj63J85J18k58P4O7K9K8
$$ -141 64 -210 -75 -138 -59 -16 -7 -186 -33 80 -83 -89 -30 -90 79 -28 -22 -185 0 118 -140 -66 1 30 58
3943E8p2oM8R8n4m7p4P9m8j8j2O4R9p0k7M2J4J6J6j00J16r4L8j18PJ17j29J5J9
$$ 58 -14 -20 28 126 72 25 -49 30 -18 -36 -48 16 115 45 18 60 74 90 106 6 122 28 66 -52 -45 72 -57 -42 -23
3972b3m7kJ43j64l4J09j20J33q0N3p6kO2q2M2O0J8r9J13k8O5op5M7M6o6J5k7M4
$$ -23 -70 -72 71 -93 -127 -18 -138 -5 -85 -32 -108 -110 -48 -130 -88 -28 -10 -109 4 -24 41 35 -40 7 53 -13 2 -25 19
4001A9k1J05q8P9l0p1Jj46J02J43ql0K4j20R6N8p1j17P7O5j30L3J4nK4Q8j70K13
$$ 19 -2 103 15 94 64 -7 -6 -152 -50 93 85 55 79 -41 55 113 42 -75 2 67 -63 -30 -16 -21 3 91 -79 134
4029A34j56k7M7j83K99j88N0m0p3J71j97J90J11j89J7j6Q5no1J20o7J71k15J03
$$ 134 -22 -49 -2 -185 114 -74 -24 -64 -137 34 -163 27 138 -51 -34 -50 35 30 -31 89 22 193 -22 81
4053H1l2k0k1R4j04OK7Jj72L2J37o1P4Rp5M6j37J73J5j63J06pj01Q6O1p7L8J1
$$ 81 49 29 8 102 -2 4 31 32 -140 -108 29 -32 42 51 -24 22 -115 58 73 -90 16 9 -92 -6 55 -22 16 27
4081B7k9M4j20J0j7R6n6nK8m7Q6j67j1J11n9J72k1m7l7LJ38q4L8pJK9K7Op5M1
$$ 27 -2 42 -78 -68 -85 11 -45 -50 -22 -69 17 -150 -161 -50 -109 63 42 -5 -42 -39 99 15 53 46 47 76 103 109 34 75
4111G5N8p2rl7J10k02J17l5m5N6nr3J24r1L5j8P5Mj70J54m8n9J18q5K4m2m2K19
$$ 75 133 61 52 15 125 -77 40 5 -40 16 11 -82 42 -49 -14 -32 43 47 -123 31 -17 -76 42 -43 -19 -61 -103 116
4139A16k32K26p8l7oq8J15j01J98j46j4l1L2k4JJ58j70Q8K8j28J40q2P5R5p6n
$$ 116 -116 110 32 -5 -11 -99 16 -85 113 -33 -47 -78 -46 -70 -69 89 -81 7 35 -93 47 -35 40 135 59 54
4165E4N6p1J13j02pk3j20J67j09n1kJ17K7r0J6m6J07j77J03o0P6K0o9j5J05ro7
$$ 54 110 39 152 50 43 20 -100 67 -42 -93 -95 22 49 -41 -25 -71 36 -141 -38 -98 -22 -2 -71 -86 19 10 -57
4192e7J6O7j60J54l1O8J2n2L0r9l4J11k7J9oj1J35j50l0J35j59J39K6m1l2q9Q3
$$ -57 -41 26 -134 20 -11 57 69 17 47 -52 -86 25 -2 17 11 0 135 -15 -45 90 -69 70 96 55 23 -66 17
4219A7P8j71mJ70j45L3RL6K7k8l1j3q9J35n7l6Q0j47J08jk1K3p9R1J44j11l9m4
$$ 17 95 -76 -80 90 -55 -22 -13 23 50 22 -9 -22 -111 24 -33 -69 11 -136 -28 -29 -50 -27 -106 -15 129 18 -21 -65
4247f5PJ9M3j7J53j80n2J07rl3J06l1j15J13j48K19o6oJ0oRM3PO6j47M9j1k4m4
$$ -65 -58 -39 4 -13 140 -40 -92 15 6 -27 79 48 -67 46 -102 117 51 45 55 49 58 101 108 174 27 76 65 41 -3
4276cJ8kM8j03M6j21J27l1N2r2Q0n9m1O4j9J21j98j01J42J11j21O5o9K29j84J30
$$ -3 15 13 61 -42 4 -117 10 -21 31 -61 19 -40 -81 -17 -36 85 -113 -214 -72 39 -82 -17 -86 143 -41 89
4302H9j03M1r0Q9l6k7J82j08o6J50q9j7N2J1j3q3rP8M3l0j8p0r2K51j41k3O4q7
$$ 89 -14 27 -63 26 -10 -37 145 37 -29 121 32 15 67 78 65 -18 -27 51 94 64 46 -24 -116 135 -6 -29 35 -52
4330e2K3mk1J7R2q1J5j02M0l7L0J13l4q6O4M0J5po1P5j56P9k7j5j2P5J62j11J11
$$ -52 -29 -33 -54 -37 55 -26 -11 -113 -73 -110 -80 33 -1 -87 -23 17 32 25 -36 39 -117 -38 -65 -80 -92 -17 145 34 145
4359A45j21N6r1J19j3r6L6P0j14J05p4J07k70Q1J21l3N3j66J9j5J45l4rn6k3K51
$$ 145 24 80 -11 108 95 -1 35 105 -9 96 22 129 -141 -60 61 28 81 -85 -66 -81 64 30 21 -35 -58 193
4385A93k75Q2j13J63p4O9j14O9L1k07J57r6K48j94J54ln2m0j1r6J09M7l3J41j38
$$ 193 -82 0 -113 50 -24 45 -69 0 31 -176 -19 -115 133 -61 93 90 38 -2 -13 -109 0 47 14 155 17
4410A7o0J13l9P2j35J11j12Q0j13J39j26P3K6q5p4J77J9p0r2P5Oj3p9m0J02o8
$$ 17 -43 70 31 103 -32 79 -33 47 -66 73 -53 20 46 -39 -113 64 83 13 -79 -4 2 -11 -90 -130 -28 -96
4436i6L8M4q1J4J35p3O4j27O0N4j25NN2j32J45Q5j02m9O2m1O7p5J09k5m5K9k1
$$ -96 -58 -14 -95 -81 54 -19 45 -82 -22 32 -93 -88 -36 -168 -23 62 -40 -89 -27 -68 -1 -76 33 8 -37 -8 -29
4463b9R3r8P0j1lJ26k5q7J06k0r3R1j01o7O0K6K0k5Qj06n6l8J14j7O0QJ2q8K1
$$ -29 64 -34 36 25 22 148 123 36 142 122 29 120 19 -48 12 38 58 33 41 -65 -121 -159 -45 -62 -2 6 18 -70 -49
4492d9J22j09no9P0k5J62j07m3o4P1K6k4r0P8j8J83p7k7L8r7J70j38J4P8kp6M6
$$ -49 73 -36 -41 -110 -40 -65 97 -10 -53 -117 -46 -20 -44 -134 -56 -74 109 32 5 43 -54 116 -22 -8 70 68 -8 38
4520C8Kn5J36Pj24J20j66J55j97O2q4j1J37j47J67k56J22QJ6P3q0Q0j09O3l0M1
$$ 38 40 -15 121 128 4 124 -42 113 -84 -22 -106 -117 20 -127 40 -216 -94 -86 -70 3 -77 3 -106 -43 -73 -32
4546c2N7m8L9n0O0jk0M3O2j10qM9l4J03p7K2J7j44J41Lj45K26n0j20k6L2N9N7
$$ -32 25 -23 16 -34 26 25 5 48 110 0 -8 41 7 110 33 55 72 -72 69 72 -73 153 103 -17 -43 -11 48 105
4574A05k47K86p7o1m1J7J22j51M3K2l4O3j12k4N7j25Q5oN6L8q4J8P0n6M3j11J8
$$ 105 -142 144 67 6 -35 -18 104 -47 -4 18 -16 47 -65 -89 -32 -157 -72 -78 -22 16 -68 -50 20 -36 7 -104 -86
4601h6J59P5j29K0K5p9j22J52p7N8MrL4j3L0r9O0j9O0m0q7J01L7M6j27M8O9j1
$$ -86 73 148 19 39 64 -15 -137 15 -62 -4 0 -9 25 12 42 -57 3 -16 44 4 -83 18 55 101 -26 22 91 80
4629H0m3j1j09L9Q0L9r9M2Oj8p2J6pQJ3K2p0N0r3J46r5Q0j47J14O0j1k5J03o2
$$ 80 37 26 -83 -44 36 75 -24 18 24 6 -66 -50 -57 -49 -36 -14 -84 -34 -127 19 -76 4 -143 -29 31 20 -5 98 36
4658C6Mjj12K83j94Pk6K8P5q4O4j01K6M1J0l0Ol6k6N0q0j7J60j03Q1K5Jj23l0
$$ 36 40 39 -73 210 16 23 -3 25 100 16 80 -21 5 46 56 26 32 -4 -30 20 -60 -77 83 -20 61 86 87 -36 -66
4687f6J6J9j0N1j24P1k3O0j75%Q3J49j16J1J47l2j67N5p6J54j2M6j7j07J32j33
$$ -66 -50 -31 -41 10 -114 -43 -66 -6 -181 -181 -98 51 -65 -54 93 61 -106 -51 -127 27 15 61 44 -63 69 -64
4713f4Q6j6L0p2O0rM1j46J49L4j42Q0j25J37o3n8J92j01L6j3Lp3m3J65n2kmj23
$$ -64 22 6 36 -36 24 15 56 -90 59 93 -49 31 -94 43 -20 -78 114 13 49 36 39 -34 -77 88 36 34 30 -93
4741i3K8l3J54j74J91j58n5J19N1m4j49J36N5m3r0J82j78j2J70m9o0P2L9R1k54
$$ -93 -65 -98 56 -118 73 -85 -140 -21 30 -14 -163 -27 28 -15 -105 77 -101 -113 57 8 -52 20 59 150 -104
4766a04qJ51m1L6J6nM4q8M3p1L9j4n3L4N7o0rK7J12j74p7J20j21J82n7J6m1R9
$$ -104 -112 39 -2 34 50 45 89 1 44 -27 12 -2 -55 -21 36 -24 -33 -6 106 -68 -145 -25 -146 36 -21 -5 -46 53
4794E3M6j78J62k02J15N8p7rO2o6l9R3j7L1j43j5J04Q1l8n0J49m9oJ30j55R7p6
$$ 53 99 -79 83 -119 -4 54 -23 -32 30 -36 -75 18 1 32 -111 -126 -22 59 21 -29 120 71 65 195 40 137 61
4821F1pQ2k7q4K3l5p3K36k64J06K02j81l1m9rQ3m9L3Q0j13m4N4J17j16kl9Q3N6
$$ 61 54 136 109 25 48 13 -60 176 -88 18 220 39 8 -41 -50 33 -16 17 97 -16 -60 -6 111 -5 -7 -46 37 93
4849I3j04j04M3O1J02j07Nj72N8K3j7J31n6l6J40o2O3l7j18n8J65OQl8O4n1O5
$$ 93 -11 -115 -72 -11 91 -16 -11 -183 -125 -102 -119 12 -44 -80 60 -2 61 24 -94 -152 13 19 27 -11 53 2 67
4876F7Q4j86LJ06k6j20J86p1q6Q5n3p1pO1k6L5k08R3K1J59j33k9P1J1m3J39j6
$$ 67 151 -35 -32 74 48 -72 114 43 -43 42 -11 -82 -89 -28 -54 -19 -227 -134 -113 46 -87 -116 -45 -34 -77 62 46
4903D6j63J23N6J7j99J20L3k6M2J0q9n8J22m2jL6m2J16J9r2J22j30K0M8J3ml1
$$ 46 -117 6 62 79 -120 0 33 7 49 59 -30 -88 34 -8 -9 27 -15 101 120 28 150 20 40 88 101 97 66
4930F6K4n0j03K09j25M5q6O0l4K8o4j8p1J47l4J3k11P6O0M3qPJ8k1n2pP1L2J5
$$ 66 90 40 -63 146 21 66 -20 40 6 34 -30 -48 -119 28 -6 7 -204 -128 -68 -25 -33 -26 -8 -29 -81 -88 -17 15 30
4959C0j49J33j90J97l5J44q8L7q6J03j10k2j4J13k8L4P0j17k3N3J2qo3m8Q2M0
$$ 30 -119 14 -176 21 -14 130 42 79 -7 96 -14 -36 -50 63 35 69 139 22 -1 52 64 56 -7 -55 27 67
4985F7m9m5j0M4M0q3o2j4J31q4J1m1O0j95K12o6O6n5P8M4j5m5p2RJ48j10k9J18
$$ 67 18 -27 -37 7 47 -36 -98 -112 19 -65 -54 -95 -35 -230 -18 -84 -18 -73 5 49 34 -11 -83 -74 74 -36 -65 53
5013E3l4j00J10pO2l0o8O9j23J2N5Qn3Q8No1k8P3nJ14j26m0m4J7Q6j11M4K9k0
$$ 53 19 -81 29 22 84 54 -14 55 -68 -56 -1 7 -46 42 47 -14 -42 31 26 140 14 -26 -70 -53 33 -78 -34 -5 -25
5042b5r2J90n9J1k6m2KJ3pJ37q4n4Ql3L5k8R9o1m7Q7q2K6J3J04k01J73JO7o7p4
$$ -25 -117 73 14 25 -1 -43 -41 -28 -35 102 18 -36 -28 -61 -26 -54 45 -16 -63 24 -58 -32 -19 85 -116 57 58 125 58 -16
5072a6P3J7o7J07q5r5K00oK5j65k5kj7R7Rk3o6N5NL7j9m8K6j25J55n7n7k4J85
$$ -16 57 74 7 114 29 -66 134 128 153 -12 -37 -39 -56 41 50 27 -39 16 21 58 39 -9 17 -108 47 -10 -67 -91 94
5101I4j84R1l8k1J01q9M1kk8M3j3j22J18mO4m4K9l4r1J34o3k4K13l07L40k29k9
$$ 94 -90 1 -37 -58 43 -46 -5 -7 -35 8 -5 -127 -9 -13 51 7 36 2 -89 45 -18 -42 171 -136 204 -25 -54
5128e4N2p4J27R4o9n3J27j88R9r4M1Q4j87J6Q2n3J8L8J1J5q0m4L1j1P4Q3j13O2
$$ -54 -2 -76 51 145 76 23 150 -38 61 -33 8 92 -95 -79 3 -50 -32 6 17 32 -48 -92 -61 -72 2 85 -28 34
5156C4p7J18mj27kj2j57K53j18l3J87j9N2j22J43j21N9o0J06r7k7Om6J01J08p8
$$ 34 -43 75 71 -56 -58 -70 -227 26 -92 -125 62 43 95 -27 116 -5 54 -6 100 3 -24 -18 -64 37 145 67
5182F7k2k8n7L6j20Q2J93j76J17Jj04k3lQ4q0O2j28O1J45q8O6j40m9M9L6q4nk9
$$ 67 45 17 -40 -4 -124 -42 151 -25 92 93 -11 -34 -37 47 -33 29 -99 -38 107 19 85 -55 -104 -55 -19 -103 -108 -137
5210a37N3N2n9O0K5j8K1j56M2K77k09j3J83n6K8j3j4Q9j05J11j40j6J6K00j61
$$ -137 -84 -32 -91 -31 -6 -24 -3 -159 -117 160 -49 -62 121 65 93 80 66 155 50 161 21 5 21 221 60
5235F0o2J9L4j23Q9nj00J40kj53MO1oK09j70p2m6N3M3m0J25o2kK4j27L0m8NK0
$$ 60 -2 17 51 -72 17 12 -88 52 50 -103 -99 -38 -44 165 -5 -77 -123 -70 -27 -67 58 -4 -6 18 -109 -79 -127 -122 -102
5264a02J47l6j7k3J64j32P1q2M2j4J19j41P1k6K4l0q0J28O7k15J35m7P7JJ8o6
$$ -102 45 9 -8 -31 133 1 72 -10 32 18 137 -4 67 41 65 35 -45 83 150 -65 70 23 100 101 119 53
5290E3j32O6n6J17p2N4j27K1k0j3l9R3m2QM0R4j23J23m4P6j2o8r4p6J40l0m6K4
$$ 53 -79 -13 -69 48 -24 30 -97 -76 -96 -109 -148 -55 -97 -89 -49 45 -78 45 1 77 65 -3 -97 -173 -33 -63 -109 -85
5318h5O1J03l4l5%J1j7l0m4O5k7N0k9O4j0j1O7p1j17J67J24k12N6n8M2Jj9r2J25
$$ -85 -24 79 45 10 10 21 4 -26 -70 -5 -32 18 -11 53 43 32 99 28 -89 78 202 -10 46 -12 30 31 12 -80 45
5347D5p2p5J26j4M8q5m7k6N1JM9Nk6k7mJ14p1j0j2j31O2J36L7m2j34J83Qo2K2
$$ 45 -27 -102 24 10 58 -27 -74 -100 -49 -48 1 6 -20 -47 -51 63 -8 -18 -30 -161 -99 37 74 32 -102 81 89 27 49
5376D9p1O1l7J13j59Q3P7q2n0P3R7j07k3J05n2k8p7J51o0j51J25j49R5o7J12q3
$$ 49 -22 39 2 115 -44 39 116 34 -16 57 154 47 24 129 77 49 -28 123 63 -88 37 -112 -17 -84 28 -55
5402e5LQ9j52R3M8j8j32mR5Jj9L5L2r8l1O9K8L7l1M1%n8R9k8l5KJ8P5p3J17K8
$$ -55 -52 37 -115 -22 26 8 -124 -128 -33 -32 -51 -16 16 -82 -113 -44 -16 21 -10 31 31 -27 72 44 9 11 29 104 31 148 176
5433A76j50k9J35j09P1m4M2K5l1o7J02N9j05j02J8OL0J24j83%J09j82P3N0rk3
$$ 176 26 -3 132 23 94 50 92 117 86 19 121 180 75 -27 -9 -3 27 151 -32 -32 77 -105 -32 18 9 -14
5459a4J7j00rR9l9q4J11m4N8n3R4o1p5J20J0L6p2J7R8P0j67P7Lk7l2K6r6J51J2
$$ -14 3 -97 -106 -7 -46 -130 -19 -63 -5 -58 36 -25 -100 20 30 66 -6 11 109 179 12 89 92 65 33 59 -37 114 126
5488A26j73L2J2l9Q0l5n7%K6p2P9J31j67J8N5pk9J49n1n8n1j8L2l3Q0l5n7k2J12
$$ 126 -47 -15 -3 -42 38 3 -54 -54 -28 -100 -21 110 -57 -39 16 9 -20 129 78 20 -31 -49 -17 -50 30 -5 -62 -84 28
5517B8l9J2q5Q3M9o5kk1Q4l5k9M6pJ48j67M1J9J0n5J1J0Q5j24K2J10j33O3q8J07
$$ 28 -11 1 -84 -1 48 -17 -19 -40 44 9 -20 26 19 167 0 41 60 70 15 26 36 121 -3 19 129 -4 59 -29 78
5546G8l9l0j7O1j64J04on0Mn9J30j4l8J6k3j38J98l1M9j94K39n5l8M9j21J34k2
$$ 78 39 9 -8 53 -111 -7 -13 -63 -59 -118 12 -2 -40 -24 -47 -185 13 -18 31 -163 76 21 -17 32 -89 45 23
5573B3R3p6n4K4o8J22M2j98J46q4Nj3M1J85j66P2LJ2n2n2m9k3J89o4j24j5J82
$$ 23 116 40 -14 10 -58 64 106 -92 54 -30 -25 -38 3 188 22 94 97 109 57 5 -44 -67 122 58 -66 -81 101
5600A01j2j27Q4j1M7j13j2N6m4O2K9n3p6Q9j05O8p2J17j06Q3J10q7Pj23o6J18
$$ 101 89 -38 46 35 82 -31 -43 13 -31 31 60 7 -69 20 -85 -17 -89 28 -78 5 115 28 35 -88 -154 -36
5626c6O3KK1OQ3j10J4k6j7l8J60j4Kq5M8r2M4K1n2jQ0K6p3j6Mj2P8l3n3Q3q8R
$$ -36 27 29 50 56 139 29 43 17 0 -38 122 108 110 25 73 -19 25 46 -6 -7 73 99 26 10 14 2 80 47 -6 77 -11 -2
5658bn5J09j65M9l6o8J12q1P1P6j02N6J40q7j39J63m3q9J54j75M8P9K1r3P5L8
$$ -2 -57 52 -113 -64 -100 -168 -56 -137 -66 10 -92 -36 104 17 -122 41 -2 -91 63 -112 -64 15 36 -57 18 56
5684E6l8L0K5mk8n5j0R4j7jm1Q9j32R5Q1m1j11PRq1J17j26q4J62p9J48j50N7Q2
$$ 56 18 48 73 69 41 -14 -24 70 53 52 11 100 -32 63 144 103 -8 -1 8 -73 44 -82 -166 -4 -83 65 -85 -28 54
5713E4j5q1O1q8l6J11n4k8Q2k4m9P3NK1J07j84M2K4N4j26P2N7r6M2j01J2M0mJ3
$$ 54 39 -42 19 -69 -105 6 -48 -76 6 -18 -67 6 11 32 139 -45 -3 21 75 -51 21 78 -18 24 -77 -65 -25 -29 -16
5742a6N6m4o1J70j2j49j1J04o0plk2k1L7JP3n6J0ro0J2n8n6N6o8J63r3Q6M5j25
$$ -16 40 -4 -65 105 93 -56 -67 37 -23 -30 -33 -55 -76 -39 -38 35 -21 -11 -20 -80 -68 -126 -182 -126 -194 -31 -124 -38 7 -118
5772a18o0J4J76Qk1P9n0l9J03j03oK1q1P2k2Q0J6k5LJ5O8m9p7R2m5j53J45M0P2
$$ -118 -178 -164 12 20 -1 78 28 -11 92 -11 -17 4 -77 -5 -27 53 69 44 47 62 130 81 4 96 51 -102 43 83 155
5801A55q8N9j74L9lk4Q8n6n8M7p9j9M1M8j1j52K01k00K35j25k1O3j00M6L3J17
$$ 155 67 126 -48 -9 -12 -36 52 -4 -62 -15 -94 -113 -72 -24 -35 -187 14 -186 49 -76 -97 -34 -134 -88 -55 62
5827F2j6n2l0J22k3j00P3j6m7Q2q8J41m7q6Q5N8r3j3j3M9J0rr3O9LP0j58P5l0
$$ 62 46 -6 -36 86 63 -37 36 20 -27 55 -33 108 61 -25 60 118 25 12 -1 48 58 49 -44 25 28 98 -60 15 -15
5856a5m3Q6j43N1J8j63J41J53j61K1k5R5m2j38M3J06NO9l05K08k7J88j99R4K9
$$ -15 -58 28 -115 -64 -46 -209 -68 85 -76 -55 -80 15 -27 -165 -122 -16 -11 58 -247 -39 -66 122 -77 17 46
5881D6q3jR2l6Q0q4r6K20k1j48N7Q7l2m3l2J19j65J48j15l1J45m7r4pkJ23q2Q
$$ 46 -37 -38 54 18 98 14 -82 138 117 -31 26 113 81 38 6 125 -40 108 -7 -38 107 60 -34 -41 -43 80 -2 6
5909Fl7M3j12J24j7j5NJL0q4J17j11j1m1L3j8%K7k7P8j1P8q1K8L0p9R2M8j70J24
$$ 6 -31 12 -100 24 7 -8 -3 -2 28 -56 61 -50 -61 -102 -69 -87 -87 -60 -87 -9 -20 58 -23 5 35 -44 48 96 -74 50
5939E0r1R2l0n2J54m5p2m1p9M2L9K5n4j1J41j44O0M3J3k5p4p7K09j10P4K1j14
$$ 50 -41 51 21 -31 123 78 6 -35 -114 -72 -33 -8 -62 -73 68 -76 -16 27 40 15 -59 -136 73 -37 37 58 -56
5966e6m4K0J59j53P0l3N4n5L3J2M5q8m1L5j1K2K3N5q5nR6kj11J62r4m7J4N4o5
$$ -56 -100 -80 79 -74 -4 -37 17 -38 -5 7 52 -36 -77 -42 -53 -31 -8 47 -38 -43 53 51 -60 102 8 -39 -25 29 -36
5995c6J2R1K3j26P7j04J55N6k22J11q7L0m8J04j3p7J15j44R6L3r6Q8m7n5RN4K3
$$ -36 -24 67 90 -36 41 -63 92 148 -74 37 -50 -20 -68 36 23 -54 61 -83 13 46 -50 38 -9 -64 -55 -1 22
6022B2l9K2p9L7j04J52J5k1j33J34N5j16R2K2r4j4l9J23P2j2J16k22J73j66L7
$$ 22 -17 5 -74 -37 -141 11 26 5 -128 6 61 -55 37 59 -35 -49 -88 35 107 95 211 -11 162 -4 33
6047C3j0N7m8j7N1j31P6P2J6j36Qj03J74n6j7j36J26p3M5o8J04mjl3L1m6M0J59
$$ 33 23 80 32 15 66 -65 11 83 99 -37 -29 -132 42 -14 -31 -167 -41 -114 -69 -137 -33 -37 -38 -71 -40 -86 -46 113
6075A13j20L1K2m3M0m0Lm9R0o2QJ19j27L0m3J22j00p7PK34l0m2K4r3%p1J55j09
$$ 113 -7 24 46 3 43 3 6 -43 47 -15 -7 112 -15 15 -28 94 -6 -83 -76 158 128 86 110 17 17 -54 101 -8
6103hq5R0n3M2k2pL1j2n3J17N3j00L5m8l0j8P6j48J47n7n3J51p0pk0J29r7j0j3
$$ -8 -93 -3 -56 -14 -36 -43 -12 -24 -77 40 93 -7 28 -20 -50 -68 8 -140 7 -50 -103 48 -22 -29 -49 80 -17 -27 -40
6132d0MN8j11j5J57qj47J04%J15o5n4O7k1j97J59qN6pN4j17J32r8M0P8j30K2M7
$$ -40 -36 22 -89 -104 53 45 -102 2 2 117 52 -2 65 44 -153 6 -2 54 47 101 -16 116 18 58 136 6 28 75
6160G5j29P1N3k01K45kk04J5J43q8Lj74J81j28N7Q1J1M1l7j89L17j09l2k1j9q1
$$ 75 -54 17 70 -131 114 112 -92 -77 66 -22 -19 -193 -12 -140 -83 -2 9 50 13 -176 141 32 0 -21 -40 -121
6186a21J72m9Jr6J90n4MQ6l6r3O0K0M1n9p7M1L4o6M0R6j3J5j12Mo9J05q3J5R5
$$ -121 51 2 3 -93 97 43 47 133 97 4 64 84 125 66 -11 30 64 -2 38 134 121 136 24 28 -41 64 -19 -4 91
6215I1o2k6q8J19j34J82r5p3mO2m1k5j06J99j2j01M3N6J34j14q8J33K3p1K8N4
$$ 91 29 3 -85 34 -100 82 -13 -86 -90 -28 -69 -94 -200 -1 -13 -114 -71 -15 119 5 -83 50 73 2 30 84
6241H4n6K5j5n1J00k23P3M1J49j2j67QQ4O1l1KJ31j96R1j49K9L5o9J20KLj03J19
$$ 84 28 53 38 -13 87 -136 -63 -22 127 115 -52 -44 40 101 70 72 203 7 98 -51 -22 13 -56 64 66 69 -34 85
6269H5O8k93J50P1p4Rj63J21q6K5L8K0M8p8L3J12m8j65K01m7o6J27k07KL13j30
$$ 85 153 -140 10 81 7 16 -147 -26 -112 -87 -49 -29 19 -59 -26 86 38 -127 74 27 -39 88 -119 -117 196 66
6295F6j38Q7M3o7J33n5j11K7k6l9J43jR5k08k9Q5n7J54j45N0J4n1k9L2j3j7N8
$$ 66 -72 15 58 -9 124 69 -42 -15 -41 -80 63 62 157 -51 -80 5 -52 102 -43 7 21 -30 -59 -27 -40 -57 1
6322AM7jl0Mj64J16l0k1R5r3K7l6J7k0K2N3ll2J48k7P9p9p1J67j73O7N8j35N2
$$ 1 48 47 17 21 -143 -27 -57 -78 17 -76 -49 -85 -68 -88 -66 -13 -16 -48 100 73 152 73 2 169 -4 63 121 -14 38
6351C8K1m9k6M5J09k03J39L8o4r9J05l2o0P2o1R2p4J9or8OP5l1L3mn5%rL0o8O9
$$ 38 59 10 -16 29 138 -65 74 112 48 -51 54 22 -38 34 -27 65 -9 10 4 -94 -88 -13 -44 -11 -15 -70 -70 -79 -49 -117 -48
6382d8n8qM9Lj5O5K2j10L3R4lN2n3J09J0j38l9Q6o5NQ1p8J01n7Nk5k3J5L4l1j01
$$ -48 -106 -114 -65 -62 -77 -12 10 -100 -67 27 24 76 23 132 142 4 -35 51 -14 -9 72 -6 95 38 43 18 -5 10 44 13 -88
6413h8O2n6K33j70p5P9L0q6o3k2J86mp6K8K0m9j18J90q9p0q7J75J41k6k22K3K56
$$ -88 -26 -82 151 -19 -94 -15 15 -71 -134 -156 30 26 -50 -22 -2 -51 -169 21 -68 -138 -225 -50 91 65 -157 -134 122
6440A22k17N9n4J19p1Q2p8q8K53r6l4J01j42O7O5j05J13P9j60j09K0J63L2j48
$$ 122 -95 -36 -90 29 -42 40 -38 -126 127 31 -3 98 -44 23 88 -17 96 175 15 -94 -74 89 121 -27
6464b7j23J93J9o4r8%J15m7R0j56N1J8l3l7Q4m6J9m3J29n1qm7m7J16N8p5j2P2
$$ -27 -150 43 62 -2 -100 -100 15 -32 58 -98 -47 -29 -62 -99 -15 -61 -42 -85 44 -7 -15 -62 -109 7 65 -10 -22 50
6492E0j28J01q6P1J2p5k7O3J2N7o0Q8k1j6j3rP1J6o0j9R6j49R2j14J3Q9m0p5J07
$$ 50 -78 23 -63 8 20 -55 -82 -19 -7 50 -10 78 57 41 28 19 90 106 46 27 123 -26 66 -48 -35 54 14 -61 46
6521D6M4q6j7m3M7j5q0R6l1l0qJ79m6r2p3R9n2R7n9o2M6J2j3j06J82kK9L4j13
$$ 46 90 4 -13 -56 -9 -24 -104 -8 -39 -69 -77 102 56 -36 -109 -10 -62 35 -24 -86 -40 -28 -41 -147 35 33 62 96 -17
6550a7M9j07N1O4J9n9m0J6L4l8M3JJ15j25n5R2r0L1j23J18J1M1Q0j12j41Q3L2
$$ -17 32 -75 -24 40 59 0 -40 -24 10 -28 15 16 131 6 -49 43 -47 -16 -139 -21 -10 31 111 -1 -142 -59 -27
6577b7p1J61j59J49j61q5M1J29Q2k4j6n5K7kM0jq5K5J45k83J24kM8J8j03J76M
$$ -27 -98 63 -96 53 -108 -193 -152 -23 59 35 19 -36 -9 -11 29 28 -57 -32 113 -170 -46 -48 0 18 -85 91 95
6604I5n3M4k6K7q4k3p2R0P2M6j6j28J24j25l9J11Kk0Oq7M0K1j07O7k2p9J00M2
$$ 95 42 86 60 87 3 -20 -92 -2 70 116 100 -28 96 -29 -68 43 45 25 31 -56 -16 5 -102 -35 -57 -136 -36 6
6632Fk3Q2k38K38p7l8J7l1O7j19KN1J17J2M9N0k08N8K7m6Q1P4rq4Lk5m8j1kP4
$$ 6 -17 65 -173 65 -12 -50 -33 -64 3 -116 -114 -63 54 66 115 165 -43 15 42 -4 77 151 142 58 61 36 -12 -23 -25 49
6662D9j68K29r8l3K15j27j67J59k9j71J57R1m6j1l1j72R4J6P9j67J18k6O1m8m2
$$ 49 -119 110 12 -21 194 67 -100 59 30 -141 16 107 61 50 19 -153 -59 -43 36 -131 -13 -39 22 -26 -68
6687f8K3L6M9j57J22j07J15mKk0R5k3l3L4J15k54Q3q7K57k23N5m0M5m8J59k1j18
$$ -68 -45 -9 40 -117 5 -102 13 9 11 -9 86 63 30 64 179 -75 8 -79 178 -45 10 -30 15 -33 126 105 -13
6714a3K08k19r7p8K21L0j01m8K4M6%m2J32j50O2m6J07l9j30J83k2j29N0o7O6J22
$$ -13 195 -24 -121 -199 22 52 -49 -97 -73 -27 -27 -69 63 -87 -25 -71 36 -3 -133 50 28 -101 -51 -118 -52 70
$$ [...]
8191G4
##END NTUPLES=NMR FID
##END=
