##TITLE=1H ikalashn
LR-790-C-R2-K1
12.11.2024
##JCAMPDX= 6.0         $$ Bruker NMR JCAMP-DX V2.0
##DATA TYPE= NMR FID
##DATA CLASS= NTUPLES
##ORIGIN= UXNMR, Bruker Analytische Messtechnik GmbH
##OWNER= root
$$ TOPSPIN		Version 1.3
$$ 2024-11-12 16:09:08.156 +0400  Irina@DPX200
$$ Compression mode = diff/dup
##.OBSERVE FREQUENCY= 200.131300845
##.OBSERVE NUCLEUS= ^1H
##.DELAY= (6, 6)
##.ACQUISITION MODE= SIMULTANEOUS
##.ACQUISITION SCHEME= undefined
##.AVERAGES= 64
##.DIGITISER RES= 18
##SPECTROMETER/DATA SYSTEM= spect
##.PULSE SEQUENCE= zg
##.SOLVENT NAME= D2O
##.SHIFT REFERENCE= INTERNAL, D2O, 1, 17.49637
##AUDIT TRAIL= $$ (NUMBER, WHEN, WHO, WHERE, WHAT)
$$ ##TITLE= Audit trail, TOPSPIN		Version 1.3
$$ ##JCAMPDX= 5.01
$$ ##ORIGIN= Bruker BioSpin GmbH
$$ ##OWNER= Irina
$$ $$ F:/spectra/data/iren/nmr/1H/4/audita.txt
$$ ##AUDIT TRAIL=  $$ (NUMBER, WHEN, WHO, WHERE, VERSION, WHAT)
(   1,<2024-11-12 16:06:52.015 +0400>,<Irina>,<DPX200>,<TOPSPIN 1.3>,
      <created by zg
	started at 2024-11-12 16:02:39.171 +0400,
	POWCHK disabled, PULCHK disabled
       configuration hash MD5:
       BE 6D 3F 07 2A EA 11 49 91 17 2B D3 AF B3 58 0D
       data hash MD5: 16K
       79 5A 47 96 E3 96 44 DC 35 A9 F9 C7 B5 12 48 4C>)
$$ ##END=
$$ 
$$ $$ hash MD5
$$ $$ 40 23 9B 45 61 F2 5B 29 26 36 7E E5 8C FF F6 6B
##$RELAX= 
##$RELAX= 
##$RELAX= 
##$RELAX= 
##$RELAX= 
##$RELAX= 
##$RELAX= 
##$RELAX= 
##$RELAX= 
$$ Bruker specific parameters
$$ --------------------------
##$DU= <F:/spectra>
##$EXPNO= 4
##$NAME= <1H>
##$PROCNO= 1
##$TYPE= <nmr>
##$USER= <iren>
##$AMP= (0..31)
100 100 100 100 100 100 100 100 100 100 100 100 100 100 100 100 100 100 
100 100 100 100 100 100 100 100 100 100 100 100 100 100 
##$ANAVPT= -1
##$AQSEQ= 0
##$AQ_mod= 1
##$AUNM= <au_zg>
##$AUTOPOS= <>
##$BF1= 200.13
##$BF2= 200.13
##$BF3= 200.13
##$BF4= 200.13
##$BF5= 200.13
##$BF6= 200.13
##$BF7= 200.13
##$BF8= 200.13
##$BYTORDA= 1
##$CFDGTYP= 0
##$CFRGTYP= 5
##$CHEMSTR= <none>
##$CNST= (0..63)
1 1 145 1 1 1 1 1 1 1 1 1 1 1 1 1 1 1 1 1 1 1 1 1 1 1 1 1 1 1 1 1 1 1 
1 1 1 1 1 1 1 1 1 1 1 1 1 1 1 1 1 1 1 1 1 1 1 1 1 1 1 1 1 1 
##$CPDPRG= <>
##$CPDPRG1= <>
##$CPDPRG2= <>
##$CPDPRG3= <>
##$CPDPRG4= <mlev>
##$CPDPRG5= <mlev>
##$CPDPRG6= <mlev>
##$CPDPRG7= <mlev>
##$CPDPRG8= <mlev>
##$CPDPRGB= <>
##$CPDPRGT= <>
##$D= (0..63)
0 2 0 0 0 0 0 0 0 0.06 0 0.03 0 0 0 0 0.0002 0 0 0 0 0 0 0 0 0 0 0 0 0 
0 0 0 0 0 0 0 0 0 0 0 0 0 0 0 0 0 0 0 0 0 0 0 0 0 0 0 0 0 0 0 0 0 0 
##$DATE= 1731413210
##$DBL= (0..7)
120 120 120 120 120 120 120 120 
##$DBP= (0..7)
150 150 150 150 150 150 150 150 
##$DBP07= 0
##$DBPNAM0= <>
##$DBPNAM1= <>
##$DBPNAM2= <>
##$DBPNAM3= <>
##$DBPNAM4= <>
##$DBPNAM5= <>
##$DBPNAM6= <>
##$DBPNAM7= <>
##$DBPOAL= (0..7)
0.5 0.5 0.5 0.5 0.5 0.5 0.5 0.5 
##$DBPOFFS= (0..7)
0 0 0 0 0 0 0 0 
##$DE= 6
##$DECBNUC= <off>
##$DECIM= 32
##$DECNUC= <off>
##$DECSTAT= 4
##$DIGMOD= 1
##$DIGTYP= 9
##$DL= (0..7)
0 120 120 120 120 120 120 120 
##$DP= (0..7)
150 150 150 150 150 150 150 150 
##$DP07= 0
##$DPNAME0= <>
$$ [...]
##$SW= 21.9926040160658
##$SWIBOX= (0..15)
0 0 2 0 0 0 0 0 0 0 0 0 0 0 0 0 
##$SW_h= 4401.40845070422
##$TD= 16384
##$TD0= 1
##$TE= 300
##$TE2= 300
##$TE3= 300
##$TEG= 300
##$TL= (0..7)
0 120 120 120 120 120 120 120 
##$TP= (0..7)
150 150 150 150 150 150 150 150 
##$TP07= 0
##$TPNAME0= <>
##$TPNAME1= <>
##$TPNAME2= <>
##$TPNAME3= <>
##$TPNAME4= <>
##$TPNAME5= <>
##$TPNAME6= <>
##$TPNAME7= <>
##$TPOAL= (0..7)
0.5 0.5 0.5 0.5 0.5 0.5 0.5 0.5 
##$TPOFFS= (0..7)
0 0 0 0 0 0 0 0 
##$TUNHIN= 0
##$TUNHOUT= 0
##$TUNXOUT= 0
##$USERA1= <user>
##$USERA2= <user>
##$USERA3= <user>
##$USERA4= <user>
##$USERA5= <user>
##$V9= 5
##$VALIST= <valist>
##$VCLIST= <CCCCCCCCCCCCCCC>
##$VD= 0
##$VDLIST= <DDDDDDDDDDDDDDD>
##$VPLIST= <PPPPPPPPPPPPPPP>
##$VTLIST= <TTTTTTTTTTTTTTT>
##$WBST= 1024
##$WBSW= 25
##$XGAIN= (0..3)
0 0 0 0 
##$XL= 0
##$YL= 0
##$YMAX_a= 1624047
##$YMIN_a= -1358856
##$ZGOPTNS= <>
##$ZL1= 120
##$ZL2= 120
##$ZL3= 120
##$ZL4= 120
##$ABSF1= 10
##$ABSF2= 0
##$ABSG= 5
##$ABSL= 3
##$ALPHA= 0
##$AQORDER= 0
##$ASSFAC= 0
##$ASSFACI= 0
##$ASSFACX= 0
##$ASSWID= 0
##$AUNMP= <proc_1d>
##$AXLEFT= 0
##$AXRIGHT= 0
##$AXTYPE= 0
##$AXUNIT= <>
##$AZFE= 0.1
##$AZFW= 0.1
##$BCFW= 1
##$BC_mod= 2
##$BYTORDP= 1
##$COROFFS= 0
##$CY= 7568.61572265625
##$DATMOD= 1
##$DC= 2
##$DFILT= <>
##$DTYPP= 0
##$F1P= 17.9538593292236
##$F2P= -4.03888763876832
##$FCOR= 0.5
##$FTSIZE= 32768
##$FT_mod= 4
##$GAMMA= 1
##$GB= 1
##$INTBC= 1
##$INTSCL= 1
##$ISEN= 128
##$LB= -0.5
##$LEV0= 0
##$LPBIN= 0
##$MAXI= 945.577
##$MC2= 0
##$MEAN= 0
##$ME_mod= 0
##$MI= -402.1523
##$NCOEF= 0
##$NC_proc= 0
##$NLEV= 6
##$NOISF1= 8.587773
##$NOISF2= 6.764455
##$NSP= 1
##$NTH_PI= 0
##$NZP= 0
##$OFFSET= 17.49637
##$PC= 1
##$PHC0= 115.5571
##$PHC1= 5.665494
##$PH_mod= 0
##$PKNL= yes
##$PPARMOD= 0
##$PPDIAG= 0
##$PPIPTYP= 0
##$PPMPNUM= 100
##$PPRESOL= 1
##$PSCAL= 0
##$PSIGN= 0
##$REVERSE= no
##$SF= 200.13
##$SI= 32768
##$SIGF1= 18.5376
##$SIGF2= -6.396296
##$SINO= 400
##$SIOLD= 32768
##$SREGLST= <1H.CDCl3>
##$SSB= 3
##$STSI= 0
##$STSR= 0
##$SW_p= 4401.40845070422
##$SYMM= 0
##$S_DEV= 0
##$TDeff= 0
##$TDoff= 0
##$TI= <>
##$TILT= no
##$TM1= 0
##$TM2= 0
##$TOPLEV= 0
##$USERP1= <user>
##$USERP2= <user>
##$USERP3= <user>
##$USERP4= <user>
##$USERP5= <user>
##$WDW= 1
##$XDIM= 8192
##$YMAX_p= 0
##$YMIN_p= 0
$$ End of Bruker specific parameters
$$ ---------------------------------
##NTUPLES= NMR FID
##VAR_NAME=  TIME,          FID/REAL,        FID/IMAG
##SYMBOL=    X,             R,               I
##VAR_TYPE=  INDEPENDENT,   DEPENDENT,       DEPENDENT
##VAR_FORM=  AFFN,          ASDF,            ASDF
##VAR_DIM=   8192,          8192,            8192
##UNITS=     SECONDS,       ARBITRARY UNITS, ARBITRARY UNITS
##FACTOR=    0.0002272,     1,               1
##FIRST=     0,             0,               0
##LAST=      1.8609952,     -623,            560
##MIN=       0,             -1358856,        -1358856
##MAX=       1.8609952,     1624047,         1624047
$$ Real data points
##PAGE= N=1
##DATA TABLE= (X++(R..R)), XYDATA
$$ plain form
0 0 0 0 0 0 0 0 0 0 0 0 0 0 0 0 1 -64 64 -64 64 -65 128 -128 129 -192 193 -251 257 -321 382 -388 450 -519
32 -519 612 -706 771 -893 992 -1110 1242 -1394 1546 -1726 1916 -2114 2350 -2596 2864 -3160
48 -3160 3482 -3844 4229 -4653 5131 -5659 6248 -6914 7661 -8522 9509 -10673 12052
61 12052 -13734 15810 -18477 22040 -27052 34653 -47684 75837 -268590 775516 1186177
72 1186177 -66026 210004 1132185 531236 -963254 -749737 269587 28793 -796563
81 -796563 -310615 431423 -18514 -509078 365894 1132246 508310 -203840 124406 154999
91 154999 -791947 -1199112 -335806 297122 89806 189417 768701 614692 -97066 -106814 278129
102 278129 -132932 -726749 -337262 202930 -290011 -736911 99160 992298 558107 -75994
$$ packed form
0@%%%%%%%%%%%%%%Jo5J28j28J28j29J93k56K57l21L85m44N08n78P03p70Q38r69
32e19J131j318J477j664J885k102K352k636K940l272L642m030M464m946N460o024
48c160O642p326Q073q882R784j0790J1907j3162J4575j6183J8031k0182K2725
61A2052k5786K9544l4287M0517m9092O1705q2337J23521l44427J044106M10661
72A186177j252203K76030R22181o00949j494490K13517J019324k40794q25356
81g96563M85948P42038m49937m90564Q74972P66352o23936p12150L28246L0593
91A54999r46946m07165Q63306O32928k07316R9611N79284j54009p11758r748L84943
102B78129m11061n93817L89487N40192m92941m46900Q36071Q93138m34191o34101
$$ plain form
112 -75994 319623 584933 -322934 -1040661 -459358 146655 -207000 -351276 382026 685973
122 685973 30532 -186464 472138 574593 -237285 -534929 -36129 -86772 -767932 -651973
132 -651973 318236 701044 317028 290673 586216 219876 -514158 -551320 -145699 -192817
142 -192817 -365625 15949 384938 77649 -205476 211247 585603 243279 -120029 51797
152 51797 60623 -501684 -791881 -321687 154312 167065 264125 611605 549468 3518 -269789
163 -269789 -123755 -171721 -422579 -292538 95311 91455 -167131 -34084 361847 398144 159562
174 159562 139059 184177 -117731 -498856 -475689 -223344 -116540 -3254 301409 468600
184 468600 268320 56616 89415 69881 -174832 -306546 -170796 -110455 -250394 -229394 85724
$$ packed form
112g5994L95617K65310r07867p17727N81303O06013l53655j44276P33302L03947
122F85973o55441k16996O58602J02455q11878k97644M98800n0643o81160J15959
132f51973R70209L82808l84016k6355K95543l66340p34034l7162M05621m7118
142a92817j72808L81574L68989l07289k83125M16723L74356l42324l63308J71826
152E1797Q826n62307k90197M70194M75999J2753R7060L47480o2137n45950k73307
163b69789J46034m7966k50858J30041L87849l856k58586J33047L95931L6297k38582
174A59562k0503M5118l01908l81125K3167K52345J06804J13286L04663J67191
184D68600k00280k11704L2799j9534k44713j31714J35750O0341j39939K1000L15118
$$ plain form
195 85724 334900 326642 289545 295420 116207 -230658 -407359 -321901 -212837 -150011 17323
206 17323 226795 243499 110352 84791 171947 151477 3719 -94061 -131723 -242626 -368195
217 -368195 -296520 -27700 225480 351458 394034 340330 123733 -164574 -326565 -310552 -227494
228 -227494 -131963 4071 126331 131827 68192 80987 167826 187872 108367 16396 -79532 -240001
240 -240001 -377753 -325760 -99687 121482 262961 357749 352214 169160 -76712 -197125 -199642
251 -199642 -203877 -188757 -80791 27558 25397 14138 122663 244665 226310 128559 59169
262 59169 -55206 -259570 -374491 -264462 -72700 48302 157025 284785 285099 118655 -18850
273 -18850 -26222 -46652 -144091 -179031 -118080 -106430 -143231 -53577 159095 284731 262095 212622
$$ packed form
195H5724K49176q258l7097N875j79213l46865j76701Q5458J09064O2826J67334
206A7323K09472J6704j33147k5561Q7156k0470j47758r7780l7662j10903j25569
217c68195P1675K68820K53180J25978M2576n3704k16597k88307j61991J6013Q3058
228b27494R5531J36034J22260N496o3635J2795Q6839K0046p9505r1971r5928j60469
240b40001j37752N1993K26073K21169J41479R4788n535j83054k45872j20413k517
251a99642m235J5120J07966J08349k161j1259J08525J22002j8355r7751o9390
262E9169j14375k04364j14921J10029J91762J21002J08723J27760L14j66444j37505
273a8850p372k0430r7439l4940O0951J1650l6801Q9654K12672J25636k2636m9473
$$ plain form
285 212622 134708 -72675 -304723 -346218 -215717 -92881 3150 146491 243346 173501 50934
296 50934 38222 68903 15514 -61369 -76015 -112778 -220924 -248478 -94090 107248 220298
307 220298 283337 310087 189702 -63934 -251755 -271096 -221468 -160800 -32054 122087 161703
318 161703 96143 70225 107547 99586 41064 9066 -25627 -139385 -256821 -237287 -103685
329 -103685 32638 151103 268316 297305 171007 -12567 -123366 -170857 -198510 -169381 -69091
340 -69091 15223 29350 41962 103535 155777 149130 116728 69757 -37080 -182578 -261700 -221725
352 -221725 -117375 4745 138144 234420 225211 126734 24362 -42062 -89147 -117585 -109381
363 -109381 -87877 -88194 -83299 -27655 69436 159381 210451 206127 124012 -26859 -179571 -258208
$$ packed form
285B12622p7914k07383k32048m1495J30501J22836R6031J43341R6855o9845j22567
296E0934j2712L0681n3389p6883j4646l6763j08146k7554J54388K01338J13050
307B20298O3039K6750j20385k53636j87821j9341M9628O0668J28746J54141L9616
318A61703o5560k5918L7322p961n8522l1998l4693j13758j17436J9534J33602
329a03685J36323J18465J17213K8989j26298j83574j10799m7491k7653K9129J00290
340f9091Q4314J4127J2612O1573N2242o647l2402m6971j06837j45498p9122L9975
352b21725J04350J22120J33399R6276r209r8477j02372o6424m7085k8438Q204
363a09381K1504l17M895N5644R7091Q9945N1070m324q2115j50871j52712p8637
$$ plain form
375 -258208 -238710 -143426 -7709 120156 187084 173844 111577 45874 -1027 -27895 -42835
386 -42835 -63189 -97431 -132300 -136412 -85517 16555 137569 223896 232823 154316 17328 -126381
398 -126381 -222458 -228076 -151622 -41953 54454 115616 132329 108883 72576 53438 42912 8418
410 8418 -53054 -113072 -154777 -167501 -120806 -4107 129269 207095 207798 152429 49105 -80127
422 -80127 -167481 -168348 -118152 -70681 -24714 32334 70195 74252 87341 126086 127207 55057 -40724
435 -40724 -115801 -178285 -209353 -146968 -511 125450 174192 179352 150233 55825 -61832 -109168
447 -109168 -86653 -78315 -92576 -68389 -21052 -7497 8762 92350 181987 172150 87033 7230
459 7230 -80288 -198062 -246373 -149463 -3863 76192 123727 176250 157551 41703 -42714 -27824
$$ packed form
375b58208J9498R5284J35717J27865O6928j3240o2267o5703m6901k6868j4940
386d2835k0354l4242l4869m112N0895J02072J21014Q6327Q927p8507j36988j43709
398a26381r6077n618P6454J09669R6407O1162J6713k3446l6307j9138j0526l4494
410H418o1472o0018m1705j2724M6695J16699J33376P7826P03n5369j03324j29232
422h0127q7354q67N0196M7471M5967N7048L7861M057J3089L8745J121p2150r5781
435d0724p5077o2484l1068O2385J46457J25961M8742N160k9119r4408j17657m7336
447a09168K2515Q338j4261K4187M7337J3555J6259Q3588Q9637r837q5117p9803
459G230q7518j17774m8311R6910J45600Q0055M7535N2523j8699j15848q4417J4890
$$ plain form
471 -27824 -20168 -79292 -106022 -65436 -60299 -93254 -33525 118089 194562 153623 113100 77419
483 77419 -55030 -213017 -220109 -105112 -37425 -9830 84295 170005 115256 18282 31769 72443
495 72443 1823 -89518 -79301 -66576 -140366 -154087 -7717 135313 145287 134187 166672 100442
507 100442 -83308 -180408 -121918 -80325 -102985 -43883 82637 94611 16604 41049 134773
518 134773 106940 -3749 -24458 -17690 -128433 -231202 -137615 27817 72267 84703 183859
529 183859 209902 44735 -103618 -76151 -42207 -120381 -131601 -305 55530 -35890 -38593
540 -38593 109427 167096 72087 37811 83953 -9835 -205142 -225660 -79887 -15717 -21813 90949
552 90949 224902 155646 -7746 -22168 27141 -53368 -140911 -67344 11819 -63189 -115503 11124
$$ packed form
471b7824P656n9124k6730M0586N137l2955N9729J51614P6473m0939m0523l5681
483G7419j32449j57987p092J14997O7687K7595R4125Q5710n4749r6974J3487M0674
495G2443p0620r1341J0217J2725p3790j3721J46370J43030R974j1100L2485o6230
507A00442j83750r7100N8490M1593k2660N9102J26520J1974p8007K4445R3724
518A34773k7833j10689k0709O768j10743j02769R3587J65432M4450J2436R9156
529A83859K6043j65167j48353K7467L3944p8174j1220J31296N5835r1420k703
540c8593J48020N7669r5009l4276M6142r3788j95307k0518J45773O4170o096J12762
552I0949J33953o9256j63392j4422M9309q0509q7543P3567P9163p5008n2314J26627
$$ plain form
564 11124 129883 96225 75937 150447 113358 -84540 -189728 -119340 -84110 -120940 -32252
575 -32252 145312 157068 34605 27795 102676 37973 -89001 -59506 19797 -67783 -183924
586 -183924 -95937 55144 55608 37236 157135 220544 54716 -115844 -95020 -59250 -143835
597 -143835 -149073 20749 119298 34498 -4793 96428 122259 10607 -23999 45544 2709
608 2709 -149523 -174256 -62395 -15217 -17211 86353 208379 154564 14219 -21144 -19939 -107131
620 -107131 -157931 -59025 27554 -17393 -38295 58526 109159 42766 33303 114224 81938 -84418
632 -84418 -154177 -89891 -81242 -122259 -23386 156220 173458 60424 37320 73290 -10023 -131691
644 -131691 -94896 6192 -26908 -106084 -46816 60685 54724 28421 106342 163384 60484
$$ packed form
564A1124J18759l3658k0288P4510l7089j97898j05188P0388L5230l6830Q8688
575c2252J77564J1756j22463o810P4881o4703j26974K9495P9303q7580j16141
586a83924Q7987J51081M64j8372J19899O3409j65828j70560K0824L5770q4585
597a43835n238J69822R8549q4800l9291J01221K5831j11652l4606O9543m2835
608B709j52232k4733J11861M7178j994J03564J22026n3815j40345l5363J205q7192
620a07131n0800R8906Q6579m4947k0902R6821N0633o6393r463Q0921l2286j66356
632h4418o9759O4286Q649m1017R8873J79606J7238j13034k3104L5970q3313j21668
644a31691L6795J01088l3100p9176N9268J07501n961k6303P7921N7042j02900
$$ plain form
655 60484 -75426 -100817 -95620 -137459 -117267 12793 108869 92338 69219 86066 54366 -27068
667 -27068 -45610 -8631 -28910 -91088 -88797 -37424 -22930 -4714 82967 160293 124044 40531
679 40531 -3190 -49510 -133726 -156739 -69278 15775 26050 36450 87380 93020 31672 3188
691 3188 32830 22357 -50192 -95530 -84381 -75477 -68071 -1465 97105 136347 109820 72825 23926
704 23926 -54175 -113542 -101639 -56818 -32784 -12474 26100 50913 45840 48174 70188 68703 23752
717 23752 -29900 -72864 -109479 -121109 -76721 8259 78498 110418 110873 82610 24336 -36810
729 -36810 -70557 -70317 -52963 -38126 -32191 -23392 3001 38585 62668 77365 89918 71172 -1201
742 -1201 -85910 -120602 -106913 -81221 -31714 51499 113747 102718 56834 32940 11864 -32404
$$ packed form
655F0484j35910k5391N197m1839K0192J30060R6076j6531k3119J6847l1700q1434
667b7068j8542L6979k0279o2178K291N1373J4494J8216Q7681P7326l6249q3513
679D0531m3721m6320q4216k3013Q7461Q5053J0275J0400N0930N640o1348k8484
691C188K9642j0473p2549m5338J1149Q904P406O6606R8570L9242k6527l6995m8899
704B3926p8101n9367J1903M4821K4034K0310L8574K4813n073K334K2014j485m4951
717B3752n3652m2964l6615j1630M4388Q4980P0239L1920M55k8263n8274o1146
729c6810l3747K40J7354J4837N935Q799K6393L5584K4083J4697J2553j8746p2373
742a201q4709l4692J3689K5692M9507Q3213O2248j1029m5884k3894k1076m4268
$$ plain form
754 -32404 -60980 -42635 -29142 -56414 -68231 -22643 31342 55242 81254 112338 89250 4545
766 4545 -68246 -95148 -105528 -97644 -36481 40124 65990 57124 64481 64748 23143 -13778 -4371
779 -4371 -8090 -63825 -101594 -67886 -24517 -10599 33166 116620 136295 62525 -3856 -21805
791 -21805 -58844 -116074 -97084 -12762 22537 -257 17663 71859 68235 24093 30631 55442
803 55442 3174 -86261 -103897 -70754 -63797 -43816 46966 129519 111548 51999 31422 3969
815 3969 -68567 -101053 -49441 -9343 -31283 -32865 22361 47747 25382 41147 94917 78869
827 78869 -11975 -65639 -66893 -91332 -115396 -48380 62476 96052 68026 69711 72077 4948
839 4948 -66142 -52202 -14427 -40414 -70904 -31967 13112 2898 9294 79468 117582 61394
$$ packed form
754c2404k8576J8345J3493k7272j1817M5588N3985K3900K6012L1084k3088q4705
766D545p2791k6902j0380P884O1163P6605K5866q866P357K67m1605l6921R407
779d371l719n5735l7769L3708M3369J3918M3765Q3454J9675p3770o6381j7949
791b1805l7039n7230J8990Q4322L5299k2794J7920N4196l624m4142O538K4811
803E5442n2268q9435j7636L3143O957J9981R0782Q2553j7971n9549k0577k7453
815C969p2536l2486N1612M0098k1940j582N5226K5386k2365J5765N3770j6048
827G8869r0844n3664j254k4439k4064O7016J10856L3576k8026J685K366o7129
839D948p1090J3940L7775k5987l0490L8937M5079j0214O396P0174L8114n6188
$$ plain form
851 61394 -4888 -22343 -53459 -114102 -110992 -25522 35325 35126 49595 86162 66132 1058 -14880
864 -14880 9993 -13238 -69968 -73630 -37134 -34434 -33872 30211 106502 102739 52320 27563 415
877 415 -68457 -112829 -73521 -15493 -5260 2781 46070 66077 32317 14664 43287 44627 -12773
890 -12773 -56884 -56328 -64679 -84682 -46855 42212 94116 84830 71919 58653 363 -72701 -83040
903 -83040 -46920 -32749 -33495 -2367 34331 29295 14653 40753 70444 47665 -146 -24457 -46882
916 -46882 -88716 -98472 -42521 25381 56402 71527 86418 66024 3572 -41423 -41476 -38757 -52527
929 -52527 -46351 -14357 2010 57 21597 63868 75933 48950 19906 -7039 -52568 -93299
941 -93299 -83716 -36180 2931 29449 59510 73405 49997 13898 1031 -3150 -25889 -47498
$$ packed form
851F1394o6282j7455l1116o0643L110Q5470O0847j99J4469L6567k0030o5074j5938
864a4880K4873k3231n6730l662L6496K700N62O4083P6291l763n0419k4757k7148
877D15o8872m4372L9308N8028J0233Q041M3289K0007l3760j7653K8623J340n7400
890a2773m4111N56q351k0003L7827Q9067N1904r286j2911j3266n8290p3064j0339
903h3040L6120J4171p46L1128L6698n036j4642K6100K9691k2779m7811k4311k2425
916d6882m1834r756N5951O7902L1021J5125J4891k0394o2452m4995n3K719j3770
929e2527O176L1994J6367j953K1540M2271J2065k6983k9044k6945m5529m0731
941i3299R583M7536L9111K6518L0061J3895k3408l6099j2867m181k2739k1609
$$ plain form
953 -47498 -47546 -41082 -40329 -21473 26672 70645 79738 65213 40598 -4045 -57729 -84843 -69692
966 -69692 -38394 -11070 18086 44939 48272 33178 25151 27251 17940 -5110 -27234 -44738 -62803
979 -62803 -66390 -36504 13546 56853 80152 80810 54094 4997 -43200 -66025 -64431 -46939 -21702
992 -21702 5103 22301 27186 30737 35887 38243 32695 15834 -12680 -45909 -68343 -69006 -45407
1005 -45407 -4183 40807 71571 74435 52341 19070 -15221 -41938 -50859 -42521 -31468 -22518 -8590
1018 -8590 10678 28701 41760 53252 54428 30526 -12047 -46758 -65304 -70464 -52028 -9015
1030 -9015 35326 54575 52885 45792 30243 1460 -20651 -21670 -23772 -39367 -47464 -32861 -10367
1043 -10367 9515 38216 72287 76158 39925 -3091 -34967 -63502 -78828 -56762 -7757 24488
$$ packed form
953d7498m8O464P53J8856M8145M3973R093j4525k4615m4643n3684k7114J5151
966f9692L1298K7324K9156K6853L333j5094q027K100r311k3050k2124j7504j8065
979f2803l587K9886N0050M3307K3299O58k6716m9097m8197k2825J594J7492K5237
992b1702K6805J7198M885L551N150K356n548j6861k8514l3229k2434o63K3599
1005d5407M1224M4990L0764K864k2094l3271l4291k6717q921Q338J1053Q950J3928
1018h590J9268J8023J3059J1492J176k3902m2573l4711j8546n160J8436M3013
1030i015M4341J9249j690p093j5549k8783k2111j019k102j5595q097J4603K2494
1043a0367J9882K8701L4071L871l6233m3016l1876k8535j5326K2066M9005L2245
$$ plain form
1055 24488 33584 41477 45970 28523 5944 3555 6801 -14698 -43296 -49545 -41378 -37299 -15286
1068 -15286 36834 77947 72730 45787 21796 -14003 -61657 -78525 -47976 -14794 -4345 11208
1080 11208 37587 43328 23437 18648 32298 21604 -17041 -41198 -42464 -51471 -55469 -19608 36435
1093 36435 62339 56419 50151 37420 -4845 -46640 -48731 -32888 -32565 -30070 -3410 20128 19414
1106 19414 23796 48791 56279 24341 -10704 -25975 -46536 -72889 -61157 -8861 30367 38975
1118 38975 48466 57594 34651 -8624 -24145 -14369 -20572 -40758 -36242 -15168 -9729 -7561 23676
1131 23676 63731 64520 36286 11549 -13261 -53436 -78421 -58724 -16204 11278 28292 47962
1143 47962 51197 27692 4551 896 -2472 -19615 -32499 -31767 -32157 -33843 -14767 24718 52876
$$ packed form
1055B4488R096P893M493j7447k2579k389L246k1499k8598o249Q167M079K2013
1068a5286N2120M1113n217k6943k3991l5799m7654j6868L0549L3182J0449J5553
1080A1208K6379N741j9891m789J3650j0694l8645k4157j266r007l998L5861N6043
1093C6435K5904n920o268j2731m2265m1795k091J5843L23K495K6660K3538p14
1106A9414M382K4995P488l1938l5045j5271k0561k6353J1732N2296L9228Q608
1118C8975R491R128k2943m3275j5521R776o203k0186M516K1074N439K168L1237
1131B3676M0055P89k8234k4737k4810m0175k4985J9697M2520K7482J7014J9670
1143D7962L235k3505k3141l655l368j7143j2884P32l90j686J9076L9485K8158
$$ plain form
1156 52876 56536 49596 31598 -6007 -47793 -61565 -48414 -31294 -12651 14484 37585 37199 26143
1169 26143 24620 24957 9158 -14652 -28045 -35515 -45553 -45003 -17341 21216 45873 52053 49197
1182 49197 33666 1505 -32079 -43756 -37446 -29610 -22588 -6959 12149 22215 24794 34030 42491
1195 42491 30799 1089 -26620 -42031 -53047 -53336 -26599 15465 43652 48318 43762 33982 8601
1208 8601 -20518 -29277 -22685 -24167 -30112 -21338 -3864 4066 12608 37434 55646 42794 11863
1221 11863 -11195 -32860 -59133 -63000 -29569 9630 25815 34540 47893 40986 8572 -11509
1233 -11509 -5268 -9116 -31956 -37937 -20411 -13721 -18261 4177 47408 58188 34610 19940 10644
1246 10644 -24406 -62747 -55423 -18717 -5493 -3188 23289 48831 33549 7958 14143 22665 -6736
$$ packed form
1156E2876L660o940j7998l7605m1786j3772J3151J7120J8643K7135K3101l86j1056
1169B6143j523L37j5799k3810j3393p470j0038N50K7662L8557K4657O180k856
1182D9197j5531l2161l3584j1677O310P836P022J5629J9108J0066K579R236Q461
1195D2491j1692k9710k7709j5411j1016k89K6737M2064K8187M666m556r780k5381
1208H601k9119q759O592j482n945Q774J7474P930Q542K4826J8212j2852l0931
1221A1863k3058k1665k6273l867L3431L9199J6185Q725J3353o907l2414k0081
1233a1509O241l848k2840n981J7526O690m540K2438M3231J0780k3578j4670r296
1246A0644l5050l8341P324L6706J3224K305K6477K5542j5282k5591O185Q522k9401
$$ plain form
1259 -6736 -38769 -33510 -23969 -37576 -33732 14600 51922 44110 31543 37101 18019 -31998 -53104
1272 -53104 -29202 -16699 -28572 -15700 22480 29057 8705 17849 45749 33324 -8681 -20747
1284 -20747 -18120 -42818 -64571 -30883 21467 34111 29310 47418 51429 7235 -33485 -24723 -11243
1297 -11243 -31193 -38030 -5648 13512 -4664 -2785 37616 52887 23387 5338 10122 -14618
1309 -14618 -62718 -63036 -17735 5197 3578 28995 61297 42369 -2761 -8314 5857 -15501 -43933
1322 -43933 -27773 -2468 -16377 -26248 10074 47732 37606 20562 30393 22419 -28204 -59369
1334 -59369 -37989 -16914 -22987 -8980 34367 46953 18321 8482 26112 16487 -20606 -29199 -12707
1347 -12707 -23315 -45642 -25462 21098 33652 25080 38639 48387 11179 -34387 -36104 -20746
$$ packed form
1259f736l2033N259R541j3607L844M8332L7322p812j2567N558j9082n0017k1106
1272e3104K3902J2503j1873J2872L8180O577k0352R144K7900j2425m2005j2066
1284b0747K627k4698k1753L3688N2350J2644m801J8108M011m4194m0720Q762J3480
1297a1243j9950o837L2382J9160j8176J879M0401J5271k9500j8049M784k4740
1309a4618m8100l18M5301K2932j619K5417L2302j8928m5130n553J4171k1358k8432
1322d3933J6160K5305j3909r871L6322L7658j0126j7044R831p974n0623l1165
1334e9369K1380K1075o073J4007M3347J2586k8632r839J7630r625l7093q593J6492
1347a2707j0608k2327K0180M6560J2554q572J3559R748l7208m5566j717J5358
$$ plain form
1359 -20746 -30600 -33812 -387 28040 16524 5146 26205 38570 14123 -7154 -1997 -11428 -44820
1372 -44820 -52715 -19224 7539 11856 28434 54449 44672 2683 -17858 -14013 -23514 -40291 -26166
1385 -26166 1987 4744 -4786 11222 34630 29044 14615 17084 13298 -21052 -49247 -39931 -20131
1398 -20131 -14378 145 34749 50716 30069 8001 7721 -1452 -25756 -33807 -16941 -10741 -20358
1411 -20358 -12944 15800 29538 24720 27345 32198 12419 -24661 -39123 -31119 -27311 -24544 153
1424 153 28247 32192 20075 18255 19583 4565 -14042 -16266 -15391 -27354 -32773 -15929 7582 18064
1438 18064 27297 40452 37501 9412 -17562 -26358 -29485 -33487 -23819 705 15321 14987 16698 23815
1452 23815 21496 9257 2532 -1295 -15801 -34467 -35072 -20474 -5752 7903 28800 43744 35636
$$ packed form
1359b0746r854l212L3425K8427j1516j1378K1059J2365k4447k1277N157r431l3392
1372d4820p895L3491K6763M317J6578K6015r777m1989k0541L845r501j6777J4125
1385b6166K8153K757r530J6008K3408n586j4429K469l786l4350k8195R316J9800
1398b0131N753J4523L4604J5967k0647k2068k80r173k4304q051J6866O200r617
1411b0358P414K8744J3738m818K625M853j9779l7080j4462Q004L808K767K4697
1424A53K8094L945j2117j820J328j5018j8607k224Q75j1963n419J6844K3511J0482
1438A8064R233J3155k951k8089k6974q796l127m002R668K4524J4616l34J711P117
1452B3815k319j2239o725l827j4506j8666o05J4598J4722J3655K0897J4944q108
$$ plain form
1465 35636 12430 -5016 -15777 -27215 -32169 -21360 -5565 440 3312 14283 23701 21796 17891
1478 17891 15242 6169 -15502 -33112 -33933 -25721 -14842 2362 26171 37193 30630 16543 6019
1491 6019 -5971 -19501 -24151 -19014 -14749 -13376 -5840 8562 19803 23840 26833 25323 10263 -12940
1505 -12940 -29119 -32283 -29152 -19787 -1038 19238 27877 23885 19505 13056 1696 -9173 -13663
1518 -13663 -15704 -21255 -23617 -14777 855 12893 24229 32996 31355 14711 -7856 -22284 -29167
1531 -29167 -30876 -22348 -4572 12046 16762 18268 19986 17562 9126 1670 -3535 -12332 -24050 -28219
1545 -28219 -19830 -8087 5947 21041 33819 32651 17147 21 -13205 -23669 -28914 -22471 -8853
1558 -8853 860 5952 12756 19083 19491 15746 11170 4385 -9747 -24109 -28566 -24146 -14896 -446
$$ packed form
1465C5636k3206j7446j0761j1438m954J0809J5795O005K872J0971R418j905l905
1478A7891k649r073k1671j7610q21Q212J0879J7204K3809J1022o563j4087j0524
1491F019j1990j3530m650N137M265J373P536J4402J1241M037K993j510j5060k3203
1505a2940j6179l164L131R365J8749K0276Q639l992m380o449j1360j0869m490
1518a3663k041n551k362Q840J5632J2038J1336Q767j641j6644k2567j4428o883
1531b9167j709Q528J7776J6618M716J506J718k424q436p456n205q797j1718m169
1545b8219Q389J1743J4034J5094J2778j168j5504j7126j3226j0464n245O443J3618
1558h853R713N092O804O327M08l745m576o785j4132j4362m457M420R250J4450
$$ plain form
1572 -446 18325 30433 28796 18739 7351 -4834 -17002 -22279 -18631 -13982 -10384 -4189 6798
1585 6798 15251 19683 21868 20610 10567 -7294 -21408 -27957 -27453 -20078 -3901 14446 23486 23324
1599 23324 19745 12667 1276 -8835 -13056 -14668 -16989 -17897 -11574 -868 8899 18090 26688 26279
1613 26279 15202 -2247 -15549 -25427 -28456 -22056 -7216 7580 14730 18871 19157 15289 7193 323
1627 323 -4221 -11613 -19194 -21524 -16529 -8808 2844 16879 27575 26955 16894 4338 -9199 -21072
1641 -21072 -26050 -20040 -10274 -1780 6136 13071 16731 15562 13167 10374 3054 -8285 -18522 -22834
1655 -22834 -21482 -15608 -1309 14708 24423 25749 20085 9240 -4539 -14985 -19038 -17752 -14302
1668 -14302 -8482 -1277 5423 10991 15990 19438 16995 8263 -3145 -14098 -23320 -25772 -18495 -4311
$$ packed form
1572d46J8771J2108j637j0057j1388j2185j2168n277L648M649L598O195J0987
1585F798Q453M432K185j258j0043j7861j4114o549N04P375J6177J8347R040j62
1599B3324l579p078j1391j0111m221j612k321r08O323J0706R767R191Q598m09
1613B6279j1077j7449j3302r878l029O400J4840J4796P150M141K86l868q096o870
1627C23m544p392p581k330M995P721J1652J4035J0696o20j0061j2556j3537j1873
1641b1072m978O010R766Q494P916O935L660j169k395k793p320j1339j0237m312
1655b2834J352N874J4299J6017R715J326n664j0845j3779j0446m053J286L450
1668a4302N820P205O700N568M999L448k443q732j1408j0953r222k452P277J4184
$$ plain form
1682 -4311 8601 18082 22713 21057 11699 598 -7177 -11576 -14836 -15981 -12765 -8147 -2189 6205
1696 6205 15576 21520 20525 13682 2188 -11261 -21663 -24497 -18711 -9088 2399 14218 18883 16742
1710 16742 12430 8097 2371 -6436 -12161 -13307 -15835 -16424 -10092 3676 14247 19612 21019 19459
1724 19459 7676 -9044 -18746 -19803 -18196 -14068 -2711 8084 12680 12270 13963 14553 7775 -826
1738 -826 -5731 -11774 -19088 -21034 -12371 -1338 8076 17717 24315 20404 8049 -2727 -9366 -16392
1752 -16392 -19677 -14054 -4791 -131 2193 9955 17372 15142 9871 7474 3082 -10955 -22061 -20332
1766 -20332 -12592 -7704 1683 16346 23398 17086 8064 4338 -2338 -12748 -16705 -11224 -8443 -8844
1780 -8844 -3731 8134 13843 13659 15431 15817 4557 -10746 -17932 -17291 -17158 -13476 882 13982 15200
$$ packed form
1682d311J2912R481M631j656r358j1101p775m399l260j145L216M618N958Q394
1696F205R371N944r95o843j1494j3449j0402k834N786R623J1487J1819M665k141
1710A6742m312m333n726q807n725j146k528n89O332J3768J0571N365J407j560
1724A9459j1783j6720r702j057J607M128J1357J0795M596m10J693N90o778q601
1738h26m905o043p314j946Q663J1033R414R641O598l911j2355j0776o639p026
1752a6392l285N623R263M660K324P762P417k230n271k397m392j4037j1106J729
1766b0332P740M888R387J4663P052o312r022l726o676j0410l957N481K781m01
1780h844N113J1865N709j84J772L86j1260j5303p186O41J33L682J4358J3100J218
$$ plain form
1795 15200 12326 13987 10388 -602 -8624 -7559 -8939 -15905 -15878 -4969 4513 7510 13110 22068 18598
1810 18598 4012 -7600 -10142 -15991 -21653 -14410 507 7078 6867 11582 16285 11682 1923 488
1824 488 -803 -9883 -18655 -15271 -7817 -4676 2499 15133 23052 15249 6757 1890 -5499 -16761 -18656
1839 -18656 -10103 -3969 -3336 2613 12153 14809 8696 8831 9258 718 -12034 -16097 -12999 -13369 -11488
1854 -11488 1419 15781 17309 12284 11487 7632 -4279 -14135 -12303 -8669 -11089 -9991 564 8561
1868 8561 8477 10612 16258 13950 1605 -8115 -10879 -14247 -18781 -12037 2007 9927 10646 13039 15277
1883 15277 8133 -1988 -5659 -5754 -9820 -14708 -10703 -3116 135 4009 13007 18305 13402 4368 -1176
1898 -1176 -7881 -17003 -18146 -10111 -1644 1637 6889 14028 13704 7178 3097 2168 -2268 -11040 -13117
$$ packed form
1795A5200k874J661l599j0990q022J065j380o966K7J0909R482K997N600Q958l470
1810A8598j4586j1612k542n849n662P243J4917O571k11M715M703m603r759j435
1824D88j291r080q772L384P454L141P175J2634P919p803q492m867p389j1262j895
1839a8656Q553O134O33N949R540K656o113J35M27q540j2752m063L098l70J881
1854a1488J2907J4362J528n025p97l855j1911r856J832L634k420J098J0555P997
1868H561q4K135N646k308j2345r720k764l368m534O744J4044P920P19K393K238
1883A5277p144j0121l671r5m066m888M005P587L251L874Q998N298m903r034n544
1898a176o705r122j143Q035Q467L281N252P139l24o526m081r29m436q772k077
$$ plain form
1913 -13117 -10108 -8515 -5891 2485 12914 16377 11996 8954 4231 -5971 -14717 -14921 -9297 -6339
1927 -6339 -3844 4400 11091 10606 8613 8670 7070 -266 -8445 -11803 -12194 -12601 -8303 1458 10425 12824
1943 12824 12443 11403 5831 -4085 -9830 -10124 -9575 -9607 -6281 521 5425 7632 9713 12652 10126 2969
1959 2969 -4518 -9112 -13497 -15095 -9692 -727 6260 10287 12711 12228 6703 -552 -4917 -6029 -9784
1974 -9784 -11225 -7496 -3252 253 4321 10055 13505 11365 5664 -75 -6010 -13248 -15146 -10713 -3591
1989 -3591 2206 6683 11154 11633 7940 2716 445 -3070 -7882 -11547 -9320 -5977 -3884 1648 9161
2004 9161 13282 11395 7663 3171 -3048 -10402 -13138 -9200 -5679 -3060 1891 8043 10122 8308 6482
2019 6482 6050 911 -6455 -9805 -10259 -9505 -7640 -381 8088 11533 10901 9229 5293 -1509 -8018 -9827
$$ packed form
1913a3117L009J593K624Q376J0429L463m381l042m723j0202q746k04N624K958
1927f339K495Q244O691m85j993N7j600p336q179l358l91m07M298R761Q967K399
1943A2824l81j040n572r916n745k94N49l2L326O802M904K207K081K939k526p157
1959B969p487m594m385j598N403Q965O987M027K424m83n525p255m365j112l755
1974i784j441L729M244L505M068N734L450k140n701n739n935p238j898M433P122
1989c591N797M477M471M79l693n224k271l515m812l665K227L343K093N532P513
2004I161M121j887l732m492o219p354k736L938L521K619M951O152K079j814j826
2019F482m32n139p366l350m54P54J865P259Q469L445o32j672l936o802o509j809
$$ plain form
2035 -9827 -8113 -8092 -5701 5 4752 6581 7245 10016 8644 2879 -3795 -6714 -9908 -12857 -9809 -1975
2051 -1975 5430 7767 9671 10743 6696 75 -4373 -5872 -7859 -9506 -7353 -1747 472 2905 8122
2066 8122 12048 9478 4793 928 -3933 -9641 -12828 -9414 -3343 312 4430 9417 10554 7149 2474
2081 2474 1072 -1835 -7126 -9536 -7098 -5446 -4060 980 7611 10655 9386 7296 4665 -1666 -8652
2096 -8652 -10743 -8534 -5698 -3178 1652 7312 8194 6274 6084 5515 634 -4998 -7504 -7469 -8736 -7205
2112 -7205 -580 5759 8634 9142 9714 6355 -1361 -6310 -7712 -7090 -7714 -4825 713 3814 4806 5864
2128 5864 8131 6870 2257 -1982 -4616 -8289 -10725 -8050 -2519 3063 5849 9054 9795 6677 776
2143 776 -2413 -4693 -7143 -8506 -5350 -1701 -563 2063 6386 8903 7095 4731 1670 -2652 -7702
$$ packed form
2035i827J714K1K391N706M747J829O64K771j372n765o674k919l194k949L048P834
2051a975P405K337J904J072m047o621m448j499j987j647K153N606K219K433N217
2066H122L926k570m685l865m861n708l187L414O071L655M118M987J137l405m675
2081B474j402k907n291k410K438J652J386N040O631L044j269k090k631o331o986
2096h652k091K209K836K520M830N660Q82j920j90n69m881n632k506L5j267J531
2112g205O625O339K875N08N72l359p716m949j402O22o24K889N538L101R92J058
2128E864K267j261m613m239k634l673k436K675N531N582K786L205P41l118n901
2143G76l189k280k450j363L156L649J138K626M323K517j808k364l061m322n050
$$ plain form
2158 -7702 -9808 -8348 -4478 -474 3118 7895 8763 6427 3892 1129 -2177 -5734 -7269 -6080 -5555
2173 -5555 -3174 1099 5945 7696 7647 6730 3577 -1237 -6214 -7875 -7666 -6522 -2599 1404 5122 6006
2189 6006 5738 5821 4003 283 -3114 -5293 -7181 -7688 -5497 -1515 3566 6057 8205 8209 4761 293 -3881
2206 -3881 -6889 -7333 -6411 -4307 -477 2371 4356 6182 6974 5187 3048 -500 -3480 -7138 -8116 -6672
2222 -6672 -3248 1002 4704 7897 7954 5967 2779 -722 -4337 -6217 -6667 -5109 -3216 -362 2502 4901
2238 4901 6216 6289 4379 1432 -2311 -5512 -7321 -7004 -4691 -1443 3463 5475 6756 6800 4136 1203
2254 1203 -1844 -4308 -5421 -6189 -4996 -2423 543 3673 6088 7402 6249 2624 -516 -3960 -7042
2269 -7042 -7469 -5085 -2480 230 3406 5688 6284 4992 3185 640 -1744 -4266 -6209 -5896 -4186 -1557
$$ packed form
2158g702k106J460L870M004L592M777Q68k336k535k763l306l557j535J189N25
2173e555K381M273M846J751m9r17l153m814m977j661K09J144L923M003L718Q84
2189F006k68Q3j818l720l397k179j888n07K191L982N081K491K148Ml448m468m174
2206c881l008m44R22K104L830K848J985J826P92j787k139l548k980l658r78J444
2222f672L424M250L702L193N7j987l188l501l615j880m50J558J893K854K864K399
2238D901J315P3j910k947l743l201j809L17K313L248M906K012J281M4k664k933
2254A203l047k464j113p68J193K573K966L130K415J314j153l625l140l444l082
2269g042m27K384K605K710L176K282N96j292j807k545k384k522j943L13J710K629
$$ plain form
2285 -1557 1453 5693 7045 6668 4555 986 -2332 -5272 -6133 -5398 -4313 -1635 1685 4174 5133 4993
2301 4993 4563 3138 -610 -3023 -5580 -6289 -5448 -3351 194 4093 5767 5947 5727 3447 -244 -3633
2317 -3633 -4696 -5859 -5021 -3020 -216 2264 4036 5765 5896 4241 1600 -1566 -3809 -6227 -6609 -4172
2333 -4172 -1123 1517 4089 6082 5588 3403 1584 -1280 -3315 -5196 -5703 -3876 -2274 -260 2513
2348 2513 5165 5887 4795 2459 437 -3090 -5304 -6417 -4767 -2825 -212 2588 4660 4915 4452 2887
2364 2887 911 -1302 -3673 -4696 -5214 -4325 -2199 1087 4084 5501 5971 4550 2061 -1406 -3948 -5554
2380 -5554 -4931 -3805 -1785 1296 3253 4211 4947 4401 2309 294 -2817 -3975 -4650 -5045 -3108 152
2396 152 2670 4523 5636 4981 2704 -17 -2370 -3875 -5025 -4343 -3028 -562 1263 3417 4469 4297
$$ packed form
2285a557L010M240J352l77k113l569l318k940q61P35J085K678L320K489R59j40
2301D993m30j425l748k413k557p09Q41K097L545L899J674J80k20k280l691l389
2317c633j063j163Q38K001K804K480J772J729J31j655k641l166k243k418l82K437
2333d172L049K640K572J993m94k185j819k864k035j881n07J827J602K014K773
2348B513K652P22j092k336k022l527k214j113J650J942K613K800K072K55m63j565
2364B887j976k213k371j023n18Q89K126L286K997J417M70j421k489l467k542j606
2380e554O23J126K020L081J957R58P36n46k092k015l111j158o75l95J937L260
2396A52K518J853J113o55k277k721k353j505j150O82J315K466J825K154J052j72
$$ plain form
2412 4297 3693 1368 -585 -3374 -4915 -5070 -3405 -1897 1070 2927 4744 4603 3310 1387 -616 -2304
2428 -2304 -3781 -4083 -4286 -2433 -590 2451 3646 4714 3981 2831 611 -1882 -3990 -4948 -4347 -2347
2444 -2347 -311 1755 3367 4616 4065 2585 930 -771 -3074 -3974 -3954 -2915 -1668 541 2679 4040
2460 4040 4722 3630 1861 -858 -2805 -4180 -4143 -2924 -1776 782 2679 3132 3705 3117 2453 566 -1503
2477 -1503 -3315 -3938 -4088 -2823 -522 1648 3352 3987 3711 2739 410 -1911 -3046 -2994 -3482 -2673 -757
2494 -757 1046 2144 3055 3836 3003 1693 -623 -2108 -3920 -3963 -3676 -2080 369 2021 3229 4150 3326
2511 3326 1537 -211 -1888 -2692 -3383 -3256 -2383 -653 922 2682 3888 4000 2423 1217 -800 -3442
2527 -3442 -4240 -3247 -2439 -1469 843 2867 3615 3223 1770 1689 -130 -2243 -3185 -2832 -3150 -1952 -80 2295
$$ packed form
2412D297o04k325j953k789j541j55J665J508K967J857J817j41j293j923k003j688
2428b304j477l02k03J853J843L041J195J068p33j150k220k493k108r58O01K000
2444b347K036K066J612J249n51j480j655j701k303r00K0J039J247K209K138J361
2460D040O82j092j769k719j947j375L7J219J148K558J897M53N73n88o64j887k069
2477a503j812o23j50J265K301K170J704O35k76r72k329k321j135N2m88Q09J916
2494g57J803J098R11P81q33j310k316j485j812m3K87J596K449J652J208R21q24
2511C326j789j748j677q04o91J27Q73J730J575J760J206J12j577j206k017k642
2527c442p98R93Q08R70K312K024P48l92j453q1j819k113r42L53l18J198J872K375
$$ plain form
2545 2295 3367 3485 3512 2103 131 -2056 -3226 -3267 -3148 -2021 -468 1598 2426 2944 3322 2337 332
2562 332 -1282 -2581 -2980 -3250 -2476 -838 1307 2349 3246 3450 2519 562 -486 -1928 -2835 -2872 -2648 -977
2580 -977 245 1422 2423 3346 2418 923 -118 -1610 -3495 -3175 -2380 -2003 -535 1164 2584 2924 2557
2597 2557 2166 100 -334 -2447 -3107 -3105 -1940 -296 898 2256 2546 2770 2699 1270 -234 -2350 -3237 -2949
2615 -2949 -2269 -1360 -141 1718 2937 2897 2046 1306 -187 -1306 -2440 -2929 -2796 -1361 106 1326 2575
2632 2575 2741 2438 2018 59 -1182 -2360 -2924 -2218 -2072 -651 1085 2016 2148 2594 1559 638 -388
2649 -388 -1534 -2278 -2599 -2591 -1541 125 1570 2027 2570 2137 780 229 -1541 -2181 -2392 -2237 -816 -338
2667 -338 894 2251 2428 2235 1884 447 -648 -2157 -2511 -2508 -1765 -767 574 2374 2342 2352 1701 170 -484
$$ packed form
2545B295J072J18K7j409j972k187j170m1J19J127J553K066Q28N18L78r85k005
2562C32j614j299l99k70P74J638K145J042Q97K04r31j957j048j442r07l7K24J671
2580i77J222J177J001R23r28j495j041j492j885L20P95L77J468J699J420L40l67
2597B557l91k066m34k113o60KJ165J644J194J358K90K24p1j429j504k116q87K88
2615b949O80R09J219J859J219m0q51p40j493j119j134m89J33J435J467J220J249
2632B575J66l03m20j959j241j178n64P06J46J421J736R31J32M46j035r21j026
2649c88j146p44l21QJ050J666J445M57N43m33j357n51j770o40k11J55J421M78
2667c38J232J357J77j93l51j437j095j509l54LP43R98J341J800l2J0o51j531o54
$$ plain form
2686 -484 -1424 -2031 -2398 -1683 -1494 268 970 2054 2618 2267 1280 428 -1233 -1935 -2232 -2245 -1276 -301 752
2705 752 1649 2416 2233 1741 401 -825 -1573 -2181 -2040 -1426 -526 715 1327 1930 1787 1862 1166 -674 -1158
2724 -1158 -1359 -1883 -1384 -796 367 1540 2205 2181 1652 1499 231 -924 -1813 -1830 -1554 -1407 163 707 1703
2743 1703 1516 1974 1567 834 -597 -1716 -1871 -2456 -1559 -136 214 1543 1973 2096 1214 402 -753 -1703
2761 -1703 -2032 -1655 -1472 -680 74 823 1513 2170 2096 1050 54 -276 -1274 -1711 -1352 -1118 -320 849 1021
2780 1021 1485 1940 963 823 -180 -1591 -1914 -1892 -1383 -1199 375 1228 1628 1957 1826 465 -220 -986 -1443
2799 -1443 -1995 -1426 -975 -34 1567 1263 1484 1887 1042 -238 -1085 -1223 -2026 -1693 -1249 -202 790 1331 2101
2818 2101 2156 1592 270 -55 -1245 -1861 -1190 -1478 -740 -377 1133 2018 1838 1521 775 43 -597 -1580 -1962
$$ packed form
2686d84r40o07l67P15J89J762P02J084N64l51r87q52j661p02k97j3R69R75J053
2705G52Q97P67j83m92j340j226p48o08J41O14R00J241O12O03j43P5o96j840m84
2724a158k01n24M99N88J163J173O65k4n29j53j268j155q89j7K76J47J570N44R96
2743A703j87M58m07p33j431j119j55n85Q97J423L50J329M30J23q82q12j155r50
2761a703l29L77J83P92P54P49O90O57p4j046r96l30r98m37L59K34P98J169J72
2780A021M64M55r77j40j003j411l23K2N09J84J574Q53M00L29j31j361o85p66m57
2799a443n52N69M51R41J601l04K21M03q45j280q47j38q03L33M44J047R92N41P70
2818B101N5n64j322l25j190o16O71k88P38L63J510Q85j80l17p46p32o40r83l82
$$ plain form
2837 -1962 -1763 -1030 -264 956 1261 1744 1906 1023 468 -637 -1503 -1785 -2016 -1130 -194 521 1837 1679 1782
2856 1782 1029 760 -187 -1824 -1820 -1668 -1478 -409 190 1466 998 1872 1500 887 76 -706 -1717 -1663 -1732 -1132
2876 -1132 131 973 1375 1520 1902 888 575 -637 -1329 -1460 -1504 -1037 -151 409 1453 1762 1511 1526 614
2895 614 -292 -1111 -1383 -1446 -1752 -715 197 1221 1272 1910 1871 977 625 -870 -1155 -1720 -1496 -1187 -172 953
2915 953 1532 1730 1537 1095 250 -258 -1772 -1836 -1238 -1330 -932 733 858 1428 1905 1095 487 -412 -987 -1234
2935 -1234 -2174 -1153 -665 134 1034 1968 1596 1574 1005 -109 -540 -1330 -1576 -1577 -1144 -516 393 822 1899 1489
2955 1489 1633 136 -368 -1179 -2035 -1766 -1113 -581 422 1061 1556 1575 1435 537 32 -1260 -1501 -2047 -1393
2974 -1393 -933 641 484 1247 1682 1518 963 55 -1222 -1242 -1626 -2144 -1272 35 765 1184 1910 1356 691
$$ packed form
2837a962J99P33P66J220L05M83J62q83n55j105q66k82k31Q86R36P15J316j58J03
2856A782p53k69r47j637MJ52J90J069N99J276m68Q74l72o13q11p82j011N4o9O00
2876a132J263Q42M02J45L82j014l13j212o92j31m4M67Q86N60J044L09k51J5r12
2895F14r06q19k72o3l06J037R12J024N1O38l9q94l52j495k85n65K24L09J015J125
2915I53N79J98j93m42q45n08j514o4N98r2L98J665J25N70M77q10o08q99n75k47
2935a234r40J021M88P99R00R34l72k2n69j114m31p90k46jM33O28R09M29J077m10
2955A489J44j497n04q11q56K69O53N32J003O39M95J9j40q98n05j292k41n46O54
2974a393M60J574j57P63M35j64n55r08j277k0l84n18Q72J307P30M19P26n54o65
$$ plain form
2993 691 -198 -273 -926 -1718 -1492 -1223 -699 82 794 1613 2035 1708 889 -225 -963 -1809 -1795 -1526 -887 176
3013 176 559 1412 1671 1626 1121 467 -526 -1305 -1889 -1336 -1333 -493 483 1545 1865 1138 1085 1005 -312 -1273 -1506
3034 -1506 -2580 -1337 -828 267 703 1400 1756 1661 562 59 -807 -1020 -1425 -1749 -647 303 415 1448
3052 1448 2286 1893 776 541 -719 -1634 -1317 -1462 -710 -757 433 1071 1536 1503 1224 308 -181 -887 -1768
3071 -1768 -1378 -1080 -670 374 1010 1343 1597 1248 426 -379 -227 -1440 -1746 -1347 -458 -198 373 1226 1980
3090 1980 1453 1240 190 -373 -1256 -1599 -1405 -1116 -489 696 972 1773 2014 1027 415 -384 -1102 -1422 -1375
3109 -1375 -1105 -433 544 736 1617 1879 1219 627 -75 -628 -1601 -1580 -1919 -1153 -386 443 1217 1761 959 697
3129 697 455 -310 -1133 -1678 -1398 -1457 -486 304 991 1770 1341 1355 270 -52 -1198 -1527 -1436 -1300 -507 -377
$$ packed form
2993F91q89p5o53p92K26K69N24P81P12Q19M22l27q19j114p38q46J4K69O39J063
3013A76L83Q53K59m5n05o54r93p79n84N53LQ40R76J062L20p27n3q0j317r61k33
3034a506j074J243N09J095M36O97L56r5j099n03q66k13m05l24J102R50J12J033
3052A448Q38l93j117k35j260r15L17j45P52m7J190O38M65l3k79r16m89p06q81
3071a768L90K98M10J044O36L33K54l49q22q05J52j213l06L99Q89K60N71Q53P54
3090A980n27k13j050n63q83l43J94K89O27J185K76Q01K41r87o12p99p18l20M7
3109a375K70O72R77J92Q81K62o60n92p02n53r73K1l39P66P67Q29P74N44q02k62
3129F97k42p65q23n45K80n9R71P90O87P79m29J4j085l22j146l29R1J36P93J30
$$ plain form
3149 -377 1254 1748 1791 1470 761 174 -972 -1131 -1803 -1047 -561 97 861 2072 1327 1976 927 -8 -588
3168 -588 -1328 -1468 -1335 -1669 -207 664 981 1315 1404 1611 400 256 -1160 -1747 -1394 -1004 -714 315 1022
3187 1022 1503 1573 1376 689 12 -813 -1150 -1444 -1664 -772 -19 1057 1534 2103 1597 1189 388 -537 -928 -1405
3207 -1405 -1349 -1281 -16 1013 1105 1509 1487 1367 978 8 -801 -1317 -1469 -1347 -809 90 1016 2242 1745 562
3227 562 331 -146 -598 -1579 -1933 -1729 -1310 -187 1145 1140 1689 1684 632 383 -459 -1050 -1681 -1435 -923 -306
3247 -306 473 1301 1657 1492 1007 574 -442 -1088 -962 -1845 -1295 -1114 117 212 1462 1880 1555 768 330
3266 330 -1239 -1663 -2023 -1420 -459 350 690 1793 1078 1554 726 724 -844 -1220 -1405 -1381 -814 -239 688 1154
3286 1154 1553 1567 1481 372 -215 -1419 -1648 -1850 -1008 -646 329 670 1527 1434 1158 736 -334 -1049 -1270 -1449
$$ packed form
3149c77J631M94M3l21p09n87j146j59o72P56M86O58P64J211p45O49j049r35n80
3168e88p40j40J33l34J462Q71L17L34Q9K07j211j44j416n87L53L90K90J029P07
3187A022M81P0j97o87o77q25l37k94k20Q92P53J076M77N69n06m08q01r25l91m77
3207a405N6O8J265J029R2M04k2j20l89r70q09n16j52J22N38Q99R26J226m97j183
3227E62k31m77m52r81l54K04M19J123J332nN49nj052k49q42n91o31K46N12O17
3247c06P79Q28L56j65m85m33j016o46J26q83N50J81J231R5J250M18l25p87m38
3266C30j569m24l60O03R61Q09L40J103p15M76q28kj568l76j85K4N67N75R27M66
3286A154L99J4q6j109n87j204k29k02Q42L62R75L41Q57r3k76m22j070p15k21j79
$$ plain form
3306 -1449 -945 -702 136 1282 1635 2304 1705 890 157 -393 -783 -1586 -1311 -893 336 504 1414 1352 2046
3325 2046 1414 1077 -316 -1604 -1833 -1673 -965 -466 236 1211 1735 1605 1517 1074 -711 -987 -1685 -1603 -1192
3344 -1192 -700 163 777 1666 1891 1682 1098 129 -1358 -1989 -1607 -1543 -1087 -182 884 1639 1863 1478 1235
3363 1235 402 -412 -713 -1674 -1641 -1455 -175 377 1430 1578 1360 1318 86 -439 -1122 -1952 -1490 -1284 -418
3382 -418 466 985 1363 1714 1920 1102 471 -697 -1158 -1377 -1532 -1016 -572 949 1422 2059 1673 1129 157
3401 157 -458 -1473 -1779 -1326 -845 -115 706 1519 1544 1294 1443 458 -110 -841 -1353 -1620 -1614 -182 632 1023
3421 1023 1948 1646 1397 789 -573 -1325 -1732 -1485 -1902 -1084 259 646 1798 1480 1417 538 427 -448 -1305
3440 -1305 -1527 -1465 -1018 -366 776 1559 1843 1596 1240 166 -506 -902 -1577 -1667 -1316 -663 502 1428 1738
$$ packed form
3306a449N04K43Q38J146L53O69n99q15p33n50l90q03K75M18J229J68R10o2O94
3325B046o32l37j393j288k29J60P08M99P02R75N24j30q8m43j785k76o98Q2M11
3344a192M92Q63O14Q89K25k09n84r69j487o31L82O4M56R05J066P55K24l85k43
3363A235q33q14l01r61L3J86J280N52J053J48k18m2j232n25o83q30M62K06Q66
3382d18Q84N19L78L51K06q18o31j168m61k19j55N16M44J521M73O37l86n44r72
3401A57o15j015l06M53M81P30Q21Q13K5k50J49r85n68p31n12k67OJ432Q14L91
3421A023R25l02k49o08j362p52m07K47m17Q18J343L87J152l18o3q79j11q75q57
3440a305k22O2M47O52J142P83K84k47l56j074o72l96o75r0L51O53J165R26L10
$$ plain form
3459 1738 1838 1047 790 -470 -626 -1435 -1961 -965 -718 45 1066 1240 1482 1599 1096 163 -804 -484 -1780
3478 -1780 -1565 -1034 59 556 1233 1395 1372 1106 -164 -435 -1183 -1721 -1564 -634 -449 810 1319 1657 1279
3497 1279 1446 899 -582 -977 -1388 -1669 -1555 -487 -47 1087 1536 1729 906 330 90 -922 -1873 -1820 -853
3516 -853 -235 109 666 1042 1923 1419 857 177 -594 -1707 -1936 -1787 -1142 -9 1034 1378 1627 1006 450
3535 450 471 -419 -1022 -1801 -1498 -888 -591 304 1475 1672 1746 1360 420 -55 -1098 -1323 -1462 -1477 -538 -279
3555 -279 641 1830 1695 1299 627 -577 -546 -1349 -1526 -1282 -649 227 311 1317 1579 1941 1092 430 -784
3574 -784 -1511 -1816 -1562 -619 2 396 975 1899 976 1205 262 -2 -1035 -1312 -1510 -1457 -654 -91 969 1499
3594 1499 1803 1333 937 -247 -799 -1460 -1430 -1195 -573 -36 918 1412 2075 1709 1028 187 -503 -1547 -1684
$$ packed form
3459A738J00p91k57j260j56q09n26R96K47P63J021J74K42J17n03r33r67L20j296
3478a780K15N31J093M97O77J62k3k66j270k71p48n38J57R30J85J259N09L38l78
3497A279J67n47j481l95m11k81J14J068M40J134M49J93q23n76k40j012r51N3R67
3516h53O18L44N57L76Q81n04n62o80p71j113k29J49O45J133J043L44K49o21n56
3535D50K1q90o03p79L03O10K97Q95J171J97P4l86r40m75j043k25j39j5R39K59
3555b79R20J189j35l96o72j204L1q03j77K44O33Q76Q4J006K62L62q49o62j214
3574g84p27l05K54R43O21L94N79R24r23K29r43k64j033k77j98N3Q03N63J060N30
3594A499L04m70l96j184n52o61L0K35O22N37R54M94O63l66o81q41o90j044j37
$$ plain form
3613 -1684 -1439 -855 -149 980 1416 1935 1268 575 444 -298 -886 -1428 -1585 -939 -392 -29 1032 1556 1505
3632 1505 1115 701 -286 -909 -1700 -1787 -1101 -855 116 1138 1604 1277 879 1044 248 -607 -1278 -1539 -1464 -875
3652 -875 50 616 782 1358 1833 1243 41 -101 -1380 -1877 -992 -1222 -42 1075 787 948 1207 1320 869
3671 869 -222 -877 -1527 -1432 -1188 -738 417 880 1779 1728 1311 765 28 -855 -1214 -1034 -1326 -902 53 737
3691 737 1110 741 1408 1286 367 -933 -1589 -1032 -1641 -1015 -440 767 1065 1220 1434 1580 155 -700 -1083
3710 -1083 -1724 -1468 -1191 -703 -112 453 1495 1985 903 1117 225 -980 -1035 -1419 -1585 -896 69 624 880
3729 880 878 756 649 40 -372 -1211 -1561 -1539 -1446 -707 421 1742 1783 2044 802 26 -454 -1772 -1396 -1125
3749 -1125 -991 -1050 158 1064 1384 937 1084 330 -40 -460 -1481 -1396 -1383 -555 247 436 1394 1463 1861 1001
$$ packed form
3613a684K45N84P06J129M36N19o67o93j31p42n88n42j57O46N47L63J061N24n1
3632A505l90m14r87o23p91q7O86K46R71J022M66l27l98J65p96q55o71k61P5N89
3652h75R25N66J66N76M75n90j202j42j279m97Q85k30J180J117k88J61K59J13m51
3671H69j091o55o50R5K44M50J155M63Q99n1m17n46p37q83l59J80k92M24R55O84
3691G37L73l69O67j22r19j300o56N57o09O26N75J207K98J55K14J46j425q55l83
3710a083o41K56K77M88N91N65J042M90j082K14q92j205n5l84j66O89R65N55K56
3729H80kj22j07o09m12q39l50K2R3P39J128J321M1K61j242p76m80j318L76K71
3749a125J34n9J208R06L20m47J47p54l70m20j021Q5J3Q28Q02J89R58O9L98q60
$$ plain form
3769 1001 102 -627 -1367 -1384 -833 -962 57 247 763 1245 1169 1332 732 -553 -720 -1063 -1671 -939 -632 38
3789 38 942 1609 1509 1346 -94 -240 -847 -2011 -1441 -1031 -320 107 556 1117 1877 965 815 -141 -865 -1516
3809 -1516 -1218 -1647 -843 274 1007 1133 1119 1118 815 301 -468 -738 -1143 -1625 -831 -549 2 855 1426 1216
3829 1216 1069 590 -383 -1027 -1889 -1530 -1148 -942 230 300 752 1108 889 17 -187 -358 -744 -1335 -938 -914
3849 -914 8 293 1325 1615 1234 923 131 -301 -1352 -1214 -1051 -778 -227 380 861 1248 1647 1076 442
3868 442 -216 -867 -669 -1445 -1054 -836 100 592 1635 1279 733 220 -102 -496 -1449 -1464 -907 -538 -151 787
3888 787 1317 831 1023 787 -142 -360 -862 -1330 -1517 -637 -530 254 1212 1465 1336 876 686 -149 -989 -1099
3908 -1099 -1197 -969 -403 -133 1004 1414 1347 973 739 115 -1325 -1332 -1878 -1362 -406 446 662 1081 726 843
$$ packed form
3769A001q99p29p40j7N51j29J019J90N16M82p6J63o00j285j67l43o08P32L07O70
3789C8R04O67j00j63j440j46o07j164N70M10P11M27M49N61P60r12j50r56p24o51
3809a516K98m29Q04J117P33J26j4jl03n14p69k70m05m82P94K82N51Q53N71k10
3829A216j47m79r73o44q62L59L82K06J172P0M52L56k19q72k04j71l86n91L97K4
3849i14R22K85J032K90l81l11p92m32j051J38J63K73N51O07M81L87L99n71o34
3868D42o58o51J98p76L91K18R36M92J043l56n46n13l22l94r53j5N57L69L87R38
3888G87N30m86J92k36r29k18n02m68j87Q80J07P84R58K53j29m60j90q35q40j10
3908a099r8K28N66K70J137M10o7l74k34o24j440pn46N16R56Q52K16M19l55J17
$$ plain form
3928 843 675 154 -607 -1033 -1010 -1267 -578 -211 741 558 1612 1723 1027 184 -929 -1040 -1865 -1198 -1386 46
3948 46 296 1187 1397 1395 1135 571 78 -1073 -1169 -1179 -1022 -449 264 494 1342 1428 1154 808 -19 -560 -801 -1319
3970 -1319 -1705 -621 -76 484 909 1088 1364 978 -17 -495 -1096 -1566 -1376 -830 -172 288 967 1075 1038 1006
3990 1006 367 -402 -574 -941 -1074 -1123 -572 160 656 1228 1205 1159 1459 -388 -921 -1054 -1593 -1403 -746 257
4010 257 875 1380 1269 1285 837 -664 -499 -1158 -1365 -1051 -694 -141 -8 689 1533 1423 792 274 -705 -932
4030 -932 -1136 -1709 -895 -576 40 225 1219 613 619 462 -158 -726 -972 -1146 -1468 -939 -78 856 1359 1481 1683
4051 1683 430 -116 -502 -942 -1279 -1043 -908 -514 793 1004 1303 1414 1210 435 -333 -703 -1306 -1098 -1286
4070 -1286 -689 816 888 1243 978 1265 253 -338 -497 -728 -1184 -858 -735 -189 490 1307 1331 1429 1180 466
$$ packed form
3928H43j68n21p61m26K3k57O89L67R52j83J054J11o96q43j113j11q25O67j88J432
3948D6K50Q91K10kk60n64m93j151r6j0J57N73P13K30Q48Q6k74l46q27n41k41n18
3970a319l86J084N45N60M25J79K76l86r95m78o01m70J90N46O58M60O79J08l7l2
3990A006o39p69j72l67j33m9N51P32M96N72k3m6L00j847n33j33n39J90O57J003
4010B57O18N05j11J6m48j501J65o59k07L14L57N53J33O97Q44j10o31n18r79k27
4030i32k04n73Q14L19O16J85R94o06Oj57o20n68k46j74l22N29Q61R34N03J22K02
4051A683j253n46l86m40l37K36J35L94J307K11K99J11k04p75p68l70o03K08j88
4070a286N97J505P2L55k65K87j012n91j59k31m56L26J23N46O79Q17K4R8k49p14
$$ plain form
4090 466 -24 -1438 -1717 -881 -867 -54 250 628 1101 950 904 182 -90 -723 -1462 -1031 -703 -570 30 967
4110 967 1214 1228 1021 638 -132 -662 -766 -1409 -912 -699 137 862 928 1479 1359 895 -87 -405 -771 -1408 -1383
4131 -1383 -891 -360 485 942 1266 1158 560 299 -299 -992 -1470 -1479 -795 -218 348 85 1033 1073 965 704 -262
4152 -262 -988 -1094 -920 -1414 -743 -138 585 924 800 590 563 467 -504 -1168 -1542 -1228 -741 -93 340 1030 1339
4173 1339 1098 1248 463 -327 -1335 -1366 -1138 -819 -459 163 878 1026 1584 609 446 -349 -205 -1234 -999
4192 -999 -804 -1019 299 1235 592 1237 1182 524 -102 -342 -1162 -1089 -1300 -861 317 787 804 1035 788 939
4212 939 -401 -398 -875 -1478 -1090 -680 -358 152 592 1337 1910 1143 253 -103 -262 -1182 -1229 -391 -190 -73 652
4233 652 768 1485 1026 361 251 -899 -867 -1250 -1336 -491 613 618 928 1492 1385 540 -161 -370 -794 -886 -1109
$$ packed form
4090D66m90j414k79Q36J4Q13L04L78M73j51m6p22k72o33p39M31L28J33O00R37
4110I67K47J4k07l83p70n30j04o43M97K13Q36P25O6N51j20m64r82l18l66o37K5
4131a383M92N31Q45M57L24j08n98k61n98o93m78rO84N77N66k63R48M0j08k61r66
4152b62p26j06J74m94O71O05P23L39j24k10k7r6r71o64l74L14M87O48M33O90L09
4173A339k41J50p85p90j008l1K28L19L60O22P15J48N58r75j63p95J44j029K35
4192i99J95k15J318R36o43O45n5o58o26k40q20P3k11M39J178M70J7K31k47J51
4212I39j340Lm77o03L88M10L22N10M40P45N73p67q90l56j59r20m7Q38K01J17P25
4233F52J16P17m59o65j10j150L2l83q6Q45J104NL10N64j07q45p01k09m24r2k23
$$ plain form
4254 -1109 -758 -161 720 766 754 1366 827 332 226 -274 -1321 -1386 -1167 -385 376 925 1158 1264 982 220
4274 220 103 -650 -1026 -1083 -1088 -847 45 565 355 1190 1440 819 240 -146 -1057 -993 -1206 -691 -229 917 945
4295 945 1138 923 476 408 123 -471 -1133 -834 -950 -434 0 477 830 1242 503 424 89 -455 -1252 -1148 -864
4316 -864 -546 136 494 821 1182 889 812 -116 -97 -600 -1124 -1479 -893 -131 398 782 1268 1204 440 340 -441
4337 -441 -702 -1158 -905 -590 -167 -89 753 1221 1479 921 143 27 -1340 -1311 -1155 -1343 -270 12 817 1161
4357 1161 1139 525 295 -202 -618 -1082 -1072 -885 -489 18 170 775 1088 1485 832 466 -291 -822 -976 -1344
4377 -1344 -466 -487 410 690 972 1156 784 652 -412 -914 -664 -695 -1483 -686 74 -165 1008 904 655 800
4397 800 -186 -472 -1154 -979 -996 -730 -4 858 661 982 1241 679 281 -309 -494 -1338 -939 -1009 -39 215 715
$$ packed form
4254a109L51N97Q81M6j2O12n39m95j06n00j047o5K19P82P61N49K33J06k82p62
4274B20j17p53l76n7nK41Q92N20k10Q35K50o21n79l86r11O4k13N15M62J146K8
4295I45J93k15m47o8k85n94o62K99j16N16M34M77L53M12p39p9l35n44p97J04K84
4316h64L18O82L58L27L61k93p7r28J9n03n24l55N86P62N29L84M86o4p64j00p81
4337d41k61m56K53L15M23P8Q42M68K58n58p78j16j367K9J56j88J073K82Q05L44
4357A161k2o14k30m97m16m64J0J87L96N07J52O05L13L97o53l66p57n31j54l68
4377a344Q78k1Q97K80K82J84l72j32j064n02K50l1p88P97P60k39J173j04k49J45
4397H00r86k86o82J75j7K66P26Q62j97L21K59n62l98n90j85q44L99p0R70K54N00
$$ plain form
4418 715 1249 1265 516 -256 -409 -819 -1120 -1159 -718 22 202 232 1097 1126 1101 -40 85 -403 -1495 -1002 -1251
4439 -1251 -233 -114 375 1049 1117 1379 515 -14 -142 -736 -1054 -750 -630 -858 255 983 1301 1023 1042 985
4459 985 -733 -668 -1134 -799 -935 -164 129 1056 976 660 1138 446 57 -572 -899 -1330 -1003 -406 445 849
4479 849 893 1054 1310 658 324 -603 -1370 -1348 -1034 -739 -421 -25 588 893 1123 752 -185 -147 -642 -890 -1155
4500 -1155 -1142 -105 116 239 1077 1242 1238 429 -323 -784 -1265 -1064 -896 -401 159 371 755 1509 1309 881
4520 881 297 -978 -1152 -754 -1379 -93 -14 -9 1541 1193 1194 999 -155 -417 -1012 -1691 -1331 -957 -536 522
4540 522 913 1189 1222 682 513 133 -746 -835 -919 -918 -700 408 705 678 647 850 424 -142 -296 -1214 -1027 -1295
4562 -1295 -1037 -473 540 846 1265 1086 521 155 -557 -937 -1193 -710 -542 -370 769 857 1314 1185 931
$$ packed form
4418G15N34J6p49p72j53m10l01l9M41P40J80L0Q65K9k5j141J25m88j092M93k49
4439a251J018J19M89O74O8K62q64n29j28n94l18L04J20k28J113P28L18k78J9n7
4459I85j718O5m66L35j36P71K93R27q0l16M78o92l89o29l27m31L27N97Q51M04
4479H49M4J61K56o52l34r27p67K2L14K95L18L96O13L05K30l71r37L8m95k48k65
4500a155J3J037K21J23Q38J65mq09p52m61m81K01J68M95N60K12L84P54k00m28
4520H81n84j275j74L98o25J286P9NJ550l48Jj95j154k62n95o79L60L74M21J058
4540E22L91K76L3n40j69l80q79q9q4JK18J108K97k7l1K03m26n66j54r18J87k68
4562a295K58N64J013L06M19j79n65l66p12l80k56M83J68J72J139Q8M57j29k54
$$ plain form
4581 931 427 -71 -845 -926 -1080 -572 -786 173 603 683 1617 768 583 -128 -823 -1218 -1038 -593 -367 -500 564
4602 564 982 1233 899 699 306 -574 -666 -1160 -1402 -702 -796 56 756 1209 1846 456 128 -556 -870 -1083
4622 -1083 -883 -1298 -431 -233 954 1253 1443 1129 366 -114 -432 -936 -1003 -1031 -850 313 676 1372 985 947
4642 947 427 -111 -440 -778 -714 -998 -807 -588 348 780 1547 1064 712 171 -363 -1354 -1334 -804 -1046 -297 224
4663 224 1149 1168 1039 1215 281 165 -624 -951 -972 -929 -494 -394 744 1011 1432 936 644 454 -332 -1170 -891
4684 -891 -744 -174 37 554 852 874 1256 828 214 -238 -1380 -1085 -566 -943 -100 328 1016 980 972 915 -76
4705 -76 -413 -914 -1181 -1303 -1024 -686 78 375 902 1197 1086 480 -152 -776 -942 -1588 -1554 -1136 -251 847
4725 847 755 1008 727 874 426 -149 -930 -873 -731 -654 -475 597 545 970 1680 880 476 -47 -1038 -835 -1485
$$ packed form
4581I31n04m98p74q1j54N08k14R59M30Q0R34q49j85p11o95l95J80M45K26j33J064
4602E64M18K51l34k00l93q80r2m94k42P00r4Q52P00M53O37j390l28o84l14k13
4622a083K00m15Q67J98J187K99J90l14p63m80l18n04o7k8J81J163L63O96l87l8
4642I47n20n38l29l38O4k84J91K19R36M32P67m83l52n41n34r91K0N30k42P49N21
4663B24R25J9j29J76r34j16p89l27k1M3M35J00J138K67M21m96k92j90p86q38K79
4684h91J47N70K11N17K98K2L82m28o14m52j142K95N19l77Q43M28O88l6qn7r91
4705g6l37n01k67j22K79L38P64K97N27K95j11o06o32o24j66o46L4M18Q85J098
4725H47r2K53k81J47m48n75p81N7J42P7J79J072n2M25P10q00m04n23r91K03o50
$$ plain form
4746 -1485 -1110 -203 476 835 1222 976 999 192 107 -567 -1031 -1327 -1275 -855 -2 301 930 1024 784 1045 78
4767 78 -688 -1008 -1328 -1321 -798 142 397 769 642 878 856 183 -299 -797 -1248 -1280 -851 -759 142 470 1179 1337
4789 1337 1130 417 30 -934 -684 -1269 -1072 -732 -161 504 1230 958 1107 537 173 -149 -972 -1353 -1091 -1008
4809 -1008 -128 355 1047 1098 978 729 268 53 -857 -711 -1161 -602 -761 466 734 1263 1194 1195 497 142 -565
4830 -565 -1017 -1065 -1328 -568 282 646 991 1347 1033 609 -508 -291 -525 -1497 -1105 -667 -76 255 768 1343
4850 1343 963 830 49 -479 -1222 -741 -838 -807 -190 -141 855 1409 1166 612 579 397 -743 -1224 -1508 -781 -170
4871 -170 344 119 1220 967 843 677 -293 -544 -1208 -995 -1484 -487 300 420 847 1130 1131 920 275 -833
4891 -833 -842 -1078 -1579 -969 72 411 712 1087 1409 1041 333 -30 -848 -1147 -1113 -702 -644 -352 601 796 1348
$$ packed form
4746a485L75R07O79L59L87k46K3q07q5o74m64k96N2M20Q53L03O29R4k40K61r67
4767G8p66l20l20PN23R40K55L72j27K36k2o73m82m98m51l2M29R2R01L28P09J58
4789A337k07p13l87r64K50n85J97L40N71O65P26k72J49n70l64l22q23l81K62Q3
4809a008Q80M83O92N1j20k49m61k15r10J46m50N59j59J227K68N29o9Jo98l55p07
4830e65m52m8k63P60Q50L64L45L56l14m24j117K17k34r72L92M38N91L31N13N75
4850A343l80j33p81n28p43M81r7L1O17M9R96N54k43n54l3j82j140m81k84P27O11
4871a70N14k25J101k53j24j66r70k51o64K13m89R97P87J20M27K83Jk11o45j108
4891h33rk36n01O10J041L39L01L75L22l68p08l63q18k99L4M11N8K92R53J95N52
$$ plain form
4912 1348 825 801 -173 -600 -999 -1212 -1172 -570 -360 470 990 1233 938 709 7 -476 -649 -1256 -1036 -773
4932 -773 -407 357 1016 1012 1196 1003 377 -290 -811 -926 -1304 -907 -327 -43 984 740 1360 1574 467 -47
4952 -47 -400 -1073 -1017 -1070 -820 -86 225 1135 1251 778 1036 27 -56 -726 -1843 -715 -942 -37 588 790
4972 790 1018 1387 705 150 -294 -1166 -1153 -1397 -793 -197 151 887 1211 943 922 423 -365 -685 -826 -1334 -620
4993 -620 -803 95 260 1402 1407 1333 934 -83 -720 -705 -1542 -1193 -841 -184 618 464 1513 1442 744 250 -132
5014 -132 -720 -1646 -1197 -417 -361 -212 686 1329 1015 810 922 -251 -625 -1372 -943 -905 -418 243 584 355
5034 355 1000 1599 688 383 -604 -567 -1027 -870 -875 -195 543 1186 912 1083 771 164 -819 -471 -1079 -1176 -719
5055 -719 -144 46 653 1005 1142 908 583 -432 -1087 -1144 -1118 -1160 -659 17 927 1008 1362 1659 295 297 -121
$$ packed form
4912A348n23k4r74m27l99k13M0O02K10Q30N20K43k95k29p02m83j73o07K20K63
4932g73L66P64O59mJ84j93o26o67n21j15l78L97N80K84J027k44O20K14j107n14
4952d7l53o73N6n3K50P34L11R10J16m73K58j009q3o70j117J128k27R05O25K02
4972G90K28L69o82n55m44q72J3k44O04N96L48P36L24k68k1m99p88l20j41n08P14
4993f20j83Q98J65J142Np4l99j017o37J5q37L49L52O57Q02j54J049p1o98m94l82
5014a32n88r26M49P80N6J49Q98O43l14k05J12j173l74p47M29L8M87O61L41k29
5034C55O45N99r11l05r87L7m60J57nO80P38O43k74J71l12o07r83L48o08r7M57
5055g19N75J90O07L52J37k34l25j015o55n7K6m2N01O76R10Q1L54K97j364Km18
$$ plain form
5076 -121 -1517 -1416 -1086 -771 -82 609 893 1466 1188 875 414 -366 -543 -1153 -1253 -1117 -63 766 1005
5095 1005 1392 1443 1211 492 -496 -409 -813 -1082 -800 -552 231 260 1428 1537 1185 768 -127 -602 -921 -1342
5115 -1342 -818 -391 -235 454 862 970 1270 956 -141 -722 -820 -933 -854 -987 -122 249 968 1328 1154 947
5135 947 19 -426 -1039 -1186 -1256 -911 -542 54 406 743 1544 979 286 -304 -855 -748 -1152 -1217 -629 -206 777
5156 777 983 1282 1265 793 -57 -180 -1007 -1278 -1091 -632 -770 768 846 1380 1232 708 -127 -243 -946 -1077
5176 -1077 -1069 -1167 -543 42 740 1145 950 869 854 -497 -708 -937 -1133 -1087 -635 205 584 1361 1385 1195 642 213
5198 213 -243 -1211 -1081 -1137 -1026 -95 690 1427 1059 956 633 69 11 -989 -941 -1331 -679 -15 216 812 1045
5219 1045 1597 648 318 -471 -906 -1379 -1622 -986 -410 -155 930 1099 1366 377 577 -360 -815 -1091 -1491
$$ packed form
5076a21j396J01L30L15O89O91K84N73k78l13m61p80j77o10j00J36J054Q29K39
5095A005L87N1k32p19r88Q7m04k69K82K48P83K9J168J09l52m17q95m75l19m21
5115a342N24M27J56O89M08J08L00l14j097n81r8j13P9j33Q65L71P19L60j74k07
5135I47r28m45o13j47p0L45L69N96L52L37Q01n65o93n90n51J07m04o5N88M23R83
5156G77K06K99j7m72q50j23q27k71J87M59j38J538P8N34j48n24q35j16p03j31
5176a077Qr8O24N85O98M05j95q1j5j351k11k29j96M6M52Q40L79P77K4j90n53m29
5198B13m56r68J30n6J11R31P85P37l68j03l23n64n8j000M8l90O52O64K31N96K33
5219A045N52r49l30p89m35m73k43O36N76K55J085J69K67r89K00r37m55k76m00
$$ plain form
5238 -1491 -1186 -566 -176 400 989 1333 1251 562 134 -550 -1201 -1178 -911 -834 42 -95 970 1465 668 846
5258 846 -116 -623 -471 -972 -986 -684 -189 -59 846 1321 1105 845 364 -142 -433 -752 -1215 -1611 -497 -336
5278 -336 368 828 846 1352 1077 329 -570 -1062 -1639 -1405 -605 76 687 699 1077 1092 816 288 -27 -1061 -922
5299 -922 -1399 -1345 -555 279 999 1217 1415 1159 448 112 -699 -1137 -1642 -1104 -490 -202 589 923 1216 871
5319 871 815 330 -412 -1588 -1182 -1602 -1089 369 469 730 935 1423 907 330 -188 -937 -1266 -1064 -643 61
5339 61 153 1137 1166 1474 940 441 -427 -946 -1069 -1115 -1084 -224 454 440 979 772 1243 453 -160 -100 -1164 -1387
5361 -1387 -848 -935 -303 641 753 1486 1049 789 296 74 -647 -988 -1399 -842 -723 509 927 1156 1497 1163
5381 1163 803 -538 -993 -872 -1542 -1225 -471 105 398 1333 1836 1262 612 100 -541 -1097 -1086 -1031 -12 4
$$ packed form
5238a491L05O20L90N76N89L44q2o89m28o84o51K3K67P7Q76j37J065M95p97J78
5258H46r62n07J52n01j4L02M95J30R05M75k16k60m81n06k91l19m63l96J114J61
5278c36P04M60J8N06k75p48q99m92n77K34Q00O81O11J2L78J5k76n28l15j034J39
5299i22m77N4P90Q34P20K18J98k56p11l36q11m38n05N38O14K88P91L34K93l45
5319H71n6m85p42j176M06m20N13J458J00K61K05M88n16n77n18p49l29K02M21P04
5339F1R2R84K9L08n34m99q68n19j23m6L1Q60O78j4N39k07M71p90o13O0j064k23
5361a387N39q7O32R44J12P33m37k60m93k22p21l41m11N57J19J232M18K29L41l34
5381A163l60j341m55J21o70L17P54N76K93R35N03n74o50n12o41n56J1N5J019J6
$$ plain form
5401 4 840 1036 1208 1408 947 319 5 -941 -1557 -1103 -937 15 397 416 1433 1224 1176 700 -603 -802 -1536
5422 -1536 -1146 -1231 -593 61 270 1221 1433 1059 695 175 -720 -1344 -1117 -972 -827 138 974 1330 1307 982
5442 982 855 202 -455 -577 -596 -1405 -734 -635 375 965 1012 1177 903 88 -446 -491 -961 -902 -898 -242 204 1110
5464 1110 1074 1098 1015 345 -179 -715 -1378 -1619 -1100 -507 10 611 765 1214 1437 905 276 -524 -1093 -1166 -1483
5485 -1483 -688 -896 429 753 1293 1150 998 418 -574 -1054 -1314 -1622 -716 -436 3 1087 990 1276 901
5504 901 662 -449 -625 -1114 -1210 -1210 -623 142 533 812 1075 1395 725 143 -614 -1346 -1395 -1393 -823 -88 557 863
5526 863 1115 1172 1270 454 -341 -1275 -1182 -1095 -958 -186 241 710 1335 1476 1074 458 -156 -753 -1230 -1201 -1304 -739
5548 -739 414 846 1253 1018 1182 619 -57 -549 -1257 -1588 -1102 -883 118 447 744 1392 1516 1057 -36
$$ packed form
5401DQ36J96J72K00m61o28l14r46o16M54J66R52L82J9J017k09m8m76j303j99p34
5422a536L90q5O38O54K09R51K12l74l64n20q95o24K27J45J45R65Q36L56k3l25
5442I82j27o53o57j22j9q09O71R9J010N90M7J65k74q15n34m5m70N9MO56M46R06
5464A110l6K4q3o70n24n36o63k41N19N93N17O01J54M49K23n32o29q00n69p3l17
5485a483P95k08J325L24N40j43j52n80r92m80k60l08R06K80M39J084r7K86l75
5504I01k39j111j76m89r6%N87P65L91K79K63L20o70n82p57p32m9KN70P35O45L06
5526H63K52N7R8q16p95r34R3Q7J37P72M27M69O25J41m02o16o14n97m77K9j03N65
5548g39J153M32M07k35J64n63o76m92p08l31M86K19J001L29K97O48J24m59j093
$$ plain form
5567 -36 -603 -1205 -1388 -1107 -1284 -909 446 1133 1063 1033 1177 613 -154 -1499 -1289 -1327 -889 -527 227 992 1553
5588 1553 1561 740 681 -460 -688 -689 -1165 -1305 -464 -270 673 1057 1362 1281 737 -364 30 -1149 -1380 -1215 -948
5609 -948 -184 94 1195 1167 1571 732 873 -552 -878 -921 -1302 -864 47 70 578 1025 1162 811 320 251 -1033
5630 -1033 -1336 -1254 -1281 -596 -105 1132 874 1116 1046 844 590 -689 -1162 -1410 -1510 -819 -210 111 787 1529
5650 1529 1456 1136 209 -468 -921 -1559 -1381 -680 -319 112 1043 1330 1371 1303 578 -116 -591 -1489 -1227 -1220 -279
5671 -279 466 1085 1034 1652 777 378 -85 -593 -1402 -1545 -1274 -533 -406 617 1230 1397 1421 676 161 -718
5691 -718 -867 -1232 -1309 -351 -217 380 917 1361 1606 1033 -84 -465 -892 -1386 -1240 -1101 -1017 -195 962 1062
5711 1062 1471 848 1233 106 -1149 -1416 -1522 -1177 -562 -195 542 1015 1694 810 331 177 -606 -717 -1556
$$ packed form
5567c6n67o02j83K81j77L75J355O87p0l0J44n64p67j345K10l8M38L62P54P65N61
5588A553Qq21n9j141k28jm76j40Q41J94R43L84L05q1n44j101L94j179k31J65K67
5609i48P64K78J101k8M04q39J41j425l26m3l81M38R11K3N08M47J37l51m91o9j284
5630a033l03Q2k7O85M91J237k58K42p0k02k54j279m73k48j00O91O09L21O76P42
5650A529p3l20r27o77m53o38J78P01L61M31R31K87M1o8p25o94m75q98K62PR41
5671b79P45O19n1O18q75l99m63n08q09j43K71P41J27J023O13J67K4p45n15q79
5691g18j49l65p7R58J34N97N37M44K45n73j117l81m27m94J46J39Q4Q22J157J00
5711A062M09o23L85j127j255k67j06L45O15L67P37M73O79q84m79j54p83j11q39
$$ plain form
5730 -1556 -1183 -647 -125 86 998 1478 1323 1058 78 -777 -846 -1208 -1365 -1208 -438 917 935 1378 1141 954
5750 954 611 -430 -943 -1402 -823 -771 -505 -78 100 1005 1241 1221 273 -265 -537 -1085 -814 -1341 -1141 -359
5770 -359 826 1391 1532 937 1004 274 -203 -896 -1012 -1324 -425 -326 369 638 941 1537 1211 132 -380 -1198
5790 -1198 -1331 -1221 -1131 -899 239 495 887 1062 1430 695 -281 -345 -1399 -1310 -867 22 62 364 1381 1813
5810 1813 1476 818 -5 -805 -1403 -1065 -1274 -1298 -339 -9 933 927 1156 989 -102 -326 -612 -1138 -1344 -919
5830 -919 -428 274 1200 1149 860 449 670 -60 -884 -877 -1332 -1381 -630 246 277 1209 1766 1186 544 -292 -466 -1218
5852 -1218 -1842 -666 -582 -632 303 852 1188 832 629 28 -246 -1031 -1652 -1371 -535 -701 546 1066 1385 1711
5872 1711 1093 141 -298 -432 -1512 -1748 -776 -643 130 1152 1195 1065 971 732 20 -1414 -1001 -934 -1866 -1024
$$ packed form
5730a556L73N36N22K11R12M80j55k65r80q55o9l62j57J57P70J355J8M43k37j87
5750I54l43j041n13m59N79N2K66M27J78R05K36k0r48n38k72n48K71n27K00P82
5770c59J185N65J41n95O7p30m77o93j16l12Q99R9O95K69L03N96l26j079n12q18
5790a198j33J10R0K32J138K56L92J75L68p35r76o4j054Q9M43Q89M0L02J017M32
5810A813l37o58q23q00n98L38k09k4R59L30R42oK29j67j091k24k86n26k06M25
5830i19M91P02R26n1k89m11K21p30q24Pm55m9P51Q76L1R32N57n80o42q36j74p52
5852a218o24J176Q4n0R35N49L36l56k03o01k74p85o21K81Q36j66J247N20L19L26
5872A711o18r52m39j34j080k36R72J33P73J022M3j30r4k39p12j434M13O7r32Q42
$$ plain form
5892 -1024 5 406 793 913 858 1308 525 -648 -654 -1357 -855 -517 -26 636 634 1447 1629 1316 220 -530
5912 -530 -687 -1138 -1466 -968 -707 147 1256 1105 1194 1502 125 135 -592 -1186 -1245 -1431 -452 -333 1008 1168
5932 1168 1681 1564 1162 321 -514 -942 -1424 -1499 -912 -219 224 694 601 1027 1013 74 -501 -898 -1475 -929 -740
5953 -740 -61 655 1041 1069 1556 892 605 -338 -1212 -702 -1322 -1017 -1149 -100 653 831 1535 1278 555 478
5973 478 -66 -921 -1232 -1606 -1098 -39 821 453 1165 1645 404 -29 -62 -770 -1042 -951 -802 -757 -88 614
5993 614 1215 1015 778 739 -132 -1369 -1298 -971 -943 -886 215 513 874 1493 1087 885 187 -75 -1205 -1150 -840
6014 -840 -1000 -450 415 899 1636 1425 1067 431 -278 -931 -742 -1083 -399 -192 293 819 1290 657 876 566
6034 566 -374 -739 -1336 -1451 -1160 -650 -124 577 1323 979 704 176 -8 -637 -761 -1566 -938 -554 -220 391
$$ packed form
5892a024J029M01L87J20n5M50p83j173op03N02L38M91O62kQ13J82l13j096p50
5912e30j57m51l28M98K61Q54J109j51Q9L08j377J0p27n94n9j86R79J19J341J60
5932A168N13j17m02q41q35m28m82p5N87O93M43M70r3M26j4r39n75l97n77N46J89
5953g40O79P16L86K8M87o64k87r43q74N10o20L05j32J049P53J78P04k57p23p7
5973D78n44q55l11l74N08J059Q60l68P12M80j241m33l3p08k72R1J49M5O69P02
5993F14O01k00k37l9q71j237P1L27K8N7J101K98L61O19m06k02o98k62j130N5L10
6014h40j60N50Q65M84P37k11l58o36p09o53J89l41O84K07M85N26M71o33K19l10
6034E66r40l65n97j15K91N10N26P01P46l44k75n28j84o29j24q05O28L84L34O11
$$ plain form
6054 391 721 1493 1426 170 173 -65 -865 -1650 -900 -867 -162 345 1209 877 639 1008 -42 -14 -650 -793 -1171
6075 -1171 -1008 -630 -63 709 796 1063 1434 378 -154 -679 -1151 -990 -1421 -246 255 778 830 992 1106 949
6095 949 -40 -67 -975 -971 -1138 -1036 -269 86 1026 1304 1159 1142 175 -218 -817 -1167 -779 -554 -772 366 675
6116 675 1609 1250 1019 760 245 -491 -1099 -1387 -883 -241 -328 310 963 713 878 796 -444 -950 -850 -993
6136 -993 -1179 -65 -239 446 1199 1378 1436 755 492 -854 -1055 -1140 -448 -861 -311 424 515 1010 1515 1225
6156 1225 364 -77 -319 -1182 -1137 -588 -434 636 356 1086 1159 887 897 246 -642 -1034 -918 -964 -272 -186 638
6177 638 739 1316 846 677 77 -76 -753 -1175 -1011 -617 -260 215 902 531 1168 556 227 -277 -795 -1007
6197 -1007 -1225 -676 -417 167 776 980 1057 541 968 -256 -439 -988 -1429 -1048 -928 16 501 1643 1104
$$ packed form
6054C91L30P72o7j256Lk38q00p85P50L3P05N07Q64l32k38L69j050K8o36j43l78
6075a171J63L78N67P72Q7K67L71j056n32n25m72J61m31J175N01N23N2J62J14j57
6095I49r89k7r08Mj67J02P67L55R40K78j45j7r67l93n99l50L88K25k18J138L09
6116F75R34l59k31k59n15p36o08k88N04O42q7O38O53k50J65q2j240n06J00j43
6136i93j86J114j74O85P53J79N8o81k63j346k01q5O92m13N50P35R1M95N05k90
6156A225q61m41k42q63M5N49J54J070k80P30P3k72J0o51q88l92J16m6O92Q6Q24
6177F38J01N77m70j69o00j53o77m22J64L94L57M75O87l71O37o12l29n04n18k12
6197a007k18N49K59N84O09K04P7n16M27j224j83n49m41L81J20R44M85J142n39
$$ plain form
6216 1104 1087 821 68 -509 -1011 -934 -815 -399 24 374 792 1246 871 852 344 -340 -844 -1201 -1226 -956 -110
6237 -110 -34 1360 1381 1263 757 984 -92 -584 -583 -1106 -589 -333 -96 682 706 1211 1123 537 -136 -307 -491
6258 -491 -1131 -984 -388 -102 552 985 1114 1326 1007 531 -378 -804 -473 -1162 -539 -312 92 716 1195 1304
6278 1304 983 287 142 -783 -851 -959 -978 -498 -124 53 861 1016 874 721 51 -463 -927 -1027 -1289 -1101
6298 -1101 -447 543 750 1182 1085 496 -148 -227 -1135 -1105 -663 -219 2 472 468 1128 1340 625 -104 -171 -276 -885
6320 -885 -847 -758 -558 171 836 1145 1078 1110 -315 130 -848 -1109 -1186 -595 -533 23 543 786 842 1130 389 -21
6342 -21 -448 -945 -1200 -1292 -721 98 370 1398 1242 1131 582 620 200 -958 -1149 -1028 -676 -247 126 658
6362 658 1348 662 1048 748 -68 -522 -1159 -712 -892 -560 181 532 1054 1562 1337 465 135 -358 -959 -968 -1033
$$ packed form
6216A104j7k66p53n77n02P7J19M16M23L50M18M54l75j9n08o84n04l57k5K70Q46
6237a10P6J394K1j18n06K27j076m92Jn23N17K56K37P78K4N05q8n86o73j71j84
6258d91o40J47N96K86O54M33J29K12l19m76r09m26L31o89O23K27M04O24M79J09
6278A304l21o96j45r25o8j08j9M80L74J77Q08J55j42j53o70n14m64j00k62J88
6298a101O54R90K07M32r7n89o44p9r08L0M42M44K21M70mO60K12p15p29o7j05o09
6320h85L8Q9K00P29O65L09o7L2j425M45r78k61p7N91O2N56N20K43N6K88p41m10
6342b1m27m97k55r2N71Q19K72J028j56j11n49L8m20j158j91J21L52M29L73N32
6362F58O90o86L86l00q16m54o37M47j80L32P41L51N22N08k25q72l30m93o01ro5
$$ plain form
6383 -1033 -905 109 778 1106 936 922 674 202 -313 -933 -1219 -1331 -896 -470 -13 859 1267 815 670 433
6403 433 -206 -594 -924 -1208 -1178 -688 -248 431 1057 966 763 955 57 -368 -916 -1036 -1366 -593 -285 606 587
6424 587 910 789 440 484 -275 -777 -1339 -1377 -799 -571 439 652 1352 958 930 668 -283 -459 -783 -642 -491
6445 -491 -572 -184 1145 924 1051 966 72 -37 -702 -1312 -932 -856 -567 147 391 1215 1306 1553 883 71 -222
6466 -222 -1019 -981 -892 101 72 425 710 1624 1309 592 534 -431 -844 -1236 -1256 -908 -397 -6 872 907 1317 904
6488 904 -17 -265 -880 -896 -1392 -1518 -630 -255 553 849 1028 1128 116 62 -411 -469 -1256 -1374 -359 -159
6508 -159 316 540 917 1310 998 434 -459 -638 -1334 -1109 -708 -833 102 842 1076 752 880 397 -156 -334
6528 -334 -872 -901 -978 -396 -597 840 1349 1131 916 375 -60 -846 -584 -674 -1405 -607 -16 630 621 1042 1166
$$ packed form
6383a033J28J014O69L28j70j4k48m72n15o20k86j12M35M26M57Q72M08m52j45k37
6403D33o39l88l30k84L0M90M40O79O26r1k03J92q98m25n48j20l30P73L08Q91j9
6424E87L23j21l49M4p59n02n62l8N78K28J010K13P00l94k8k62r51j76l24J41J51
6445d91q1L88J329k21J27q5q94j09o65o10L80P6K89P14K44Q24R1K47o70q12k93
6466b22p97L8Q9R93k9L53K85R14l15p17n8r65m13l92k0L48N11L91Q78L5M10m13
6488I04r21k48o15j6m96j26Q88L75Q08K96J79J00j012n4m73n8p87j18J015K00
6508a59M75K24L77L93l12n64q93j79o96K25M01j25R35P40K34l24J28m83n53j78
6528c34n38k9p7N82k01J437N09k18k15n41m35p86K62r0p31P98N91O46rM21J24
$$ plain form
6549 1166 563 572 -302 -836 -1129 -1093 -1016 -511 667 774 1076 1163 420 666 -34 -575 -740 -1268 -578 -539 284
6570 284 1095 547 1281 1214 404 -157 -462 -920 -1208 -963 -690 -382 664 725 1370 817 1137 293 -662 -1005
6590 -1005 -1135 -939 -742 -219 348 603 827 1292 789 678 -683 -770 -1154 -1675 -1564 -248 333 742 1271
6609 1271 1050 778 860 34 -871 -764 -1350 -862 -524 -41 279 717 1171 572 524 -101 -690 -1320 -997 -880
6629 -880 -1199 -512 284 258 901 1317 1036 207 -550 -975 -924 -569 -809 -199 96 600 692 777 1107 340 -605
6650 -605 -260 -1444 -1546 -1099 -730 -89 559 1142 1365 933 388 -34 -667 -994 -813 -1181 -750 -161 64 711
6670 711 858 909 858 262 -221 -1176 -1214 -1427 -436 -4 317 748 1018 1220 643 -68 -629 -478 -906 -1133 -1196
6691 -1196 -332 507 447 1179 950 1249 345 -439 -361 -1015 -840 -1361 -219 79 604 1034 1156 1042 402 335
$$ packed form
6549A166o03Rq74n34k93L6P7N05J178J07L02Q7p43K46p00n41j65n28O90L9Q23
6570B84Q11n48P34o7q10n61l05m58k88K45K73L08J046O1O45n53L20q44r55l43
6590a005j30J96J97N23N67K55K24M65n03j11j361q7l84n21J11J316N81M09N29
6609A271k21k72Q2q26r05J07n86M88L38M83L20M38M54n99m8o25n89o30L23J17
6629h80l19O87P96k6O43M16k81q29p57m25N1L55k40O10K95N04R2Q5L30p67r45
6650f05L45j184j02M47L69O41O48N83K23m32n45m22o33l27J81l68M31N89K25O47
6670G11J47N1n1n96m83r55l8k13R91M32L21M31K70K02n77p11n61J51m28k27o3
6691a196Q64Q39o0P32k29K99r04p84P8o54J75n21J142K98N25M30J22j14o40o7
$$ plain form
6711 335 -593 -1175 -1219 -1389 -856 94 497 955 1359 1132 841 79 -16 -756 -1208 -903 -847 -403 -52 1093 591
6732 591 1004 611 649 -7 -731 -1178 -1166 -237 -831 234 468 1098 1409 1143 504 72 -281 -1250 -522 -1057
6752 -1057 -760 -725 29 954 1269 1020 608 25 -183 -975 -937 -1299 -443 -149 222 782 1181 873 725 159
6772 159 404 -680 -893 -1336 -961 -219 -332 734 642 1222 445 329 -175 -498 -1158 -577 -721 -645 -66 523
6792 523 949 790 1166 504 167 -158 -694 -805 -1072 -1182 38 157 1152 836 918 1286 8 -103 -634 -1053
6812 -1053 -790 -773 -239 -70 699 1314 1205 1251 192 -69 -687 -1179 -880 -861 -907 418 377 1105 698 670 592
6833 592 15 -599 -727 -857 -1228 -864 65 420 1362 1261 1177 1110 191 -332 -1046 -487 -1019 -739 87 -85 546
6854 546 1168 994 1201 994 -492 -326 -1440 -1763 -595 -570 223 952 886 1113 426 56 205 -438 -1112 -833
$$ packed form
6711C35r28n82m4j70N33R50M03M58M04k27k91p62r5p40m52L05N6M44L51J145n02
6732E91M13l93L8o56p24m47J2R29n94J065K34O30L11k66o39m32l53r69P28n35
6752a057K97L5P54R25L15k49m12n83k08p92L8l62Q56K94L71N60L99l08j48n66
6772A59K45j084k13m43L75P42j13J066r2N80p77j16n04l23o60N81j44P6N79N89
6792E23M26j59L76o62l37l25n36j11k67j10J220J19R95l16Q2L68j278j11n31m19
6812a053K63J7N34J69P69O15j09M6j059k61o18m92K99J9m6J325m1P28m07k8p8
6833E92n77o14j28j30l71L64R29L55R42j01q4o7r19n23p14N59n32K80Q26j72O31
6854E46O22j74K07k07j486J66j114l23J168K5P93P29o6K27o87l70J49o43o74K79
$$ plain form
6874 -833 -646 -625 -96 627 935 1275 622 224 90 187 -574 -1592 -605 -869 -284 -264 313 991 1234 638 506
6895 506 -355 -543 -846 -1107 -1133 4 403 -36 1190 1262 1058 407 119 -688 -1191 -1022 -939 -632 -65 643
6915 643 1009 1321 489 398 68 -284 -1092 -748 -683 -586 -175 383 821 1269 1536 828 429 -1107 -938 -586 -655
6936 -655 -812 -76 -96 540 1371 1188 1149 272 -241 -562 -836 -1087 -1250 -705 -34 304 1010 784 955 326 197
6957 197 -484 -822 -1066 -772 -505 -14 50 714 1083 846 675 91 -535 -575 -929 -1395 -481 -52 574 545 1378
6978 1378 1055 790 -196 -349 -761 -1414 -885 -1357 -477 -114 325 880 1222 694 353 164 -343 -781 -718 -1243
6998 -1243 -976 46 1022 725 948 1484 418 -103 -584 -999 -939 -687 -864 -224 78 1080 689 1101 514
7017 514 185 -179 -619 -1374 -740 -758 -149 645 777 1266 1178 1007 468 148 -385 -702 -1107 -866 -381 405 605
$$ packed form
6874h33J87K1N29P23L08L40o53l98j34R7p61j018R87k64N85K0N77O78K43n96j32
6895E06q61j88l03k61k6J137L99m39J226P2k04o51k88q07n03J69Q3L07N67P08
6915F43L66L12q32r1l30l52q08L44O5R7M11N58M38M48K67p08l99j536J69L52o9
6936f55j57P36k0O36Q31j83l9q77n13l21k74k51j63N45O71L38P06k26J71o29j29
6957A97o81l38k44K94K67M91O4O64L69k37j71n84o26m0l54m66R14M29O26k9Q33
6978A378l23k65r86j53m12o53N29m72Q80L63M39N55L42n28l41j89n07m38O3n25
6998a243K67J022R76k97K23N36j066n21m81m15O0K52j77O40L02J002l91M12n87
7017E14l29l64m40p55O34j8O09P94J32M89q8j71n39l20n33l17m05K41M85P86K00
$$ plain form
7038 605 1038 863 915 470 455 -153 -430 -1061 -1018 -442 -269 351 985 1037 1563 1153 77 -72 -777 -1434 -1208
7059 -1208 -736 -792 275 878 757 1482 1183 428 182 -925 -1194 -287 -1205 -732 655 169 560 1108 1054
7078 1054 1069 91 -642 -703 -1332 -1219 -520 470 720 705 1005 701 559 409 -354 -650 -911 -815 -544 124 272
7099 272 1360 694 784 709 406 -303 -424 -1416 -984 -669 -319 468 626 1000 1297 1096 492 -115 -559 -815
7119 -815 -948 -792 -744 -141 300 807 1179 688 774 281 -299 -1044 -1012 -818 -741 -386 416 376 1178 1224 464 526
7141 526 -656 -754 -835 -1107 -800 -455 -77 217 1230 1035 771 731 231 -875 -728 -942 -1273 -401 223 267
7161 267 727 831 1260 593 -352 -321 -1107 -1014 -931 -592 -177 778 983 997 657 1020 -188 -664 -784 -896 -583
7182 -583 -507 -303 227 828 995 947 788 399 -465 -806 -1045 -1133 -949 -51 84 788 731 548 1224 293 -338
$$ packed form
7038F05M33j75N2m45j5o08k77o31M3N76J73O20O34N2N26m10j076j49p05o57K26
7059a208M72n6J067O03j21P25k99p55k46j107k69R07r18M73J387m86L91N48n4
7078A054J5r78p33o1o29J13O99R90K50j5L00l04j42j50p63k96k61R6K71O68J48
7099B72J088o66R0p5l03p09j21r92M32L15L50P87J58L74K97k01o04o07m44k56
7119h15j33J56M8O03M41N07L72m91Q6m93n80p45L2J94P7L55Q02m0Q02M6p60O2
7141E26j182r8q1k72L07L45L78K94J013j95k64m0n00j106J47k14l31Q72O24M4
7161B67M60J04M29o67r45L1p86R3Q3L39M15R55K05J4l40L63j208m76j20j12L13
7182e83P6K04N30O01J67m8j59l89q64l41k39q8J84Q98J35P04n7j83O76r31o31
$$ plain form
7203 -338 -989 -943 -811 -955 -447 595 76 557 608 988 535 44 220 -943 -1310 -949 -384 240 303 439
7223 439 650 610 509 -170 -229 -961 -996 -1083 -789 -375 12 804 526 683 1195 14 48 -733 -774 -926 -495 -167
7245 -167 44 948 944 1317 963 917 240 -760 -1260 -1288 -1025 -437 -112 178 520 930 738 361 -260 -41 -598
7266 -598 -363 -672 -1157 -417 333 -37 350 996 867 391 -588 -594 -877 -891 -499 -12 -71 390 907 488 653
7287 653 161 -251 -519 -1010 -819 -319 -582 -40 577 514 1120 751 445 58 -518 -894 -914 -885 -741 129 530
7308 530 684 1061 794 575 562 -240 -469 -639 -699 -656 -731 144 721 583 867 471 178 -493 -748 -1343 -692
7329 -692 -734 84 -326 594 1045 1001 630 257 263 -495 -540 -805 -674 -616 45 1209 1114 1414 385 414 47 -421
7351 -421 -615 -1060 -835 -523 -276 -231 219 1046 765 531 208 -88 -420 -626 -1129 -1057 -3 -237 341 518
$$ packed form
7203c38o51M6J32j44N08J042n19M81N1L80m53m91J76j163l67L61N65O24O3J36
7223D39K11m0j01o79n9p32l5q7K94M14L87P92k78J57N12j181L4p81m1j52M31L28
7245a67K11R04mL73l54m6o77j000n00k8K63N88L25K90L42M10j92l77o21K19n57
7266e98K35l09m85P40P50l70L87O46j29m76r79ok83j4L92M87n9M61N17m19J65
7287F53m92m12k68m91J91N00k63N42O17o3O06l69l06l87n76l76k0K9J44Q70M01
7308E30J54L77k67k19j3q02k29j70o0M3p5Q75N77j38K84l96k93o71k55n95O51
7329f92m2Q18m10R20M51m4l71l73Op58m5k65J31N8O61J164r5L00j029K9l67m68
7351d21j94m45K25L12K47M5M50Q27k81k34l23k96l32k06n03P2J054k34N78J77
$$ plain form
7371 518 990 696 228 -176 -435 -974 -1206 -920 -640 54 191 424 1165 1664 149 357 51 -512 -1076 -576
7391 -576 -838 -744 600 596 1019 444 460 -226 -181 -356 -637 -1185 -843 -54 200 641 700 797 854 -72 -540 -939
7413 -939 -637 -1214 -962 -573 -535 208 944 743 814 443 -217 -85 -647 -1122 -1007 -537 -333 1042 623 1221
7433 1221 876 422 -190 -464 -515 -1453 -1050 -457 -447 473 595 993 527 487 932 385 -1056 -866 -711 -474
7453 -474 -374 186 877 485 1313 510 561 28 -469 -725 -1169 -907 -175 -102 92 505 444 1258 457 481 -427
7474 -427 -584 -806 -721 -925 -17 476 864 1191 706 808 85 -607 -487 -1059 -788 -342 -384 646 328 1129
7494 1129 806 805 640 56 -499 -427 -931 -377 -605 -205 702 441 977 1239 367 -89 -694 -1164 -588 -642 -286
7515 -286 -28 229 459 846 1344 434 477 -233 -310 -716 -464 -656 -463 374 417 372 444 355 492 -270 -968 -1117
$$ packed form
7371E18M72k94m68m04k59n39k32K86K80O94J37K33P41M99j515K08l06n63n64N00
7391e76k62R4J344mM23n75J6o86M5j75k81n48L42P89K54M41N9R7N7r26m68l99
7413i39L02n77K52L89L8P43P36k01P1l71o60J32n62m75J15M70K04J375m19N98
7433A221l45m54o12k74n1r38M03N93J0R20J22L98m66m0M45n47j441J90J55K37
7453d74J00N60O91l92Q28q03N1n33m97k56m44K62P32P3J94M13o1Q14q01K4r08
7474d27j57k22Q5k04R08M93L88L27m85J02p23o92J20n72K71M46m2J030l18Q01
7494A129l23jj65n84n55P2n04N54k28M00R07k61N36K62q72m56o05m70N76n4L56
7515b86K58K57K30L87M98r10M3p10p7m06K52j92J93Q37M3m5P2q9J37p62o98j49
$$ plain form
7537 -1117 -313 -635 -446 349 732 759 813 872 512 -100 -203 -1064 -953 -1011 -646 234 632 200 1199 557 563 360
7559 360 -279 -623 -945 -986 -652 -18 560 680 566 563 293 17 -29 -872 -971 -1310 -633 -491 77 223 1090 656
7581 656 724 373 101 21 -719 -694 -451 -177 -26 247 208 1507 1012 212 388 -881 -1195 -750 -458 -545 -347
7602 -347 -77 742 404 676 528 306 -134 -748 -658 -846 -914 -217 212 687 793 506 759 280 157 -1116
7622 -1116 -654 -1217 -1015 -6 -409 476 970 1037 690 944 254 -93 -549 -717 -858 -201 253 -166 634 937
7642 937 1209 241 6 -111 -576 -1289 -848 -283 -143 402 838 919 859 780 101 12 -587 -966 -1048 -970 51 547
7664 547 427 489 1101 788 325 -112 -701 -644 -921 -1463 -548 47 936 1077 849 679 720 -284 -418 -981 -984
7685 -984 -733 -249 -101 175 658 930 1213 601 188 -109 -664 -716 -811 -856 -473 688 704 391 596 414 143
$$ packed form
7537a117Q04l22J89P95L83K7N4N9l60o12j03q61J11n8L65Q80L98m32R99o42Ok03
7559C60o39l44l22m1L34O34N78J20j14lk70k76m6q43r9l39O77J42N68J46Q67m34
7581F56O8l51k72q0p40K5K43K74J51K73l9J299m95q00J76j269l14M45K92q7J98
7602c47K70Q19l38K72j48k22m40o14R0j88o8O97M29M75J06k87K53m79j23j273
7622a116M62n63K02J009m03Q85M94O7l47K54o90l47m56j68j41O57M54m19Q00L03
7642I37K72r68k35j17m65p13M41N65J40N45M36Q1o0p9o79q9n99l79q2P8J021M96
7664E47j20O2O12l13m63m37n89N7k77n42R15N95Q89J41k28j70M1j004j34n63l
7685i84K51M84J48K76M83K72K83o12m13k97n55n2r5m5L83J161J6l13K05j82k71
$$ plain form
7706 143 79 -855 -781 -948 -873 -645 -488 310 754 1231 490 372 60 -757 -559 -1305 -930 -347 -31 405 609
7727 609 823 1062 330 -209 -377 -844 -1003 -742 -451 -243 387 981 599 860 1004 65 -223 -222 -329 -366 -639
7748 -639 -519 531 763 852 1385 503 564 -290 -527 -946 -800 -891 -387 -759 147 315 559 1172 383 -56 -224
7769 -224 -711 -957 -720 -742 -508 558 715 365 365 96 -265 -311 -305 -1356 -849 -586 -111 343 591 546 1203 484
7791 484 604 -363 -586 -1148 -1093 -799 -39 156 881 1077 1379 796 331 375 -412 -904 -576 -939 -563 5 330
7812 330 1115 786 1164 420 -83 -54 -548 -571 -1123 -949 -147 211 1068 642 637 732 413 -139 -877 -1052 -196 -762
7834 -762 -454 509 676 635 442 922 286 -50 -626 -899 -776 -663 -329 316 285 853 1007 251 489 15 -385
7855 -385 -436 -533 -757 -437 303 376 937 768 595 557 294 -309 -897 -919 -759 -754 -190 373 283 552 870 1252 268
$$ packed form
7706A43o4r34P4j67P5K28J57P98M44M77p41j18l12q17J98p46L75N83L16M36K04
7727F09K14K39p32n39j68m67j59K61K91K08O30N94l82K61J44r39k88Jj07l7k73
7748f39J20J050K32Q9N33q82O1q54k37m19J46r1N04l72R06J68K44O13p89m39j68
7769b24m87k46K37k2K34J066J57l50%k69l61m6Oj051N07K63M75M54K48m5O57p19
7791D84J20r67k23n62N5K94P60J95P25J96L02n83m65M4p87m92L28l63L76N68L25
7812C30P85l29L78p44n03K9m94k3n52J74Q02L58Q57m26nR5l19n52p38j75Q56n66
7834g62L08R63J67m1j93M80o36l36n76k73J23J13L34O45l1N68J54p56K38m74m00
7855c85n1r7k24L20P40P3N61j69j73l8k63o03n88k2J60NN64N63r0K69L18L82r84
$$ plain form
7878 268 -530 255 -1119 -702 -449 -578 -47 601 512 771 882 478 -78 -189 -886 -798 -489 -372 -339 633 553
7899 553 1124 867 508 470 -385 -730 -901 -571 -456 -234 527 372 1001 662 547 149 -306 -483 -845 -848 -585
7920 -585 -391 203 191 709 1243 558 613 428 -418 -762 -654 -1042 -304 -319 760 575 1138 728 -397 -277
7940 -277 -594 -501 -748 -666 -271 329 131 215 911 526 207 303 -156 -521 -1301 -564 -430 112 135 701 853 334
7962 334 592 29 -65 -514 -829 -436 -799 -545 -365 62 633 699 1142 10 155 -625 -714 -1119 -774 -320 81
7983 81 350 848 584 610 483 125 -27 -701 -917 -1521 -432 -238 328 650 639 760 655 287 184 -1069
8003 -1069 -750 -873 -296 -48 76 212 913 600 470 435 -7 -363 -407 -933 -601 -293 339 373 1075 813 720
8024 720 761 588 -426 -442 -809 -491 -342 -192 262 619 446 870 407 -142 -410 -769 -1033 -878 -482 23
$$ packed form
7878B68p98P85j374M17K53j29N31O48q9K59J11m04n56j11o97Q8L09J17L3R72q0
7899E53N71k57l59l8q55l45j71L30J15K22P61j55O29l39j15l98m55j77l62lK63
7920e85J94N94j2N18N34o85N5j85q46l44J08l88P38j5J079j85N63m10j125J20
7940b77l17R3k47Q2L95O00j98Q4O96l85l19R6m59l65p80P37J34N42K3N66J52n19
7962C34K58n63r4m49l15L93l63K54J80M27N71O6M43j132J45p80q9m05L45M54M01
7983H1K69M98k64K6j27l58j52o74k16o04J089J94N66L22j1J21j05l68j03j253
8003a069L19j23N77K48J24J36P01l13j30l5m42l56m4n26L32L08O32L4P02k62r3
8024G20M1j73j014j6l67L18J49J50M54L57j73M24m63n49k68l59k64J55L96N05
$$ plain form
8044 23 235 411 844 339 577 39 -50 -289 -303 -1116 -697 130 -48 603 1105 501 614 285 318 -267 -323 -727
8066 -727 -897 -62 -529 164 874 897 919 72 126 -289 -32 -770 -921 -336 -172 119 -516 796 843 267 566
8087 566 251 -192 -467 -160 -310 -255 -42 112 413 975 921 12 88 -45 -781 -600 -617 50 242 513 809
8108 809 756 558 132 -186 -257 -738 -533 -110 -4 58 469 439 609 762 434 511 88 -595 -553 -1012 -179 -254
8130 -254 46 684 477 850 -1 200 356 -671 -429 -829 -493 -384 -170 429 1051 741 559 323 -217 -422
8150 -422 -522 -650 -576 -425 156 45 693 642 805 659 -94 110 -789 -860 -872 -250 -126 413 408 558 372 942
8172 942 -71 -237 -428 -689 -570 -482 -356 -8 79 1077 490 268 20 -129 -247 -979 -880 -1007 -623
$$ packed form
8044B3K12J76M33n05K38n38q9k39j4q13M19Q27j78O51N02o04J13l29L3n85n6m04
8066g27j70Q35m67O93P10K3K2q47N4m15K57p38j51N85J64K91o35J312M7n76K99
8087E66l15m43k75L07j50N5K13J54L01N62n4r09P6j33p36J81j7O67J92K71K96
8108H09n3j98m26l18p1m81K05M23J06O2M11l0J70J53l28P7m23o83M2m59Q33p5
8130b54L00O38k07L73q51K01J56j027K42m00L36J09K14N99O22l10j82k36n40k05
8150d22j00j28P4J51N81j11O48n1J63j46p53K04q99p1j2O22J24N39nJ50j86N70
8172I42j013j66j91k61J19Q8J26L48Q7R98n87k22k48j49j18p32R9j27L84
8191f23
$$ Imaginary data points
##PAGE= N=2
##DATA TABLE= (X++(I..I)), XYDATA
$$ plain form
0 0 0 0 0 0 0 0 0 0 0 0 0 1 -1 64 -64 64 -65 128 -128 129 -192 193 -257 321 -322 386 -450 520 -640 707
30 707 -832 911 -1035 1185 -1347 1512 -1688 1900 -2118 2369 -2631 2921 -3237 3586 -3967 4381
46 4381 -4833 5327 -5870 6470 -7123 7848 -8656 9551 -10558 11698 -12995 14483 -16222
59 -16222 18281 -20764 23820 -27697 32808 -39852 50244 -67135 99302 -182431 845703
70 845703 1624047 -247771 -279462 482541 -4729 -1358856 -867690 417467 338354 -536851
80 -536851 -72772 726710 329061 -282678 395839 937795 86047 -813947 -440496 -129953
90 -129953 -709022 -803747 292391 961350 514561 218998 519467 253049 -510447 -529776
100 -529776 -14472 -211603 -652862 -187949 461975 103771 -305116 416564 1090806 384023
$$ packed form
0@%%%%%%%%%%%JkO5j28J28j29J93k56K57l21L85m50N78o43P08q36R70j160J347
30G07j539J743j946K220k532K859l200L588m018M487n000N552o158O823p553Q348
46D381r214J0160j1197J2340j3593J4971j6504J8207k0109K2256k4693K7478l0705
59a6222L4503l9045M4584n1517O0505p2660R0096j17379J66437k81733J028134
70H45703P78344j871818l1691P62003m87270j354127M91166J285157p9113q75205
80e36851M64079P99482l97649o11739O78517N41956q51748q99994L73451L10543
90a29953n79069r4725J096138O68959m46789k95563L00469k66418p63496j9329
100e29776N15304j97131m41259M64913O49924l58204m08887P21680O74242p06783
$$ plain form
110 384023 -503566 -227531 115433 -579848 -1034476 -186961 607932 254126 -57360 489784
120 489784 673650 -84597 -413666 175721 271245 -516244 -740164 -67102 121378 -361661
130 -361661 -154842 769849 933033 198713 -130453 62949 -222818 -785591 -592698 63133
140 63133 164837 -32943 233203 514460 155094 -194368 138511 423074 -19137 -460436
150 -460436 -262726 -98003 -432881 -490638 151778 650044 481153 270808 346423 140259
160 140259 -422206 -594591 -254384 -94047 -216922 -50350 328637 297297 -9953 60626
170 60626 372713 283134 -100688 -207798 -134546 -309022 -501805 -266989 153501 296645
180 296645 290082 392645 368071 32364 -242116 -190055 -128345 -270029 -300410 -65807 85659
$$ packed form
110C84023q87589K76035L42964o95281m54628Q47515P94893l53806l11486N47144
120D89784J83866p58247l29069N89387R5524p87489k23920O73062J88480m83039
130c61661K06819R24691J63184p34320l29166J93402k85767n62773J92893O55831
140F3133J01704j97780K66146K81257l59366l49462L32879K84563m42211m41299
150d60436J97710J64723l34878n7757O42416M98266j68891k10345P5615k06164
160A40259n62465j72385L40207J60337j22875J66572L78987l1340l07250P0579
170F0626L12087q9579l83822j07110P3252j74476j92783K34816M20490J43144
180B96645o563J02563k4574l35707k74480N2061O1710j41684l0381K34603J51466
$$ plain form
191 85659 9441 48030 316903 437535 236245 13736 -76122 -229078 -443146 -422978 -137923
202 -137923 95984 169008 247460 327804 223283 5251 -64806 1193 -33513 -181417 -238827
213 -238827 -181848 -156095 -136467 36285 307736 436929 347040 167871 -25971 -250708 -423392
224 -423392 -391809 -182685 21897 138278 213944 241553 162418 43073 17021 60720 29935
235 29935 -93246 -187438 -217651 -239879 -209001 -23245 241257 381205 343497 228748 68756
246 68756 -160123 -342569 -328572 -179779 -67417 1936 108006 186939 145690 86215 128120
257 128120 166528 58083 -107395 -183742 -221773 -281726 -233385 -1900 228734 285847 252921
268 252921 223138 107649 -105692 -225231 -170864 -111811 -138460 -116066 -1661 61861 53951
$$ packed form
191H5659p6218L8589K68873J20632k01290k22509q9858j52956k14068K0168K85055
202a37923K33907P3024P8452Q0344j04521k18032p0057O5999l4706j47904n7410
213b38827N6979K5753J9628J72752K71451J29193q9889j79169j93842k24737j72684
224d23392L1583K09124K04582J16381P5666K7609p9135j19345k6052M3699l0785
235B9935j23181r4192l0213k2228L0878J85756K64502J39948l7708j14749j59992
246F8756k28879j82446J3997J48793J12362O9353J06070P8933m1249n9475M1905
257A28120L8408j08445j65478p6347l8031n9953M8341K31485K30634N7113l2926
268B52921k9783j15489k13341j19539N4367N9053k6649K2394J14405O3522p910
$$ plain form
279 53951 126399 264928 265277 97570 -60955 -159180 -281309 -356942 -225988 29835 186990
290 186990 219491 240270 214735 62176 -94931 -102870 -47517 -80040 -138110 -116215 -80409 -93824
302 -93824 -39856 145338 298504 280433 171673 55639 -115759 -313100 -361005 -210517 -27202
313 -27202 83788 175472 243102 189255 49881 -17838 1914 -14257 -84554 -115817 -114772 -150744
325 -150744 -161440 -44421 139237 242791 248322 212671 109071 -82113 -245560 -263876 -182898
336 -182898 -100325 -10543 99582 158197 126863 88685 99369 95377 27995 -54159 -112274 -173779
348 -173779 -222735 -176648 -29652 122775 211632 241386 207067 87838 -65827 -159557 -167465
359 -167465 -139798 -102285 -46785 6868 31362 50181 100074 157870 168531 114317 17825 -103697
$$ packed form
279E3951P2448J38529L49j67707j58525r8225j22129p5633J30954K55823J57155
290A86990L2501K0779k5535j52559j57107p939N5353l2523n8070K1895L5806j3415
302i3824N3968J85194J53166j8071j08760j16034j71398j97341m7905J50488J83315
313b7202J10990R1684O7630n3847j39374o7719J9752j6171p0297l1263J045l5972
325a50744j0696J17019J83658J03554N531l5651j03600j91184j63447j8316Q0978
336a82898Q2573Q9782J10125N8615l1334l8178J0684l992o7382q2154n8115o1505
348a73779m8956M6087J46996J52427Q8857K9754l4319j19229j53665r3730p908
359a67465K7667L7513N5500N3653K4494J8819M9893N7796J0661n4214r6492j21522
$$ plain form
371 -103697 -218438 -264571 -201464 -59771 91311 200610 236874 187865 79004 -30950 -96522
382 -96522 -112193 -100587 -81403 -67972 -62054 -45864 1291 79027 159793 202155 172676 68747
394 68747 -72061 -194828 -250583 -215754 -101131 41863 150334 187600 163772 101883 27434
405 27434 -31355 -55802 -62434 -83016 -112797 -117832 -85771 -25429 62213 161839 219231 184094
417 184094 75103 -46108 -146645 -208309 -195939 -101918 9260 72537 98808 116177 110396
428 110396 72568 41958 32355 -4123 -89015 -160298 -165293 -126951 -63317 49710 181363 231834
440 231834 170415 71167 -16736 -109902 -178127 -155957 -68773 -14961 -6217 25283 74830 83549
452 83549 75183 106426 124107 42397 -86405 -157449 -174423 -179431 -119592 41021 185428 201478
$$ packed form
371a03697j14741m6133O3107J41693J51082J09299L6264m9009j08861j09954o5572
382i6522j5671J1606J9184J3431N918J6190M7155P7736Q0766M2362k9479j03929
394F8747j40808j22767n5755L4829J14623J42994J08471L7266k3828o1889p4449
405B7434n8789k4447o632k0582k9781n035L2061O0342Q7642R9626N7392l5137
417A84094j08991j21211j00537o1664J2370R4021J11178O3277K6271J7369n781
428A10396l7828l0610r603l6478q4892p1283m995L8342O3634J13027J31653N0471
440B31834o1419r9248q7903r3166o8225K2170Q7184N3812Q744L1500M9547Q719
452H3549q366L1243J7681q1710j28802p1044j6974n008N9839J60613J44407J6050
$$ plain form
464 201478 147394 104063 28865 -94269 -151965 -93946 -42224 -66760 -66985 1938 40923 28022
476 28022 75342 175378 171098 41055 -62632 -102698 -172249 -227858 -132690 51213 133836
487 133836 118249 135698 147566 43786 -76184 -67031 -14507 -65125 -133630 -85876 -17310 -31422
499 -31422 -10593 128737 221511 144267 35659 1303 -69298 -202709 -218471 -72516 33745
510 33745 29695 64363 150016 123367 7896 -3963 62069 14444 -109172 -122769 -68497 -102464
522 -102464 -127102 15207 187553 183895 103373 101524 65139 -107053 -221524 -129655 -22533
533 -22533 -47901 -42942 83141 130625 26612 -943 113405 129777 -15721 -91614 -48127
544 -48127 -93715 -208764 -144887 66938 151954 101970 127606 176722 49236 -136262 -134766
$$ packed form
464B01478n4084m3331p5198j23134n7696N8019N1722k4536k25O8923L8985j2901
476B8022M7320J00036m280j30043j03687m0066o9551n5609R5168J83903Q2623
487A33836j5587J7449J1868j03780j19970R153N2524n0618o8505M7754O8566j4112
499c1422K0829J39330R2774p7244j08608l4356p0601j33411j5762J45955J06261
510C3745m050L4668Q5653k6649j15471j1859O6032m7625j23616j3597N4272l3967
522a02464k4638J42309J72346l658q0522j849l6385j72192j14471R1869J07122
533b2533k5368M959J26083M7484j04013k7555J14348J6372j45498p5893M3487
544d8127m5588j15049O3877K11825Q5016m9984K5636M9116j27486j85498J496
$$ plain form
555 -134766 -38661 -65824 -120854 -24863 76936 20770 -28443 85917 175524 86961 -6477
566 -6477 13276 -29776 -187422 -221037 -63510 44110 30150 84814 199185 147987 -27009
577 -27009 -64368 10979 -33168 -139231 -91555 18658 -26080 -102974 9981 167258 136959
588 136959 48284 85509 89741 -90259 -233092 -143632 -22390 -43074 -28649 123411 186566
599 186566 55331 -27352 48237 62128 -60356 -105919 -26100 -34427 -138221 -108264 54783
610 54783 121827 84833 115340 158613 44864 -123263 -141813 -79257 -94771 -96904 23213 115220
622 115220 57403 8358 77392 105684 10888 -36403 15350 -18624 -154921 -171441 -36447
633 -36447 35431 16733 87747 204525 148994 -27430 -81059 -31991 -73606 -149955 -76247 53061
$$ packed form
555a34766R6105k7163n5030R5991J01799n6166m9213J14360Q9607q8563r3438
566f477J9753m3052j57646l3615J57527J07620j3960N4664J14371n1198j74996
577b7009l7359P5347m4147j06063M7676J10213m4738p6894J12955J57277l0299
588A36959q8675L7225M232j80000j42833Q9460J21242k0684J4425J52060O3155
599A86566j31235q2683P5589J3891j22484m5563P9819q327j03794K9957J63047
610E4783O7044l6994L0507M3273j13749j68127j8550O2556j5514k133J20117R2007
622A15220n7817m9045O9034K8292r4796m7291N1753l3974j36297j6520J34994
633c6447P1878j8698P1014J16778n5531j76424n3629M9068m1615p6349P3708J29308
$$ plain form
645 53061 36088 -38486 20435 123433 94322 20607 44499 59795 -60124 -176853 -140737
656 -140737 -54339 -31523 12194 124892 173167 90824 9050 -2372 -29673 -92199 -89418 -26690
668 -26690 -19633 -58052 -30691 45529 69713 65113 102063 116122 25256 -87615 -116733 -106539
680 -106539 -115508 -76552 41190 122509 97122 57633 64744 44074 -31156 -63827 -29800 -27315
692 -27315 -79802 -91184 -33178 16327 39356 87491 137697 110987 21640 -48800 -86314 -119223
704 -119223 -118906 -53491 24208 53793 56335 68032 67304 37206 13859 12271 -7427 -57614 -94267
717 -94267 -93746 -70527 -29890 40594 112638 134811 98566 39755 -21036 -76375 -106082 -92559
729 -92559 -48720 -6083 18809 27653 35242 51023 65848 59077 36282 9849 -30150 -91105 -131203
$$ packed form
645E3061j6973p4574N8921J02998k9111p3715K3892J5296j19919j16729L6116
656a40737Q6398K2816M3717J12698M8275q2343q1774j1422k7301o2526K781O2728
668b6690P057l8419K7361P6220K4184m600L6950J4059r0866j12871k9118J0194
680a06539q969L8956J17742Q1319k5387l9489P111k0670p5230l2671L4027K485
692b7315n2487j1382N8006M9505K3029M8135N0206k6710q9347p0440l7514l2909
704a19223L17O5415P7699K9585K542J1697p28l0098k3347j588j9698n0187l6653
717i4267N21K3219M0637P0484P2044K2173l6245n8811o0791n5339k9707J3523
729i2559M3839M2637K4892Q844P589J5781J4825o771k2795k6433l9999o0955m0098
$$ plain form
742 -131203 -101788 -27535 33679 78152 120367 122406 56032 -23759 -54088 -56308 -70583 -69874 -28852
755 -28852 3625 -5353 -3556 46381 88452 78460 54180 36996 -14188 -95506 -131302 -96756 -44886
768 -44886 1060 62751 112627 97030 42719 15227 1113 -38863 -67492 -47309 -29817 -55881
780 -55881 -60490 2467 63016 68781 75662 101907 67772 -36756 -104603 -89419 -74047 -76860 -26220
793 -26220 66364 89681 42202 30627 60574 38482 -24602 -34020 -11959 -50705 -109017 -82719
805 -82719 -813 36597 52201 105386 131786 57600 -40294 -66340 -65914 -92485 -84186 -5137 49108
818 49108 26108 13226 54604 68909 25653 11125 34824 -421 -89285 -116143 -65809 -33610
830 -33610 -18869 53046 136161 119047 35366 -4148 -12883 -63440 -105883 -60867 3463 -3711
$$ packed form
742a31203K9415P4253O1214M4473M2215K039o6374p9791l0329k220j4275P09M1022
755b8852L2477q978J797M9937M2071r992k4280j7184n1184q1318l5796L4546N1870
768d4886M5946O1691M9876j5597n4311k7492j4114l9976k8629K0183J7492k6064
780e5881m609O2957O0549N765O881K6245l4135j04528o7847J5184J5372k813N0640
793b6220R2584K3317m7479j1575K9947k2092o3084r418K2061l8746n8312K6298
805h2719Q1906L7410J5604N3185K6400p4186r7894k6046M26k6571Q299P9049N4245
818D9108k3000j2882M1378J4305m3256j4528K3699l5245q8864k6858N0334L2199
830c3610J4741P1915Q3115j7114q3681l9514q735n0557m2443M5016O4330p174
$$ plain form
842 -3711 -25272 18827 66516 48357 30149 63232 62947 -20213 -92143 -85417 -66805 -73127 -32751
855 -32751 64798 110599 72590 40417 42988 7494 -58404 -66369 -25884 -28009 -62230 -42179 19003
868 19003 38371 34113 71331 104556 54985 -31448 -65375 -67172 -90167 -86715 -12120 60421 60764
881 60764 42065 56158 53499 3311 -27090 -6610 -6838 -57295 -82200 -47316 -14916 -4788 38009
894 38009 105584 111840 48593 -6992 -33099 -72622 -105895 -73930 -3613 27251 23311 39536
906 39536 60817 39766 8594 16056 27687 -10732 -61041 -69585 -56073 -53139 -26302 44199 99250
919 99250 91424 55784 28981 -10668 -67550 -87671 -55177 -22100 -15327 -20 33874 46234
931 46234 34045 36427 52703 35967 -14779 -52149 -62777 -72347 -68751 -22787 42708 73228 69463
$$ packed form
842c711k1561M4099M7689j8159j8208L3083k85q3160p1930O726J8612o322M0376
855c2751R7549M5801l8009l2173K571l5494o5898p965M0485k125l4221K0051O1182
868A9003J9368m258L7218L3225m9571q6433l3927j797k2995L452P4595P2541L43
881F0764j8699J4093k659n0188l0401K0480k28n0457k4905L4884L2400J0128M2797
894C8009O7575O256o3247n5585k6107l9523l3273L1965P0317L0864l940J6225
906C9536K1281k1051l1172P462J1631l8419n0309q544J3512K934K6837P0501N5051
919I9250p826l5640k6803l9649n6882k0121L2494L3077O773J5307L3894J2360
931D6234j2189K382J6276j6736n0746l7370j0628r570L596M5964O5495L0520l765
$$ plain form
944 69463 59524 41898 -2395 -42763 -47025 -35054 -38517 -42147 -22265 4351 18522 35832 66441
957 66441 75949 45125 -2404 -39763 -69254 -87733 -69957 -18349 30431 51797 58775 56469 35517
970 35517 3916 -12917 -14300 -22335 -39233 -47792 -41418 -29269 -6252 33884 72340 82582 60346
983 60346 21265 -25029 -66974 -85410 -68157 -29579 7401 35323 49482 47547 34079 20785
995 20785 11964 2486 -13357 -32680 -49924 -57635 -47540 -15273 25918 61327 78979 68549 32909
1008 32909 -12717 -47366 -63227 -60586 -41372 -12270 11573 22391 30799 40420 42413 34044 21052
1021 21052 2220 -30932 -62259 -69992 -51161 -20744 16057 55019 76036 62072 27828 -86
1033 -86 -20689 -41559 -48556 -34174 -19645 -18920 -12572 14112 39397 47553 51655 50898 22797 -29606
$$ packed form
944F9463r939j7626m4293m0368m262J1971l463l630J9882K6616J4171J7310L0609
957F6441R508l0824m7529l7359k9491j8479J7776N1608M8780K1366O978k306k0952
970C5517l1601j6833j383q035j6898q559O374J2149K3017M0136L8456J0242k2236
983F0346l9081m6294m1945j8436J7253L8578L6980K7922J4159j935j3468j3294
995B0785q821r478j5843j9323j7244p711J0095L2267M1191L5409J7652j0430l5640
1008C2909m5626l4649j5861K641J9214K9102K3843J0818Q408R621J993q369j2992
1021B1052j8832l3152l1327p733J8831L0417L6801L8962K1017j3964l4244k7914
1033h6k0603k0870o997J4382J4529P25O348K6684K5285Q156M102p57k8101n2403
$$ plain form
1047 -29606 -67716 -72401 -59311 -37267 6295 54944 69133 49026 28973 14842 -8714 -31044
$$ packed form
1047b9606l8110m685J3090K2044M3562M8649J4189k0107k0053j4131k3556k2330
$$ [...]
8191E60
##END NTUPLES=NMR FID
##END=
