##TITLE=1H ikalashn
LR-789-O-C1
24.10.2024
##JCAMPDX= 6.0         $$ Bruker NMR JCAMP-DX V2.0
##DATA TYPE= NMR FID
##DATA CLASS= NTUPLES
##ORIGIN= UXNMR, Bruker Analytische Messtechnik GmbH
##OWNER= root
$$ TOPSPIN		Version 1.3
$$ 2024-10-24 14:20:29.265 +0400  Irina@DPX200
$$ Compression mode = diff/dup
##.OBSERVE FREQUENCY= 200.131300845
##.OBSERVE NUCLEUS= ^1H
##.DELAY= (6, 6)
##.ACQUISITION MODE= SIMULTANEOUS
##.ACQUISITION SCHEME= undefined
##.AVERAGES= 32
##.DIGITISER RES= 18
##SPECTROMETER/DATA SYSTEM= spect
##.PULSE SEQUENCE= zg
##.SOLVENT NAME= CDCl3
##.SHIFT REFERENCE= INTERNAL, CDCl3, 1, 17.49637
##AUDIT TRAIL= $$ (NUMBER, WHEN, WHO, WHERE, WHAT)
$$ ##TITLE= Audit trail, TOPSPIN		Version 1.3
$$ ##JCAMPDX= 5.01
$$ ##ORIGIN= Bruker BioSpin GmbH
$$ ##OWNER= Irina
$$ $$ F:/spectra/data/iren/nmr/1H/4/audita.txt
$$ ##AUDIT TRAIL=  $$ (NUMBER, WHEN, WHO, WHERE, VERSION, WHAT)
(   1,<2024-10-24 14:19:30.937 +0400>,<Irina>,<DPX200>,<TOPSPIN 1.3>,
      <created by zg
	started at 2024-10-24 14:17:22.859 +0400,
	POWCHK disabled, PULCHK disabled
       configuration hash MD5:
       BE 6D 3F 07 2A EA 11 49 91 17 2B D3 AF B3 58 0D
       data hash MD5: 16K
       C6 CB DF 75 1A E8 E4 D8 52 FC 48 4D 28 73 3F E9>)
$$ ##END=
$$ 
$$ $$ hash MD5
$$ $$ 8B 74 1D 96 65 DE 6B 32 03 2A EC 64 44 EC 03 8F
##$RELAX= 
##$RELAX= 
##$RELAX= 
##$RELAX= 
##$RELAX= 
##$RELAX= 
##$RELAX= 
##$RELAX= 
##$RELAX= 
$$ Bruker specific parameters
$$ --------------------------
##$DU= <F:/spectra>
##$EXPNO= 4
##$NAME= <1H>
##$PROCNO= 1
##$TYPE= <nmr>
##$USER= <iren>
##$AMP= (0..31)
100 100 100 100 100 100 100 100 100 100 100 100 100 100 100 100 100 100 
100 100 100 100 100 100 100 100 100 100 100 100 100 100 
##$ANAVPT= -1
##$AQSEQ= 0
##$AQ_mod= 1
##$AUNM= <au_zg>
##$AUTOPOS= <>
##$BF1= 200.13
##$BF2= 200.13
##$BF3= 200.13
##$BF4= 200.13
##$BF5= 200.13
##$BF6= 200.13
##$BF7= 200.13
##$BF8= 200.13
##$BYTORDA= 1
##$CFDGTYP= 0
##$CFRGTYP= 5
##$CHEMSTR= <none>
##$CNST= (0..63)
1 1 145 1 1 1 1 1 1 1 1 1 1 1 1 1 1 1 1 1 1 1 1 1 1 1 1 1 1 1 1 1 1 1 
1 1 1 1 1 1 1 1 1 1 1 1 1 1 1 1 1 1 1 1 1 1 1 1 1 1 1 1 1 1 
##$CPDPRG= <>
##$CPDPRG1= <>
##$CPDPRG2= <>
##$CPDPRG3= <>
##$CPDPRG4= <mlev>
##$CPDPRG5= <mlev>
##$CPDPRG6= <mlev>
##$CPDPRG7= <mlev>
##$CPDPRG8= <mlev>
##$CPDPRGB= <>
##$CPDPRGT= <>
##$D= (0..63)
0 2 0 0 0 0 0 0 0 0.06 0 0.03 0 0 0 0 0.0002 0 0 0 0 0 0 0 0 0 0 0 0 0 
0 0 0 0 0 0 0 0 0 0 0 0 0 0 0 0 0 0 0 0 0 0 0 0 0 0 0 0 0 0 0 0 0 0 
##$DATE= 1729765170
##$DBL= (0..7)
120 120 120 120 120 120 120 120 
##$DBP= (0..7)
150 150 150 150 150 150 150 150 
##$DBP07= 0
##$DBPNAM0= <>
##$DBPNAM1= <>
##$DBPNAM2= <>
##$DBPNAM3= <>
##$DBPNAM4= <>
##$DBPNAM5= <>
##$DBPNAM6= <>
##$DBPNAM7= <>
##$DBPOAL= (0..7)
0.5 0.5 0.5 0.5 0.5 0.5 0.5 0.5 
##$DBPOFFS= (0..7)
0 0 0 0 0 0 0 0 
##$DE= 6
##$DECBNUC= <off>
##$DECIM= 32
##$DECNUC= <off>
##$DECSTAT= 4
##$DIGMOD= 1
##$DIGTYP= 9
##$DL= (0..7)
0 120 120 120 120 120 120 120 
##$DP= (0..7)
150 150 150 150 150 150 150 150 
##$DP07= 0
##$DPNAME0= <>
$$ [...]
##$SW= 21.9926040160658
##$SWIBOX= (0..15)
0 0 2 0 0 0 0 0 0 0 0 0 0 0 0 0 
##$SW_h= 4401.40845070422
##$TD= 16384
##$TD0= 1
##$TE= 300
##$TE2= 300
##$TE3= 300
##$TEG= 300
##$TL= (0..7)
0 120 120 120 120 120 120 120 
##$TP= (0..7)
150 150 150 150 150 150 150 150 
##$TP07= 0
##$TPNAME0= <>
##$TPNAME1= <>
##$TPNAME2= <>
##$TPNAME3= <>
##$TPNAME4= <>
##$TPNAME5= <>
##$TPNAME6= <>
##$TPNAME7= <>
##$TPOAL= (0..7)
0.5 0.5 0.5 0.5 0.5 0.5 0.5 0.5 
##$TPOFFS= (0..7)
0 0 0 0 0 0 0 0 
##$TUNHIN= 0
##$TUNHOUT= 0
##$TUNXOUT= 0
##$USERA1= <user>
##$USERA2= <user>
##$USERA3= <user>
##$USERA4= <user>
##$USERA5= <user>
##$V9= 5
##$VALIST= <valist>
##$VCLIST= <CCCCCCCCCCCCCCC>
##$VD= 0
##$VDLIST= <DDDDDDDDDDDDDDD>
##$VPLIST= <PPPPPPPPPPPPPPP>
##$VTLIST= <TTTTTTTTTTTTTTT>
##$WBST= 1024
##$WBSW= 25
##$XGAIN= (0..3)
0 0 0 0 
##$XL= 0
##$YL= 0
##$YMAX_a= 609738
##$YMIN_a= -1139942
##$ZGOPTNS= <>
##$ZL1= 120
##$ZL2= 120
##$ZL3= 120
##$ZL4= 120
##$ABSF1= 10
##$ABSF2= 0
##$ABSG= 5
##$ABSL= 3
##$ALPHA= 0
##$AQORDER= 0
##$ASSFAC= 0
##$ASSFACI= 0
##$ASSFACX= 0
##$ASSWID= 0
##$AUNMP= <proc_1d>
##$AXLEFT= 0
##$AXRIGHT= 0
##$AXTYPE= 0
##$AXUNIT= <>
##$AZFE= 0.1
##$AZFW= 0.1
##$BCFW= 1
##$BC_mod= 2
##$BYTORDP= 1
##$COROFFS= 0
##$CY= 7568.61572265625
##$DATMOD= 1
##$DC= 2
##$DFILT= <>
##$DTYPP= 0
##$F1P= 17.9538593292236
##$F2P= -4.03888763876832
##$FCOR= 0.5
##$FTSIZE= 32768
##$FT_mod= 4
##$GAMMA= 1
##$GB= 1
##$INTBC= 1
##$INTSCL= 1
##$ISEN= 128
##$LB= 0.02
##$LEV0= 0
##$LPBIN= 0
##$MAXI= 945.577
##$MC2= 0
##$MEAN= 0
##$ME_mod= 0
##$MI= -402.1523
##$NCOEF= 0
##$NC_proc= 0
##$NLEV= 6
##$NOISF1= 8.587773
##$NOISF2= 6.764455
##$NSP= 1
##$NTH_PI= 0
##$NZP= 0
##$OFFSET= 17.49637
##$PC= 1
##$PHC0= -45.48676
##$PHC1= 11.6701
##$PH_mod= 0
##$PKNL= yes
##$PPARMOD= 0
##$PPDIAG= 0
##$PPIPTYP= 0
##$PPMPNUM= 100
##$PPRESOL= 1
##$PSCAL= 0
##$PSIGN= 0
##$REVERSE= no
##$SF= 200.13
##$SI= 32768
##$SIGF1= 18.5376
##$SIGF2= -6.396296
##$SINO= 400
##$SIOLD= 32768
##$SREGLST= <1H.CDCl3>
##$SSB= 3
##$STSI= 0
##$STSR= 0
##$SW_p= 4401.40845070422
##$SYMM= 0
##$S_DEV= 0
##$TDeff= 0
##$TDoff= 0
##$TI= <>
##$TILT= no
##$TM1= 0
##$TM2= 0
##$TOPLEV= 0
##$USERP1= <user>
##$USERP2= <user>
##$USERP3= <user>
##$USERP4= <user>
##$USERP5= <user>
##$WDW= 1
##$XDIM= 8192
##$YMAX_p= 0
##$YMIN_p= 0
$$ End of Bruker specific parameters
$$ ---------------------------------
##NTUPLES= NMR FID
##VAR_NAME=  TIME,          FID/REAL,        FID/IMAG
##SYMBOL=    X,             R,               I
##VAR_TYPE=  INDEPENDENT,   DEPENDENT,       DEPENDENT
##VAR_FORM=  AFFN,          ASDF,            ASDF
##VAR_DIM=   8192,          8192,            8192
##UNITS=     SECONDS,       ARBITRARY UNITS, ARBITRARY UNITS
##FACTOR=    0.0002272,     1,               1
##FIRST=     0,             0,               0
##LAST=      1.8609952,     -7,              116
##MIN=       0,             -1139942,        -1139942
##MAX=       1.8609952,     609738,          609738
$$ Real data points
##PAGE= N=1
##DATA TABLE= (X++(R..R)), XYDATA
0@%%%%%%%%%%%%l2O4o4O4p7J09j28J60j92K24k88L48l86M46n36O08p04Q08r15
$$ 0 0 0 0 0 0 0 0 0 0 0 0 0 -32 32 -32 32 -45 64 -64 96 -96 128 -160 188 -198 248 -288 320 -384 424 -491
31d91J059j209J369j551J745j958K194k459K748l062L407l777M191m641N126n660
$$ -491 568 -641 728 -823 922 -1036 1158 -1301 1447 -1615 1792 -1985 2206 -2435 2691 -2969
47b969O243o884P588q361R208j0148J1193j2359J3670j5148J6836j8790K1078
$$ -2969 3274 -3610 3978 -4383 4825 -5323 5870 -6489 7181 -7967 8869 -9921 11157
60A1157k3794K7084l1168L6405m3389N3229o8238R4259j52013N06656k04380p21903
$$ 11157 -12637 14447 -16721 19684 -23705 29524 -38714 55545 -96468 410188 205808 -516095
72e16095O92527M33306k97569m98475J47302J78285q5788j69055J5526j68684
$$ -516095 176432 609738 312169 -186306 -39004 139281 53493 -115562 -100036 -268720
82b68720k03656J54763M42920k2468m50748j39521M03381J72682k71455n9182
$$ -268720 -472376 -317613 125307 102839 -347909 -487430 -84049 88633 -182822 -242004
92b42004M43738K42023k62774k14673J97751J90900o9278j05119m298m9252m0901
$$ -242004 201734 443757 180983 -33690 164061 354961 285683 180564 176266 127014 86113
103H6113N3070o1707l29449k24351K22293L24777j35960m31250p2455L90451K92947
$$ 86113 139183 77476 -251973 -476324 -254031 70746 -65214 -496464 -568919 -178468 114479
114A14479o9052r3011J10189J25969L7790L5875m8968k05616o3776K71719K03404
$$ 114479 45427 -47584 62605 188574 226364 262239 213271 7655 -56121 215598 419002
125D19002k43126l52195K3282K31479o516k00791l2867J55521L6444j65258j25534
$$ 419002 175876 -176319 -153037 78442 71926 -128865 -161732 -6211 30233 -135025 -260559
136b60559M4199P0837J1488N5464J05201K1954l7663M2608O0370n6242l7186J57227
$$ -260559 -216360 -145523 -134035 -78571 26630 48584 10921 53529 113899 57657 20471 177698
148A77698J73002p4542k16348p8140P4860K8077r8311j16306k0351N1270Q147
$$ 177698 350700 276158 59810 -18330 56530 84607 -13704 -130010 -150361 -99091 -90944
159i0944p7696p9094J0810J07242J47518R2911l5219q9871J0651J04285M0314
$$ -90944 -168640 -247734 -236924 -129682 17836 110747 75528 -14343 -3692 100593 140907
170A40907o3284l9135N0504O3015k0446j08155r9006J9634J06937M1402p1448
$$ 140907 77623 38488 88992 152007 131561 23406 -75600 -55966 50971 92373 20925
181B0925p5139j6337q890k9824k3805O66L9845P7347M3250m7655o7838K0121R0986
$$ 20925 -54214 -70551 -79441 -109265 -133070 -132404 -92559 -15212 28038 -19617 -87455 -67334 23652
194B3652O8299J1829n63L0723L1446m3323j02775m2275N6212M2113m6814p6756
$$ 23652 91951 103780 103217 133940 165386 122063 19288 -22987 33225 75338 28524 -48232
206d8232n2063l1510O33K8596M602o677O2167J03406R200r4567n3737O8108J03943
$$ -48232 -100295 -131805 -131172 -102576 -97974 -104651 -42484 60922 70122 -24445 -78182 -10074 93869
219I3869K7615n1672m2084J6206K1551k7982m0081n09K7923L3314J8021n0388
$$ 93869 121484 69812 27728 43934 65485 37503 -2578 -3087 24836 58150 76171 25783
231B5783j13089m9637P1816O3298m0866m8339L4908M4392k7723m7481J3864P3208
$$ 25783 -87306 -136943 -65127 -1829 -42695 -91034 -56126 -11734 -39457 -86938 -73074 134
243A34P3986L0720j0830k3020j5803k407J1409K387k7503j8065K1404j4054j05830
$$ 134 74120 104840 94010 70990 55187 52780 64189 66576 39073 21008 42412 28358 -77472
256g7472q7462M4795R5104J2435m1094o58L3576J3042j0781r062J1961M5861N5256
$$ -77472 -164934 -120139 -25035 -12600 -53694 -54352 -20776 -7734 -18515 -27577 -15616 30245 85501
269H5501J2331m9683o4071j2567N5327N4806j7576n0131Q203L8047l3382q6466
$$ 85501 97832 48149 -15922 -28489 26838 81644 64068 13937 22140 60187 26805 -59661
281e9661k9311M3970M1205J397k9547m6211k3803K6386L8745J0107R235M4990
$$ -59661 -88972 -45002 -3797 -2400 -31947 -78158 -101961 -75575 -36830 -26723 -17488 27502
293B7502N2420P844m1185l9437J8531O1812K4854m3746m9171j1606j2841l8057
$$ 27502 79922 87766 46581 7144 25675 87487 112341 68595 19424 7818 -5023 -43080
305d3080l1768k822K5374M2926J6835m4920n3940J4524O1760L1676q060j762K0770
$$ -43080 -74848 -77670 -52296 -9370 7465 -37455 -91395 -76871 -15111 16565 8505 6743 27513
318B7513K0430j2331m3664k0519M5005O6701J3767l9506m0586j6144M882P054
$$ 27513 47943 35612 -8052 -28571 16434 83135 96902 57396 16810 666 5548 12602
330A2602j6578k7675O518K8751j7410o8783m1393K7220N8685L9586L212j2559
$$ 12602 -3976 -31651 -25133 3618 -13792 -82575 -123968 -96748 -38063 1523 4735 -7824
342g824J0333L3406J0360k0855J302M1827L4354j2272n0244n4725j9509K2544
$$ -7824 2509 35915 46275 25420 26722 68549 102903 90631 40387 -14338 -33847 -11303
354a1303J7399k1569k2918J1718J3689j8992l3423j0007L0387N5440K8214l1231
$$ -11303 6096 -15473 -38391 -26673 -12984 -31976 -65399 -75406 -45019 10421 38635 7404
366G404m3807N068L4643J1625o487R455L0090K7343n066m4475m0880J4129M5365
$$ 7404 -36403 -31335 3308 14933 8446 17901 47991 75334 70268 25793 -15087 -958 44407
379D4407J1223l2137l6182k0055r015r890k0599j2979L0231N5713J4901l6362
$$ 44407 55630 23493 -12689 -32744 -41759 -51649 -72248 -85227 -54996 717 15618 -20744
391b0744k5370K0700M2403K9734N253o423O917J4626j9035n1163k4880K5674L4369
$$ -20744 -46114 -25414 16989 46723 51976 45553 52470 67096 48061 -3102 -27982 -2308 32061
404C2061K282k8953l7052j4115J6992J2964j5876r513K7350K8834j0520l8062
$$ 32061 34343 5390 -31662 -45777 -28785 -15821 -31697 -41210 -13860 14974 4454 -33608
416c3608k4785J5296M8897L7287j0305k4810P204K3380j978j8938k781J9574K2391
$$ -33608 -58393 -43097 5800 43087 32782 7972 15176 38556 36578 17640 14859 34433 56824
429E6824l510m5040n2905j0365K4759J1919j0956o905N634Q021J01j3477p626
$$ 56824 53314 8274 -44631 -54996 -30237 -18318 -29274 -36179 -30545 -22524 -22423 -35900 -43526
442d3526L1663N7207K1139k9346k9302J780J2398J040j0601n951J4471J9951j5311
$$ -43526 -11863 45344 66483 37137 7835 9615 22013 23053 12452 6501 20972 40923 25612
455B5612m9605k9336J8992L5392J5480j2011k5074j0646J4168N900k3776j1647
$$ 25612 -23993 -53329 -34337 1055 16535 4524 -20550 -31196 -17028 -11128 -34904 -46551
467d6551L5295M4847M492k9958k4777M745L0506K6852k527j6343m71N709j4957
$$ -46551 -11256 33591 38083 8125 -16652 -11907 18599 45451 42924 26581 26110 31819 16862
480A6862l2025k0941O967K7957J6005k5614l8651j368K6672Q289n164J4854K8679
$$ 16862 -15163 -36104 -29137 -1180 14825 -10789 -49440 -50808 -24136 -15847 -21011 -6157 22522
493B2522J2181r900k1019j7749Q049L3687K0631j5885k7035p763P742l817k2541
$$ 22522 34703 24803 3784 -13965 -5916 27771 48402 32517 5482 -2281 5461 1644 -20897
506b0897j3022K7685M0871p225n0864k8488J6953K1682O707L853J570j110R207
$$ -20897 -33919 -6234 34637 27412 -23452 -51940 -34987 -13305 -6598 -2745 -1175 -2285 6922
519F922P748j8502k2363J9856N0985K2343k8299l9904q356J8176K776k1982q348
$$ 6922 14670 -3832 -26195 -6339 44646 66989 38690 -1214 -9570 8606 11382 -10600 -18948
532a8948J9814R498k1217k4153p870K251J9700L3202J0517k2703j0116K0180P463
$$ -18948 866 10364 -10853 -35006 -42876 -40625 -20925 12277 22794 91 -10025 10155 17618
545A7618k0215n100L1161K8466j2400l7915k0902R160J4702j849n722L593J733
$$ 17618 -2597 -7697 23464 51930 39530 1615 -19287 -10127 4575 2726 -2996 597 2330
558B330n561n436j5514k2415J0318N0386K3686l9139l7910J7347L2741q89j3778
$$ 2330 -3231 -8667 -24181 -46596 -36278 14108 37794 -1345 -39255 -21908 10833 9944 -3834
571c834R208K5798J3348r027k3815k1588l901J7641K2882j627l3924k5851J2130
$$ -3834 5374 31172 44520 35493 11678 -9910 -13811 3830 26712 25085 -8839 -34690 -22560
584b2560J4604k1235j9209L0412L9905p064l0447l782J4556P261O024J2242P305
$$ -22560 -7956 -29191 -48400 -17988 21917 14853 -15594 -19376 -4820 2441 8465 20707 28012
597B8012j680l408q326j7193j2516J0828K7798R711k7991l3313M688K2711o136
$$ 28012 26332 22924 14598 -2595 -15111 -4283 23515 33226 5235 -28078 -23390 -679 -6815
610f815k4117L963K7454J1456j3480k1190j5362Q712L8023K9552j0755k3359L919
$$ -6815 -30932 -26969 485 11941 -1539 -22729 -38091 -29379 8644 38196 27441 4082 8001
623H001J8430m75j8695r354J2982J8927k485k7843k6581n821R144J2205P655n371
$$ 8001 26431 25956 7261 -2093 10889 29816 27331 -512 -27093 -32914 -23770 -11565 -3910 -9281
637i281r277N248Q657j1711j2543K0145L4390O815j7067r461J369K031M28j651
$$ -9281 -18558 -13310 -4653 -16364 -28907 -8762 25628 32443 15376 5915 7284 9315 9743 8092
651H092m1J0286J0184j2072l0207j6314J2156K1924P537j4712j7734l25R067m034
$$ 8092 8051 18337 28521 16449 -13758 -30072 -17916 4008 11545 -3167 -20901 -21226 -12159 -16193
665a6193j2543K380K0100K3742J3496j0923k9712q445L3096K8619j4336k4498
$$ -16193 -28736 -26356 -6256 17486 30982 20059 -9653 -18098 14998 43617 29281 4783
677D783N230J3254j2126k4708j0317P552J4531R285n851j9578j6335L946J9826
$$ 4783 10013 23267 11141 -13567 -23884 -16332 -1801 7484 1633 -17945 -34280 -30334 -10508
690a0508J2215o820j465K1372J1676k5541k3895J9186L1315j856j5013J332K331
$$ -10508 1707 -5113 -6578 14794 26470 929 -22966 -3780 27535 25679 10666 11998 14329
703A4329j1770p428L424j875j378J5985J1493k3389m0462n802L5421K4347j8454
$$ 14329 2559 -4869 -1445 -3320 -4698 11287 22780 -609 -41071 -46873 -11452 12895 -5559
716e559k1805J9015L0096r572k8947P32K5054J6404P054L51k2432k7808O701K8195
$$ -5559 -27364 -8349 21747 12175 -16772 -16040 9014 25418 32472 32823 10391 -17417 -10716 17479
730A7479j042k7001m038K3211N652k8745k5925R380K8765J2435p500n027J936
$$ 17479 16437 -10564 -14602 8609 14261 -14484 -40409 -31029 -2264 10171 2671 -2356 -420
743d20l353j870O431K130j862J3969J7500j7021l5154P41L2273R123k0464p909
$$ -420 -3773 -5643 788 2918 1056 15025 32525 15504 -19650 -18909 13364 22487 2023 -5886
757e886J5427N190j7432k1027m378J3116J6771R413o274j8528j3011J3721K6255
$$ -5886 9541 14731 -2701 -23728 -28106 -14990 1781 11194 4920 -13608 -26619 -12898 13357
770A3357Q23k1026M958L2259N094l5142k3532J5155K2455L352p254r485j0297
$$ 13357 14180 -6846 -1888 30371 35465 323 -23209 -8054 14401 17753 10499 1014 -9283
783i283l875K360j26l786L315J5170J2179q515k3390o342K1168J7806p392r887
$$ -9283 -13158 -10798 -10924 -14710 -11395 3775 15954 7439 -15951 -22293 -1125 16681 9289 -598
797e98Q855P714j1744j4504m52J0144J3359Q496q408k0599p472R890N484p082
$$ -598 8257 15971 4227 -10277 -10729 -585 12774 21270 12862 -7737 -15209 -5319 165 -6917
811f917n560O533J2789J280j7885j6988Q752K5860J2316o720q919j926K686M176
$$ -6917 -12477 -5944 6845 8125 -9760 -26748 -17996 7864 20180 13460 4541 2615 5301 9477
825I477l609j0086K322J7872N024k0493k1781q70J2199J0449M46n848j205O712
$$ 9477 5868 -4218 -1896 15976 21000 507 -21274 -22144 -9945 504 950 -4898 -6103 609
839F09J633j0556o405J0715J6569O750o141j4255q528P692J0388l630n787P458
$$ 609 2242 -8314 -14719 -4004 12565 19315 13174 -1081 -9609 -1917 8471 4841 -946 6512
853F512R660n313j6549j1992J615J4864J2074o639j5806k665Q291K58o737L86
$$ 6512 16172 10859 -5690 -17682 -16067 -1203 10871 4232 -11574 -14239 -5948 -5690 -12427 -12041
867a2041J1646J4570O095r791j7306k163J6112J1481l682q312k691J139j472j0616
$$ -12041 -395 14175 20270 10479 -6827 -8990 7122 18603 14921 6609 3918 5057 3585 -7031
881g031j3358L654K0431Q926j3144j4318l37O487N562K642k31K386R108K750j2824
$$ -7031 -20389 -16735 3696 12622 -522 -14840 -15177 -8690 -3128 -486 -717 1669 10777 13527 703
896G03j2588M661J6346J0356l097j1204p158M604L196r808p883R315J2282l324
$$ 703 -11885 -7224 9122 19478 16381 5177 -1981 2623 5819 -3989 -11872 -2557 9725 6401
910F401j4133j2247k076R622J3543J535p410J648R889J025r071m507P843J5135
$$ 6401 -7732 -19979 -22055 -12433 1110 2645 -4765 -3117 6772 7797 -1274 -5781 2062 17197
924A7197Q384r060j8591n790Q358L760n576l263L428L516p43r630j3020R47J7963
$$ 17197 25581 16521 -2070 -7860 498 4258 -1318 -4581 -1153 2363 1620 -8010 -21030 -20083 -2120
939b120J2812o460r533p40M203J784j524j212O070J3703M359j3068j4597N14R867
$$ -2120 10692 4232 -5301 -6041 -1838 -54 -1578 -2790 3280 16983 21342 8274 -6323 -5809 4058
954D058P280j170p287n897K391k65j2351r841Q861J7009N141q242j0346k734P460
$$ 4058 11338 10168 2881 -3016 -625 -890 -13241 -23082 -14221 2788 7929 -313 -10659 -13393 -5933
969e933J0714J389l423N382R269k351j3086j0139J787J1182J0558l532j4092o235
$$ -5933 4781 6170 2747 8129 17398 15047 1961 -8178 -6391 4791 15349 11817 -2275 -8510
983h510N027R47p544j873Q178R290K085q425j4295k579J2998J1043j483l371L161
$$ -8510 -3483 -2536 -10080 -11953 -3775 5515 7600 -825 -15120 -17699 -4701 6342 4859 1488 4649
998D649L748j534o009n704L961J4326P720j1301j5279l643M247K275j989k753
$$ 4649 8397 6863 854 -4850 -889 13437 21157 9856 -5423 -9066 -4819 -2544 -4533 -7286
1012g286J355P458K777j1460j2148O060J6935Q294k765o396l533K800M022m128
$$ -7286 -5931 1527 4304 -7156 -19304 -13244 3691 11985 9220 2824 -709 2091 6113 1985
1026A985o532N704J1723Q75j1239j1615k776O954J0542O71q228k152O041j421
$$ 1985 -4547 1157 12880 13755 2516 -9099 -11875 -4921 5621 6292 -1936 -4088 1953 532
1040E32j0320m518O733J0910O685m066j0706m287Q032P169j688k117M877M901
$$ 532 -9788 -14306 -7573 3337 10022 5956 -4750 -9037 -1005 6164 4476 2359 7236 12137
1054A2137k430r422j0987q53J2287R683o498j0853j663M522O34k627j482M251
$$ 12137 9707 285 -10702 -11555 732 10415 3917 -6936 -8599 -4077 -3443 -6070 -7552 -3301
1068c301J1386O528r422j4261o70J1050P521j248n063l274K151J804n854q077
$$ -3301 8085 14613 5191 -9070 -9740 1310 8831 7583 2520 -754 1397 3201 -2653 -10730
1082a0730L947J3304N416o363r634n082J938O951J594m849J013Q297J005j0819
$$ -10730 -6783 6521 11937 5574 -4060 -9142 -7204 -253 1341 -3508 -2495 5802 6807 -4012
1096d012o708M937J0359P355j186q497m517L854J111o093l564N265P468J307p260
$$ -4012 -10720 -5783 4576 11931 10745 2248 -2269 1585 2696 -3397 -6961 -1696 5772 7079 -181
1111a81j2384l522J1287J2142k529p259K131N508k69n493m499J558J0169Q456
$$ -181 -12565 -16087 -4800 7342 4813 -2446 -315 5193 4924 -569 -5068 -3510 6659 15115
1125A5115o022j4125m979N480N736M73k442m35M055K901p820j0676K059J1793
$$ 15115 9093 -5032 -10011 -4531 1205 1678 -764 -1199 2856 5757 -2063 -12739 -10680 1113
1139A113N699k691n176l106m31M375J277l448L090J1100L293j0761j1867P5Q128
$$ 1113 6812 4121 -1055 -4161 -4592 -217 1060 -2388 702 11802 15095 4334 -7533 -7458 670
1154F70O265k598o927j537M817j558q842l523N930R286N952j442j0342p445P735
$$ 670 6935 4337 -2590 -4127 690 -868 -9710 -13233 -7303 1983 7935 6493 -3849 -11294 -3559
1169c559J1945j207p789K948P912p56r679q184Q92R152P881k220q361m453Q4J590
$$ -3559 8386 7179 -610 2338 10250 9494 -185 -8369 -7477 1675 9556 7336 -1025 -5478 -5394 -3804
1185c804N18j481p45O133P065o255j3893m67J2897P296k466j145K218O06j996
$$ -3804 -3286 -4767 -5512 621 7686 1431 -12462 -12929 -32 7264 4798 3653 5871 6477 4481
1200D481l487m273J649Q831N407o280j1973n699M331P206j351p338J759J1149
$$ 4481 994 -3279 -1630 7201 12608 6328 -5645 -11344 -7013 193 -1158 -8496 -6737 4412
1214D412J190j2171o814O732R769N243J595n223p697J307O707k69o674K68R381
$$ 4412 5602 -6569 -13383 -6651 3118 8361 9956 4733 -2964 -1657 5050 4781 -1893 -1625 7756
1229G756N119p831j3526l696R206Q016l571n861J508J914l811l229L85K115O029
$$ 7756 12875 5044 -8482 -12178 -2972 5044 1473 -4388 -2880 -966 -4777 -8006 -7621 -5506 523
1244E23Q955j51j1392m662P896O440l228k962L102N316j190r580r343K457R576
$$ 523 9478 9327 -2065 -6727 1169 7609 4381 1419 4521 9837 8647 -933 -10276 -7819 1757
1259A757M106m049o061k953J120L585K83n303J109J2316N676r673j0282J960Q531
$$ 1757 5863 1814 -4247 -7200 -6080 -2495 -2212 -7515 -6406 5910 11586 1913 -8369 -6409 2122
1274B122M886K54k715k907J478J738m248n750J550P244M488l996j0060n670M643
$$ 2122 7008 7262 4547 1640 3118 4856 608 -5142 -3592 3652 8140 4144 -5916 -11586 -6943
1289f943O857j744l812M410O271k588o456j915K236O327O903O5o917l603K779
$$ -6943 -86 -1830 -5642 -1232 5039 2451 -4005 -5920 -3684 2643 9546 9611 2694 -909 1870
1304A870J087m103k330L628N401J708o841r924j272P806N869k067k557l96J487
$$ 1870 2957 -1146 -3476 152 5553 7261 420 -9504 -10776 -2970 2899 832 -1725 -2121 -634
1319f34J775k678n058R22J0573P020o381q367n47L466K374J142q84j707J378J646
$$ -634 1141 -1537 -6595 -5673 4900 11920 5539 -2828 -3375 91 2465 3607 2723 1016 2394 4040
1335D040n107p236J73O792N673n65n885m314L390L907k403k114N371O043j562
$$ 4040 -1067 -8303 -8130 -1338 4335 3770 -2115 -6429 -3039 868 -1535 -3649 1722 7765 6203
1350F203m878l536k610K760P411K009o623l400L776J174o008m446L716Q667L413
$$ 6203 1325 -2211 -4821 -2061 5350 7359 736 -2664 1112 2286 -3722 -8168 -4452 4215 7628
1365G628m820q021j612M470L055N3M08N40J91J821j182p531l046R534Q992l639
$$ 7628 2808 -5213 -6825 -2355 700 753 1161 1701 1892 3713 2531 -5000 -8046 1488 10480 6841
1381F841r008j421K622R1k161m86J978M227J910m521o191o54M410N822K719l079
$$ 6841 -2167 -3588 -966 -875 -3036 -3522 -1544 2683 4593 72 -6119 -6773 -2363 3459 6178 3099
1397C099l992K077L533n268o068M610Q638O66n750m800k351O70M451K109k695
$$ 3099 -893 1184 4717 -551 -6619 -2009 6629 7295 1545 -3255 -5606 -4936 -485 1624 -1071
1412a071p46L845J477m719o082P25P693P744k019p800k027M700N26l627L06L268
$$ -1071 -1817 2028 3505 -1214 -7296 -6571 1122 8866 6847 -953 -2980 1720 2246 -1381 -1075 2193
1428B193K510J81k392o771m624M859P389r6m980k036K370Q57k670k967K736P987
$$ 2193 4703 4884 2492 -4279 -8903 -4044 3345 3249 -1731 -3767 -1397 -540 -3210 -6177 -3441 4546
1444D546M675m854n974p72K732J721J401j67j964J516J615m939p574N31P968L823
$$ 4546 9221 4367 -1607 -2379 353 2074 3475 3308 1344 2860 4475 -464 -8038 -7507 461 4284
1460D284k382m423k347J310K060l39k021K442O452J480m585m945j443M342O277
$$ 4284 1902 -2521 -4868 -3558 -1498 -1837 -3858 -1416 5036 6516 1931 -3014 -4457 -115 6162
1475F162R78m863k462L195J6n435l187L103M401J750j925o233m166K874M981K44
$$ 6162 7140 2277 -185 3010 3026 -2409 -5596 -2493 1908 3658 1733 -4500 -8666 -5792 -811 -567
1491e67j483J626K919Q04k767l908j70O836O377k817o020j027J123k99j157j141
$$ -567 -2050 -424 2495 3299 532 -3376 -3546 3290 9667 6850 830 -197 926 627 -530 -1671
1507a671J40L155K460m306p462r49N421M238Q5k000j040J220J887j682l626K329
$$ -1671 -1531 1624 4084 -222 -7684 -8633 -3212 1026 1111 -889 -1929 -709 1178 -504 -4130 -1801
1523a801P039L326l266n126k154J259L745M72l119r81L284j1n893m270J319M337
$$ -1801 5238 8564 5298 172 -1982 -723 3022 3494 375 -606 2678 2667 -3226 -7496 -6177 -1840
1539a840L618M95m509l078K617L357j491p63K832L864J369k626n511k129M710
$$ -1840 1778 2273 -2236 -5314 -2697 660 -831 -1594 1238 5102 6471 3845 -1666 -3795 915
1554I15N165j442m405n78J277j100k914j537O04L854M348k413o553k094L919L534
$$ 915 6080 4638 233 -345 932 -168 -3082 -4619 -4015 -161 4187 1774 -4779 -6873 -2954 580
1570E80J10q22N62K146J903l024m890O33O354L583k035m007k564l82J554j1k864
$$ 580 690 -132 430 2576 4479 1455 -3435 -2802 3552 7135 5100 1093 -1471 -1853 -299 -310 -3174
1587c174K27M291K036m982n006P19L382M275J570k679j956K395J522l105k610
$$ -3174 -2947 1344 3380 -1602 -6608 -5889 -2507 1768 3338 659 -1297 1098 2620 -485 -3095
1602c095K693M557J796k016n215l307K533M410j037k501Q42K419r54l400k956
$$ -3095 -402 4155 5951 3935 -1280 -4587 -2054 2356 1319 -1182 -340 2079 1125 -2275 -5231
1617e231M1M197N773p26n612j961K554J811r75k06P45L231K037l082o440j313
$$ -5231 -5190 -993 4780 4054 -1558 -3519 -965 846 -129 -335 410 3641 5678 2596 -3844 -5157
1633e157M737L616r27j873j249m02Q04j016k819O95N538L447l166m587j431K023
$$ -5157 -420 3196 2269 396 -853 -1255 -451 -1467 -4286 -3591 1947 5394 2228 -2359 -3790 -1767
1649a767K964J019j450r17K769R44m139m464J509M802K858m48l833l236J290K850
$$ -1767 1197 2216 766 -151 2618 3562 -577 -5041 -3532 1270 4128 3680 -153 -3389 -2099 751
1665G51j486k410K102M652K42l090m044j620L388N232M03l436j128J222M3k289
$$ 751 -735 -3145 -1043 3609 3851 761 -3283 -4903 -1515 3717 4120 684 -444 778 821 -1468
1681a468j470N82L586L492j501n967k368L291K518l34l72Q97J040M42j821l828
$$ -1468 -2938 -2356 1230 4722 3221 -2746 -5114 -1823 695 361 -11 886 1926 2368 547 -3281
1697c281l98M673M236j538l561j637L44J134kk091J3M151K223m265m829J90L354
$$ -3281 -3679 994 5230 3692 131 -1506 -1162 -28 -30 -2121 -2108 2043 4266 1 -4828 -4638 -1284
1714a284K939Q69j852k077J015K245j524l005J470M477K165j618m194k758J102
$$ -1284 1655 2524 672 -1405 -390 1855 331 -2674 -1204 3273 5438 3820 -374 -3132 -2030
1729b030L778K41l050PK223l20k790k234k93K915M559J88l862k257J921J756q05
$$ -2030 1748 1989 -1061 -1054 1169 849 -1941 -4175 -4468 -1553 3006 3194 -668 -2925 -1004 752 -53
1746e3m61J655K243R77j830m571j356K975L478o52k371j021J02K36n85k634l58
$$ -53 -514 1141 3384 4361 2531 -2040 -3396 -421 3057 2405 34 -987 -885 -649 -1234 -3868 -4226
1763d226M578L530k335m570r99J945K911J407p40q15J297J979k124m091K09L566
$$ -4226 352 3882 1547 -3023 -4022 -2077 834 2241 1501 686 1983 3962 1838 -2253 -2044 1522
1779A522K570k67l637l052P0K585n50k158R86K830R17k587k510r76K063M550J371
$$ 1522 4092 3825 188 -2864 -2794 -209 -759 -2917 -1931 899 1816 -771 -3281 -4257 -2194 2356 3727
1796C727k940j215K063P43k289j557J557K620K041j622m013k713J997K806q01
$$ 3727 787 -428 1635 2378 89 -1468 89 2709 4750 3128 -885 -3598 -1601 1205 404
1811D04j325l67O85O23j012l217j140M699M581j112l449p93J215J091L47J2k75
$$ 404 -921 -1288 -603 20 -992 -4209 -5349 -650 3931 2819 -630 -1423 -208 883 1230 1242 967
1828I67J455K048j837m525j451K388K669O99k069k160j11J299j117k424J538L744
$$ 967 2422 4470 2633 -1892 -3343 -955 1714 2413 344 -1816 -1927 -628 -1745 -4169 -2631 1113
1844A113J378j387k082j712K66L680J885j885j254K282J019k447k960k6L062L031
$$ 1113 2491 1104 -978 -2690 -2424 1256 3141 1256 2 2284 3303 856 -2104 -2130 932 3963
1860C963n34m092k525J270J326j021m03J090J105J146k43l233k757L228M795P37
$$ 3963 3429 -663 -3188 -1918 -592 -1613 -2016 -926 179 1325 1082 -2151 -4908 -1680 3115 3852
1876C852k834r06N97M15q23j125O9K667K198j572l911j712M97J940J561m09j388
$$ 3852 1018 112 709 1124 301 -824 -755 1912 4110 2538 -1373 -3085 -2588 -648 913 504 -884
1893h84K98J560j159l758P1M383K530p09j861j501m3J287O87p26j17K117J300
$$ -884 -586 974 -185 -3943 -3872 511 3041 2332 471 -1030 -1073 214 901 175 58 2175 3475
1910C475j902l295j617J477L691P81k820j872J561R03k229j156J687K077J374
$$ 3475 1573 -1722 -3339 -1862 1829 2610 -210 -2082 -521 382 -1847 -3003 -1316 761 2135
1925B135K31k676k953J019L468P26j346j36Q13M72j419k286j158L082L472n17
$$ 2135 2366 -310 -3263 -2244 1224 1950 604 468 1281 1753 334 -1952 -3110 -28 3444 2927
1941B927l269j370O74L99j43L89q1R50K055j435l724r88K804K657m4j092r28p7
$$ 2927 -342 -1712 -1038 -639 -782 -393 -474 476 2531 1096 -2628 -3616 -812 1845 1801 709 -219 -296
1959b96Q28o06j555OL001J959j565k556j671N06K292J660j616j339J725J007k243
$$ -296 532 -74 -1629 -1623 1378 3337 1772 -784 -2455 -1949 343 2003 387 -952 773 1780 -463
1976d63k133L83K059K003N40k030k433P75J299P2j033P10J534N93q27k310j510
$$ -463 -2596 -2213 -154 1849 2389 359 -2074 -1299 0 72 -961 -251 1283 1876 1049 -1261 -2771
1993b771J956L075K68k114p16O22j75o29n06n0J496K128n24l802j301J622J729
$$ -2771 -815 2260 2528 414 -302 320 145 -484 -990 -1040 456 2584 2060 -1742 -3043 -1421 308
2010C08Q0k46m57K20J092p95k202l22K872K370q81j474j240o70J573Q78r85r31
$$ 308 388 142 -315 -95 997 202 -2000 -2322 550 2920 2039 565 -675 -1345 228 1106 121 -810
2028h10K333J245k609k489k80J397J901P66r78j719L45O66m56j301J175J994J205
$$ -810 1523 2768 159 -2330 -2610 -1213 688 1454 476 -1243 -898 -232 -688 -1989 -814 1180 2385
2045B385n04k302j800J388K164N17j319k6R44o44r58j558m30J407K933j98k908
$$ 2385 1881 -421 -2221 -833 1331 1848 529 503 1447 803 -155 -1713 -2143 -736 2197 1999 -909
2062i09j547Q55Q20j9k52P11J264J136j099k453n91K394J847J61q22r46p08M02
$$ -909 -2456 -1601 -781 -800 -1052 -341 923 2059 960 -1493 -2084 310 2157 2318 1496 550 -158 244
2080B44L80j523l34K192J709j743k583j089N77J182J622m31j007O66J093j388
$$ 244 624 -899 -1233 959 2668 925 -1658 -2747 -2170 -988 634 203 -804 -138 955 -433
2096d33j805Q77J996J500M39j612j566j32J821j49j391Q63R09J30j402j761j195
$$ -433 -2238 -1361 635 2135 2574 962 -604 -736 1085 936 -455 408 1317 1447 45 -1716 -2911
2113b911Q83K750Q83j914j409J314K21j068l11N66J964J847n02k705j402J352
$$ -2911 -2028 722 1605 -309 -1718 -404 -183 -1251 -1562 -996 968 2815 2313 -392 -1794 -442
2129d42J882k85J7k51l87J35l70j870j210K333K459p23k065r36j06O97Q84k66
$$ -442 1440 1155 1172 921 534 669 299 -1571 -2781 -448 2011 1288 -777 -1713 -1819 -1122 -238 -504
2147e04k68J811J142j404k454k45J763J654Q73n76j699k68J281j058j563L89K067
$$ -504 -772 1039 2181 777 -1677 -1922 -159 1495 2368 1792 93 -175 1106 48 -1515 -1126 941
2164I41N73r36j423j764N40J733Q67j119J42J133P9j085r83j16J417K205O58k299
$$ 941 1514 578 -845 -2609 -2069 -336 531 -588 -446 687 766 -319 -1302 -1418 -1 2204 2862 563
2182E63j415P39O76o06k10N89M75M61o19k025j522J855J974J79j358m56Q8J56
$$ 563 -852 -113 563 -43 -253 336 811 1272 653 -1372 -2894 -1039 935 1114 -244 -700 -612 -456
2200d56l3n82k77J953J912j051k523k55N39J401P76o73n66J9J014j208j764k76
$$ -456 -489 -1071 -1348 605 2517 1466 -1057 -1312 -773 628 1404 731 165 184 1198 -10 -1774 -2050
2218b050K376J244j90j475j155m93J402N56j016N3J734L29r39j282r98J089K179
$$ -2050 326 1570 1380 -95 -1250 -1743 -341 215 -801 -748 986 1315 376 -906 -1904 -815 1364
2235A364Q12j487j366Q84P58j404n05N80R21J018j50k154j496P68J878M0p05J60
$$ 1364 2176 689 -677 207 965 -439 -944 -364 557 1575 1425 -729 -2225 -1457 421 461 -244 -84
2253h4J74J26l10j240n32J818K074n90j744n41K86M08M24M3n36O84J361r89j978
$$ -84 90 216 -94 -1334 -1866 -48 2026 1436 -308 -849 -563 -155 269 312 -224 460 1821 832 -1146
2272a146p22J600J096O41q69j214l99P08K92j152L81J403P43q95j024j094K99
$$ -1146 -1868 -268 828 1469 600 -614 -1013 -305 -13 -1165 -784 619 1362 467 -557 -1651 -1352
2289a352J643J361r90q00Q39N85j480q95K76J044J612J12j814j661M06J501m41
$$ -1352 291 1652 662 -138 701 1286 -194 -1089 -813 231 1843 1955 141 -1520 -1114 387 -54
2306e4l90K66O88J80l35j575j322J351K509K15j264l52qk4K6J79n01R52J853p21
$$ -54 -444 -178 510 690 355 -1220 -2542 -1191 1318 1533 269 -83 -91 -115 -89 90 -411 541 2394 1673
2326A673k154q71O03Q06O92k98p11k99Q85m53j650n3J657J177j96r13j145j26
$$ 1673 -481 -1352 -749 57 749 451 -260 -559 326 -127 -1777 -1830 -173 1004 808 -105 -1250 -1376
2344a376R23J362p69l48J604L90j016j594j06O41J512O66j061j508L19M78p16
$$ -1376 -453 909 140 -208 1396 1786 770 -824 -930 -289 1223 1889 828 -680 -361 117 -599
2361e99j130N88R42R07J78j319k030J055J844J98l49j77L41L77k29q41n86J003
$$ -599 -1729 -1141 -199 708 886 -433 -2463 -1408 436 634 285 108 449 826 597 -244 -830 173
2379A73J674L00j917j033M43K33q6K05m80L08J144n31k316n42J485J325K60j17
$$ 173 1847 2147 230 -803 -360 -127 -213 -8 -488 -180 964 433 -1883 -2425 -940 385 645 528
2397E28n68n33N68M41o28k65J285J273m93j385q89j51Q68Q61o69q57O35L34j228
$$ 528 -40 -573 -5 436 -192 -457 828 2101 1608 223 -666 -817 51 912 243 -614 21 355 -873
2416h73p30R4P22J266Q06j472j276P8J612K71m53P86K32J15k90p83j100K05K237
$$ -873 -1603 -1509 -787 479 1285 -187 -1463 -1385 227 498 45 831 1063 1178 888 105 -995 -790 1447
2435A447j13j002n68o8K3j68k57QL79J084J90j909j038Q92R26M40K36j13l42M52
$$ 1447 1334 332 -236 -304 -281 -449 -706 -698 -319 765 955 -954 -1992 -1100 -174 266 502 389 47 499
2455D99N03j458l63J189J334k61r22j119k95P73P31r44l53M56J000p78j505J34
$$ 499 1002 -456 -819 370 1704 1443 521 -598 -893 -120 611 -333 -686 -230 770 -8 -1513 -1379
2473a379N33R00R30l67j035l18J041K17q98M93O51L77Jr39j098M8J261N99r10
$$ -1379 -846 54 984 617 -418 -736 305 522 -376 117 768 1145 1146 207 -891 -843 418 1017 107
2492A07M7N3l85k18k87o13P97J206P65j663j177Q57K87l5M40L52l68O41N1j340
$$ 107 154 207 -178 -396 -683 -1296 -499 707 1472 -191 -1368 -511 -224 -259 181 533 165 806 857 -483
2512d83n05R51P62L89l26o57r65J87P51o32l58Q84J050n08j657j72L72M24J146
$$ -483 -988 -37 725 1114 788 131 -834 -647 104 -528 -886 -2 1048 540 -1117 -1289 -917 -493 653
2531F53J26p99lP49p51p88k51J455O98L5m91j307j72J054%k12K9M81K96q07l28
$$ 653 779 -20 -23 726 -25 -813 -1064 391 1089 1124 633 -674 -846 208 208 -4 25 506 802 -5 -333
2552c33q43j07J685P10p67j141L28L08o5k09J57L73Q77J4j414n73M82J044k2J12
$$ -333 -1176 -1283 402 1112 345 -796 -468 -160 -225 -434 -277 96 973 987 -427 -1000 -518 526 504 616
2572F16j66l54k07L77o48q30R78J418k77j233k96j78L88M36J79m49N49M91l07
$$ 616 450 96 -111 266 -382 -1212 -234 1184 907 -326 -622 -800 -412 24 203 -246 303 794 487
2591D87j103l29M41Q96Q94j79j273LL65K06r07J48J187K78l92q22p41l13R14P53
$$ 487 -616 -945 -504 392 1286 1107 -166 -163 202 408 -499 -351 836 1114 722 -100 -841 -1154 -240 513
2611E13l38o23L24M44o40l36M6K77J262L21q85j152K76Q25q8P2M25j14j36J22
$$ 513 175 -448 -124 320 -320 -656 -610 -333 929 1250 365 -787 -511 314 226 298 723 609 473 595
2631E95q49r04M53J104L23n19o75r3k3L18k57j39N34R86l4j364k02N32L32O15
$$ 595 -254 -1158 -705 399 722 203 -472 -565 -588 -270 -527 -666 -132 854 820 -544 -746 -214 118 733
2651G33L43p80J80K45k60r80k52J132K11l73j82r18k09N11N06m61K25L76L72o74
$$ 733 1076 296 476 721 461 -519 -771 361 572 199 17 -901 -1110 -599 -93 -554 -329 47 419 -255
2671b55l91o0K18J133R51j086p45L35L16j60j65R2K16L7K55r00r86K11J065m8
$$ -255 -646 -706 -488 645 1596 510 -235 100 416 256 91 183 399 436 691 -209 -1195 -984 81 33
2691C3q2q5k11O3l1r9m22R65J057l72p28j65j98K71O60k6k81J80K70Lj499m28
$$ 33 -49 -134 -345 -282 -313 -412 -834 131 1188 816 88 -77 -275 -4 656 630 349 529 799 802 -697 -1125
2713a125J147J27J41j65p52m72P85n3k66KO74M75n34K9m07k00J049P93n55o73
$$ -1125 22 149 290 125 -627 -1099 -314 -367 -633 -631 43 518 -16 13 -394 -594 455 1248 693 20
2733B0K46L70o57l79R3K12O64J50o70r73J64N96k0J05j73K85j43R6n26m29N96
$$ 20 266 636 -21 -400 -307 -95 569 719 49 -924 -760 -164 -184 -79 -252 33 -110 -14 -540 -969 -373
2754c73J243M7n97j39J49m32M44j91l80N84N38j19j282o70O57K32N88K6o12j87
$$ -373 870 917 320 181 330 -102 342 151 -229 355 893 774 -508 -1178 -521 -289 299 325 -287 -474
2774d74L97n3o04j62R03N90k5k49o01l68M58J095m30m72P49L44q93n31K1KM14
$$ -474 -77 -130 -734 -896 7 597 572 323 -278 -646 -188 907 477 5 754 1098 205 -326 -305 -303 111
2795A11O12l78m73l02K04k90k4O2P07K91j04l84r94K90Q59P89n44j35N8m3k17
$$ 111 723 345 -128 -430 -226 -516 -540 -478 229 520 416 32 -962 -672 187 976 432 297 355 312 95
2816I5j09m59M62P85L10r77m68p8L03j7j55O0J11M87j43q95j87L61Q32Q8j99j98
$$ 95 -14 -473 -11 774 1084 107 -361 -439 -136 -153 -308 -248 -137 350 207 -688 -875 -514 318 406 207 9
2838Ik60M6L85k51J01OR29n46l69n36J20J27P25l28k78p3J70j1o07k5N35K04O68
$$ 9 -251 -205 180 -71 30 36 965 419 50 -486 -366 -239 486 158 -120 -193 -23 -34 -641 -666 -131 73 741
2861G41o31q97Q9P97J04j00K57K1K11l70j83n13P0P71L17l09n36j11J95j53L1
$$ 741 110 -787 -698 99 203 103 360 381 592 222 39 -474 -404 367 684 375 -161 -272 -77 -230 -199
2882a99j38O2P30j68p51n37M94O32r7J45j16k05J04O08q44j52M13J040l59m69
$$ -199 -337 -275 455 287 -464 -1001 -507 125 28 173 57 -148 -44 564 -280 -432 -19 1021 662 193
2902A93k63j61K18L79k07m46K26M62k74p22j03L04N98J60l49l44l01O77O9m67
$$ 193 -70 -231 -13 366 159 -287 -61 401 127 -595 -698 -394 204 364 15 -329 -630 47 116 -351
2922c51K27N65J26j02l21q22K11O49N45o07l39M47m08k27J62l24L81O25M8o66
$$ -351 -124 441 567 465 144 -678 -467 182 727 120 -219 228 -180 -407 -245 -569 -188 437 485 -181
2942a81p66M65N51l05N75p3l74L03L21k65n39J36N77L79l51n58k95L25L95k65
$$ -181 -947 -482 69 -236 339 266 -108 195 516 251 -288 -152 425 804 453 -105 -400 -75 320 55
2962E5k44OO41k40o38m75L03K49Q92k68l62k39K79J05k66j97L77L49L09j21p51
$$ 55 -189 -183 458 218 -420 -895 -592 -343 549 281 -81 -320 -41 64 -202 -399 -22 327 636 515 -236
2983b36j48L89J03J28l36J90K7l37q6l80O8M83P25n55l59j95L12L01Q1J54OK74
$$ -236 -384 5 108 236 -100 90 117 -220 -306 -686 -618 -135 590 35 -324 -519 -207 94 175 329 335 609
3005F09J22o33k51Q6K78L57l8j57o9n40M63n45l07M80J58L50n40m44j00L48M42
$$ 609 731 98 -153 -67 211 568 530 373 304 -236 227 -318 -625 -145 13 363 -177 -621 -721 -373 69
3026F9k42J8J38M50k61m21P6K69J76L67j27l17l32J77J50l49J03K26n5j33r1m12
$$ 69 -173 -155 -17 433 172 -249 -173 96 272 639 512 195 -137 40 190 -159 -56 170 115 -18 -109 -521
3048e21k20L47Q27j13o31J66Q1j52lJ27k8N75M52l42m78j02L57l3l5j09k31J53
$$ -521 -741 -394 433 320 -311 -145 -64 -216 -219 -92 -120 455 907 565 87 -15 342 309 274 165 -66 87
3070H7J19o62n7lM22K88m65L82n32O1L35J24k37J19O68n6n93j25K00j76O78M2
$$ 87 206 -456 -513 -516 -94 194 -271 111 -421 -360 -25 99 -138 -19 649 593 0 -125 75 -101 577 619
3092F19k50m08K00J0l77j04L59l4K21o5n29l42K77N81O6j02J07k57L2j51j37j34
$$ 619 369 -39 161 171 -206 -310 49 15 236 171 -358 -700 -423 158 224 122 229 -28 4 -147 -284 -418
3114d18N09M67j37m42j28N52j84j69K7j87L44j2l71o93L45M23J86m0j10j81J02
$$ -418 91 558 421 -21 -149 403 219 50 77 -110 234 222 -149 -842 -497 -74 112 72 -38 -219 -117
3135a17K04j16m44M82K42K87n44m9J53J05o4J94k76p0L72l75m47j37J53P67o4
$$ -117 87 -29 -473 9 251 538 -6 -55 98 203 139 333 57 -13 359 -16 -463 -600 -447 320 256
3156B56n2k27k97kL46k0j31M54J74l30n38K32j09M30M27k66m66L86l05Q0l08K71
$$ 256 204 -23 -320 -322 24 4 -127 327 501 171 -367 -135 -244 186 613 347 -119 267 -38 42 -266 5
3178Ej6l4N65m01n93M1K11K13j82J08L5j69K0J51l22J26Q23J4k99k28k61L06L1
$$ 5 -11 -45 520 119 -474 -433 -222 -9 -191 -83 -48 -217 -197 -46 -368 -242 581 595 296 68 -193 113 144
3201A44J8o3L8L46k76m29n18O31k9J66K22m6l07j39O0j69N6L60J32J98k14l64
$$ 144 162 99 137 483 207 -222 -740 -109 -138 28 250 204 -103 -242 -182 -351 -295 65 197 395 181 -183
3223a83k61L88N04L9m26J41J95j92l07k83J61L39L56k55m39k01K98k83L41N4k95
$$ -183 -444 -56 448 487 61 202 397 205 -102 -385 -224 115 471 216 -223 -424 -126 -409 -68 -14 -309
3244c09L81K56l35n39J37M32J55M5j37K9k14o1N51l48k37O58K41q63k69Q3lL28
$$ -309 72 328 -7 -546 -409 23 178 223 86 115 -99 -160 391 43 -194 464 705 -158 -427 -344 -347 -19
3266a9JK86n49J34j66J20k52J96L59J87J46k32r1k10M07J58m35J64L70n58j74
$$ -19 -18 268 -281 -147 -313 -193 -445 -249 110 297 443 211 120 -90 317 475 40 204 574 16 -158
3287a58O8O7Q7K69j54j06J98j66l30J03m8K0J58R8M0j69l36K62L56m90N31J44
$$ -158 -90 -23 64 333 179 73 271 105 -225 -122 -170 -150 8 106 146 -23 -359 -97 259 -231 300 444
3309D44Nk60q0Nj12J09L38n03L2j47j27O0k3j9J16L03K9k55k11K68n2K33O0O7
$$ 444 449 189 109 114 2 111 449 -54 -22 -169 -296 -236 -259 -278 -162 141 170 -85 -296 -28 -80 153 213 280
3333B80k92r2L06K1J4j0L60j45l97J39m67L00j08K71l57l72O71k52m5k3j33L37
$$ 280 -12 -104 202 223 237 227 587 442 45 184 -283 17 -91 180 -177 -549 122 -130 -175 -198 -331 6
3355Fj36L08l11k55K13K78k17K70K26J2j99k73L7j39K49L27Pm54k06J59j47r1
$$ 6 -130 178 -133 -388 -175 103 -114 156 382 394 195 -78 -41 -180 69 396 403 -51 -257 -98 -245 -336
3377c36J27mJ90K58l58p3L21J58k23K50k15m4K02K45m29k24p0O10j37j51k12j59
$$ -336 -209 -213 -23 235 -123 -196 125 283 60 310 95 51 253 498 69 -155 -225 385 248 97 -115 -274
3399b74K23nR0l43K49K66j72m01MJ13K67Q3L54o37K9J03J73l19J20L33J6K33r2
$$ -274 -51 -56 34 -309 -60 206 34 -367 -363 -250 17 100 454 -183 -154 -51 122 -197 -77 256 272 505 413
3422D13p65L35J66J92j00m84j3L16k38l8j72JL27L60j01l29j42K28l9J82j36J97
$$ 413 -352 -17 149 341 241 -243 -256 60 -178 -216 -388 -387 -60 300 199 -130 -272 -44 -83 99 -37 160
3444A60k3j35J16l61R9K61j47M01k14k22k6K66J03n51j39L51K96l97l8r1q6M73
$$ 160 137 2 118 -243 -144 117 -30 371 157 -65 -91 175 278 -273 -412 -61 235 -162 -200 -291 -377 96
3466I6M1j46kJ26np3k51L79J33o4L75o05%j53M02r3m1j66K36m1l45m7p3M07P3
$$ 96 137 -9 -11 115 110 37 -214 165 298 234 609 4 4 -149 253 160 119 -47 189 148 -197 -244 -317 90 163
3491A63J19m39J20K45n43K60KK00J54J9J15n78R6j26L16l20L66j11q4R8M7m40
$$ 163 282 -157 -37 208 -335 -75 -73 127 281 300 415 -163 -67 -193 123 -197 169 58 -26 72 119 -321
3513c21j74O40j24j04N7o8j34J06J38n6L06j8j38k31J8N3J88j7r6q1q8K24K7k80
$$ -321 -495 145 21 -83 -26 -94 -228 -122 16 -40 266 248 110 -121 -103 -50 138 121 25 -56 -144 80 107 -173
3537a73K2J98j35J69k54J76n32P3N58O0l39L49m3k21K87l75j41L67L04J97n22
$$ -173 -151 47 -88 81 -173 3 -529 -456 102 162 -177 172 129 -92 195 -180 -321 46 350 547 25
3558B5J01J31l48M61k47j52j19K52l8l56j73K96K34j05j01J71k35K59P3m00j10
$$ 25 126 257 -91 370 123 -29 -148 104 66 -290 -463 -167 67 -38 -139 32 -203 56 129 -271 -381
3579c81N47L5q5R6n9O5k12K33j68l09N49m9k98J40m1J58k51K18m90k55L99j59
$$ -381 166 201 116 212 153 218 6 239 71 -238 311 262 -36 104 63 221 -30 188 -302 -557 -158 -317
3601c17K18J34l6J6n6J21j23q2J76K13m2n5j3l2k30J26J07k78K69K67l50k18m06
$$ -317 -99 35 -1 15 -41 80 -43 -125 51 264 222 167 154 122 -108 18 125 -153 116 383 33 -185 -591
3624e91O59J01j84r7J32k20J59K26k39j6Q2M79k31j95J11j77J11Q5k81l5N26j88
$$ -591 68 169 -15 -112 20 -200 -41 185 -54 -70 12 491 260 65 176 -1 110 195 -86 -121 405 217
3646B17k59l55M53k81K49j09l1q6p8M88m07J86lj42K90k45R3l04K11K66k5j36
$$ 217 -42 -397 56 -225 24 -85 -116 -202 -280 208 -199 -13 -16 -158 132 -113 -20 -324 -113 153 128 -8
3668hL13k97L6j03N8K8j8J30r3k02m77L92j99K32Q7J02J0k3K08l98N2R2L07j77
$$ -8 305 8 44 -59 -1 27 9 139 46 -156 -633 -241 -440 -208 -121 -19 -9 -32 176 -222 -170 -78 229 52
3692E2J57m9k79K14J9n9j03J54o4L3l84NJ09J84J46j16l41P2L12k42j16K82jj24
$$ 52 209 160 -119 95 114 55 -48 106 42 75 -309 -304 -195 -11 135 19 -322 -250 62 -180 -296 -14 -15 -139
3716a39L16j58m5j13L25j2K71l95q6j33J33k31k00K99J46K27No21L20n6rP8O3
$$ -139 177 19 -26 -139 186 174 445 50 -36 -169 -36 -267 -467 -168 -22 205 210 -411 -91 -147 -156 -78 -15
3739a5j67k6J70P4k67J42N11k10L5ml10J29J93l37O7J39Qn7j18N5k29j75L48r4
$$ -15 -182 -208 -38 36 -231 -89 422 212 247 243 -67 62 255 -82 -15 124 132 75 -43 12 -217 -392 -44 -138
3763a38L61j55m5pj14j4K02j23J09j40J27J90p5J8j76jj66K63R1j62p2k01L11
$$ -138 223 68 23 16 -98 -112 90 -33 76 -64 63 253 178 196 20 19 -147 116 207 45 -27 -228 83
3786H3J78l05j2K03k97L0N2j5K26j20L9K07n38L13P9k37%L63j32l2o9Q4l42L90
$$ 83 261 -44 -56 147 -150 -120 -68 -83 143 23 62 269 -269 44 123 -114 -114 249 117 85 16 100 -242 148
3810A48j94J62k46L70k77j01R6k25K28o2J44n9q5K7rJ38K69l24k3J51nj16j75
$$ 148 -46 116 -130 240 -37 -138 -42 -267 -39 -101 43 -16 -101 -74 -83 55 324 0 -23 128 123 7 -168
3833a68L67lq9k11l5J95L8k28J87k35K71L9l6k87J14j98J38J27k6J30j84K79j20
$$ -168 199 196 107 -104 -139 56 94 -134 53 -182 89 128 92 -195 -81 -279 -141 -14 -40 90 -94 185 65
3856F5j84J17J11J63j94K52l98o0KL37k62k2J2k81L33l6pk84K72j19K28n0j35
$$ 65 -119 -2 109 272 78 330 -68 -128 -126 211 -51 -73 -61 -342 -9 -45 -52 -336 -64 -183 45 -5 -140
3879a40M9L01q3L4k73O2J20N2k04J14J88l97L99n8m04M4J9K04r9j70J08J58M8
$$ -140 -91 210 127 161 -112 -50 70 122 -82 32 220 -177 222 164 -240 -196 -177 27 -72 -242 -134 24 72
3902G2r3J81j32n0K03j67R2m4J96k31l03M34j11J56J3J4n52K54j33J20Mj4J44
$$ 72 -21 160 28 -22 181 14 106 62 258 27 -276 158 47 203 216 230 -322 -68 -201 -81 -77 -91 53
3925E3j13r5M8k27M44k07K76k30k87J76J3J96M1K8q2L61l06Pk26J77j04j22L98
$$ 53 -60 -155 -107 -334 110 -97 179 -51 -338 -162 -149 47 88 116 34 395 89 96 -130 47 -57 -179 219
3948B19K72m70k15K89k93K19j17J72k81J95j58J33K7J40r1k35J43J18k27j69J91
$$ 219 491 21 -194 95 -198 21 -96 76 -205 -10 -168 -35 -8 132 41 -194 -51 67 -160 -329 -138
3969a38N01n38J87J53l7l40J45Pk51K06J64l5k5R5j52j83J20L73k79M7j24K65
$$ -138 363 -175 12 165 128 -212 -67 -60 -311 -105 59 24 -1 94 -58 -241 -121 252 -27 20 -104 161
3991A61m3j36J07q4m0J15P7j42K7M9p9K20k46k5J05J76n99P4k8N15l92K69j09
$$ 161 118 -18 89 5 -35 80 157 15 42 91 12 232 -14 -39 66 242 -357 -283 -311 204 -188 81 -28
4014b8p9J2L71n5k03n5J32P2l10J70K4P1J0j61Q0J77j49K02n29K81r8Q6K66l17
$$ -28 -107 -95 276 221 18 -37 95 167 -143 27 51 122 132 -29 51 228 79 281 -248 33 -65 21 287 -30
4038c0m5p7J31J62j03n0J37Lk36J1K02J47r4j00J2J04k53K77j96J04q8J2j67J4
$$ -30 -75 -152 -21 141 38 -12 125 128 -108 -97 105 252 158 58 70 174 -79 198 2 106 18 30 -137 -123
4062a23k01K4J16J57j52j06J52N8j12L35j64n8J19K17k7k87J11o1r7K9J70j7j26
$$ -123 -324 -300 -184 -27 -179 -285 -133 -75 -187 148 -16 -74 45 262 235 -52 59 -2 -99 -70 100 83 -43
4085d3KJ09k09K59j84J36j76J95l82L41j20j02mK95m8r7R5j69M6L3N8J90j98J40
$$ -43 -41 68 -141 118 -66 70 -106 89 -293 48 -72 -174 -178 117 69 -28 67 -102 -56 -23 35 225 27 167
4109A67m4or7K44l61J97j13J93k08o2j38J04J60j21J53J28k98J54j59K49k73K25
$$ 167 123 117 20 264 -97 100 -13 180 -28 -90 -228 -124 36 -85 68 196 -102 52 -107 142 -131 94
4131I4L3K23m59J08M9R3j88J08P2j89R2mM3j65j05K23k89K60j48R7K43n46K85
$$ 94 127 350 -109 -1 48 141 -47 61 133 -56 36 32 75 -90 -195 28 -261 -1 -149 -52 191 -355 -70
4154g0j03J49J10JJ88k90L41j40k11r0K50j52k62NO1l1K20J93j61oj86j02J53
$$ -70 -173 -24 86 87 275 -15 326 186 -25 -115 135 -17 -279 -274 -213 -244 -24 169 8 2 -184 -286 -133
4177a33L34k17J85n1J55j84J59l58L34j71O5j88O8P3L8J18j22Mj15J8j85K28k34
$$ -133 201 -16 169 118 273 89 248 -110 224 53 118 -70 -2 71 109 227 105 109 -6 12 -173 55 -179
4200a79j61J77J30q6R8L8k67J03Q3r8L28j95J38j89L97j92j1o9j25J28j58L11
$$ -179 -340 -163 -33 -119 -21 17 -250 -147 -64 -162 166 -29 109 -80 317 125 114 45 -80 48 -110 201
4222B01j74o1k88M95m67M02n63N23q9j29K45j88J03J14j00q3l2P0J11nk77Q5M6
$$ 201 27 -34 -322 173 -294 108 -455 68 -21 -150 95 -93 10 124 24 -59 -91 -21 90 85 -192 -107 -61
4245f1K1J34j4Pj04m6k9l5K38k47J02Q1N5k80K46r6j71L17j97J31j74N16k72o1
$$ -61 -40 94 80 87 -17 -63 -92 -127 111 -136 -34 47 102 -178 68 -28 -199 118 -79 52 -122 394 122 61
4269F1k54K81j1J47j37r2l9l0J39J5l36K53N7l10L28k2j2k37N4oN3o0K82K5k12
$$ 61 -193 88 77 224 87 -5 -44 -74 65 80 -256 -3 54 -256 72 50 38 -199 -145 -151 -98 -158 124 149 -63
4294f3J34j55K16j49J79k56M15l84j12m0J21L88j72j91Q7nk63K32k27K41j50n0
$$ -63 71 -84 132 -17 162 -94 321 -63 -175 -215 -94 294 122 -69 18 13 -250 -18 -245 -4 -154 -204
4316b04L28J2k38J42p9K36k6j88j00J59J21l47J4r1K93J37k29J09j77k2K75j48
$$ -204 124 136 -102 40 -39 197 171 -17 -117 42 163 -184 -170 -261 32 169 -60 49 -128 -150 125 -23
4338b3K07k17L62m23L4Q3k16K00QJ16J29k61k8P5k4oK47j34k02J6P3q4O7j28j43
$$ -23 184 -33 329 -94 -60 23 -193 7 15 131 260 -1 -29 46 22 16 263 129 -73 -57 16 -68 -1 -129 -272
4363b72L28J78m10P1K8Kj57L81j37M3j02q6J71j95J02N5j55J93J48l86J69J1L9
$$ -272 56 234 -176 -105 -77 -75 -232 149 12 55 -47 -133 38 -157 -55 0 -155 38 186 -200 -31 -20 19
4386A9K10l39K3P6J18l77M16k04N2N6k62R6j69M5M13O0j9j25J19k70K40q7j97
$$ 19 229 -110 -87 -11 107 -270 146 -58 -6 50 -212 -116 -285 -240 173 233 214 89 208 -62 178 91 -106
4409a06R8R7n4K83k98r5J26N3olp4l06K99j61K45j90K15r1k2J26r0Kj80J42K83
$$ -106 -8 89 35 318 20 -75 51 104 98 95 21 -285 14 -147 98 -92 123 32 10 136 46 48 -132 10 293
4434B93o1n93L94K8j24n5K81j60J69Q7j73n8J57l62J40K38k26n7K3J00j63K10
$$ 293 232 -361 33 61 -63 -118 163 3 172 259 86 28 185 -177 -37 201 -25 -82 -59 41 -122 88
4456H8m8j34J58J0j47J8K70k27j9Q6P1m66M51l88N43k73m5o2J66p9J18j14J23
$$ 88 40 -94 64 74 -73 -55 215 -12 -31 55 126 -340 111 -277 266 -7 -52 -114 52 -27 91 -23 100
4479A00j19J93o7n0k4j12K60k88J22j17J43OJ95m26L12K8k57j21L48k79J57j67
$$ 100 -19 174 107 57 33 -79 181 -107 15 -102 41 47 242 -184 128 156 -101 -222 126 -153 4 -163
4501a63J9J95j5N8M5l6K65l56j51R5J93O1l7l2j14J59m0j48J1N0j91J22k6n6O2
$$ -163 -144 51 36 94 139 103 368 12 -139 -44 149 210 173 141 27 186 146 -2 9 59 -132 -10 -36 -92 -30
4526c0Q6r7R2p1j79P2L2J11K2k65K51J08m85O89j49L5l41K26n3K3J01k5k02L6
$$ -30 56 -41 51 -20 -199 -127 -95 16 38 -227 24 132 -353 336 187 222 -119 107 54 77 178 153 -49 -13
4550a3k58M29l09L20l41O5K75l35j11K79M4k75L90r4J6p5K29k06j43J19M7l14
$$ -13 -271 158 -151 169 -172 -107 168 -167 -278 1 45 -230 160 66 82 7 236 30 -113 6 53 -261
4572b61K83k50L34n5j08K15k03O6L04n75J72J65k10j76L22m2J03j80J09k1J00
$$ -261 22 -228 106 51 -57 158 -45 21 325 -250 -78 87 -123 -299 23 -19 84 -96 13 -8 92
4593I2o0j95J34O8J58j78r5K24R5k40k6K06k88O2K3K52l12q3J90K6k75L15k18
$$ 92 32 -163 -29 39 197 19 -76 148 243 3 -23 183 -105 -43 -20 232 -80 -163 27 53 -222 93 -125
4616a25J3K05J82j40Mj38k67J10mn0N00l22pJ44k67L68k41q4j24J17K57j23j09
$$ -125 -112 93 275 135 139 1 -266 -156 -160 -210 290 -32 -39 105 -162 206 -35 -119 -243 -126 131 8 -101
4639a01J15j80K08j12k3J66j54K24Lk85K54k71j83O58k98n0J13P1k25J79m42M21
$$ -101 14 -166 42 -70 -93 73 -81 143 146 -139 115 -156 -339 319 21 -29 84 155 -70 109 -333 88
4661H8j29K32k75J63k46K56p1k08L01m51N28m07N85k78l07J48Q0L8n0n3QK22J10
$$ 88 -41 191 -84 79 -167 89 18 -190 111 -340 188 -219 366 88 -219 -71 9 47 -3 -56 -48 174 284
4684B84l03k0J54k57M78l53P3K0j85M0QN6p3K26pj18Q0j69N5l1o0K61k54p0o5
$$ 284 -19 -39 115 -142 336 -17 56 76 -109 -69 -61 -5 -78 148 141 23 103 -66 -11 -42 -102 159 -95 -165 -230
4709b30K33m2J62k62m4L38l24L95k03k67K39j03q4N3K18J85k14J99k28P8J1j79
$$ -230 3 -39 123 -139 -183 155 -169 226 23 -244 -5 -108 -192 -139 79 264 50 249 21 99 110 -69
4731f9J12p1j21J89J64k31j77K08J8r6K92l26J55R1q2j80L88k4j74J43l76J99
$$ -69 43 -28 -149 40 204 -27 -204 4 22 -74 218 -108 47 138 56 -124 264 240 66 209 -167 32
4753C2J72l16J19J73k59K69k37j0N5J39j47J48j55J9J52P0j39l31K18o4L15k74
$$ 32 204 -112 7 180 -79 190 -47 -57 -2 137 -10 138 -17 2 154 224 85 -246 -28 -92 223 -51
4775e1J52p8L4k16J72K27k88Q2K62l20k3m0L1o4q2L59l14K28j00k7J95j04q5j47
$$ -51 101 23 57 -159 13 240 -48 34 296 -24 -47 -87 -56 -120 -202 157 -157 71 -29 -56 139 35 -50 -197
4799a97J68m2J2R0Q2L6j35J33k9j15k18K50j15o9J9J9R3K43l94K09p9J0J19j12
$$ -197 -29 -71 -59 31 113 149 14 147 118 3 -215 35 -80 -149 -130 -111 -18 225 -169 40 -39 -29 90 -22
4823b2q6K85l22M56k65R2l0P7Q4n23L88j30J14j45%K24l08j79O41k64j71P9K49
$$ -22 -108 177 -145 311 46 138 108 185 269 -254 134 4 118 -27 -27 197 -111 -290 351 87 -84 -5 244
4846B44k31j6j8K3L67n03J78j86l8J73J70n0k0P1j18q9N5L5k6p2rj26J5L2P2K7
$$ 244 13 -3 -21 2 369 -134 44 -142 -180 -7 163 113 93 164 46 -43 12 47 21 -51 -60 -186 -171 -139 -67 -40
4872d0l48M16m0J21k5r6k3p9P6J50m9q3J68j60o5K77k32j07OK0J22M4k09L15l02
$$ -40 -388 28 -12 109 84 -12 -35 -114 -38 112 63 -20 148 -12 -77 200 -32 -139 -133 -113 9 53 -156 159 -143
4897a43K26M1j12L3J8j13Q6rj77K30k88K57k13M57j96j82Oj8J18l20O0J78n1L92
$$ -143 83 124 12 45 63 -50 36 27 -150 80 -208 49 -164 293 97 -85 -79 -97 21 -299 -239 -61 -112 280
4921B80l44J38J59L5K8j14Qj29J2j01N1J24k23K14lk72P3K90l07l12M32j44k9
$$ 280 -64 74 233 268 296 182 190 61 73 -28 23 147 -76 138 135 -137 -64 226 -81 -393 39 -105 -134
4944a34j20L13k62J66M08k63q4j00M90o35J58J98j06kM5k1k30J82j1Q0j16j5P6
$$ -134 -254 59 -203 -37 371 108 24 -76 414 -221 -63 135 29 27 72 51 -179 3 -8 72 -44 -59 17
4967A7K2j36j12L90k90j8K58l10K01J94j02p7K08k52N8J11l09J45j74J75J43k4
$$ 17 39 -97 -209 181 -109 -127 131 -179 22 216 114 37 245 -7 51 162 -147 -2 -176 -1 142 118
4989A18P5k49m0K67m55K27j42J96P9k22Q5n9K3J37L7o6K16j01k53R1J81k81N7
$$ 118 193 -56 -96 171 -284 -57 -199 -3 76 -146 -61 -120 -97 40 77 11 227 126 -127 -36 145 -136 -79
5012g9l0M8o9J06J21q0N2n0j03nJ29q5P7k4p6J47j4j15j3L26m3j45O1q1k67L13
$$ -79 -109 -61 -130 -24 97 17 69 19 -84 -89 40 -45 32 8 -68 79 65 -50 -63 263 220 75 136 55 -212 101
5038A01J34j02r1j53k36J61m1L44k49R6k2J19J2k48R6K44k83O6o1K47J14j67n0
$$ 101 235 133 42 -111 -347 -186 -227 117 -132 -36 -58 61 73 -175 -79 165 -118 -52 -113 134 248 81 31
5061C1J71Lj39j01K45q2j94R6o9N3j0K30k42Q0n1q1J90k34Q8J44j80M00l42j27
$$ 31 202 205 66 -35 210 128 -66 30 -39 14 4 234 -8 72 21 -60 130 -104 -16 128 -52 348 6 -121
5085a21J03j2Q2k71J44J22O4k59K81J59k03k65K68M3j44K00l58K10k38L42K1k48
$$ -121 -18 -30 52 -219 -75 47 111 -148 133 292 89 -176 92 135 -9 191 -167 43 -195 147 168 -80
5107h0N7M2j95Q7j1rK20l24K99o7J60l80J62J78p2K8j69L45j45Nk19P0j07J36
$$ -80 -23 19 -176 -89 -100 -109 111 -213 86 19 179 -201 -39 139 67 95 -74 271 126 131 -88 -18 -125 11
5131A1o7K67r6k07K38j87L88o9k87k2M3J01k07L57p3j20Q2j77q0J18j70J66r3
$$ 11 -56 211 115 -92 146 -41 347 278 -9 -31 12 113 -94 263 190 70 152 -25 -105 13 -157 9 -84
5154h4nJ5J78l64N2J57J25J34j26k3j35J84k13J66j75m6J98j77L83j77K4j86P4
$$ -84 -89 -74 104 -260 -208 -51 74 208 82 59 -76 108 -105 61 -114 -160 38 -139 244 67 91 -95 -21
5177b1j99J25N8J09M2j83N4o2j94K45p0J23qj69M3o1K78j24N2r4L16m16J09M2
$$ -21 -220 -95 -37 72 114 -69 -15 -77 -271 -26 -96 27 19 -150 -107 -168 110 -14 38 -56 260 -156 -47 -5
5201ekM8k0K5j75j10R3j5J05R4k44J9L24j50J45P5k14Q4j72J69L4k49J75j28L03
$$ -5 -7 41 21 46 -129 -239 -146 -161 -56 38 -206 -187 137 -13 132 207 -7 77 -95 74 108 -141 34 -94 209
5226B09R8l09K15k07J3P9k21J70%r8j38L75m08K69k01L04j75K15k49K6m0K6K04
$$ 209 307 -2 213 6 19 98 -123 47 47 -51 -189 186 -222 47 -154 150 -25 190 -59 -33 -73 -47 157
5249A57j81J12J73j57m7K29l89O5k5J86j52L4j42J43M5K2j09J28j54J07j08K6
$$ 157 -24 88 261 104 57 286 -103 -38 -63 123 -29 5 -137 6 51 73 -36 92 -62 45 -63 -37
5271c7R4j58L21m25L30l9j64J3K09jq6k53K91j86K24q0kk10o6K98N6j69k0J35
$$ -37 57 -101 220 -205 125 86 -78 -65 144 143 57 -196 95 -91 133 53 51 -159 -225 73 129 -40 -60 75
5295G5k89J41M0N2J59l29M5J30L0J39l17Q8J43j22J69j65l6Q5k6j19K96j89N5
$$ 75 -214 -73 -33 19 178 -151 -106 24 54 193 -124 -36 107 -15 154 -11 -47 38 12 -107 189 0 55
5318E5O9k6mJ0j84J27j53P1J23J68o4m26L06pn7O4j56O4J25P2j41j61L16k35r4
$$ 55 124 98 94 104 -80 47 -106 -35 88 256 192 -234 72 65 8 72 -84 -20 105 177 36 -125 191 -44 -138
5343a38L16m01P2p7K90o4r7J84k85L8J37j00J7J93q0r3J60j09l59L90L9j33L7
$$ -138 178 -223 -151 -228 62 -2 -99 85 -200 -162 -25 -125 -108 85 5 -88 72 -37 -396 -6 33 -100 -63
5366f3L9J6j49K24jRp1j75M17j83rQ6p9r4J52m4Nk8j98J40N8L4N9j56j38J19J07
$$ -63 -24 -8 -157 67 66 75 4 -171 246 63 54 140 61 -33 119 75 80 52 -146 -6 52 86 145 -11 -149 -30 77
5393G7l4P6j92nK83l85K88L2j96K05n2L1j21n0l9L3K5K04j2k73J56o7O9R0l2n5
$$ 77 43 119 -73 -78 205 -180 108 140 -56 149 97 128 7 -43 -82 -49 -24 180 168 -105 51 -16 53 143 111 56
5419E6R5l27K41K41l49J57q3j96m5K25m4p7L6j15J03Q9j37M9J44j4N6k50J98m5
$$ 56 151 -176 65 306 -43 114 31 -165 -210 15 -29 -106 -70 -185 -82 7 -130 -81 63 49 105 -145 53 8
5443HJ59j18k01M15m42O6L61p4o7P8l00J33kk5J7L6k77R2R3P8J51k51NM3J17j2
$$ 8 167 49 -152 263 -179 -113 248 174 107 185 -115 18 16 -9 8 44 -233 -141 -48 30 181 -70 -65 -22 95 83
5469H3j32J16J41j65j86R8J70k20k8J49l8j12K70L4j95J44k05J93k78J86nl22
$$ 83 -49 67 208 43 -143 -45 125 -95 -123 26 -12 -124 146 180 -15 129 -76 117 -161 25 20 -302
5491c02L19J78j53j7J65j62j07K38K5k28J5L3Pn5P3m9p5j15L11l65L54j16m41
$$ -302 17 195 42 25 190 28 -79 159 184 -44 -29 4 11 -44 29 -20 -95 -210 101 -264 90 -26 -467
5514d67N44k26n6J76KJ18j42k4l9J22k18K04J97l04L5J42o8L7k48K19J13k40J75
$$ -467 77 -149 -205 -29 -27 91 -51 -75 -114 8 -210 -6 191 -113 -78 64 -4 33 -215 4 117 -123 52
5537E2K7p3l5J08k37J35j70K27J80ml9k93q9OK04J11j95L2K54m28K81n1k37J51
$$ 52 79 6 -29 79 -158 -23 -193 34 214 210 171 -122 -211 -205 -1 110 -85 -53 201 -227 54 3 -234 -83
5561h3J77k21L2O5J5N8n6O8M3k73J40J34j42J52q3j73J55K25k99q8K61j98J55
$$ -83 94 -127 -95 -30 -15 43 -13 55 98 -175 -35 99 -43 109 26 -147 8 233 -66 -154 107 -91 64
5584F4qj02K28k66K12r8P1o3j7j50P7j13J27Q2J02j21J81j31L3k70M88l97J80
$$ 64 56 -46 182 -84 128 30 101 38 21 -129 -52 -165 -38 44 146 25 206 75 108 -162 326 -71 109
5607A09m1j89L32o2m03J41J81j12k22K52J17k43j75M18j8O7k67J79k59N3LK51
$$ 109 68 -121 211 149 -254 -113 68 -44 -266 -14 103 -140 -315 103 85 152 -115 64 -195 -142 -139 112
5629A12q5k33K17J38o7l21K80k13K05k39K7k94L93L9J05N0n4k17M5L23k07j87
$$ 112 27 -206 11 149 82 -239 41 -172 33 -206 -179 -473 -80 -41 64 114 60 -157 -112 211 4 -183
5651a83R4J34J26j23J72j89J2j00p4L67j65N4N8J02k09k52L90j93k45J68p7K55
$$ -183 -89 45 171 48 220 31 43 -57 -131 236 71 125 183 285 76 -176 214 21 -224 -56 -133 122
5673A22j78o0J85k39R3r1L37m13k2K16K0J02j1j09K0J97m41J06M39k89k6K9P1
$$ 122 -56 -116 69 -170 -77 -168 169 -244 -266 -50 -30 72 61 -48 -28 169 -272 -166 273 -16 -42 -13 58
5696E8K3k5K69m92K34m4n7K08l12M6l0L74m72K2J13J25O8j03K01M9J16m45J29
$$ 58 81 56 325 -167 67 23 -34 174 -138 -92 -122 252 -220 -198 -85 40 108 5 206 255 371 -74 55
5719E5p5J57j17p3j80K06j11k7Q2k78L81J67l63M86j46j44L0K1j93mL54j93N2
$$ 55 -20 137 20 -53 -233 -27 -138 -165 -83 -361 20 187 -176 310 164 20 50 71 -122 -126 228 35 87
5742H7k82J67K11k58KJ96j03r0O7n5j28K0L19j61K2K8O0K31l91J4q3l2J57K18
$$ 87 -195 -28 183 -75 -73 123 20 -70 -3 -58 -186 -166 153 -8 14 42 102 333 -58 -44 -127 -159 -2 216
5766B16k46j8m6R6O2j10j07K53kk26K63m57L25L2J01j69l9J9O0r1J06k60L06k22
$$ 216 -30 -48 -94 2 64 -46 -153 100 98 -128 135 -322 3 35 136 -33 -72 -53 7 -84 22 -238 68 -154
5790a54O4R2j00L10j12k08L5q7J90j24K83k43q1L48l34K30j59Q8j78P2J56J11
$$ -154 -90 2 -98 212 100 -108 -73 -160 30 -94 189 -54 -135 213 -121 109 -50 38 -140 -68 88 199
5812A99j15k1l0j77J76l2p2r7P2J32J03k76J51k01M20k06J37Q8m7l10K42M5l02
$$ 199 84 63 33 -144 32 0 -72 -169 -97 35 138 -138 13 -188 232 26 163 251 204 -106 136 181 -121
5835a21J59m3l6J17r8K15n81K04K91p8j84J74l9p4J97r4p7J58j26m0j42Q5J81
$$ -121 38 -5 -41 76 -22 193 -388 -184 107 29 -155 19 -20 -94 103 9 -68 90 -36 -76 -218 -133 48
5858D8KpK4j88K45k89J37k4L07k59o7J44p0l2j65L31j29M2k23M47k14m6P5k80
$$ 48 50 43 67 -121 124 -165 -28 -52 255 -4 -71 73 3 -29 -194 137 8 50 -173 274 60 14 89 -191
5882a91J58L2q0k5K32j20q7NK57l01K75k69L12j65l34J91K31k46L26J46j30k2
$$ -191 -33 -1 -81 -106 126 6 -81 -76 181 -120 155 -114 198 33 -301 -110 121 -125 201 347 217 195
5904A95n7j36J28o7r4J6L5j4j47K64j70o3o5J44j16r7J94j8P2n2m7K13N7l71K33
$$ 195 138 2 130 63 -31 -15 20 6 -141 123 -47 -110 -175 -31 -147 -244 -50 -68 4 -48 -95 118 175 -196 37
5929C7P6k15j44K30LL06k89p8J20j13K75k89J60r0n7j14J73Jj18J59%j72MP4P5
$$ 37 113 -102 -246 -16 -13 293 4 -74 46 -67 208 -81 79 -11 -68 -182 -9 -8 -126 33 33 -139 -135 -61 14
5954A4Q3j56J21l31J87p3M6k5K09k58M40j25j91j89N95n65J91J06J35k22O8j42
$$ 14 97 -59 62 -269 -82 -155 -109 -134 75 -183 257 132 -59 -248 347 -218 -27 79 214 -8 60 -82
5976h2j28k1J27O7Q4l2j97l4J66K37k35l0P7J64j35l03J78l0L51j82j93j74O13
$$ -82 -210 -231 -104 -37 47 15 -182 -216 -50 187 -48 -78 -1 163 28 -275 -97 -127 224 42 -151 -325 288
5999B88l28N5NL21m00P4N2k47J33K03l42K17k63L29q6J3j02j63N02j71p3M0J84
$$ 288 -40 15 20 341 -59 15 67 -180 -47 156 -186 31 -232 97 11 24 -78 -241 261 90 17 57 241
6022B41j76k82K30k93M00n5j23j03j57K00K26m18M23j2q3r1jN8K3J71j77J10m7
$$ 241 65 -217 13 -280 120 65 -58 -161 -318 -118 108 -310 113 101 18 -73 -74 -16 7 178 1 111 64
6045F4m7j8j11P0K21j98MJ76K9o7m14M72l98P6LQ2j4q4J99j4pj64O5j59J65R9
$$ 64 17 -1 -112 -42 179 -19 -15 161 190 123 -291 181 -217 -141 -138 -56 -70 -154 45 31 24 -140 -75 -234 -69 30
6071C0R4j30j47K99k35J89o7j23P4R3k87L73k36LJ84K4l26K07pk5K73k09k34J70
$$ 30 124 -6 -153 146 -89 100 33 -90 -16 77 -210 163 -73 -70 114 138 -188 19 12 -13 260 51 -183 -13
6095a3JO6J81k91J83j83J55k6j03R6j69J91J36j36P0j33P8r4m0q9P1K91j47k32
$$ -13 -12 54 235 -56 127 -56 99 73 -30 66 -103 88 224 88 158 25 103 9 -31 -120 -49 242 95 -137
6119a37K14k04O9J86j71r9R0j88K95J85k1j51p5N6J11j24n3L8p7N1j7N1j34M0
$$ -137 77 -127 -58 128 -43 -142 -52 -240 55 240 219 68 -7 49 160 36 -17 21 -56 -5 -22 29 -105 -65
6143f5k40L44l9R1n9k94L79k43K79j29RN1l8k04M8J76p3j17Q4J35n13M97n4J7
$$ -65 -305 39 0 91 32 -262 117 -126 153 24 33 84 46 -158 -110 66 -7 -124 -40 95 -418 79 25 42
6167D2j15k26K98o1N0j94J16P0n8K04m9j20j51J79%p4L64j91j44P1l8J21l5j57
$$ 42 -73 -299 -1 -62 -12 -206 -90 -20 -78 126 77 -43 -194 -15 -15 -89 275 84 -60 11 -27 94 59 -98
6191i8K63k07K7J52r1R0j87j91L19l01J47K28l1J20k59J49R5j07l08J8K33k01
$$ -98 165 -42 -15 137 46 136 -51 -242 77 -224 -77 151 120 240 -19 130 225 118 -190 -172 61 -140
6213a40R5K05k32K63nj90j53K08j98M7J39K99K4k31k85L27j85J49k37K06j30M9
$$ -140 -45 160 -72 191 186 -4 -157 51 -147 -100 39 338 362 131 -154 173 -12 137 -100 106 -24 25
6235B5J13l81o8K76o8m3j70L99o0P0o5O5K4j51J07k6m8l4J49j02k56L80l19pJ58
$$ 25 138 -243 -311 -35 -103 -146 -316 83 23 93 28 93 117 -34 73 47 -1 -35 114 12 -244 136 -183 -190 -32
6260c2K0Mj08K47k67K67k59j00J6K42P3k8Q8j17l14K74R4k53L15k66n8K8j06M96
$$ -32 -12 -8 -116 131 -136 131 -128 -228 -212 30 103 75 163 46 -268 6 100 -153 162 -104 -162 -134 -240 256
6284B56l46K61k86J93J15j92J03j51K06j02L0j05l6J99M4l46Q5j26kp4L97j49
$$ 256 -90 171 -115 78 193 1 104 -47 159 57 87 -18 -54 145 189 -157 -72 -198 -200 -274 123 -26
6306b6o2L59m09n0L70k09j47K8J28R4q3J9K1j23J75m5m7J84k62M4kJ02k59K17
$$ -26 -88 271 -138 -188 182 -27 -174 -146 -18 76 -7 12 33 -90 85 40 -7 177 -85 -41 -43 59 -200 17
6330A7M6j70p1M7j8L2L0p3M23k06j02O7J44j32k7K32k55K23m71M51l69K13q8M8
$$ 17 63 -107 -178 -131 -149 -117 -87 -160 263 57 -45 22 166 34 7 239 -16 207 -264 187 -182 31 -57 -9
6354ij56L23j88r3L81k95j5J9K69m20J72J39j74JJ22QK57l88j0L32l01J95j10
$$ -9 -165 158 -30 -123 258 -37 -52 -33 236 -184 -12 127 -47 -46 76 84 341 -47 -57 275 -26 169 59
6377E9j30L26j88o3K22j24Kl56K63j71J69j10RK43k98J84k13J95l26J08L47j47
$$ 59 -71 255 67 4 226 102 104 -252 11 -160 9 -101 -92 151 -147 37 -176 19 -307 -199 148 1
6399Aj54J72J15k31J77J33r9j25L8J0q7K74l0q5n8R9k43J8J35q7P4r5P1Q7P7j34
$$ 1 -153 19 134 -97 80 213 114 -11 27 37 -50 224 194 109 51 150 -93 -75 60 -27 47 -48 23 110 187 53
6425E3l5J16rj28J84j82M0kk7l4O9R9k63R1L8J24k84J91j80L5O6N5P3j16j49J14
$$ 53 18 134 125 -3 181 -1 39 37 10 -24 45 144 -119 -28 10 134 -150 41 -139 -104 -38 17 90 -26 -175 -61
6451f1J39LP9j86J2L9j9k14J85J24m4L4j36K89j74r8O1k50K06Q0j89K97Km38J67
$$ -61 78 81 160 -26 -14 25 6 -208 -23 101 57 91 -45 244 70 -28 33 -217 -11 69 -120 177 179 -259 -92
6476i2J00P6j87n7J03J19J8j07J51m71L72P7k33Q7j2J0k12K79k32R7K08j74K46
$$ -92 8 84 -103 -160 -57 62 80 -27 124 -347 25 102 -131 -44 -56 -46 -258 21 -211 -114 94 -80 166
6499A66k01J35j9k47L55l27N1K27n3k68K38j0m6M6k1j14J00O4q3K04k67L61m04
$$ 166 -35 100 81 -166 189 -138 -87 140 87 -181 57 47 1 47 26 -88 12 76 -7 197 -70 291 -113
6522a13Q0o3J23k9k41L15j55j49J13Q1L10l66m3J67k08K97j2j61r1J22K68l32
$$ -113 -33 -96 27 -2 -243 72 -83 -232 -119 -38 272 -94 -137 30 -178 119 107 -54 -145 -23 245 -87
6544h7Q4p3R7j34n9L3lM47m52L91k76nJ72k61J16q0N4j15lK3P6J66L7k10N1J05
$$ -87 -3 -76 21 -113 -172 -139 -142 305 -147 244 -32 -37 135 -126 -10 -90 -36 -151 -154 -131 -55 111 148 -62 -11 94
6570I4J82m33k8L18j40QK02k48N2K75k56J28Ok6l81J23J79j83K74k97Q9p9J19
$$ 94 276 -157 -185 133 -7 1 203 -45 7 282 26 154 160 134 -247 -124 55 -128 146 -151 -62 -141 -22
6593b2J37k44M6K05q0j19K30J53k98Q2l29J76J33P0l23M4J56J50k17j47K14J28
$$ -22 115 -129 -83 122 42 -77 153 306 8 90 -239 -63 70 140 -183 -139 17 167 -50 -197 17 145
6615A45j29N0K8j12l5K59k51R6k24K5L89k22K06l28K01j3J25k05N8j41k07K38
$$ 145 16 66 94 -18 -53 206 -45 51 -173 -148 241 19 225 -103 98 85 210 5 63 -78 -285 -47
6637d7k0j67N8M31j87k58P2K74O7k32l0R5j77J27J71k17O6J54k1k28k0L6J56j69
$$ -47 -67 -234 -176 255 68 -190 -118 156 223 -9 -39 56 -121 6 177 -40 26 180 159 -69 -89 -53 103 -66
6661f6K21k49J75J88l8k64mm8J27Q7k02n1J71O2m2k9p0J85j82J28o5K3q9J67k72
$$ -66 155 -94 81 269 231 -33 -37 -85 42 129 -73 -124 47 109 67 38 -32 153 -29 99 34 57 -32 135 -137
6686a37P2m1J49K0q1K09k83rJ33k17J14NJ86j80J8p0K34J12j61k40K49M7j10J51
$$ -137 -65 -106 43 63 -18 191 -92 -101 32 -185 -71 -66 120 -60 -42 -112 122 234 73 -167 82 129 19 170
6710A70j75O7l8m0L0l16K39K25k43np6J96k4k3P4k76J58N1Q9K77m02L7k40L56
$$ 170 -5 62 24 -16 14 -302 -63 162 -81 -86 -162 34 10 -13 61 -215 -57 -6 83 360 -42 -5 -245 111
6734A11J6j1j23j3k4q0L26j98n3n5K94k75J9N5j2J70Q7l31Q9m8j0K79k88K3J21
$$ 111 127 116 -7 -20 -44 -124 202 4 -49 -104 190 -85 -66 -11 -23 147 234 -97 -8 -56 -66 213 -75 -52 69
6759F9P2k18J02j37K46j76j11R4J62j30k22N39l07q9j62J79Ml2J07K2R5l2QKk5
$$ 69 141 -77 25 -112 134 -42 -153 -59 103 -27 -249 290 -17 -106 -268 -89 -85 -117 -10 12 107 75 83 85 60
6784F0k31K16k44J19M03Q0n41Q3K1O5P1k64J70p1j97RK25k59L51k3k13J38J19
$$ 60 -171 45 -199 -80 323 403 -138 -55 -34 31 102 -162 8 -63 -260 -251 -26 -285 66 43 -170 -32 87
6807H7j76Q8m6R2j64n8J98o8m6K19j24j42M85m10j02k9K58Mj77M1O3J90l12J40
$$ 87 -89 -1 -47 45 -119 -177 21 -47 -93 126 2 -140 345 -65 -167 -196 62 66 -111 -70 -7 183 -129 11
6831A1j12K1R6M7q9O1k05J76N2M8k19P5O2k6K2J70o4k36K0K6J39j6j86P8Rj52
$$ 11 -101 -80 16 63 -26 35 -170 6 58 106 -113 -38 24 -2 20 190 126 -110 -90 -64 75 59 -127 -49 -40 -192
6857a92n1L10k6p2K16k85N8K05j10n0k6K4J3j64K92j92OK17j83j14k3L8J05L6
$$ -192 -243 67 41 -31 185 -100 -42 163 53 3 -23 1 14 -150 142 -50 -44 173 -10 -124 -147 -109 -4 32
6881C2j36L04k81L21k24p0k86N15k33J97j65RM8k6N6m4q7J84j62j60J63J68k3
$$ 32 -104 200 -81 240 16 -54 -340 175 -58 139 -26 -17 31 5 61 17 -70 114 -48 -208 -45 123 100
6904A00j99K49j08j67j01J73J2l4j8J51P2j53K29j18m5J82k67j57M38q3k37J82
$$ 100 -99 150 42 -125 -226 -53 -41 -75 -93 58 130 -23 206 88 43 225 -42 -199 239 156 -81 101
6926A01j51L67k33j79Lk6K23N5k3j96J41J96m27l4L38r5j81K16j38K84l66K54
$$ 101 -50 317 84 -95 -92 -118 105 160 137 -59 82 278 -149 -183 155 60 -121 95 -43 241 -125 129
6948A29Q4l02R2L6j94J94J20k21K85l73M32l95K49j31k81L13j50K3n6O7J32k45
$$ 129 213 -89 3 39 -155 39 159 -62 223 -150 282 -113 136 5 -276 37 -113 -90 -146 -79 53 -192
6970a92L42j74jqJ19J34r6k54M8J39k07J80J27K00m45J95n0J45R7m96J87J37k62
$$ -192 150 -24 -25 -33 86 220 124 -130 -82 57 -150 30 157 357 -88 107 57 202 299 -197 -10 127 -135
6993a35J59j29O4K4k1n0P5L09j96r3p0rK58k55K50q1j84K2L5r5k0k1o8L17k6k72
$$ -135 24 -105 -41 -17 -38 -88 -13 296 100 7 -63 -72 186 -69 181 100 -84 -62 -27 -122 -142 -163 -231 86 60 -212
7019b12K29J23k91J86k17J35N1j70J83j4J31j76J52L4J8p2J22j34j09J74j5p3
$$ -212 17 140 -151 35 -182 -47 4 -166 17 3 134 -42 110 144 162 90 212 78 -31 143 128 55
7041E5r3o4K03j69O3n2k34M07J02j11j19o1M0j28K41j40M1N8Q6p4k18L03j27K38
$$ 55 -38 -102 101 -68 -5 -57 -291 116 218 107 -12 -73 -33 -161 80 -60 -19 39 125 51 -167 136 9 247
7065B47k87J75j96N5k36K82n2l58M86J32n61K79j63K23J77k49J06j54l3J21j63
$$ 247 -40 135 -61 -6 -242 40 -12 -370 116 248 -313 -34 -197 26 203 -46 60 -94 -127 -6 -169
7086a69qK20j05M2j58J47R2j43J11J28j25j9l33L10mJ25k11J27J06j05q4j81m
$$ -169 -177 43 -62 -20 -178 -31 61 -82 29 157 32 13 -320 -10 -14 111 -100 27 133 28 -56 -237 -241
7109b41L60o1R9l86M55m0m4l7k13J43J62l01J77J05k25n4k3L12k12p0O9r5J12
$$ -241 119 58 157 -229 226 186 142 105 -108 35 197 -104 73 178 -47 -101 -124 188 -24 -94 -25 -120 -8
7132hqM3M7K6j97J89j12J31j14p5J40J4n0k43K08J05O3N5j11k08J32J01r2Lpj16
$$ -8 -16 27 74 100 -97 92 -20 111 -3 -78 62 76 26 -217 -9 96 159 214 103 -105 27 128 36 39 32 -84
7158h4n7N6J46k53P6Q7o0J27j7R4r4r8L0j79J44J04m6n0j7J52J10l56K27o1J1
$$ -84 -141 -85 61 -192 -116 -29 -89 38 21 115 21 -77 -47 -226 -82 22 -24 -74 -91 61 171 -185 42 -19 -8
7183hj17K11k08p6J01n3K07Qn0J11l76K88p2J69J88k74k41J63K04j58n5J21n9
$$ -8 -125 86 -122 -198 -97 -150 57 65 15 126 -250 38 -34 135 323 49 -192 -29 175 17 -38 83 24
7206B4j44J25J27m38K41J3j08jJ49j64O3j13J64j81M64k00j79K93q3Q3j00J25
$$ 24 -120 5 132 -306 -65 -52 -160 -161 -12 -176 -113 -226 -62 -243 221 21 -158 135 52 135 35 160
7228A60l43L34k78j6Q8L4L6J83n4l00Q5j56N33m40K97n1k61l6L01j12P7K1J24
$$ 160 -183 151 -127 -143 -55 -21 15 198 144 -156 -71 -227 306 -134 163 112 -149 -185 116 4 81 102 226
7251B26j07R5j15Q2p7j87K13l4rj24n6p1K27j5J18k98M5j59L07O3m79L32j03J90
$$ 226 119 214 99 181 104 -83 130 96 87 -37 -93 -164 63 48 166 -132 -87 -246 61 124 -355 -23 -126 64
7275F4p2J94o3k80L37L91l27n4k53K62k37J87k69J00J6J49l25K01q7J34j43O3
$$ 64 -8 186 123 -157 180 571 244 190 -63 199 -38 149 -120 -20 -4 145 -180 21 -66 68 -75 -12
7297a2k6L0Kp9J44k28J17J73j67l8K43j79J3J92k65J31j53K36j72j28l1K28p0
$$ -12 -38 -8 -6 -85 59 -169 -52 121 -46 -84 159 -20 -7 185 -80 51 -102 134 -38 -166 -197 31 -39
7320c9k64K49L28n8m24J09p9L43j55m4J67O2k06K3J49l22n0J88K77m25O3K29j83
$$ -39 -303 -54 274 216 -208 -99 -178 165 10 -34 133 195 -11 12 161 -161 -211 -23 254 -171 -108 121 -62
7343f2J9J21P1l38k4K08m4J99p2k10L49j33j60j60K84j14M4J79l42J56J16M1k97
$$ -62 -43 78 149 -189 -213 -5 -49 150 78 -132 217 84 -76 -236 48 -66 -22 157 -185 -29 87 128 -169
7366a69M35k84P1L2J00k61k09J90R0l0l7m8MM4j69J59j8J40K6k26J82J55n9k31
$$ -169 266 -18 53 85 185 -76 -285 -95 -5 -35 -72 -120 -116 -72 -241 -82 -100 40 66 -160 22 177 118 -113
7390a13K21k12P4m0j05Q6L1m3J25j96N1j55l4K6K71K78n29M63l68J05p6Q4p9J82
$$ -113 108 -104 -30 -70 -175 -89 -58 -101 24 -172 -121 -276 -310 -284 -13 265 -264 199 -169 -64 -140 -56 -135 47
7414D7R2l74L28j34N6O8j19R8J11j71O1j77J95k05J87P8j74R6qj25K17m1j39n1
$$ 47 139 -235 93 -41 15 83 -36 62 173 2 63 -114 81 -124 63 141 -33 63 55 -70 147 106 -33 -84
7438h4K6J31r6J14j15J34K7j24j40O5Q3Q5Qk01o0L89k49J13k01j70K73m4j15J25
$$ -84 -58 73 -23 91 -24 110 137 13 -127 -62 21 106 114 -87 -147 242 -7 106 -95 -265 8 -36 -151 -26
7462b6j73K2M45j16r9K6L25m61N5M6j23J69L2o4J61k21n5j12J96J69j20j76K92
$$ -26 -199 -177 268 152 53 79 404 -57 -2 44 -79 90 122 58 219 -2 -57 -169 27 196 76 -100 192
7485A92l57J46J10j68Rmr0M4J54L2K17l13o9J54j49L14N2j57l98K45l9J40j55
$$ 192 -165 -19 91 -77 -68 -72 -162 -118 36 68 285 -28 -97 57 -92 222 274 117 -281 -36 -75 65 -90
7508i0k2O1rj76K53J49k14R1k65L87p7k94J14L29j00k77K39k22l4J14J05j09O
$$ -90 -112 -51 -60 -236 17 166 -48 43 -222 165 88 -206 -92 237 137 -140 99 -123 -157 -43 62 -47 -41
7531d1n6k0K21O1l6L8k09p4N19m97K95l9P8k20j28RP9M6K92k37q4K7j12j16L19
$$ -41 -97 -117 104 165 129 167 -42 -116 403 -94 201 162 240 20 -108 -99 -20 26 318 81 -3 24 -88 -204 115
7556A15j98K40k69j78K45m5J35nj10R3rO3j02J17K1m8j54M6o7kJ56P5n5J8j91
$$ 115 -83 157 -112 -290 -45 -90 45 40 -70 23 14 77 -25 92 113 65 -89 -43 -110 -112 44 119 64 82 -109
7581a09J34K27j00k57J84k87M23l20J1J14k83K30j3m6J52o4j34J07k14L01k89
$$ -109 25 252 152 -105 79 -208 215 -105 -94 20 -263 -33 -46 -92 60 -4 -138 -31 -245 56 -233
7602b33J65M5KR6k87J05j24K44O6j66Q4R3k08r3K31j3j82j47O5L16l92K25R5j76
$$ -233 -68 -23 -21 75 -212 -107 -231 13 79 -87 -3 90 -118 -211 20 7 -175 -322 -257 59 -333 -108 -13 -189
7626a89K87j89K00j63o7K43J4K24l51J24Kl09L76j48N8o0n4J42k21K13k69P2Q6
$$ -189 98 -91 109 -54 -121 122 136 360 9 133 135 -174 202 54 112 52 -2 140 -81 132 -137 -65 21
7649B1o0j95K08lJ48o7N4j34M7j4J35l51K20Lr6L60l31J08K5MJ03j77mJ33k92
$$ 21 -39 -234 -26 -29 119 52 106 -28 19 5 140 -211 9 12 -84 276 -55 53 78 82 185 8 4 137 -155
7674a55R3J61q7J20j77k3K4l7J41j08k0P3n2L1lR0J17j64J06nj81J87l14L41j05
$$ -155 -62 99 12 132 -45 -68 -44 -81 60 -48 -68 5 -47 -16 -19 71 188 24 130 125 -56 131 -183 158 53
7699E3n1K02l25K43OK1l44O8J0j8J64k38R3j3J80o8K77j94J61l19m2M02k19j45
$$ 53 2 204 -121 122 128 149 -195 -127 -117 -135 29 -209 -116 -129 51 -17 260 66 227 -92 -134 268 49 -96
7723i6j61J07J52J24L8l17L52m7j1o8Rm3k97Q8K6o9L62k93J23J86n7J45m17K2
$$ -96 -257 -150 2 126 164 -153 199 152 141 73 82 39 -258 -170 -144 -213 149 -144 -21 165 108 253 -164 -142
7747a42K08o4j34oP3K96k56jK7N4k12lK24r9R3m0J20o5J10k61J74N5j16L8M3j10
$$ -142 66 2 -132 -138 -65 231 -25 -26 1 55 -157 -160 64 -35 58 18 138 73 183 -78 96 151 35 73 116 6
7773FO7M3n8j11J16k5k32M9M6N0O6l0l78P16j82k94j7K82j86J11j37Q2R2p1K1
$$ 6 73 116 58 -53 63 38 -194 -145 -99 -49 17 -13 -391 325 143 -151 -168 114 -72 39 -98 -16 76 5 26
7798B6J57J20q9o6p0J06l54O9J70J34n16K26J26j19M7n5J89l6m6O3j73J00K10
$$ 26 183 303 214 148 78 184 -170 -101 69 203 -313 -87 39 -80 -33 -88 101 65 19 82 -91 9 219
7821B19k09j34J29J17N6l51J92M9j97L1j50K49q0L19m1m5j9k44M8kk49J47J65
$$ 219 10 -124 5 122 178 -173 19 68 -129 -98 -248 1 -79 240 199 154 135 -109 -61 -63 -312 -165 0
7844@Jr5K55j05j56J93j66j91K27o2K88q7Q4j16R0j53K00m3m13K27rP7l4j1j88
$$ 0 1 -94 161 56 -100 93 -73 -264 -37 -99 189 102 186 70 160 7 207 164 -249 -22 -31 46 12 1 -187
7869a87j8J39q0L67l75L15j41j54K39j31K2K69j83J86k02k21J36M89n11p9L26
$$ -187 -205 -66 -146 221 -154 161 20 -134 105 -26 -4 265 82 268 66 -155 -19 470 -41 -120 206
7890B06l9j36P7r8j68J60J41q3J72k13k04J33j6K19o2j24K07o7j66j7J51k2n9
$$ 206 167 31 108 10 -158 2 143 60 232 19 -185 -52 -68 151 89 -35 172 105 -61 -78 73 51 -8
7913hp4j6J45j04J61l42J14R9N1j9j23P1oJ28j51K33k27R9j7j22J80M6R9k88J53
$$ -8 -82 -98 47 -57 104 -238 -124 -25 26 7 -116 -45 -51 77 -74 159 -68 31 14 -108 72 118 217 -71 82
7938H2l00P6L78j81j6o2K35j60j30n4J89O0Rj68M6L4q2qJ58j19j04l9J79j0j01
$$ 82 -218 -142 236 55 39 -23 212 52 -78 -132 57 117 126 -42 4 38 -44 -52 106 -13 -117 -156 23 13 -88
7963h8P3J31j53p6P3J59j85J73k00K32k53KK01L3j39J0j05k5J35J17o4l70L04
$$ -88 -15 116 -37 -113 -40 119 -66 107 -93 139 -114 -112 89 122 -17 -7 -112 -137 -2 115 51 -319 -15
7986a5q6J20K5N0n6j43J37l2J67k18N1J02l28K32j52L56l18J47L8O8j68K82q6
$$ -15 -101 19 44 94 38 -105 32 0 167 -51 0 102 -226 6 -146 210 -108 39 77 145 -23 259 173
8009A73r6K41k72J14l10R7jj83J6l2K74Q7L9J14k70m8K55j3j84j18K94k19k4n
$$ 173 77 318 46 160 -150 -53 -54 -237 -221 -253 21 108 147 261 -9 -57 198 185 1 -117 177 -42 -66 -71
8033g1J89j03k55K45r0Q3R9j11K5J10j71pM6N5n65N09o1J09j7j95J07j19M39k03
$$ -71 118 15 -240 5 -85 -2 97 -14 11 121 -50 -57 -11 44 -521 -12 -73 36 19 -176 -69 -188 251 48
8057D8j67k5N8j00Q8L4o0J07Q3J5j44O7j16L19j89n2J30p1L8j39L06o4K3j07k09
$$ 48 -119 -144 -86 -186 -98 -64 -124 -17 66 81 -63 4 -112 207 18 -34 96 25 63 -76 230 166 189 82 -127
8082a27J3K3K18q2j49M1j12J57j32K44K08l02J55j75j91J8L82l6n69L39Q3k74
$$ -127 -114 -91 127 45 -104 -63 -175 -18 -150 94 302 0 155 -20 -211 -193 189 153 -416 -77 6 -268
8104b68M10j31K3j9K5Kj13k1rJ77q6J07k25lJ75l13L45r1K1j33Q9Q7j18j22K7
$$ -268 142 11 34 15 40 42 -71 -92 -101 76 -10 97 -128 -131 44 -269 76 -15 6 -127 -38 49 -69 -191 -164
8129a64J24J7p6K13j23o5J00R1r2J20n2k52J70j37j00L92l66K01N8j62P6J31K2
$$ -164 -40 -23 -99 114 -9 -74 26 117 25 145 93 -159 11 -126 -226 166 -200 1 59 -103 -27 104 126
8152A26l11K53k92J79L8j5R8k26K56l9N8j35n8K10p6k70K79j74J97O8k40Ko9Q
$$ 126 -185 68 -224 -45 -7 -22 76 -150 106 67 125 -10 -68 142 66 -204 75 -99 98 166 -74 -72 -141 -133
8176a33k5L48k58N5pj49k8J55j3K45k32R8L2K2j17
$$ -133 -158 190 -68 -13 -20 -169 -197 -42 -55 190 -42 56 88 110 -7
8191g
$$ Imaginary data points
##PAGE= N=2
##DATA TABLE= (X++(I..I)), XYDATA
0@%%%%%%%%%%%%%l2O4o4O4o8J00j28J58j90K24k57K89l52M16m80N45o13P09q10
$$ 0 0 0 0 0 0 0 0 0 0 0 0 0 0 -32 32 -32 32 -36 64 -64 94 -96 128 -129 160 -192 224 -256 289 -324 385 -425
32d25R09j033J168j323J489j664J862k081K319k574K854l164L498l860M265m707
$$ -425 484 -549 619 -704 785 -879 983 -1098 1221 -1353 1501 -1663 1835 -2025 2240 -2467
48b467N187n714O293o933P643q431R313j0312J1446j2745J4251j6029J8156k0759
$$ -2467 2720 -2994 3299 -3634 4009 -4422 4891 -5421 6025 -6720 7531 -8498 9658 -11101
62a1101K4034k8292L4090m2483N5765q0062J38774n33526o97141J016929O08013
$$ -11101 12933 -15359 18731 -23752 32013 -48049 90725 -442801 -1139942 -123013 485000
73D85000k92393m21848L34806L69855m5549j90832M1250n6036j28138J03974K57065
$$ 485000 192607 -229241 105565 475420 429871 239039 280289 224253 96115 200089 457154
84D57154k13812n61403j72240L67315J14240l43187j19830L77802J66346l20368
$$ 457154 243342 -318061 -490301 -122986 -8746 -351933 -471763 -93961 72385 -247983
94b47983j87813L02848K83307m8551q2043R0689P1023J5121N6726k5118k13816
$$ -247983 -435796 -132948 150359 101808 19765 110454 181477 196598 253324 228206 14390
105A4390r2572K60628K37201k45049m48106j9023L86951J61636k66177k43031
$$ 14390 -78182 182446 419647 174598 -273508 -292531 94420 256056 -10121 -253152
115b53152M9644Q9814m0151m0601k3571p3145O9290L22907J99702k15011k42808
$$ -253152 -203508 -113694 -153845 -194446 -218017 -291162 -221872 101035 300737 85726 -157082
126a57082J74563L35069J3679k14195l7157J33226k5365k29227j48607N0903O2725
$$ -157082 17481 352550 366229 152034 114877 248103 222738 -6489 -155096 -104193 -41468
137d1468m1200l0834K4414l4352p9507J7056P4536n594Q342J63585J47351r2032
$$ -41468 -82668 -113502 -89088 -123440 -202947 -185891 -111355 -116949 -108607 54978 202329 110297
149A10297j78933J6933J68860P3332p8204p6715K5494O4411j2611r7970p4243
$$ 110297 -68636 -51703 117157 190489 112285 35570 61064 125475 112864 14894 -59349
160e9349K3220P8042M6871m1997j33631j27007O797J01761L2072n8346o746R5000
$$ -59349 -36129 41913 88784 46787 -86844 -213851 -207054 -105293 -73221 -131567 -138313 -43313
172d3313Q8834j300n2626m289J02182J34205K1802j02608q7974o747p22l7661
$$ -43313 45521 44221 -8405 -12694 89488 223693 245495 142887 54913 48166 47444 9783
184I783l4261q546Q506J2874k6226q7594o7414M1384J01966N2890j2559j2369
$$ 9783 -24478 -33024 -24518 -11644 -37870 -125464 -192878 -151494 -49528 3362 -9197 -21566
196b1566K7106L0334k1802m8026K2765J02580N6832n2366p1306j6959J1352J7859
$$ -21566 5540 35874 14072 -33954 -11189 91391 148223 95857 24551 7592 18944 36803
208C6803K1690r239l3943P194K5995o0240j28100m5453Q3735R0600p809o7332
$$ 36803 58493 49254 15311 22505 48500 -11740 -139840 -185293 -101558 -10958 -18767 -86099
220h6099k1461N4358N9801R061J98M2821N7246K7460j0224n8912q4841j4723Q1423
$$ -86099 -107560 -53202 6599 15660 15858 58679 115925 143385 133161 74249 -10592 -25315 56108
233E6108M2749p7996q2324J1199K3343m7909n2115K5827P3672M4474j0895l7000
$$ 56108 98857 20861 -61463 -50264 -26921 -74830 -126945 -101118 -27446 17028 6133 -30867
245c0867k0508J1031K9001L5222K3063l860j343K5224k633o8710l6743P8489R2000
$$ -30867 -51375 -40344 -11343 23879 46942 43082 41739 66963 64330 -4380 -41123 37366 129366
258A29366k5413q8869l3000J1130j6291l9033k1796P849K9661K4366j6208m8968
$$ 129366 103953 15084 -17916 -6786 -23077 -62110 -83906 -76057 -46396 -22030 -38238 -87206
270h7206k4880M4079R2405O4279j3654l9319J9478M4962k5145o8355k996N9652
$$ -87206 -112086 -68007 24398 88677 75023 35704 55182 100144 74999 6644 3648 63300
282F3300K4280m1625o2407n0276j5914K7320L0247p491j2695J9801K2363j8251
$$ 63300 87580 45955 -16452 -66728 -82642 -55322 -25075 -32566 -45261 -25460 -3097 -21348
294b1348m2549j1537M9239P2022K0453m3800l1964K0066K3381n867k523K3224
$$ -21348 -63897 -75434 -26195 45827 66280 22480 -9484 10582 33963 28096 25573 48797
306D8797K9036J3526k3421o8452n8108J3786M7526j060m5452k7376O618Q373j2952
$$ 48797 77833 91359 67938 -514 -58622 -44836 2690 1630 -43822 -71198 -64580 -56207 -69159
319f9159j9321J7040P1925O9528J531m3763k1011J8234L0195J6989j0053k3176
$$ -69159 -88480 -71440 485 70013 71544 27781 6770 25004 55199 72188 62135 38959
331C8959l84J1074l2652o8987k5689M3115M8040K451l5103l4613k290K3271N125
$$ 38959 38575 49649 16997 -51990 -77679 -34564 13476 15927 -19176 -53789 -56079 -32808 -27683
344b7683j7942Q863M5964K7596k0696l7369j2902K8169N4496L1367j6619k2242
$$ -27683 -45625 -36762 9202 36798 16102 -21267 -34169 -6000 48496 79863 63244 41002
356D1002Q647O034l0219l8021p356K1853K0704j7034o0966n0113J3869M4842J4842
$$ 41002 49649 55683 25464 -12557 -19913 1940 22644 5610 -55356 -105469 -91600 -46758 -31916
369c1916n830J4499L3256K0278p862k7070o772M3384N4647K002m4703l5100o244
$$ -31916 -37746 -23247 10009 30287 22425 -4645 -11417 31967 86614 88616 43913 8813 2569
382B569K386k852j1991o392K0362K6208k0078n9124k8667K8159L9002J0931j2962
$$ 2569 4955 2103 -9888 -16280 4082 30290 10212 -48912 -77579 -49420 -10418 513 -12449
395a2449j4085M351J4825n774k2133J2017N5876M3643n737l3101k4781K430K2351
$$ -12449 -26534 -22183 -7358 -13132 -35265 -23248 32628 76271 70534 37433 12652 15082 37433
408C7433Q422k5147k2241Q006L435l5583m6679j2819K9947M4469J8242k4698k6227
$$ 37433 45855 20708 -1533 6473 9908 -25675 -72354 -85173 -55226 -10757 7485 -17213 -43440
421d3440J6113L4874O981q826J1354K8090J6140j4417l9967l0707J5040L9624
$$ -43440 -27327 7547 14528 5702 17056 45146 61286 46869 6902 -23805 -8765 30859
433C0859J0072k3615j8261k562l528j0835j5536m962K4272L3750p622m7252k7145
$$ 30859 40931 17316 -945 -3507 -7035 -17870 -33406 -38368 -14096 19654 12032 -35220 -62365
446f2365J9394L0273J2141J757P838K1061J7815j4209l5764n639L7685L3757o952
$$ -62365 -42971 -12698 -557 1200 9038 30099 47914 33705 -2059 -7698 29987 63744 56792
459E6792l4811l4944j3257Q549J168k3311r405L1688K9775j6695l7715j1140K6254
$$ 56792 21981 -12963 -26220 -17671 -16503 -39814 -49219 -17531 12244 -4451 -42166 -53306 -27052
472b7052M0510K3558q647j8095K498J0998p948j8889q29K1230K4171m44l6216
$$ -27052 13458 37016 28369 10274 12772 23770 15822 -3067 -3896 17334 41505 41061 4845
485D845l7394N366K9712K997j7507J475J3422o632k3862j7872j40K4058L6479
$$ 4845 -32549 -27183 2529 5526 -11981 -10506 2916 -3716 -27578 -45450 -45590 -21532 14947
498A4947J4551k0252k1172P824K1629O607r727m90K6238K2488k7273n8749k0679
$$ 14947 29498 9246 -11926 -4102 17527 24134 14407 13917 40155 62643 35370 -23379 -44058
511d4058K8522K3391p122j2441p014o500J738M445j0407o943L0176M6443O363
$$ -44058 -15536 7855 733 -11708 -18722 -25222 -23484 -19039 -29446 -36389 -6213 40230 46593
524D6593l9230l1969J1425L3162J0598j6583n247J8779L609k7849k4023K501J1882
$$ 46593 7363 -24606 -13181 19981 30579 13996 8749 27528 31137 3288 -20735 -18234 -6352
537f352J3427J3424r486l5318j6215J9097R792j5723L53L2483K1201j9873l0998
$$ -6352 7075 20499 11013 -24305 -40520 -21423 -11631 -27354 -27001 5482 26683 6810 -24188
550b4188q3L0461K6122M90p436J570q29j1016j1257j1468j1713J1110L3558q5
$$ -24188 -24271 6190 32312 32802 25366 26936 26107 15091 3834 -7634 -19347 -8237 25321 25236
564B5236n3732l7295K6534L8955l895j7252J1102K4609N071j5594j7677k201J7094
$$ 25236 -28496 -65791 -39257 -302 -4197 -21449 -10347 14262 19333 3739 -13938 -16139 955
577I55K7071J7748j1314l2782j7450J9777J8306j8170j9393K3146K4847k6198
$$ 955 28026 45774 34460 1678 -15772 4005 22311 4141 -15252 7894 32741 6543
589F543m2994l671K0957P745n29N866K593n561l032K0j179O487K3790K6483J233
$$ 6543 -36451 -40122 -19165 -11420 -11949 -6083 -3490 -9051 -12083 -12063 -13242 -6755 17035 43518 44751
604D4751k9996k4619J3849K6072p578k7535L84K0075m079k8920k3395k856J7962
$$ 44751 14755 -9864 3985 30057 22479 -5056 -4672 15403 11324 -17596 -40991 -43847 -25885
617b5885L1610J3511k3446k6438Q512K5409L302j2679J769K1442J8028p377k6093
$$ -25885 5725 19236 -4210 -30648 -22136 3273 6575 -6104 -4335 17107 35135 27758 1665
630A665j4097J1287K0159R163l224j4783j6065k100K798j2369j1908J6056K3983
$$ 1665 -12432 -1145 19014 28177 24953 10170 -5895 -7995 -5197 -17566 -29474 -13418 10565
643A0565q144k7659q764J1235J1243P336O582O787J1317P624j1123k0634k07K3811
$$ 10565 2421 -25238 -34002 -22767 -11524 -4188 2394 9181 20498 28122 16999 -3635 -3842 19969
657A9969K0134n546k4974k0986o29P862n954j3204K851J7361J0700n343k0173
$$ 19969 40103 34557 9583 -11403 -12032 -4170 -10124 -23328 -20477 -3116 7584 2241 -17932
670a7932k1976N014L9004K5461j9277k4332J1909K0784o590j6645L757J9272J3819
$$ -17932 -39908 -34894 4110 29571 10294 -14038 -2129 18655 12065 -4580 -823 18449 32268
683C2268j440j5814k1592j0721Q561J6569K061j6250j0488R497L334k5025j6756
$$ 32268 30828 15014 -6578 -17299 -8738 7831 9892 -6358 -16846 -7349 -4015 -29040 -45796
696d5796K7825L3834n035j9854M592J1830l108q01J1756O214j008P214N54k7096
$$ -45796 -17971 15863 10828 -9026 -4434 7396 4288 3487 15243 21457 20449 27663 28217 1121
710A121l1380O793L7276J3768k9725k7244J5377K3130j5749k9604P676L2309J2673
$$ 1121 -30259 -23466 13810 27578 -2147 -29391 -14014 9116 -6633 -36237 -28561 3748 16421
723A6421o486q597j5080j1817J9556L3775l2k5875j363K3233J741k9535j8261
$$ 16421 9935 1338 -13742 -25559 -6003 27772 27740 1865 502 23735 25476 -4059 -22320
736b2320J8578K7365l70k1933j4807r60j887k594N926N021j138Q112J1001j5011
$$ -22320 -3742 23623 23253 1320 -13487 -14447 -16334 -18928 -13002 -7981 -9119 -1007 9994 -5017
750e017k3877J4050L9839Q861k4289q801J5945L514j9372j5799N514J7148J0583
$$ -5017 -28894 -14844 24995 33856 9567 766 16711 20225 853 -14946 -9432 7716 18299
763A8299n592j6639j8647n012J6818K1937m956k2490K691K7653P7l3896j2231
$$ 18299 12707 -3932 -22579 -27591 -10773 11164 6208 -16282 -13591 14062 14139 -19757 -31988
776c1988K9833K8224l080j4492q436l467J955O737K972l871J480P079L88j7051
$$ -31988 -2155 26069 22989 8497 61 -3406 -1451 5286 8258 4387 5867 12946 13334 -3717
790c717k1393m24K3069J4312j3705j4279Q166R332q957q360J0333J7510J0575
$$ -3717 -25110 -25534 -2465 11847 -1858 -16137 -7971 1361 -7596 -15956 -5623 11887 22462
803B2462K00j3113j6920o45J4613O304q772p292M683O252o527j8114j0092J4973
$$ 22462 22662 9549 -7371 -8016 6597 12901 4129 -3163 1520 7772 1245 -16869 -26961 -11988
817a1988K4225L422j6875j2166J873P156N418l86m439N907J5349J002k0957j5221
$$ -11988 12237 15659 -1216 -13382 -11509 -4353 1065 679 -3760 2147 17496 18498 -2459 -17680
831a7680J0699J9241O997o773j0444m909K958j508j0198m592J1269J2279k155
$$ -17680 -6981 12260 19257 12484 2040 -2869 89 -1419 -11617 -16209 -4940 7339 5184
844E184j3311j1530J06J4397J3966j401m763O995P789p467j4371l419J0292J3808
$$ 5184 -8127 -19657 -19551 -5154 8812 7411 2648 9643 17432 9965 -4406 -7825 2467 16275
858A6275M374j3860j8399j659J0055K84p579Q32J0097P265l921j3755j1751O319
$$ 16275 20649 6789 -11610 -13269 -3214 -2930 -10509 -9677 420 7685 3764 -9991 -21742 -15423
872a5423K0632J0127p563q996M80M914R61m983m634R155J7696J276k0831j5871
$$ -15423 5209 15336 7773 -1223 -743 4171 5132 149 -4485 4670 22366 23642 2811 -13060
886a3060L286R281K014k782m082j686K731j512j0995n580J2416J8873O406p499
$$ -13060 -9774 -493 1521 -1261 -5343 -7029 -4298 -5810 -16805 -22385 -9969 8904 15310 7811
900G811j0660j383R512O648n553m791R598Q839r346j7414p846M517J1153Q152
$$ 7811 -2849 -4232 5280 11928 6375 1584 11182 20021 10675 -6739 -14585 -10068 1085 9237
914I237n259j3231k014P103q43q679n10J1315J2659J755j2200j3143L108J6315
$$ 9237 3978 -9253 -11267 -4164 -5007 -13686 -14196 -2881 9778 11533 -667 -13810 -10702 5613
928E613Q148m266k530M709J451m903r151p807M445J4843M329j5579j5302j2N570
$$ 5613 13761 9495 6965 11674 13125 8222 -929 -8736 -4291 10552 14881 -698 -16000 -16012 -10442
943a0442J967j089R38O275R509Jj2695q676R723J6497O113m647p749l961K696
$$ -10442 -8475 -9564 -8626 -2351 7158 7159 -5536 -14212 -4489 12008 18121 13474 5725 1764 4460
958D460J139q433n283J0774J3096m713j6411j0892J220Q626P942k008o241K122
$$ 4460 5599 -2834 -8117 2657 15753 11040 -5371 -16263 -15043 -6417 1525 -483 -6724 -4602
972d602O642l684j1250j224J1171J5005P018o975j3406k151R969L420o499j453
$$ -4602 2040 -1644 -12894 -14118 -2947 12058 19076 12101 -1305 -3456 6513 9933 3434 1981
986A981O820L202o648j3209j1137J959J4679Q275o765p776K084M028j302l034
$$ 1981 8801 12003 5355 -7854 -18991 -17032 -2353 5922 -843 -8619 -6535 -2507 -3809 -6843
1000f843O71Q315J2726K640j3807j3016L575J0497L927k040l010R1L119k234j2136
$$ -6843 -6172 2143 14869 17509 3702 -9314 -5739 4758 8685 6645 3635 3726 6845 4611 -7525
1015g525q672R296J5411J303j1289r433j632M932N345j274k519P015J1019j840
$$ -7525 -16197 -6901 8510 9813 -1476 -10909 -12541 -7609 -2264 -3538 -6057 958 11977 10137
1029A0137j2062o642N915J1366P751l733j1113l832M316j444r664k125R315Q317
$$ 10137 -1925 -8567 -2652 8714 16465 12732 1619 -2213 2103 659 -9005 -11130 -1815 6502
1043F502j123q642r846n9J1115P875l075l192M245L145m624p460l991N814J3883
$$ 6502 5379 -3263 -13109 -13168 -2053 5822 2747 -445 3800 6945 2321 -5139 -9130 -3316 10567
1058A0567N593j0315j2329J348O591N20l638k46L185N553m35j2251j1580M690
$$ 10567 16160 5845 -6484 -5136 1455 1975 -1663 -1909 1276 6829 6394 -5857 -17437 -12747
1072a2747J4902N749m519n952j617L485L399k862l409O715J1756l83j2071r983
$$ -12747 2155 7904 3385 -2567 -4184 -699 2700 -162 -3571 3144 14900 14517 2446 -7537
1086g537j008N469O142l6o006j123N938j225r881l036R882J0667K492n996q942
$$ -7537 -8545 -3076 3066 3030 -2976 -4099 1839 614 -9267 -12303 -2421 8246 10738 4742 -4200
1101d200j876O133L708m128j615O313N426l627r064q102J497J3255Q548p427j0766
$$ -4200 -6076 57 3765 -363 -1978 4335 9761 6134 -2930 -11032 -9535 3720 12268 4841 -5925
1116e925R81N624k015n281j290M908R046M085q874j2194J457J1573P219r30l640
$$ -5925 -4944 680 -1335 -6616 -7906 -2998 6048 10133 1259 -10935 -9478 2095 9314 8384 4744
1131D744j159J735k28p839p758N234J1661J482q567p216j564K325M521K695j999
$$ 4744 3585 5320 5092 -2747 -10505 -5271 6390 7872 -695 -7911 -9475 -7150 -2629 66 -1933
1146a933J956Q013J18j1785p803P056J1801M593n185p591l35M600j446p068j062
$$ -1933 23 8036 8154 -3631 -11434 -4378 7423 12016 6831 -760 -1095 3505 2059 -5009 -6071
1161f071P968O446j190p279j0205m038R395J1202l519r849K488Q080j429q244
$$ -6071 1897 8343 7153 -126 -10331 -14369 -4974 6228 2709 -7140 -4652 3428 1999 -6245
1175f245k768P631J1461N060n848r566k555L662K549j86j695j812K589K014q585
$$ -6245 -9013 -1382 10079 15139 9291 -275 -2830 832 3381 3195 1500 -312 2277 4291 -4294
1190d294j1976L059J4546N571p094m401K206Q35j189o95L74N328Q465J623q403
$$ -4294 -16270 -13211 1335 6906 -188 -4589 -2383 -1548 -2737 -3432 -3058 2270 10735 12358 3955
1205C955r562k98Q794O847k707q084j13P706k107j3689m994R582R300k39n249
$$ 3955 -5607 -5905 2889 9736 7029 -1055 -1168 6538 4431 -9258 -14252 -4670 4630 4391 -858
1220h58o482m569M066Q879J523n002K448R400K275r118r655K501J2479O499p085
$$ -858 -7340 -11909 -7843 1036 2559 -2443 5 9405 11680 2562 -7093 -4592 7887 14386 7301
1235G301q693K14K124m386l295K093K987K634L330m384j1209k132J0734P602l643
$$ 7301 -1392 -1178 946 -3440 -6735 -4642 -1655 979 4309 -75 -11284 -13416 -2682 4920 1277
1250A277l462L865M875k621p051l396P018J0865J700q262o726r30K025K845j048
$$ 1277 -2185 1680 6555 3934 -3117 -6513 505 11370 13070 4808 -1918 -2848 -823 2022 974
1265I74n075J47P994R05j2311r151O849J1281L091k903l315j608L062L122j826
$$ 974 -4101 -3954 4040 4945 -7366 -16517 -9668 1613 4704 1801 -1514 -3122 -60 3062 1236
1280A236k449L772P302J194p100q829k149O837O832l562o162K236L513m899p143
$$ 1236 -1213 2559 9861 11055 3955 -4874 -7023 -186 6646 3084 -3078 -842 2671 -2228 -9371
1295i371M77N426N433L216k928p476j851N831L640k368j5M976M178j989p341o776
$$ -9371 -8894 -3468 1965 5181 2253 -5223 -7074 -1243 2397 29 14 4990 9168 7179 -162 -6938
1311f938K613R563L644n204n850p81Q06j99j968l010K406R259L039q802q080L303
$$ -6938 -4325 5238 8882 3678 -2172 -2953 -2147 -2346 -4314 -7324 -4918 4341 7380 -1422 -9502 -6199
1327f199P281L205k26r78j633R24J150l987m538L115P563K523m768p473k641L837
$$ -6199 1082 4287 4061 3083 1450 2374 3524 -463 -5001 -1886 5677 8200 3432 -4041 -6682 -2845
1343b845M365k401k503L956M115l882o221j238K057M828O102L33o885l389M938
$$ -2845 1520 -881 -3384 572 4687 805 -5416 -6654 -4597 231 6333 6666 -219 -3608 1330
1358A330K299m939k421N706O087n53q278p580R90O836L015j929j454K84n16Q16
$$ 1330 3629 -1310 -3731 1975 8062 7509 -769 -8349 -7359 -523 2492 563 -891 -607 -1123 -307
1374c07r13m193N44R693O842o773r839Q6N643J410j941n4J620K034j105n418m966
$$ -307 -1220 -5413 -4869 4824 11666 4893 -4946 -4860 783 2193 252 198 1818 3852 2747 -2671 -7637
1391g637K214O083M035p64n007l794K762L636l024m058N992Q533j729q217l350
$$ -7637 -5423 660 4695 3931 -1076 -4870 -2108 1528 -1496 -5554 438 8971 7242 -975 -4325
1406d325J464L073M096J038l892k453K008L33n367m184L346P881M006n712q361
$$ -4325 -2861 212 4308 5346 1454 -999 1009 1342 -4025 -8209 -4863 3018 7024 1312 -7049
1421g049k25O864K177k444M98M690J203k255k993l997j172O678O827l007p689
$$ -7049 -7274 -410 1767 -677 -179 4511 5714 3459 466 -3531 -4703 1975 8802 5795 -1894
1436a894j802K798L42k657j947L089O130J109p623n963K370N664K302N57j65j341
$$ -1894 -3696 -898 -556 -3213 -5160 -2071 4059 5168 -2455 -8418 -6048 -384 1918 2475 2310 969
1452I69P24J648l115m657L575Q493J782o301n505j498J726K571j496k240J591
$$ 969 1693 3341 226 -4431 -856 7637 9419 3118 -2387 -3885 -2159 412 -1084 -3324 -1733
1467a733L865j163o100l615K714O262N354n96n618j596M167J903m418q53N162
$$ -1733 2132 969 -5131 -8746 -6032 230 5584 4988 -630 -2226 1941 3844 -574 -1427 3735
1482C735L649r17m455n551k293M428M581j393l893N2J494j207l210k193K251P177
$$ 3735 7384 6467 2012 -3539 -5832 -1404 3177 1784 -2109 -2057 -563 -1770 -4980 -7173 -4922 2255
1498B255L907m447o061P09M423J436m26R79J078J681L23m809n716J414O140K407
$$ 2255 6162 1715 -4346 -3637 786 2222 1796 2775 3853 5534 5857 1048 -4668 -3254 2886 5293
1514E293l344m145j947N91J214j491k253L235O117O69n380l870J368M173M423
$$ 5293 1949 -2196 -4143 -3552 -2338 -3829 -6082 -2847 3270 3939 -1441 -5311 -3943 230 4653
1529D653M97k963j017L038m0n192k583L488M839O76l081n669k614K737K962j060
$$ 4653 5150 2187 1170 4208 4168 -1024 -3607 -119 4720 5396 2315 -3354 -5968 -3231 -269 -1329
1545a329k104K267K710r62l387l283J067O379N326k366m569M33K493n28j691l06
$$ -1329 -3433 -1166 1544 582 -2805 -6088 -5021 1358 6684 4318 -251 182 2675 2147 456 150
1561A50J932K598R66m762o998q8M848L242j879k205p3R14O95k312k757K608P389
$$ 150 2082 4680 5646 884 -6114 -6202 -1354 1888 9 -2196 -2269 -1355 -660 -2972 -5729 -3121 4268
1578D268K346m303m154l20J945K709M95j765L2L157l5o129l928K583M487J917
$$ 4268 6614 2311 -1843 -2163 -218 2491 2986 1221 1253 4410 4375 -1754 -5682 -3099 1388 3305
1594C305j339m330k138K116J584k085q42L474M205p1l302m160m28M644M651j143
$$ 3305 1966 -2364 -4502 -2386 -802 -2887 -3729 -255 3950 3879 577 -3583 -4011 633 5284 4141
1610D141l558N06J699j332l945j067J764L975K944l399o427q84L854K226o11m30
$$ 4141 583 1089 2788 1456 -2489 -3556 -1792 2183 5127 1728 -4699 -5583 -1729 497 -114 -544
1626e44J111J484L70l236m322J226O528L228k712l154o08K08N90l75j317J071
$$ -544 567 2051 2421 -815 -5137 -3911 2617 5845 3133 -21 -629 -421 169 -206 -1523 -452
1642d52M263P21n337m959R53L708K859K30k195j135K454L17l269k635L721M838
$$ -452 3811 4532 -805 -5764 -4811 -1103 1756 1986 -209 -1344 1110 1427 -1842 -4477 -756 4082
1658D082J366k896m353k005K551L151j283k478J933K886j036m218k693R97M563
$$ 4082 5448 2552 -1801 -3806 -1255 1896 613 -1865 68 2954 1918 -2300 -4993 -3996 567
1673E67M503j275n002j083K293O17j822k77J801K887J259l148n590o13N108K754
$$ 567 5070 3795 -1207 -2290 3 620 -1202 -1479 322 3209 4468 1320 -4270 -4883 225 2979
1689B979j856j391Q8M24o90j897j664J259N419K428l266l859p45K379J889P9j120
$$ 2979 1123 -268 -180 244 -446 -2343 -4007 -2748 2671 5099 1833 -2026 -2771 -392 1497 1576 456
1706D56q6L151K09m876m003K147M244J919j710k623k131J126K263j152k320K348
$$ 456 370 3521 3730 -1146 -5149 -3002 1242 3161 1451 -1172 -3303 -2177 86 -1066 -3386 -1038
1722a038M526M63l182l649o01L093M167j98k856q38K145l29k868j428J496K878
$$ -1038 3488 3951 769 -2880 -3481 -388 3779 3581 725 -113 2032 1703 -1165 -2593 -1097 1781
1738A781J928j776n055j981K988K113j028p53J528J746k12k077k817O10N183L338
$$ 1781 3709 1933 -3122 -5103 -2115 -2 -1030 -1783 -255 1491 1279 -798 -3615 -3005 2178 5516
1754E516k111l021n33Q87M68m86j948L74L559J545m790m927N06L789J702K77j448
$$ 5516 3405 384 -149 738 1206 720 -1228 -854 2705 4250 -540 -5467 -4961 -1172 530 807 -641
1771f41q78Q46J538k029k296J740M765K132k568k844j734J691K799j33k142K47
$$ -641 -1519 -673 865 -1164 -3460 -1720 3045 5177 2609 -235 -1969 -278 2521 2388 246 493
1787D93K431j023l488k379Q20K012L121m91l825j611K512J347k056qK514K796
$$ 493 2924 1901 -1587 -3966 -3146 -1134 1987 1496 -2329 -3940 -1428 -81 -2137 -2145 369 3165
1803C165M37k115l476l39L714K988j045k512j45K97m67j184k699M31M147K761
$$ 3165 3602 1487 -1989 -2328 1386 4374 3329 817 672 969 502 -682 -3381 -2950 1197 3958
1819C958l342m617k13K484J318J38j72L6J360J224j751l164O40M209K724r36k694
$$ 3958 616 -4001 -4214 -1730 -412 -274 -446 -410 950 2174 423 -2741 -2101 2108 4832 3896 1202
1836A202k023O05J494j143j936J255K998m52l567k328p0J294L059J359k128j408
$$ 1202 -821 -216 1278 135 -1801 -546 2452 2000 -1567 -3895 -3965 -2671 388 1747 -381 -1789
1852a789J720J062j936j440K028L686J639k007l963j588K648J932r75p93P77J81
$$ -1789 -69 993 -943 -2383 -355 3331 4970 2963 -1000 -2588 60 1992 1017 224 1001 1182
1868A182m37j424k618j177L508M288j352l955j165J634J146m22l1P33K763J110
$$ 1182 745 -679 -3297 -4474 -966 3322 1970 -1985 -3150 -1516 -370 -792 -823 -90 2673 3783
1884C783k361l257n99K707K334M78j049j995l35J168j797k783J067M319J481k941
$$ 3783 1422 -1835 -2434 273 2607 3085 2036 41 -294 874 -923 -3706 -2639 1680 3161 220
1900B20k671l10P33J897J161j044k05J928N60k313k493O64K745K844j32l668k026
$$ 220 -2451 -2761 -2028 -131 1030 -14 -219 1709 2269 -44 -2537 -1873 872 3716 3584 -84 -2110
1917b110J944J317j837j100K112J791m37j465k589j567K095L654K91k396n44J199
$$ -2110 -166 1151 -686 -1786 326 2117 1680 215 -2374 -3941 -1846 1808 2099 -297 -841 358
1933C58p0r51j263M57L072K547k172l467n56J547O69M28N5l06N24P48j757k982
$$ 358 288 -663 -1926 -1469 1603 4150 1978 -1489 -2045 -498 171 599 654 348 872 1620 -137 -3119
1951c119p3L684K341j160k282r05L18J216l29p26M20K535O18k293k593n4J559
$$ -3119 -3192 492 2833 1673 -609 -1514 -1196 20 -309 -1035 -615 1920 2538 245 -2348 -2402 -843
1968h43K522R71k390r79J382N53k085j645J669K677M86o56k427j737J143K006
$$ -843 1679 2650 260 -719 663 1216 -869 -2514 -845 1832 2318 1662 -765 -2502 -1359 647
1984F47J44r71K13R16l14j363j699r0K388K742p95k696n26J313O5j82K56L53R24
$$ 647 791 -180 33 949 635 -728 -2427 -2517 -129 2613 1818 -878 -1404 -91 -26 -208 48 401 1325
2003A325J332j550l289m31K806J853q25r58n11q6L8n76j351N6L411J128j564k359
$$ 1325 2657 1107 -2182 -2613 193 2046 1221 263 -248 -334 -296 -872 -2223 -2167 1244 2372 808 -1551
2021a551l91N45J959P06r08m20J518O70k122k069J123K158J213m39j379k128L12
$$ -1551 -1942 -1397 562 1268 360 -60 1458 2128 6 -2063 -940 1218 2431 1992 613 -1515 -1203
2038a203J298n06j123R66J704l3j613j808q01K060K614K47j758m15J170k58r69
$$ -1203 95 -411 -1534 -568 1136 1103 -510 -2318 -3119 -1059 1555 1802 44 -371 799 541 -428
2055d28k27O93J741J328o63l268j957K008J522k87o43k18Q80l10j148j791j69
$$ -428 -655 38 1779 3107 2444 -824 -2781 -773 749 462 -181 -399 481 171 -977 -2768 -2937
2072b937L159J738p89j752m17J16R24P94q13J57K261P43k096k510l57J833J658
$$ -2937 222 1960 1171 -581 -998 -882 42 836 23 180 2441 3184 1088 -1422 -1779 54 1712
2089A712k50j190j117J79L40j048j458J530K125P94r92j860j119J015K058O17
$$ 1712 1462 272 -845 -666 -326 -1374 -2832 -1302 823 1617 625 -1235 -2354 -1339 719 1336
2105A336j073P53J157m52j750r86K27J354K058j50k798j428P24M81l89m53Q48
$$ 1336 263 1016 2173 1721 -29 -1015 -788 566 2624 2474 -324 -1752 -1028 -547 -936 -1389 -541
2122e41J076O37j302k537l46K237K233l95n68M18p13J79J14j008j71K430J682
$$ -541 535 1172 -130 -2667 -3013 -776 1457 1062 494 912 199 378 492 -516 -687 1743 3425
2139C425k036k418n14O64J061R4n80l41J046K56j769j741Q85K293J293n29j144
$$ 3425 1389 -1029 -1543 -879 182 276 -304 -645 401 657 -1112 -2853 -1968 325 1618 1089 -55
2156e5j206M70J489m1j600J239K173j1j916j301o14O15K213K72j670j066J042
$$ -55 -1261 -791 698 657 -943 296 2469 2458 542 -759 -1373 -758 1455 1727 57 -1009 33
2173C3J11j620q71J263J616R96n58k414q11J680J554m66j93M26M99K1p75j611
$$ 33 144 -1476 -2347 -1084 532 1528 970 -1444 -2255 -575 979 513 320 746 1245 1266 491 -1120
2191a120n38K187K068j174j902n18M46l4J33k25j29J651P68j486k532N67J487
$$ -1120 -1658 529 2597 1423 -479 -997 -551 -585 -452 -677 -806 845 1613 127 -2405 -1838 -351
2208c51J106J82l86j077L40J007n50j810R73K394M31j256j313r09L49J748k7r84
$$ -351 755 937 551 -526 -186 821 271 -1539 -566 1828 2259 1003 -310 -1219 -870 878 851 -133
2226a33l31J133j23j846j018R84J208J679K62j943j518J129J006o12m27Q57J018
$$ -133 -464 669 546 -1300 -2318 -1334 -126 1553 1815 -128 -1646 -517 489 -123 -550 307 1325
2243A325n8o31j692o25J355J996k32j621J65N0J8k85r31j12J967J474j325k536
$$ 1325 1267 636 -1056 -1681 -326 1670 1438 -183 -18 32 50 -235 -1166 -1278 689 2163 838 -1698
2261a698j07R46Q96M37j02l45L07P74p95k011K55K383J033n31j427r11K84R10
$$ -1698 -1805 -859 37 474 372 27 334 1108 313 -1698 -1443 940 1973 1442 15 -896 -612 298
2279B98j2r73L45J655K80j939j057k65R69J365P93j600j094Q27P77j129o84J004
$$ 298 286 -687 -342 1313 1593 -346 -1403 -1668 -699 666 1459 -141 -1235 -408 369 -760 -1444 -440
$$ [...]
8191A16
##END NTUPLES=NMR FID
##END=
