##TITLE=1H ikalashn
LR-788-O-C1
22.10.2024
##JCAMPDX= 6.0         $$ Bruker NMR JCAMP-DX V2.0
##DATA TYPE= NMR FID
##DATA CLASS= NTUPLES
##ORIGIN= UXNMR, Bruker Analytische Messtechnik GmbH
##OWNER= root
$$ TOPSPIN		Version 1.3
$$ 2024-10-22 09:29:05.906 +0400  Irina@DPX200
$$ Compression mode = diff/dup
##.OBSERVE FREQUENCY= 200.131300845
##.OBSERVE NUCLEUS= ^1H
##.DELAY= (6, 6)
##.ACQUISITION MODE= SIMULTANEOUS
##.ACQUISITION SCHEME= undefined
##.AVERAGES= 16
##.DIGITISER RES= 18
##SPECTROMETER/DATA SYSTEM= spect
##.PULSE SEQUENCE= zg
##.SOLVENT NAME= D2O
##.SHIFT REFERENCE= INTERNAL, D2O, 1, 15.99637
##AUDIT TRAIL= $$ (NUMBER, WHEN, WHO, WHERE, WHAT)
$$ ##TITLE= Audit trail, TOPSPIN		Version 1.3
$$ ##JCAMPDX= 5.01
$$ ##ORIGIN= Bruker BioSpin GmbH
$$ ##OWNER= Irina
$$ $$ F:/spectra/data/iren/nmr/1H/4/audita.txt
$$ ##AUDIT TRAIL=  $$ (NUMBER, WHEN, WHO, WHERE, VERSION, WHAT)
(   1,<2024-10-22 09:28:41.234 +0400>,<Irina>,<DPX200>,<TOPSPIN 1.3>,
      <created by zg
	started at 2024-10-22 09:27:32.937 +0400,
	POWCHK disabled, PULCHK disabled
       configuration hash MD5:
       BE 6D 3F 07 2A EA 11 49 91 17 2B D3 AF B3 58 0D
       data hash MD5: 16K
       19 05 41 B7 BB D7 90 28 A0 EE F6 76 90 5C 8A CB>)
$$ ##END=
$$ 
$$ $$ hash MD5
$$ $$ 11 17 B9 EA F4 C4 55 0D 3B BB D4 AE 7E 77 33 BE
##$RELAX= 
##$RELAX= 
##$RELAX= 
##$RELAX= 
##$RELAX= 
##$RELAX= 
##$RELAX= 
##$RELAX= 
##$RELAX= 
$$ Bruker specific parameters
$$ --------------------------
##$DU= <F:/spectra>
##$EXPNO= 4
##$NAME= <1H>
##$PROCNO= 1
##$TYPE= <nmr>
##$USER= <iren>
##$AMP= (0..31)
100 100 100 100 100 100 100 100 100 100 100 100 100 100 100 100 100 100 
100 100 100 100 100 100 100 100 100 100 100 100 100 100 
##$ANAVPT= -1
##$AQSEQ= 0
##$AQ_mod= 1
##$AUNM= <au_zg>
##$AUTOPOS= <>
##$BF1= 200.13
##$BF2= 200.13
##$BF3= 200.13
##$BF4= 200.13
##$BF5= 200.13
##$BF6= 200.13
##$BF7= 200.13
##$BF8= 200.13
##$BYTORDA= 1
##$CFDGTYP= 0
##$CFRGTYP= 5
##$CHEMSTR= <none>
##$CNST= (0..63)
1 1 145 1 1 1 1 1 1 1 1 1 1 1 1 1 1 1 1 1 1 1 1 1 1 1 1 1 1 1 1 1 1 1 
1 1 1 1 1 1 1 1 1 1 1 1 1 1 1 1 1 1 1 1 1 1 1 1 1 1 1 1 1 1 
##$CPDPRG= <>
##$CPDPRG1= <>
##$CPDPRG2= <>
##$CPDPRG3= <>
##$CPDPRG4= <mlev>
##$CPDPRG5= <mlev>
##$CPDPRG6= <mlev>
##$CPDPRG7= <mlev>
##$CPDPRG8= <mlev>
##$CPDPRGB= <>
##$CPDPRGT= <>
##$D= (0..63)
0 2 0 0 0 0 0 0 0 0.06 0 0.03 0 0 0 0 0.0002 0 0 0 0 0 0 0 0 0 0 0 0 0 
0 0 0 0 0 0 0 0 0 0 0 0 0 0 0 0 0 0 0 0 0 0 0 0 0 0 0 0 0 0 0 0 0 0 
##$DATE= 1729574917
##$DBL= (0..7)
120 120 120 120 120 120 120 120 
##$DBP= (0..7)
150 150 150 150 150 150 150 150 
##$DBP07= 0
##$DBPNAM0= <>
##$DBPNAM1= <>
##$DBPNAM2= <>
##$DBPNAM3= <>
##$DBPNAM4= <>
##$DBPNAM5= <>
##$DBPNAM6= <>
##$DBPNAM7= <>
##$DBPOAL= (0..7)
0.5 0.5 0.5 0.5 0.5 0.5 0.5 0.5 
##$DBPOFFS= (0..7)
0 0 0 0 0 0 0 0 
##$DE= 6
##$DECBNUC= <off>
##$DECIM= 32
##$DECNUC= <off>
##$DECSTAT= 4
##$DIGMOD= 1
##$DIGTYP= 9
##$DL= (0..7)
0 120 120 120 120 120 120 120 
##$DP= (0..7)
150 150 150 150 150 150 150 150 
##$DP07= 0
##$DPNAME0= <>
$$ [...]
##$SW= 21.9926040160658
##$SWIBOX= (0..15)
0 0 2 0 0 0 0 0 0 0 0 0 0 0 0 0 
##$SW_h= 4401.40845070422
##$TD= 16384
##$TD0= 1
##$TE= 300
##$TE2= 300
##$TE3= 300
##$TEG= 300
##$TL= (0..7)
0 120 120 120 120 120 120 120 
##$TP= (0..7)
150 150 150 150 150 150 150 150 
##$TP07= 0
##$TPNAME0= <>
##$TPNAME1= <>
##$TPNAME2= <>
##$TPNAME3= <>
##$TPNAME4= <>
##$TPNAME5= <>
##$TPNAME6= <>
##$TPNAME7= <>
##$TPOAL= (0..7)
0.5 0.5 0.5 0.5 0.5 0.5 0.5 0.5 
##$TPOFFS= (0..7)
0 0 0 0 0 0 0 0 
##$TUNHIN= 0
##$TUNHOUT= 0
##$TUNXOUT= 0
##$USERA1= <user>
##$USERA2= <user>
##$USERA3= <user>
##$USERA4= <user>
##$USERA5= <user>
##$V9= 5
##$VALIST= <valist>
##$VCLIST= <CCCCCCCCCCCCCCC>
##$VD= 0
##$VDLIST= <DDDDDDDDDDDDDDD>
##$VPLIST= <PPPPPPPPPPPPPPP>
##$VTLIST= <TTTTTTTTTTTTTTT>
##$WBST= 1024
##$WBSW= 25
##$XGAIN= (0..3)
0 0 0 0 
##$XL= 0
##$YL= 0
##$YMAX_a= 233461
##$YMIN_a= -473114
##$ZGOPTNS= <>
##$ZL1= 120
##$ZL2= 120
##$ZL3= 120
##$ZL4= 120
##$ABSF1= 10
##$ABSF2= 0
##$ABSG= 5
##$ABSL= 3
##$ALPHA= 0
##$AQORDER= 0
##$ASSFAC= 0
##$ASSFACI= 0
##$ASSFACX= 0
##$ASSWID= 0
##$AUNMP= <proc_1d>
##$AXLEFT= 0
##$AXRIGHT= 0
##$AXTYPE= 0
##$AXUNIT= <>
##$AZFE= 0.1
##$AZFW= 0.1
##$BCFW= 1
##$BC_mod= 2
##$BYTORDP= 1
##$COROFFS= 0
##$CY= 7568.61572265625
##$DATMOD= 1
##$DC= 2
##$DFILT= <>
##$DTYPP= 0
##$F1P= 17.9538593292236
##$F2P= -4.03888763876832
##$FCOR= 0.5
##$FTSIZE= 32768
##$FT_mod= 4
##$GAMMA= 1
##$GB= 1
##$INTBC= 1
##$INTSCL= 1
##$ISEN= 128
##$LB= 0.02
##$LEV0= 0
##$LPBIN= 0
##$MAXI= 945.577
##$MC2= 0
##$MEAN= 0
##$ME_mod= 0
##$MI= -402.1523
##$NCOEF= 0
##$NC_proc= 0
##$NLEV= 6
##$NOISF1= 8.587773
##$NOISF2= 6.764455
##$NSP= 1
##$NTH_PI= 0
##$NZP= 0
##$OFFSET= 15.99637
##$PC= 1
##$PHC0= -40.38982
##$PHC1= 5.625349
##$PH_mod= 0
##$PKNL= yes
##$PPARMOD= 0
##$PPDIAG= 0
##$PPIPTYP= 0
##$PPMPNUM= 100
##$PPRESOL= 1
##$PSCAL= 0
##$PSIGN= 0
##$REVERSE= no
##$SF= 200.13
##$SI= 32768
##$SIGF1= 18.5376
##$SIGF2= -6.396296
##$SINO= 400
##$SIOLD= 32768
##$SREGLST= <1H.CDCl3>
##$SSB= 3
##$STSI= 0
##$STSR= 0
##$SW_p= 4401.40845070422
##$SYMM= 0
##$S_DEV= 0
##$TDeff= 0
##$TDoff= 0
##$TI= <>
##$TILT= no
##$TM1= 0
##$TM2= 0
##$TOPLEV= 0
##$USERP1= <user>
##$USERP2= <user>
##$USERP3= <user>
##$USERP4= <user>
##$USERP5= <user>
##$WDW= 1
##$XDIM= 8192
##$YMAX_p= 0
##$YMIN_p= 0
$$ End of Bruker specific parameters
$$ ---------------------------------
##NTUPLES= NMR FID
##VAR_NAME=  TIME,          FID/REAL,        FID/IMAG
##SYMBOL=    X,             R,               I
##VAR_TYPE=  INDEPENDENT,   DEPENDENT,       DEPENDENT
##VAR_FORM=  AFFN,          ASDF,            ASDF
##VAR_DIM=   8192,          8192,            8192
##UNITS=     SECONDS,       ARBITRARY UNITS, ARBITRARY UNITS
##FACTOR=    0.0002272,     1,               1
##FIRST=     0,             0,               0
##LAST=      1.8609952,     -62,             2
##MIN=       0,             -473114,         -473114
##MAX=       1.8609952,     233461,          233461
$$ Real data points
##PAGE= N=1
##DATA TABLE= (X++(R..R)), XYDATA
$$ [...]
1218C90j159m14M61N57N39Q77j96j569j358P3O68L04J220R55j68j335m26q4J55
$$ 390 -769 -1183 -722 -165 374 1251 1055 -514 -1872 -1799 -1131 -827 393 1348 1180 -155 -581 -665 -510
1237e10O99J292N19o21j147r86n88L58O22P66L77m72j051q62K60M25P11J140R76
$$ -510 189 1481 2000 1379 232 -754 -1342 -984 -362 404 781 309 -742 -1604 -1344 -919 -208 932 1908
1256A908q11j300k28J37m1O38J278K25j038j070o69k03R7P18P35M02o67j302o65
$$ 1908 1097 -203 -431 -294 -335 303 1581 1806 768 -302 -971 -1174 -1077 -359 376 778 111 -1191 -1856
1275a856L72M45N64J198Q75p12j195j73M08L02O27J102K68j097j036n24n58K34
$$ -1856 -1484 -1039 -475 723 1598 886 -309 -482 -74 228 855 1957 2225 1128 92 -432 -990 -756
1293g56N44M94L2o70j211p26K04Q39P70R58M80l93r25o6L62M41Q72J258k20r76
$$ -756 -212 282 314 -356 -1567 -2293 -2089 -1250 -480 478 958 565 -360 -426 -64 377 1249 2507 2287 1311
1313A311o88n98m14M6R12K01l77r64r29p96j86P37J002Q06l0m58n74N8M25O06
$$ 1311 623 25 -389 -343 569 770 393 -571 -1500 -2296 -2482 -1745 -743 63 33 -425 -999 -941 -516 90
1333I0J390J069j71q13n55m49n16K24Q21M37p72j004r73q35k62N45P67O06J28
$$ 90 1480 2549 2378 1565 1010 561 45 269 1090 1527 755 -249 -1222 -2057 -2319 -1774 -1007 -401 -273
1352b73m98p56n8M75P66J229J016J82p56m64j96k74N22J013K30n30r48j140j024
$$ -273 -771 -1527 -1585 -1110 -344 885 1901 2083 1327 863 667 393 915 1928 2158 1628 680 -460 -1484
1371a484k62O43M55Q7j46m83j059k98O37Q64J244J022N6l36l61j42Q6P33J013
$$ -1484 -1746 -1103 -648 -561 -707 -1190 -2249 -2547 -1910 -1046 198 1220 1276 940 579 437 523 1256 2269
1390B269J39n55n93q97j081l30O17K42L7m37n30q93n24L84P34Q17R67J39l84k02
$$ 2269 2408 1853 1260 363 -718 -1048 -431 -189 -152 -589 -1119 -2012 -2536 -2152 -1418 -601 366 505 121 -81
1410h1r5L38O74J164M26m58m74n07r69k33M90L47j4n05q09j077m35K70M38O67
$$ -81 -176 162 836 2000 2426 1968 1494 987 18 -215 275 622 608 103 -706 -1783 -2218 -1948 -1510 -843
1430h43O17k6m36r2q1N05P04J042L40m3l57m79o08J43M46M26j56l38p41j088o42
$$ -843 -226 -252 -688 -780 -861 -356 348 1390 1730 1687 1330 851 243 386 832 1258 1102 764 23 -1065 -1707
1451a707M02K63L52K97m9m76m04j51O07Q66P31N63k00j38k59n76L78P48J99m5
$$ -1707 -1305 -1042 -690 -393 -442 -918 -1322 -1473 -866 0 731 1294 1094 956 697 121 499 1247 1446 1401
1471A401m59m80j045m39J05L90J27J73j51n46m27l2L52O02Q47K12k51k78j46k25
$$ 1401 942 462 -583 -1022 -917 -527 -400 -227 -378 -924 -1351 -1383 -1031 -429 418 630 379 101 -45 -270
1491b70M29P07M89n0l23m70o80m06L15N98j31R8l51o71m47k9K75M22P79J76m18
$$ -270 159 866 1355 1305 982 512 -168 -574 -259 339 208 306 -45 -716 -1163 -1192 -917 -495 284 460 42
1512D2m02l3o2L71Q04M92j58k22m63o27k50N80K39J78m3k44o84m23JL79M23N44
$$ 42 -360 -393 -455 -84 720 1212 1054 832 369 -258 -508 72 311 489 446 202 -482 -905 -904 -525 -102 442
1534D42O9l98m35l01j28L91P16M93k81k76k75o56Q7M52N53J27j5k60o18n01K2
$$ 442 511 113 -322 -623 -751 -360 356 849 568 292 17 -639 -552 -100 453 580 565 305 -313 -814 -792
1555g92M43O02L34L7m40m06l12J15J99O34L57j86m12k86m77p2M59N43k4m4nq10
$$ -792 -349 253 587 624 184 -222 -534 -419 -220 414 771 585 173 -113 -590 -662 -203 340 316 272 267 -543
1577e43l23J74N95L18N07J17n64l73l13l8L53O35K98k30l73m52n38l7M88N40n4
$$ -543 -866 -692 -97 221 728 845 281 -92 -405 -443 -90 545 843 613 240 -212 -750 -787 -299 241 187
1598A87o8j79n20n32K42M64N53K49K21k96o31R0Q5L87O15M10l79n42k54l43l25
$$ 187 119 -60 -580 -1112 -870 -406 147 396 617 321 -310 -220 -135 252 867 1277 898 356 102 -241 -566
1619e66M90J20J81j92k36n76m10K33M94K23L45J86j68m45J35R0L42O06K98k11
$$ -566 -76 44 225 33 -203 -779 -1189 -956 -462 -239 106 292 124 -321 -186 -96 246 852 1150 939
1639I39k14n03j66k53L76L21j0m41j31o70m69K67J83L33K08J90l00l30N6K88M48
$$ 939 725 222 56 -197 179 500 490 49 -82 -752 -1221 -954 -771 -438 -230 -40 -340 -670 -614 -326 122
1660A22M58L96ql05k85j39O0K38K41r4l37k68n47m25J70J55J24K65j06l46l42
$$ 122 580 976 968 663 378 239 299 537 778 684 347 79 -468 -893 -723 -568 -444 -179 -285 -631 -973
1681i73N2L34K93N48K36J30k32j48O8J62K08L34Ql22l15n64k48N0J44J3Q5k56
$$ -973 -921 -587 -294 254 490 620 388 240 308 470 678 1012 1020 698 383 -181 -429 -379 -235 -222 -137 -393
1703c93m22m05M9L37K88N02M05k85o5j72K72J41K99O33p2j76m22m00k08J28K08
$$ -393 -815 -1220 -1171 -834 -546 -44 361 76 11 -161 111 252 551 1184 1112 936 514 114 -94 34 242
1724B42k3k04j5m75m50p3j8M46J84L36j80l16j8K56K44L44N05J34j42k62j35j74
$$ 242 219 15 0 -475 -925 -998 -1016 -570 -386 -50 -230 -546 -564 -308 -64 280 785 919 777 515 380 206
1746B06J48K14K2r2l16n54l63N3O0J5L80J00k01m58R2J77J60M27M70K19k42j97
$$ 206 354 568 590 498 182 -372 -735 -682 -622 -607 -227 -127 -328 -786 -694 -517 -357 70 540 759 517 320
1768C20j10J0K18K48J29j71j63m67m31q5L66j81K51P9k94m04j47J65K86K34L99
$$ 320 210 220 438 686 815 644 481 14 -417 -502 -136 -317 -66 13 -281 -685 -832 -667 -381 -147 252
1789B52J54l27j18j77PM88L07J21nl42j88l15M4J70K2K48j67k34l62l12M6K07
$$ 252 406 79 -39 -216 -209 279 586 707 702 360 172 -143 -99 71 93 341 174 -60 -422 -734 -688 -481
1811d81L03K10P7k45j47K8o2J94M49K48Q2l31q2j84J3K2K36N4Rk66m15j59k9J25
$$ -481 -178 32 109 -136 -283 -255 -317 -123 326 574 656 325 243 59 72 94 330 384 393 127 -288 -447 -476 -351
1835c51J50K65j4l08r4j24R4O4O09J63j46j57m4l59J65K12K39J7R1j75m54l8M0
$$ -351 -201 64 50 -258 -352 -476 -382 -318 291 454 308 151 107 -252 -87 125 364 381 472 297 -157 -195 -155
1858a55K5J28K71l9k50k25j80l7K95K52oNk23J48k65L0K25K47j9J71l9k89k06
$$ -155 -130 -2 269 230 -20 -245 -425 -462 -167 85 79 84 -139 9 -256 -226 -1 246 227 398 359 70 -136
1881a36Q3j7L20J99j42k27l74Q0j36K55J28K32j24k12n3k18kK41J92O5j7r3k16
$$ -136 -53 -70 250 449 307 80 -294 -214 -350 -95 33 265 141 -71 -124 -342 -344 -103 89 154 137 44 -172
1904a72L3J04j7K84J16j23j77m8p6j5J94K37k9J3l19j83p6l2J81N2J98k32q1k46
$$ -172 -139 -35 -52 232 348 225 48 0 -76 -91 103 340 311 324 5 -178 -254 -286 -105 -53 145 -87 -168 -414
1928d14k0L31J2J69Q3K01k85j32O5J7K36J97j45J1j99j90j65J5K38J15j25q1j45
$$ -414 -434 -103 -91 78 161 362 77 -55 10 27 263 460 315 326 127 -63 -228 -213 25 140 15 -66 -211
1951b11k81J0P8L03j3J34p7j08k1j12K28J60L94qj58j18j5k39J24K86l3k29p0
$$ -211 -492 -482 -404 -101 -114 20 -57 -165 -186 -298 -70 90 484 476 318 200 185 -54 70 356 323 94 24
1974B4j16k91l5J63J42Kl2O7j18j82J90jK89L01Mj34j46L2q5Q3K49j3O0k86j60
$$ 24 -92 -383 -418 -255 -113 -111 -143 -76 -194 -376 -186 -187 102 403 407 273 127 159 74 157 406 393 453 167 7
1999Gj95j19J19K1P3J14j60l69M2k9L48J06L16j36q6J4NJ3J38J23J48%j44k09
$$ 7 -188 -307 -188 -167 -94 20 -140 -509 -467 -496 -148 -42 274 138 52 66 71 84 222 345 493 493 349 140
2023A40k27r6J74Q4j10Q4j20k27k14J7J10K55R4K6K2k81L1J28J27K35K33j24p
$$ 140 -87 -183 -9 75 -35 49 -71 -298 -512 -495 -385 -130 -36 -10 12 -269 -238 -110 17 252 485 361 354
2046C54j9k18j46J91J49j40p9q2k39r2M4j5rK25j26J7p9m7R2J06K89J16N1o1q1
$$ 354 335 117 -29 162 311 171 92 10 -229 -321 -277 -292 -301 -76 -202 -185 -264 -311 -219 -113 176 292 343 282 201
2071B01K8k02K51O9k2J0j56k02j55j73J62O6Q5j01j4k17lL9Q8L00nJ46j09j7j32
$$ 201 229 27 278 347 325 335 179 -23 -178 -351 -189 -123 -38 -139 -153 -370 -373 -334 -246 54 49 195 86 69 -63
2096f3J53J06Q2R0r3n1k71K6n0J21K8l1O3j28k42n8N5m8R3J28J13j09j28J34j74
$$ -63 90 196 278 368 275 224 -47 -21 -71 50 78 47 110 -18 -260 -318 -263 -311 -218 -90 23 -86 -214 -80 -254
2121b54K28K31L1lRj50r7J63qQJ13j62j32r9J4n7n3J47m4P1r0q2j19J73J03j3
$$ -254 -26 205 236 233 242 92 -5 158 150 158 271 109 -23 -122 -108 -165 -218 -71 -115 -44 -134 -216 -335 -162 -59 -72
2147g2K31q0J07l29Q7J41Q7J3rP0k12r8P3k9L7n4J7qlj99o3Q8jJ03L5lj3j72N6
$$ -72 159 79 186 -143 -56 85 172 185 176 246 34 -64 9 -20 17 -37 -20 -28 -31 -230 -293 -205 -206 -103 -68 -71 -84 -256 -200
2176b00K11J25Q0j7P5j81j51O8J99j62J41M0j27j59J3r0p1L9J87j35M7o8r1L3
$$ -200 11 136 216 199 274 93 -58 10 209 47 188 228 101 -58 -45 -135 -206 -167 20 -115 -68 -136 -227 -194
2200a94P2O0K37J8M4j28k63K10j3J26L9Q7p6k39M6p8O2j7R9K1j89l7k07kJ35J10
$$ -194 -122 -62 175 193 237 109 -154 56 43 169 208 295 219 -20 26 -52 10 -7 92 113 -76 -113 -320 -322 -187 -77
2226g7P5l4J7P3r7K6K3O1J37Lo5j0j61R4l9L7J82k07K9j45m8p5OR4J85j12j22
$$ -77 -2 -36 -19 54 -43 -17 6 67 204 207 142 132 -29 65 26 63 245 38 67 -78 -126 -201 -195 -101 84 -28 -150
2253a50P9j21K9q1L18O0J9J9j45q7R6J35R0m7K8k31k3k1q9j9K30L2j23r7j6k5
$$ -150 -71 -192 -163 -244 74 134 153 172 27 -60 36 171 261 214 242 11 -12 -33 -122 -141 89 121 -2 -99 -115 -140
2279a40j43k0J18J62R7J3j88k1J78N7J03j9J10j10j94Lj7Q8J35o2j64O7o4k02
$$ -140 -283 -303 -185 -23 74 87 -101 -122 56 113 216 197 307 197 3 6 -11 77 212 150 -14 53 -11 -213
2303b13j7J0J04Mn0O9k5L2m6NQ3J51lN4j51O3r3J23%J24j24j22NL2j29O0r3L5
$$ -213 -230 -220 -116 -112 -162 -93 -118 -86 -132 -127 -44 107 104 158 7 70 -23 100 100 224 100 -22 -17 15 -114 -54 -147 -112
2331a12R2j68M0j44K03oj5J00O2l6R1o7M1rR2J04k6k0o5k51J35k3J6O1k23N8q5
$$ -112 -20 -188 -148 -292 -89 -95 -110 -10 52 16 107 40 81 72 164 268 242 222 157 -94 41 18 34 95 -128 -70 -155
2358a55j23J80Mj14K8Pj6l0K30j01k3J69P4k9j08J77j29K9K5P8l7l9j8o1k15R2
$$ -155 -278 -98 -94 -208 -180 -173 -189 -219 11 -90 -113 56 130 101 -7 170 41 70 95 173 136 97 79 18 -197 -105
2384a05M8J9j5J11l38J38k3L1K0O0K56j39n0M0O0o0J08R2q7N0j23k30Q1J18j72
$$ -105 -57 -38 -53 58 -280 -142 -165 -134 -114 -54 202 63 13 53 113 53 161 253 166 216 93 -137 -56 62 -110
2409a10K02j8p3r5j37oJ17m3J04J92j43j24J11K2j7J7j1J59j8m1q4J8kJR9k3L5
$$ -110 92 74 1 -94 -231 -237 -120 -163 -59 133 -10 -134 -23 -1 -18 -1 -12 147 129 88 4 22 20 21 120 97 132
2436A32j13j74O6J8j11J90J8j28kQ8n2o3J17J06p2O4j12J54Q5o4p1K0J48j31n7
$$ 132 19 -155 -89 -71 -182 8 26 -102 -104 -16 -68 -131 -14 92 20 84 -28 126 211 147 76 96 244 113 56
2461E6n6N1o6R4q9j3j7j06Q3q5j2OK7L7J1JP9l7j04K20M0lR6n0j39n2J93j77J08
$$ 56 0 51 -15 79 -10 -23 -40 -146 -63 -148 -160 -154 -127 -90 -79 -78 1 -36 -140 80 120 117 213 163 24 -28 165 -12 96
2490I6r7N9j15M2o6k6L5M7p4P1J7q7J17J02m9lM5n5N7k30J48m7rP1Q3j42q0L9
$$ 96 -1 58 -57 -15 -81 -107 -72 -25 -99 -28 -11 -98 19 121 72 69 114 59 116 -114 34 -13 -22 49 132 -10 -90 -51
2518e1P3j17J01N2j11J2oQp0o4J54m5O0kP6k9m1P5K2J00lm8kj01j01R2K1qn6L5
$$ -51 22 -95 6 58 -53 -41 -47 -39 -109 -173 -19 -64 -4 -6 70 41 0 75 97 197 194 146 144 43 -58 34 55 47 -9 26
2548B6j6pr1m6J79k05J53j15J32j3k6J98p0q5L5J06J5j17L8j5%j3j20J24q2q6
$$ 26 10 3 -88 -134 45 -160 -7 -122 10 -3 -29 169 99 14 49 155 170 53 91 76 76 63 -57 67 -15 -101
2574a01J19r4N8R9j25J02k1j74O1L5M3p0M7P7n0m2J2J98j22l0M9j04P7qj0rQ9
$$ -101 18 -76 -18 81 -44 58 37 -137 -76 -41 2 -68 -21 56 6 -36 -24 174 52 22 71 -33 44 36 26 17 106
2601A06j27PN0j08K3j27L1J45r5J01M2r5pJ91k39N7J29ln7k0o1M4N4L5O0j23o1
$$ 106 -21 -14 36 -72 -49 -176 -145 0 -95 6 48 -47 -54 137 -102 -45 84 81 24 4 -57 -13 41 76 136 13 -48
2628d8K4r4lP3j27J00L6o1N3L9q7J99j36J00O7k57O7p0K07m8J1n3M0P8j76K14
$$ -48 -24 -118 -121 -48 -175 -75 -39 -100 -47 -8 -95 104 -32 68 135 -122 -55 -125 82 34 45 -8 32 110 -66 148
2654A48j69p0J08j29N0J1j7p2K47j42P0r8M7PK2Oq0R4q6J47R0j47l8p9J28q1O6
$$ 148 -21 -91 17 -112 -62 -51 -68 -140 107 -35 35 -63 -16 -9 13 19 -61 33 -53 94 184 37 -1 -80 48 -33 33
2681C3P2on6k85K91j80nP2O4%K3l0o9J7O6L8%jjn1J29k6Oq4N5P2o7n9k8m2J31
$$ 33 105 99 43 -242 49 -131 -136 -64 0 0 23 -7 -76 -59 7 45 45 44 43 -8 121 95 101 17 72 144 77 18 -10 -52 79
2712G9Q6k11qo0M0K8KJ7nP7j4k6K1k06K80n3R4j41J1J37j31n9O2J4r5J5J6J06
$$ 79 165 -46 -54 -114 -74 -46 -44 -27 -32 45 31 5 26 -180 100 47 141 0 11 148 17 -42 20 34 -61 -46 -30 76
2740G6j81J59j59J05J2k9j3K5P9p0j7m2N5J37N2j62L9l9L4qn6k0L9M0l9j1r6J55
$$ 76 -105 54 -105 0 12 -17 -30 -5 74 4 -13 -55 0 137 189 27 66 27 61 53 -3 -23 16 56 17 6 -90 65
2768F5k65J98L8o3n7M0PJ5J5K4J3k3Q4j47R4r8J28k9j14J30q4K1n9K8NK6M4pl3
$$ 65 -200 -2 36 -27 -84 -44 -37 -22 -7 17 30 7 91 -56 38 -60 68 39 -75 55 -29 -8 -67 -39 -34 -8 36 29 -4
2797dj3N4r0k3J05r6P5L3j25jJ34j40J12J40j00%q7J07j50R3K3o1on6J18q8R3
$$ -4 -17 37 -53 -76 29 -67 8 41 -84 -85 49 -91 21 161 61 61 -26 81 -69 24 47 -14 -20 -76 42 -46 47
2824D7r9J7j9j5L8lK6L0n9m5J33pn8PN1k3J1N1j53J42j6q4j5L0l5P9q6p2J59o8
$$ 47 -52 -35 -54 -69 -31 -34 -8 22 -37 -82 51 44 -14 -7 44 21 32 83 -70 72 56 -28 -43 -13 -48 31 -55 -127 32 -36
2854c6r5J29l0J55j13j42K05L1mj55J63k4j23J04L2o6j35O7R5k08K8K4P9l3j05
$$ -36 -131 -2 -32 123 10 -132 73 104 100 -55 108 84 -39 65 97 31 -104 -37 58 -150 -122 -98 -19 -52 -157
2879a57K14j12K5P8Q7j58r6K28j88J30m5J7k4O2k7l9jj6J19j45J86j21l6KOK3
$$ -157 57 -55 -30 48 135 -23 -119 109 -79 51 6 23 -1 61 34 -5 -6 -22 97 -48 138 17 -19 -17 -11 12
2905A2K6K8k07J45l1Q5k8J8n1J09qk24J04O0j18J3K77j35j00J29j57J9j9N5Jm9
$$ 12 38 66 -141 4 -27 58 30 48 -3 106 98 -126 -22 38 -80 -67 210 75 -25 104 -53 -34 -53 2 3 -46
2931d6N1N8k33J53m6J3L1k5J09k1n6r4R5J56k80M5J21N0n6j17M6j0Q5J5j64M6
$$ -46 5 63 -170 -17 -63 -50 -19 -44 65 44 -12 -106 -11 145 -135 -90 31 81 25 -92 -46 -56 29 44 -120 -74
2957g4n7K7M7J96j64L6k8JQ5j79R7P0O3n8l9J6l1PM9k8j12J22j75J77j12j8l7
$$ -74 -131 -104 -57 139 -25 11 -17 -16 69 -110 -13 57 120 62 23 39 8 15 64 36 -76 46 -129 48 -64 -82 -119
2984a19J33p7P3or8J8L0j7rJ60j98O7M1p5J47N0j02K4j8j35J46j15J66j18M8j11
$$ -119 14 -63 10 4 -94 -76 -46 -63 -72 88 -110 -43 -2 -77 70 120 18 42 24 -111 35 -80 86 -32 16 -95
3010i5J00J4n7P2km4oJ9M4Q7j15L8j25J46q1L4p2N9J4j0o3qp8J59n6j01J43j55
$$ -95 5 19 -38 34 32 -12 -18 1 45 132 17 55 -70 76 -5 29 -43 16 30 20 -43 -51 -129 30 -26 -127 16 -139
3038a39k0J04n3k0J37j68K14p1k7J08l6m7p4J73j66M5J40q9K9n9K6L6J7n4P6p2
$$ -139 -159 -55 -108 -128 9 -159 55 -16 -43 65 29 -18 -92 81 -85 -40 100 11 40 -19 7 43 60 6 82 10
3064A0p9Q3N1j33P4K1N6m5Q9m8j24J36n3l3L1qN9j9k6j4q5p2J73j49J59n0okj02
$$ 10 -69 14 65 -68 6 27 83 38 127 79 -45 91 38 5 36 28 87 68 42 28 -57 -129 44 -105 54 4 -2 -4 -106
3093a06N7l3J6L4J57j14p1Q2p7O8l0J28L2r6K3l2j16K2j02J54J14p4n6o1J93n6
$$ -106 -49 -82 -66 -32 125 11 -60 22 -55 13 -17 111 143 47 70 38 -78 -56 -158 -4 110 36 -20 -81 112 56
3119E6j36J9L8QQ8j0l8o5P2q5NP5P2r2P9j10j1k0J00q9J30l2j40J08QN4n7j03
$$ 56 -80 -61 -23 -15 73 63 25 -40 32 -53 -48 27 99 7 86 -24 -35 -55 45 -44 86 54 -86 22 30 84 27 -76
3147g6M6nr2J6N4L1Q8l7p1J42R8j51j6L7o4R4j30J47j92nJ47M8r3K0L0j59K5o4
$$ -76 -30 -35 -127 -111 -57 -26 62 25 -46 96 194 43 27 64 0 94 -36 111 -81 -86 61 109 16 36 66 -93 -68 -132
3175a32O8J7J2J69j52Nl9J00J77k15P3o9J47k38J26j09J82l8n4p2P4o9m4l3M3
$$ -132 -64 -47 -35 134 -18 -13 -52 48 225 10 83 14 161 -77 49 -60 122 84 30 -42 32 -37 -81 -114 -71
3200g1j39K70m6j27K07j43m6Q6J10m5J6j13K8N6O3j22R9LM8j38R6k21J49N4j06
$$ -71 -210 60 14 -113 94 -49 -95 -9 101 56 72 -41 -13 43 106 -16 83 86 134 -4 92 -129 20 74 -32
3225c2p2L8O7k15J77j8O1j6j3P6r1J1P5j31J19N1j4j64N6Q5o7N0k9j45P0J11j10
$$ -32 -104 -66 1 -214 -37 -55 6 -10 -23 53 -38 -27 48 -83 36 87 73 -91 -35 50 -17 33 4 -141 -71 40 -70
3252g0j62J73k4k1J12p1n4J20n8J3Q7r9R7k9J47q8k8l4j08M3J7J29p7rkk3j02
$$ -70 -232 -59 -83 -104 8 -63 -117 3 -55 -42 45 -54 43 14 161 73 45 11 -97 -54 -37 92 15 6 4 -19 -121
3279a21J19J85l25J19n4P5j91K80p4J7J9R1j05l5p6L2M2L7k5k8K9l6O4r3N9r9
$$ -121 -2 183 -142 -23 -77 -2 -193 87 13 30 49 140 35 0 -76 -44 -2 35 10 -18 11 -25 39 -54 5 -94
3305i4J47r4Jo8L5j23J10M7j8lr7J71q1J08r6J92L8j25l6Q8r1l8J58m5j9o2L6
$$ -94 53 -41 -40 -108 -73 -196 -86 -39 -57 -60 -157 14 -67 41 -55 137 175 50 14 102 11 -27 131 86 67 5 41
3332D1j3j52J54m7P6o3k0J6j27J58l1J06p3l6jN3n4R5m4kQNL8l3j9m7mRrk4Q3
$$ 41 28 -124 30 -17 59 -4 -24 -8 -135 23 -8 98 25 -11 -12 41 -13 82 38 36 44 49 87 54 35 -12 -16 -7 -16 -40 43
3363D3p3q8j7j15K40K0k8r4O1L7l7o6J37J46j27m3P9KO0j24K6o2N1M6n9j52R3
$$ 43 -30 -118 -135 -250 -10 10 -18 -112 -51 -14 -51 -117 20 166 39 -4 75 77 137 13 39 -23 28 74 15 -137 -44
3390d4k8J72j14K5Lr6L7k4NJ46p2M0J2o9J4j9P0j07J08l5m7k9N8K4nj21N5k4N6
$$ -44 -72 100 -14 11 14 -82 -45 -69 -64 82 10 50 62 -7 7 -12 58 -49 59 24 -23 -52 6 30 25 -96 -41 -65 -9
3419ip2J8N6j66Q6J8P4R7n3R1r9L1k4Nl9N9jJ2j21j5L7J7p5J5k5R9j14Q2J3q6
$$ -9 -81 -63 -7 -173 -87 -69 5 102 49 140 41 72 48 53 14 73 72 84 -37 -52 -15 2 -73 -58 -83 16 -98 -16 -3 -89
3449h9N4q3J25l1R0o1k9j7Q2R3j44oK2J19r2M4n7J9p3k5M4R7p8nK7j07qn3J14
$$ -89 -35 -118 7 -24 66 5 -24 -41 41 134 -10 -16 6 125 33 77 20 39 -34 -59 -15 82 4 -1 26 -81 -89 -142 -28
3478b8j02J24m2L6M4p2J95k2j08J89j67L7q2M4L2M0j12J48j35q9Jl4Nk2L6o5O7
$$ -28 -130 -6 -48 -12 32 -40 155 133 25 214 47 84 2 46 78 118 6 154 19 -70 -69 -103 -98 -120 -84 -149 -82
3505h2P4N8j58%K24po4J37j26M0l1n9J11j03O7j18J40j97M0N5j91R1J9J36j28
$$ -82 -8 50 -108 -108 116 109 45 182 56 96 65 6 117 14 81 -37 103 -94 -54 1 -190 -99 -80 56 -72
3530g2q0O3J70j71Q4l4k7M5l9J74n6q7J01M6n4j4KMp0Ll3QJ10p7J9p4p8L2M0l2
$$ -72 -152 -89 81 -90 -6 -40 -67 -22 -61 113 57 -30 71 117 63 49 51 55 -15 -12 -45 -37 73 -4 15 -59 -137 -105 -65 -97
3560i7N9J05j0r6ol4qK44J7j71J6J27j08J1rJL0o2j17J09L6k3n2O4j01L3j4Q4
$$ -97 -38 67 57 -39 -45 -79 -87 157 174 3 19 146 38 49 40 41 71 9 -108 1 37 14 -38 26 -75 -42 -56 28
3588B8q2J16Jj4N0j34J30j06R2k8o4J58j05l1O6k4l5k2o5J2M8J19k14q1J7M4O0
$$ 28 -54 62 63 49 99 -35 95 -11 81 53 -11 147 42 11 77 53 18 -4 -69 -57 -9 110 -104 -185 -168 -124 -64
3615f4Q1n4J07q1P1m0o5J47q0R3m5l8m5M3P6r5k1M0k2m8q8j0O6M2p9Q2J0m7m9
$$ -64 17 -37 70 -11 60 20 -45 102 22 115 70 32 -13 30 106 11 -10 30 8 -40 -128 -138 -72 -30 -109 -27 -17 -64 -113
3644a13P3M9M4Pl3k3O7L1l3J9n3j36N9o1Q9N9j57J25o7j26O2J0R7j18L7m3P8J03
$$ -113 -40 9 53 60 27 4 71 102 69 88 35 -101 -42 -103 -14 45 -112 13 -54 -180 -118 -108 -11 -129 -92 -135 -57 46
3672D6J3k1m7m1j0J37o5M6Nl2j0J00j56P3r4J3m1Nk4l6M0L2j6K30l4r0jn7Q8j49
$$ 46 59 38 -9 -50 -60 77 12 58 63 31 21 121 -35 38 -56 -43 -84 -79 -103 -139 -99 -67 -83 147 113 23 22 -35 53 -96
3702i6K12o5m0J9J13k23J29LN4K3j18P0q2J4j15L6K15k27l2N2j2jP8m2q5J74j02
$$ -96 116 51 11 30 143 -80 49 52 106 129 11 81 -1 13 -102 -66 149 -78 -110 -58 -70 -71 7 -35 -120 54 -48
3729d8J49rr3P1j18J80j17k7N4K8KR2j81l0N4Mr3j25J58Pj3L0L5O0j70P3o6J67
$$ -48 101 92 -1 70 -48 132 15 -12 42 70 72 164 -17 -47 7 11 -82 -207 -49 -42 -55 -25 10 70 -100 -27 -93 74
3757G4j25L6J9J94o1j22kKQ1n6Q3j68J2K6j08P5Om8R9Jjl0j24J21J55j98K05l5
$$ 74 -51 -15 4 198 137 15 13 15 96 40 123 -45 -33 -7 -115 -40 -34 -82 17 18 17 -13 -137 -16 139 -59 146 111
3785A11l9j04K1R8rL3p5O6L2j49N8lj6k6l2Q7%r9m0J8P7j61J41nN5q0j2J34oo1
$$ 111 72 -32 -11 87 78 111 36 102 134 -15 43 40 24 -2 -34 53 53 -46 -86 -68 9 -152 -11 -16 39 -41 -53 81 75 14
3815A4K9O7j01J23n1rM2k25P5L9m1j31J48l6L4P3k78J39o9J01M6p0J12j24J16
$$ 14 43 110 9 132 81 72 114 -111 -36 3 -38 -169 -21 -57 -23 50 -228 -89 -158 -57 -11 -81 31 -93 23
3840B3Q2m9m0R8q6j03K53k20K4J43o6mk5r2R2r0P5j01j50J23N5q2J21R2j73P3
$$ 23 105 56 16 114 28 -75 178 -42 -18 125 59 55 30 -62 30 -60 15 -86 -236 -113 -58 -140 -19 73 -100 -27
3866b7j01K02J2oM9%n2j19Q2J9j14M7K9Nj6j05M7l8l9Q5p4J05j43J73q9J62o6
$$ -27 -128 74 86 80 129 129 77 -42 40 59 -55 -8 21 26 10 -95 -48 -86 -125 -40 -114 -9 -152 21 -68 94 28
3893B8m2L5Q4j25J3N2RQ0r2L4j93J50J6j27L0j7J7r5J34r5K7P3j5j9L3J05k17
$$ 28 -14 21 105 -20 -7 45 54 134 42 76 -117 33 49 -78 -48 -65 -48 -143 -9 -104 -77 -4 -19 -38 -5 100 -117
3920a17J37J7j66R8J15j18J02n6L3o6M5J40j98O5L4k08J23p0rL5Lk4p6J94r2P2
$$ -117 20 37 -129 -31 84 -34 68 12 45 -21 24 164 -34 31 65 -143 -20 -90 -99 -64 -61 -85 -161 33 -59 13
3946A3l5O3r6J55k0j00R7Nk6p3J06j6j01J46q0J3r5J04L1j74Q9j04J27j48k4K49
$$ 13 -22 41 -55 100 80 -20 77 82 56 -17 89 73 -28 118 38 51 -44 60 91 -83 6 -98 29 -119 -143 106
3972A06j4o8mO6j38l2P9j4K28p5J37j40q7k4j03R9o4J1o9J14j11mJ80j24lR8n0
$$ 106 92 24 20 86 -52 -84 -5 -19 209 134 271 131 44 20 -83 16 -48 -37 -106 8 -103 -107 73 -51 -54 44 -6
3999fk1K2o4J48K8k6N0j41J40j4l1kn3L8p3K2k1L7m3R0j34p5J17l8r4R3J2j3R8
$$ -6 -27 -5 -69 79 107 81 131 -10 130 116 85 83 30 68 -5 17 -4 33 -10 80 -54 -129 -12 -50 -144 -51 -39 -52 46
4028D6K6p4J7O6jj17J55m5lL3M8j78q1J90o0p5n3J32j6j72J45j00J5J27K1j29
$$ 46 72 -2 15 81 80 -37 118 73 70 103 151 -27 -108 82 22 -53 -106 26 10 -162 -17 -117 -102 25 46 -83
4054h3J41J14j47j04Q9J27o2o5l9J95j52j8J11k4R2j40j24qK12j6j62o3J60j64
$$ -83 58 172 25 -79 10 137 75 10 -29 166 14 -4 107 83 175 35 -89 -97 115 99 -63 -126 34 -130
4078a30k5L3l0L9l4J69P7k04R5kR9q3o4Q0M5Q0j17J01n2q8r2J98l3p2p5p0J36
$$ -130 -155 -122 -152 -113 -147 22 99 -105 -10 -12 87 4 -60 20 65 145 28 129 77 -11 -103 95 62 -10 -85 -155 -19
4105a9o5N0Qn0N8l5Q7m9M7J44j54r3K01k4oj4j50K3J41J8r4j39O4Kn2N9PL7n3
$$ -19 -84 -34 -26 -76 -18 -53 34 -15 32 176 22 -71 130 106 100 86 -64 -41 100 118 24 -115 -51 -49 -101 -42 -35 2 -51
4134e1m5M0L3p9K2J01p1L4J08j36N5nQ5j2n4j6p0J13R6r1p2R4K1j23j61j3J85
$$ -51 -96 -56 -23 -102 -80 21 -50 -16 92 -44 11 6 91 79 25 9 -61 52 148 57 -15 79 100 -23 -184 -197 -12
4161a2j47N1J20m0m6J84n7n1n7k2K66l3q7R1j54R7r2j58J45j5m0l5J5r1N7N5n6
$$ -12 -159 -108 12 -28 -74 110 53 2 -55 -77 189 156 69 160 6 103 11 -147 -2 -17 -57 -92 -77 -168 -111 -56 -112
4188a12O7P6r5j14K28No5J2J21m2r8K09j57J11p2L5jj68N5M3q2N9o3j06J00K7
$$ -112 -45 31 -64 -178 50 55 -10 2 123 81 -17 192 35 146 74 109 108 -60 -5 38 -44 15 -48 -154 -54 -27
4214b7q9jQ6q4O7jJ13o7j8m7J77L3j32M9J24m9M0o5j4j49k6j10J77q6P1K9q1p5
$$ -27 -116 -117 -31 -115 -48 -49 64 -3 -21 -68 109 142 10 59 183 134 174 109 95 -54 -80 -190 -13 -99 -28 1 -80 -155
4242a55R3O3j34M8L1o8J53j2L1q0O3Q8k23K28Qj19j6J23J7Ml0r1k6n0k2K9k1N8
$$ -155 -62 1 -133 -85 -54 -122 31 19 50 -30 33 121 -102 126 134 15 -1 122 139 143 113 22 -4 -54 -76 -47 -68 -10
4270a0nj75J58M5j31L0J2P4k1J49r7M5j9J8j64J98o1J20j93J36j95J35K0n5M3
$$ -10 -15 -190 -32 13 -118 -88 -76 -2 -23 126 29 74 55 73 -91 107 46 166 -27 109 -86 49 69 14 57
4295E7j19J29j55J14o2%l3KK4L1O3q7Q3m1M3L7l7L9o8o0P0N8j89J33Q7j45qk4
$$ 57 -62 67 -88 26 -36 -36 -69 -67 -43 -12 51 -36 47 6 49 86 49 88 20 -40 30 88 -101 32 119 -26 -34 -58
4323e8j11J48k6k3j9j2p1R5J14k5K1O1l3o3l2J77j86Q9n7J48N0j87l3p3J5L9k4
$$ -58 -169 -21 -47 -70 -89 -101 -172 -77 37 12 33 94 61 -2 -34 143 -43 46 -11 137 187 0 -33 -106 -91 -52 -76
4350g6m0J20j1n3l5j9L7N4K4m5O7L6k6P0p7M0qR0p2Q1j29p6k4P6j04J05p8L5j7
$$ -76 -116 4 -7 -60 -95 -114 -77 -23 1 -44 23 59 33 103 26 66 58 148 76 157 28 -48 -72 4 -100 5 -73 -38 -55
4379e5k3l2K8J0m0R6K1J23m3M2j06J32mk1j06J77j27J3J2r3q8lrN1n4LO8o3rm1
$$ -55 -78 -110 -82 -72 -112 -16 5 128 85 127 21 153 149 128 22 199 72 85 97 4 -84 -87 -96 -45 -99 -96 -28 -91 -100 -141
4409a41O6J13o0P6k6p6P2L5n1M6K1kOq0%N1l3J2L2j79J46j09L0Kj6M1k6N2j55
$$ -141 -75 38 -22 54 28 -48 24 59 8 54 75 73 79 -1 -1 50 17 29 61 -118 28 -81 -51 -49 -65 -24 -50 2 -153
4438a53K6L5O5k7J14K7J2OJ09r1p1M8M0p2k6K0k7K06k09j16J51l5p7k3j23J04
$$ -153 -127 -92 -27 -54 60 87 99 105 214 123 52 100 140 68 42 62 35 241 32 -84 67 32 -45 -68 -191 -87
4464h7p1Q5J25p6MJ54j19J3M7o6J27J3m8J01j57n4O2j14J32n4j05R4qj88K9J19
$$ -87 -158 -73 52 -24 -20 134 15 28 75 9 136 149 101 202 45 -9 53 -61 71 17 -88 6 -2 -190 -161 -42
4490d2J9j39K33q4Oo4m2J38j49O8M2L%J64j91L4R8K6k10J06r0J13n4j19O7M8j14
$$ -42 -23 -162 71 -13 -7 -71 -113 25 -124 -56 -14 -11 -11 153 -38 -4 94 120 -90 16 -74 39 -15 -134 -67 -19 -133
4517a33J4KJ0P2K5O0m0K1R4Jq9N1o7J12R6j95O3p5J1n1M8j4l1M3j28R3m2j04N1
$$ -133 -119 -117 -107 -35 -10 50 10 31 125 126 37 88 21 133 229 34 97 22 33 -18 30 16 -15 28 -100 -7 -49 -153 -102
4546a02o3J35J65j73lnl0J91j48K23j14o4K26j61o1N7j15J05K9k21J24J0k4LJ7
$$ -102 -165 -30 135 -38 -41 -46 -76 115 -33 190 76 12 238 77 16 73 -42 63 92 -129 -5 5 -19 -16 1
4571AR8j98J28j05O7P7Jr3J31r3j8M1M4j14M9K7J2mk0J60j51l9J8o0P2j55L8J1
$$ 1 99 -99 29 -76 -9 68 69 -24 107 14 -4 37 81 -33 16 43 55 51 31 191 40 1 19 -41 31 -124 -86 -75
4599g5P9o3n8J14jm3N0JO3q0O8m7J59k15J58P6j75M4m3Q6M0j03r9O8j42P5p2J73
$$ -75 4 -59 -117 -3 -4 -47 3 4 67 -13 55 8 167 -48 110 186 11 55 12 98 138 35 -64 4 -138 -63 -135 38
4627C8j48J21k8k4Q2p4J97j34L2lQ3k00Q4O3K5k8p2Q2j38J03r0m2O8%m8L1l3m9
$$ 38 -110 11 -17 -41 41 -33 164 30 62 59 142 -58 26 89 114 86 14 96 -42 61 -29 -71 -3 -3 -51 -20 -53 -102
4655a02n2Q7J79k52P4K9P8j15J56j50J88j26J05ml0m2J0m8L7J44j57L5r1J6M7
$$ -102 -154 -67 112 -140 -66 -37 41 -74 82 -68 120 -6 99 95 65 23 33 -15 22 166 9 44 -47 -31 16
4680A6r3K5j4j1N5J22k02l1K42j33J02r3P9R2o9p5P6K0j01P6p9l2K3j55J19j9
$$ 16 -77 -52 -66 -77 -22 100 -102 -133 109 -24 78 -15 64 156 87 12 88 108 7 83 4 -28 -5 -160 -41 -60
4706f0R0n3j6N1j04om5J56jj19J4J13k4Q2r4J22j4k2rO8k4j24l1q8J71J6l3j76
$$ -60 30 -23 -39 12 -92 -98 -143 13 12 -107 -93 20 -4 78 -16 106 92 70 61 129 105 -19 -50 -138 33 49 16 -160
4734a60J26j2Rp1J15N8j24p7O3j6J44k1l2M8l1k7O0k3Pp6J40J44m26J00P9j41
$$ -160 -34 -46 -37 -108 7 65 -59 -136 -73 -89 55 34 2 50 19 -8 52 29 36 -40 100 244 -182 -82 -3 -144
4760a44J14O1m3p1mM0N4j39J02N4n6P9K9j2n0Lq6K37o2j8j19J10q7O3j39k4J35
$$ -144 -30 31 -12 -83 -87 -47 7 -132 -30 24 -32 47 76 64 14 17 -69 168 106 88 -31 79 -8 55 -84 -108 27
4787B7r5j4Rm5J95j52M1n0NQ5m7J08j3P3j05P7j27J84r5m9L6k4M9r7j25J49O9
$$ 27 -68 -82 -73 -118 77 -75 -34 -84 -79 6 -41 67 54 127 22 99 -28 156 61 12 48 24 73 -24 -149 0 69
4814F9q9n7l2l2R7k9R2j27N7J43j6q3J18j36J0Q0O3j04J08m7o9j5K1k0j50J78
$$ 69 -20 -77 -109 -141 -44 -73 19 -108 -51 92 76 -7 111 -25 -15 65 128 24 132 85 16 1 22 2 -148 30
4840C0j68J5R4J10j89%m4N1K18j31l1J20l4n2N7p2J1qO7Q6j19K9Pp3J38j01n1
$$ 30 -138 -123 -29 81 -108 -108 -152 -101 117 -14 -45 75 41 -11 46 -26 -15 -23 44 130 11 40 47 -26 112 11 -40
4867d0k8l1O4j1J11p9R1j06J05r9p6P3P5l8m5M0n2J50k1l1N4j44q4J87P1j28J0
$$ -40 -68 -99 -35 -46 65 -14 77 -29 76 -23 -99 -26 49 11 -34 6 -46 104 83 52 106 -38 -122 65 136 8 18
4894A8k6j17J50j02J4j4O8L3l3o8J13p9J00o7o7P0mQ5nJ1J1q9N6K9j17Q6j8N4
$$ 18 -8 -125 25 -77 -63 -77 -9 24 -9 -77 36 -43 57 -10 -77 -7 -11 74 69 80 91 2 58 87 -30 56 38 92
4922I2q4L5j49j3L4K0O2K2J11j28M4l6m2J19j6r7J66M0k43J51q6K1q1jJ14L9j49
$$ 92 8 43 -106 -119 -85 -65 -3 19 130 2 46 10 -32 87 71 -26 140 180 -63 88 2 23 -58 -59 55 94 -55
4949e5R9k8M5j70O5J1N6n7p1J05o1J15K6M5q9Q9l1j66k5J27l8J49k7j19L5Q3j06
$$ -55 44 16 61 -109 -44 -33 23 -34 -105 0 -61 54 80 125 36 125 94 -72 -97 30 -8 141 114 -5 30 113 7
4976GL0j03L8J14q8k5j5k4K4r4J98j37J2J1J24qm1KO1O3m7p1K7o0j3J06p7P0j45
$$ 7 37 -66 -28 86 -2 -27 -42 -66 -42 -136 62 -75 -63 -52 72 64 23 25 86 149 102 31 58 -2 -15 91 14 84 -61
5005f1L2L0n8j21J74l3j79J09J33Qm7m9K9N8r4K33k21M7K4N0j7j40J26J2l4J8
$$ -61 -29 1 -57 -178 -4 -37 -216 -107 26 34 -13 -62 -33 25 -69 164 -57 -10 14 64 47 -93 33 45 11 29
5031B9q3p6J48Jn0j69L09r6j02l0J39j2q8Q6Q0l6O9j43J18j14%K2r1J31j14P1
$$ 29 -54 -130 18 19 -31 -200 109 13 -89 -119 20 8 -80 6 86 50 119 -24 94 -20 -20 2 -89 42 -72 -1
5057aL5j12L8L5Q4j75J02j3J9r7L3j23J34L8J8k9J22N9p4K7j28j3J26n0j7k15
$$ -1 34 -78 -40 -5 79 -96 6 -7 12 -85 -52 -175 -41 -3 15 -14 108 167 93 120 -8 -21 105 55 38 -177
5083a77K74q7l3Rm3O8P8j51M7o6Q2j84J50k9m2J55J4j11O8PqJ28n0Lr1J3OM5J9
$$ -177 97 10 -23 -14 -57 11 89 -62 -15 -81 1 -183 -33 -62 -104 51 65 -46 22 29 21 149 99 102 11 24 30 75 94
5112I4j17L5q3l%l2J17j24J50m9m5j4R3L8j37P2P3Lj2J2o5lQ6q6o0J56O8j23j24
$$ 94 -23 12 -71 -74 -74 -106 11 -113 37 -12 -57 -71 22 60 -77 -5 68 71 59 71 6 3 89 3 -57 99 167 44 -80
5141h0P2j5M0m9j2J09j92J03P3m5k9NO2j0k2N2k24J18L9Qmp0K35l32J15q4J50
$$ -80 -8 -23 17 -32 -44 65 -127 -24 49 4 -25 -20 42 32 10 62 -162 -44 -5 3 -1 -71 164 -168 -53 -137 13
5168A3N6o4l7M1l5K8K2j31J35r2pL1J8M2q1J82j13J4R4j64L6J9j74K53ln9r4j8
$$ 13 69 5 -32 9 -26 2 24 -107 28 -64 -71 -40 -22 20 -61 121 8 22 116 -48 -12 7 -167 86 83 24 -70 -88
5196h8R5n5j47J60j29J67p6j0J10L8o8j01K20j11k1J0kM4n8M5pRl3M9j06j21J41
$$ -88 7 -48 -195 -35 -164 3 -73 -83 27 65 -3 -104 116 5 -16 -6 -8 36 -22 23 16 25 -8 41 -65 -186 -45
5223d5n9M1J09j65J3J10n7L0K3m5P1j2ON8j62J81j05N2K1P2o8k3M4M6k04R1p6
$$ -45 -104 -63 46 -119 -106 4 -53 -23 0 -45 26 14 20 78 -84 97 -8 44 65 137 69 46 90 136 -68 23 -53
5250e3Qm7J72j92J14Mm1O7k6j38J23j17J37n2J5K7O7j9o9J0K8mk6o2m6K19l5o9
$$ -53 -45 -92 80 -112 2 6 -35 32 6 -132 -9 -126 11 -41 -26 1 68 49 -20 -10 18 14 -12 -74 -120 99 64 -5
5278ej35Rj4J26j53J50M0j36J46j12M9Q6m6j09J33M8o7j27J52o5J24n0K5kOj13
$$ -5 -140 -131 -145 -19 -172 -22 18 -118 28 -84 -35 51 5 -104 29 77 10 -117 35 -30 94 44 69 67 73 -40
5304d0M3j74J68j5j1o1O3j34k5L9J92q5o0J25j2n4J1MJ53j63R8r2p2P7J18o2j78
$$ -40 3 -171 -3 -18 -29 -90 -27 -161 -186 -147 45 -40 -100 25 13 -41 -30 -26 127 -36 62 -30 -102 -25 93 31 -147
5331a47J23RqM5Ro5K0p8j0NK2P5Ro3J43q1J3j65K98p2q1mkp0J14l5K2q6KP3M5
$$ -147 -24 -15 -23 22 31 -34 -14 -92 -102 -97 -75 0 9 -54 89 8 21 -144 154 82 1 -3 -5 -75 39 4 26 -60 -58 15 60
5362F0k15J28j2J09l6j29N5J11M3k4j70J07L8r3J46M4m1m9k0J9jr1P5q5o5J52
$$ 60 -155 -27 -39 70 34 -95 -40 71 114 90 -80 27 65 -28 118 162 121 72 52 71 70 -21 54 -31 -96 56
5388E6k9m6O6r8L0J1k8J05j26N3N0j05Q8j1o2L5L6J49q6j48J35o2k9M8J0o8J68
$$ 56 27 -19 47 -51 -21 -10 -38 67 -59 -6 44 -61 27 16 -46 -11 25 174 88 -60 75 13 -16 32 42 -26 142
5415A42j23r0L7M7Jn6P3r1k8J08M5p7JP1j39P9J65p4k7m3q9L3mO6o4P3l6R8j05
$$ 142 19 -71 -34 13 14 -42 31 -60 -88 20 65 -12 -11 60 -79 0 165 91 64 21 -68 -35 -39 27 -37 36 0 98 -7
5444gq9L8P5l9K1mj10J49r8K31k17q3R4Q2K1m5OR9j79J7M8n4J2n3J89k22J13p9
$$ -7 -96 -58 17 -22 -1 -5 -115 34 -64 167 -50 -133 -39 43 64 19 25 124 -55 -38 10 -44 -32 -85 104 -118 -5 -84
5472h4J03k4o0Q2q7o4N8nJ30j16K3N2O8l9J6J11r0m2J9J0qm9M3rq3j2O6j12J30
$$ -84 19 -5 -65 17 -70 -134 -76 -81 49 -67 -44 8 76 37 53 164 74 32 51 61 53 4 47 38 -45 -57 9 -103 27
5501B7L2j04p3Q7K8P3q1M9K9k7J5r6J18j7o4M1l9m3K4KJ6K5o5n9P9O7m9m6j9N8
$$ 27 59 -45 -118 -31 -3 70 -11 38 67 40 55 -41 77 60 -4 37 -2 -45 -21 -19 -3 22 -43 -102 -23 44 -5 -51 -70 -12
5531a2p4N3M4q9J23m3j44J24L8k8nJ60j51Q0J1q7r2M7L2qjKm0L2j02K8L9O2Kn4
$$ -12 -86 -33 11 -78 45 2 -142 -18 20 -8 -13 147 -4 76 87 0 -92 -45 -13 -21 -22 -20 -60 -28 -130 -102 -63 -1 1 -53
5561e3L1j00K66j17j7O1k2l0p0J40L2L5j53omP0l0j69K61j71LJ19p5j80J66o4
$$ -53 -22 -122 144 27 10 71 49 19 -51 89 121 156 3 -3 -7 63 33 -136 125 -46 -43 76 1 -179 -13 -77
5587g7J06m2o2M3mj23K36o0k6K4l5N4n2M6o8k6M1J41k40O7J09r6%p0P2N8J0j09
$$ -77 29 -13 -75 -32 -36 -159 77 17 -9 15 -20 34 -18 28 -40 -66 -25 116 -124 -57 52 -44 -44 -114 -42 16 26 -83
5615h3P4o7J17j08RQ0q3R9m9J6KJ4n0K1O6j29J06j23j5R0o8NO9P5k4q4KK6l1p2
$$ -83 -9 -76 41 -67 -58 22 -61 38 -11 5 7 21 -29 -8 58 -71 35 -88 -103 -13 -81 -76 -7 68 44 -40 -38 -12 -43 -115
5645a15J67P7r0on5N1P9l06K84q2o7K01j75M1j24R1J8J0r1M8o2O2Q5j05N4PL7
$$ -115 52 129 39 33 -22 29 108 -198 86 4 -63 138 -37 4 -120 -29 -11 -1 -92 -44 -106 -44 41 -64 -10 -3 34
5672C4L9M5r1l1kp0J28j19LJ09Mj12O9j33R4%o1Q1j64J02l4J6J50j86O8Rp7J86
$$ 34 73 118 27 -4 -6 -76 52 -67 -64 45 49 -63 6 -127 -33 -33 -94 -13 -177 -75 -109 -93 57 -129 -61 -52 -129 57
5700E7k2j51J12N7J07k00R5o5O3n7j40J16Km2J06N3m6N5j61RJ11j89J45k3p5O7
$$ 57 35 -116 -4 53 160 -40 55 -10 53 -4 -144 -28 -26 -68 38 91 45 100 -61 -52 59 -130 15 -8 -83 -16
5726a6j05Q2ol7N3P8j71J56Q2k40P7m7K24m8j20q8oJ47m5q1L7J30j94P4P3K6l0
$$ -16 -121 -39 -45 -82 -29 49 -122 34 116 -124 -47 -94 130 82 -38 -126 -132 15 -30 -111 -74 56 -138 -64 9 35 5
5753En5J16p3O8J0m1j7K3j1%j15J11L6n8L1PP8j32m0M1rm2QJ16j43K8J56k88J31
$$ 5 -50 66 -7 61 71 30 13 36 25 25 -90 21 57 -1 30 37 115 -17 -57 -16 -25 -67 -59 57 -86 -58 98 -190 -59
5782e9N1Pj5K5J6q1LJ30r2m1P1L0q5Q1OJ8q9o2p4J9N0R3k6K5O7j59M7K4O0l4Q1
$$ -59 -8 -1 -16 9 25 -56 -53 77 -15 -56 15 45 -40 41 47 65 -24 -86 -160 -141 -91 2 -24 1 68 -91 -44 -20 40 6 87
5813H7k2l5L3o3j2o5P8MN4l9j1j3o6K6q8J12l7m5J4r6J58J1Qn6n9J87j46K09r6
$$ 87 65 30 63 0 -12 -77 1 5 59 20 9 -4 -70 -44 -132 -20 -57 -102 -88 -184 -26 -15 -7 -63 -122 65 -81 128 32
5842C2M0n6Ll4Rn6K0oQ4J8j11Qj5J83k16l3P8J02j11P7N6J2m8o2k9LM5J47p8j25
$$ 32 72 16 19 -15 -6 -62 -42 -48 36 54 -57 -49 -64 119 -97 -130 -52 50 -61 16 72 84 36 -26 -55 -52 -7 140 62 -63
5872f3J5n0J93rk08K11k0r4Q9j92J41q4P0j1K2m4J9n5R7j33J84m4Jq8R0k4L5m9
$$ -63 -48 -98 95 86 -122 89 69 -25 64 -128 13 -71 -1 -12 10 -34 -15 -70 27 -106 78 34 35 -53 37 13 48 -1
5900aj08J19J7P8r4QJ9k18K27j7o5P9q7m1J24j01K3R0Qn6j8l3M1L0J27o6n0K7
$$ -1 -109 10 27 105 11 19 38 -180 47 30 -35 44 -43 -84 40 -61 -38 52 60 4 -14 -47 -6 24 151 85 35 62
5928F2jl2m4o4qR7n8Q0j36O7k5%J00n8P7p9N6l6J8j7n7J9m1J41p0O0J8ml7j12
$$ 62 61 29 -15 -79 -87 10 -48 32 -104 -37 -62 -62 38 -20 57 -22 34 -2 16 -1 -58 -39 -80 61 -9 51 69 65 28 -84
5958h4J4L0j3K6N1o4OJ8o6M5J40j56j09O0K74k17p4K00m7j09P6K6n1R2L8m1j01
$$ -84 -70 -40 -53 -27 24 -40 -34 -16 -82 -37 103 -53 -162 -102 172 -45 -119 81 34 -75 1 27 -24 68 106 65 -36
5985c6M4j7j14J49m9m7L3o3m1O4J17j5J5j25Po4R6MP5p1O0p1M6j7r8R0m5P1rj02
$$ -36 8 -9 -123 26 -23 -70 -37 -100 -141 -77 40 25 40 -85 -78 -142 -46 -42 33 -38 22 -49 -3 -20 -118 -28 -73 -2 -11 -113
6015a13J50kj07Q6r2J57j11j3Q7Qj28K5N5j81P7J94j81N0J03k2j6o9R4ml4J3J03
$$ -113 37 35 -72 14 -78 79 -32 -45 42 50 -78 -53 2 -179 -102 92 -89 -39 64 42 26 -43 51 47 13 26 129
6042A29n5j14J74j69O9Om0j09O3Q9j71J96r6L3R7p1k2J9N4j05J23j56J05J2J3
$$ 129 74 -40 134 -35 34 40 0 -109 -46 43 -128 68 -28 5 102 31 9 28 82 -23 100 -56 49 61 74
6067G4j38o0N8J05J0M3p6n4l6J49j12L2j4q6O8K8jN4P8k55J8J87Oo6L1L3j10m8
$$ 74 -64 -124 -66 39 49 92 16 -38 -74 75 -37 -5 -19 -105 -37 -9 -10 44 122 -133 -115 72 78 12 43 76 -34 -82
6095h2O2l9O4q4M6L6K8R1j53N0j52P5J64p8p3J33j00K5Q6n0P9N5j22K0j58L1J45
$$ -82 -20 -59 5 -79 -33 3 31 122 -31 19 -133 -58 106 28 -45 88 -12 13 99 49 128 183 61 81 -77 -46 99
6122I9j55P9rk8r4J00o5K5j15K24q0j1N0j1J3j31Q8o3j9N5l2J32N8o8j26K24j6
$$ 99 -56 23 14 -14 -108 -8 -73 -48 -163 61 -19 -30 20 9 22 -109 -21 -84 -103 -48 -80 52 110 42 -84 140 124
6149A24j10m7Mj06l5P3Q1j73R9N0M3o3P1O2j08N9j08Q2nJ03j66J00N0m7m6N9o8
$$ 124 14 -33 -29 -135 -170 -97 -16 -189 -90 -40 3 -60 11 73 -35 24 -84 -2 -7 96 -70 30 80 33 -13 46 -22
6176b2R6m3p3l0j8O2O5q2K7M7K8j04r4J38M9lM7P2m9l7o1ko4j2L9J9J6r0O4r3
$$ -22 74 31 -42 -72 -90 -28 37 -45 -18 29 57 -47 -141 -3 46 43 90 162 113 76 15 13 -51 -63 -24 -5 11 -79 -15 -108
6206a08J34M5o0p2Jl7M3J6M0Q9j46R0j29J73k3j19R0L0j7Q9n8j13J98j56o5Q6
$$ -108 26 71 11 -61 -60 -97 -54 -38 2 91 -55 35 -94 79 56 -63 27 57 40 129 71 -42 156 0 -65 21
6232B1JN0j69l0R7k8qL6l9J91j93j0J14k9M3j70K19n8l1J13j58J25j01m0m5P0
$$ 21 22 72 -97 -127 -30 -58 -66 -30 -69 122 -71 -81 33 4 47 -123 96 38 7 120 -38 87 -14 -54 -99 -29
6258b9J9J3n1m5P1MMl6O5rn1n7O7K0j07R7M5j43Q7L7j6Q6n8K2J1Pm7J30j17qn6
$$ -29 -10 3 -48 -93 -22 -18 -14 -50 15 6 -45 -102 -35 -15 -122 -25 20 -123 -36 1 -15 71 13 35 46 53 6 136 19 11 -45
6289d5p7K9j26K37lM2Pj90N4P6Q0j4Q8j95J40j09rJ42j06m6Rlr9J62o0k8O5j5
$$ -45 -122 -93 -219 18 15 57 64 -126 -72 4 84 70 158 -37 103 -6 -15 127 21 -25 -16 -19 -118 44 -16 -44 21 6
6317Fj02l9Q1k0N6N2Qp0N5j37P5P0j86J54k7P9j4m1O9o7L2n0J2qM9J05k67J00
$$ 6 -96 -135 -54 -74 -18 34 42 -28 27 -110 -35 35 -151 3 -24 55 41 0 69 2 34 -16 -4 -12 37 142 -125 -25
6345b5jL2j7M2j19M1OP5j40J05O9o7n8N2q3O2l2J30p7J76q4p6J4j10J17N7j01
$$ -25 -26 6 -11 31 -88 -47 -41 34 -106 -1 68 1 -57 -5 -88 -26 -58 72 -5 171 87 11 25 -85 32 89 -12
6372a2n0P7j03O3j02P4N5p7l2K18j18q0J57k7r2P7m8J55r9l9RK0o5M2k5k9O0M1
$$ -12 -62 15 -88 -25 -127 -53 2 -75 -107 111 -7 -87 70 43 -49 28 -20 135 36 -3 6 26 -39 3 -22 -51 9 50
6400E0n5j31J07P6k0q4J8k2LR4q4J35j09P0l5L5Rj04J23m6o2m7J09j45j1R5J3
$$ 50 -5 -136 -29 47 27 -57 -39 -61 -58 36 -48 87 -22 48 13 48 57 -47 76 30 -32 -79 30 -115 -126 -31 -18
6427a8m8N7k6Rj6l4LO9n3O2o0N5j4R0kj76J40j6q9j3J15K2j56J94l3j44Q6n4N8
$$ -18 -66 -9 -35 -26 -42 -76 -73 -4 -57 5 -55 0 -14 76 74 -102 38 22 -67 -80 35 57 -99 95 62 -82 4 -50 8
6456HRn1J3j57Q2J12p0j0J29o3qJ01p9J2N1M8j75P4k5L1j35Q4P8p5m1N3L6j20
$$ 8 17 -34 -21 -178 -96 16 -54 -64 65 2 -6 95 16 28 79 127 -48 26 1 32 -103 -19 59 -16 -57 -4 32 -88
6484h8J57j05P0Q0j39o7P1o8J29L5p3P4j09j4J52j84p9J70N5Qj22M1rJ0k9l2R6
$$ -88 69 -36 34 114 -25 -92 -21 -89 40 75 2 76 -33 -47 105 -79 -158 12 67 75 -47 -6 -15 -5 -34 -66 30
6511C0k2L1J0j02N4k6m6M1J8R2j96P7M6J5nP9o9n9J36p1q9m8j8m3J63K9rk4l0
$$ 30 8 39 49 -53 1 -25 -71 -30 -12 80 -116 -39 7 22 17 96 27 -32 104 33 -56 -104 -122 -165 -2 27 18 -6 -36
6540c6P4j08k8J21%K2m5J10j67M5jK7r9R7l2kP0j99J44Q8j47Pnk2O3j22K02j59
$$ -36 38 -70 -98 23 23 45 0 110 -57 -12 -13 14 -85 12 -20 -22 48 -151 -7 81 -66 -59 -64 -86 -23 -145 57 -102
6568a02J38p8J37r5Q3m3q4n6L5K5J41l8J4J8j46K5M3l8n7J33J2l6J8j10J8NL1
$$ -102 36 -42 95 0 83 40 -44 -100 -65 -40 101 63 77 95 -51 -26 17 -21 -78 55 67 31 49 -61 -43 -38 -7
6595gl9J74j80P5n9J27j0q5o9Q0M9q3R4j44P1k7l3J31Lj22N9n8P6L5j23J04L6
$$ -7 -46 128 -52 23 -36 91 81 -4 -73 7 56 -27 67 -77 -6 -33 -66 65 68 -54 5 -53 23 58 -65 39 75
6622G5o0j6o3j2J00j56J67j11N5j24Q4M0pJ7J31j73P1N7n7q4K2L5l7k0L1p4J83
$$ 75 15 -1 -64 -76 24 -132 35 -76 -21 -145 -61 -21 -28 -11 120 -53 18 75 18 -66 -44 -9 -46 -66 -35 -109 74
6649G4r1j10P4KJ6m7L3J27n7ml0K%l8o3J41j56J33J08j73J2N0n8ml2P4oj45J30
$$ 74 -17 -127 -53 -51 -35 -82 -49 78 21 17 -13 -11 -11 -49 -112 29 -127 6 114 -59 -47 3 -55 -59 -91 -17 -23 -168 -38
6678c8k5ok2M0R8o9P8j71J19N4jo5L6M6m3M9r3pN5m4o9O7O1n2O0m9l8m2o4P4l0
$$ -38 -63 -69 -91 -51 47 -22 56 -115 4 58 57 -8 28 74 31 80 -13 -20 35 -9 -78 -11 50 -2 58 9 -29 -71 -135 -61 -91
6709i1J43N2j34M0k7O0mN5J01j35N8j89L1J59j43J2O9l4j26J8j3Q6oQq3N8MO4
$$ -91 52 104 -30 10 -17 43 39 94 195 60 118 -71 -40 119 -24 -12 57 23 -103 -85 -98 -12 -18 -10 -93 -35 -31 33
6737C3P2k7m7lP7q6N5r4J11l2jmm3N4j40P9r3K7Nj10K06j6Q7j86L1Q5O5j27K2
$$ 33 105 78 31 28 105 19 74 -20 91 59 58 54 11 65 -75 4 -89 -62 -57 -167 39 23 110 -76 -45 40 105 -22 0
6766@l4j35J01K10j31J4l0Mk2j16J49Q7j65L1J40k79J31p7R4P8o7o8M9l1N2m3
$$ 0 -34 -169 -68 142 11 25 -5 -1 -23 -139 10 97 -68 -37 103 -176 -45 -122 -28 50 -17 -85 -36 -67 -15 -58
6792e8J2KJ02o2M9J38k56O7M7m4J7N7j6l9K1K3o4O0J6k15M3J14J0j8P4P3p0j13
$$ -58 -46 -44 58 -4 45 183 -73 -6 41 -3 14 71 55 16 37 60 -4 56 72 -143 -100 14 24 6 80 153 83 -30
6820c0J6o1J05N7l2o7k4M8rJ04j82J7o8J18j62J82k9Nn4M7l4J35n6j2jj0J0j18
$$ -30 -14 -75 30 87 55 -12 -36 12 3 107 -75 -58 -126 -8 -170 12 -17 -12 -66 -19 -53 82 26 14 13 3 13 -105
6848a05J67j16m9J09N2m1M4j4oQJ3L4m0q0R2j55K5P1m4R6J7k22J47k1J86j13r1
$$ -105 62 -54 -103 6 58 17 61 47 41 49 62 96 56 -24 68 -87 -62 9 -35 61 78 -144 3 -18 168 55 -36
6875c6l8J61j7m1lp7J7O6l3l4N8K1r9PJ34k7r8L5q9k8J26o1KJ6J27m9l2o9J80
$$ -36 -74 87 70 29 26 -51 -34 32 -1 -35 23 44 -55 -48 86 59 -39 -4 -93 -121 5 -56 -54 -38 89 40 8 -61 119
6904A19k67J55J39q4n7j53N3l6J95n5m4J0j2J28m4RJ7j82J20j15J31o4o5L8J8
$$ 119 -148 7 146 62 5 -148 -95 -131 64 9 -35 -25 -37 91 47 56 73 -109 11 -104 27 -37 -102 -64 -46
6929d6P6q5J48j78M5J05m1K6j31J50j11J5O0Q6j56K7k0l6N1KRk7j67K25o7j3n7
$$ -46 30 -55 93 -85 -40 65 24 50 -81 69 -42 -27 33 119 -37 -10 -30 -66 -15 -13 -4 -31 -198 27 -40 -53 -110
6956a10K64q5j10M2P3q0P1n8j69K01o3l5J03o3k9J87j53r5J66p7R6n9q8l4J67
$$ -110 154 69 -41 1 74 -6 65 7 -162 39 -24 -59 44 -19 -48 139 -14 -109 57 -20 76 17 -71 -105 62
6981F2oq9l7J85j23O0r9j3R3M7q6J77j42k4N3Q6o9ok67l0K57j26L8K9J5o3J22
$$ 62 56 -33 -70 115 -8 52 -47 -60 33 80 -6 171 29 5 58 144 75 69 -198 -228 29 -97 -59 -30 -15 -78 44
7008D4k11K23p7R4j03p9L0J23J11k20J05O3RKq8j28P4O5P3j38M3olo5OK3N6j22
$$ 44 -167 56 -21 73 -30 -109 -79 44 155 -65 40 103 112 114 26 -102 -28 37 110 -28 15 9 6 -59 -53 -30 26 -96
7036i6N9J56j50L6j15J42Or7N9pJ0O1l0q1J13J7o8K7j07k7pR2O1k7MQn9K04k06
$$ -96 -37 119 -31 5 -110 32 38 -59 0 -7 3 64 34 -47 66 83 15 42 -65 -92 -99 -7 54 27 31 39 -20 184 -22
7065b2Nl8%M2K2o2J16P1k50OM5J38l8l3L8r0J0j20O9P0J7n5J30k3K1j12O7n9j3
$$ -22 -17 -55 -55 -13 9 -53 63 134 -116 -110 -65 73 35 2 40 -50 -40 -160 -91 -21 -4 -59 71 48 69 -43 24 -35 -48
7094d8J24o0o9j7R6k4j4L8q0m7LJ80j80J29l3M7n0ml7Q3n6K7l4J28j75j11R3J
$$ -48 76 16 -53 -70 26 2 -12 26 -54 -101 -98 82 -98 31 -2 45 -5 -9 -46 37 -19 8 -26 102 -73 -184 -91 -90
7122i0Q2j24K14j32K58j31P4k75O8J00J1Qj68k4M8O2Lm1J54j39k4n3J41J0n7p
$$ -90 -8 -132 82 -50 208 77 151 -124 -56 44 55 63 -105 -129 -81 -19 -16 -57 97 -42 -66 -119 22 32 -25 -32
7148c2n2J17%m0J21K7k01K4N6o1J29J24k16n3k0J12m7j6NN5j03M0o9J74k6j16
$$ -32 -84 33 33 -7 114 141 -60 -36 20 -41 88 212 -4 -57 -77 35 -12 -28 -23 32 -71 -31 -100 74 48 -68
7174f8n2J67Op1k9R8k6j06R7n4Q5k9L6j25Q3j24lJ00J5m6K1j4M5M3r6N2q0J23
$$ -68 -120 47 53 -18 -47 51 25 -81 16 -38 47 18 54 -71 12 -112 -115 -15 0 -46 -25 -39 6 49 -47 5 -75 48
7202D8j52J85j5r6J61o4J6o3l6j2J10p6n5O8j0m8m8L7K1M8p2P0ppj6p0J09j89
$$ 48 -104 81 66 -30 131 67 83 20 -16 -28 82 6 -49 19 9 -39 -87 -50 -29 19 -53 17 10 3 -13 -83 26 -163
7230a63K46p1J6o5J38j07k3qJ01j35m5J61Q2j19R0Jn4j20m4Q6N3P0j51N9J08j24
$$ -163 83 12 28 -37 101 -6 -29 -37 64 -71 -116 45 127 8 98 99 45 -75 -119 -33 20 90 -61 -2 106 -18
7256a8mj8J90j80KJ23j9J4j90J26Jq5q2M8J36p3rJ65j45Nn5N5O0q6Q6j12R4R7
$$ -18 -22 -40 150 -30 -28 95 76 90 -100 26 27 -58 -140 -92 44 -29 -38 127 -18 -13 -68 -13 47 -39 47 -65 29 126
7284A26j44l9J34r7R2J3j19N7J6j50K14k58K0Q1j1q0K05r4p7J59l3j44J37R6k02
$$ 126 -18 -57 77 -20 72 85 -34 23 39 -111 103 -155 -135 -54 -65 -145 60 -34 -111 48 15 -129 8 104 -98
7309i8J00j22K06j09%j81K18j21Q0R7m8l1M7o7j0m4P1N3K8j17L2n5l9O9m7PK0
$$ -98 2 -120 86 -23 -23 -204 14 -107 -27 70 22 -9 38 -29 -39 -83 -12 41 69 -48 -16 -71 -110 -41 -88 -81 -61
7336f1M1M2m8J12j19O8j30Q7k5M2L4r5N6N3j7j25j0O2J9p5M8P3l4q7K9K4l9J21
$$ -61 -20 22 -26 86 -33 35 -95 -8 -33 9 43 -52 4 57 40 -85 -95 -33 -14 -89 -41 32 -2 -89 -60 -36 -75 46
7364D6JJ4k8q0l1J91k07N9P8j14J9Q2r2K6J8Q8j22J12j27N4Jp0%L3K2J06j80R8
$$ 46 47 61 33 -47 -78 113 -94 -35 43 -71 -52 30 -62 -36 -18 70 -52 60 -67 -13 -12 -82 -82 -49 -27 79 -101 -3
7392cln2R4qN7o2qP3j36KJ2K6J43o2n9L0oq4o5N4j8O5Rr7M4K0Q1L5q2j2q8R5J3
$$ -3 -6 -58 36 28 85 23 15 88 -48 -46 -34 -8 135 73 14 44 38 -46 -111 -57 -75 -10 -1 -98 -54 -34 47 82 0 -12 -100 -5 8
7425Hj7R3o9K9oo9O7j11m7L15j90o3Q7j84J92o0j16K9R9L9j39l2K50j60J32p4
$$ 8 -9 84 15 44 38 -31 36 -75 -122 193 3 -60 27 -157 35 -25 -141 -112 -13 26 -113 -145 105 -55 77 3
7451CJ10j20K5k5J7K9J3j45J81p0J72j51k0j9r7L0L6J26j04J9j30J11j54J57J21
$$ 3 113 -7 18 -7 10 39 52 -93 88 18 190 39 19 0 -97 -67 -31 95 -9 10 -120 -9 -163 -6 115
7476A15j61N1N0p9N9j42O4j1J0L0k8m8J33n5J9j34J46j36J91K7j50j1j5J56j13
$$ 115 -46 5 55 -24 35 -107 -43 -54 -44 -14 -42 -90 43 -12 7 -127 19 -117 74 101 -49 -60 -75 81 -32
7501c2K8r3J86k22J61r4R4k1l5O7j15ok0J87k57J61j07P4J0j10R2n0J45j93J31
$$ -32 -4 -97 89 -133 28 -66 28 7 -28 39 -76 -82 -102 85 -172 -11 -118 -44 -34 -144 -52 -102 43 -150 -19
7526a9Q6J6k9J5n7K5k7p8J16n8Qkm7J1P9J10j16K1j79K8P5l2L9J8Q4j22L3p2m7
$$ -19 67 83 54 69 12 37 10 -68 48 -10 -2 -4 -51 -40 39 149 33 54 -125 -97 -22 -54 -15 3 87 -35 -2 -74 -121
7555a21K26j43L6P6j73R2O4j36J75j80J19p9K3L4jm4J19M8k38J09m6Q1j38kJ94
$$ -121 105 -38 -2 74 -99 -7 57 -79 96 -84 35 -44 -21 13 12 -32 87 135 -103 6 -40 41 -97 -99 95
7580I5m5Kj53l9J85j14J09j27N1L4P1k5K1j44J06J54k46Q6Pl1n9K5rL1M2l5K3
$$ 95 50 52 -101 -140 45 -69 40 -87 -36 -2 69 44 65 -79 27 181 -65 21 28 -3 -62 -37 -46 -15 27 -8 15
7607A5p1p9R3J07j68M7J7P5m3J08j4j85R7L6j7q1m4J90q1mp6J8L7m0O7kO7j67
$$ 15 -56 -135 -42 65 -103 -56 -39 36 -7 101 87 -98 -1 35 18 -63 -107 83 2 -2 -78 -60 -23 -63 4 2 69 -98
7635i8j2K07j62J7j5Q9m4O2m2LQM7n4Q6q1j72K64j56J39j53K1J41j37j68J82J12
$$ -98 -110 97 -65 -48 -63 26 -18 44 2 5 13 60 6 92 11 -161 103 -53 86 -67 -46 95 -42 -210 -28 84
7661H4q7q5J01N2o6J31j54m6R0p5J79k5k0K9n3P5j11J3p7O8n5On5J6K6J06j83
$$ 84 -3 -88 13 65 -1 130 -24 -70 20 -55 124 99 79 108 55 130 19 32 -45 23 -32 -26 -81 -65 -39 67 -116
7688a16J72m6r0J18j30K31j97M3Q3k3RL3L0p9m4R5j46R2k2j5n8N9qm9J19j07l
$$ -116 56 10 -80 38 -92 139 -58 -15 68 45 54 87 117 38 -6 89 -57 35 13 -2 -60 -1 -9 -58 61 -46 -49
7715d9j0P5K0j21Q9j37J03P5j65J43L1o0M8l7O6j94J26Q6k5j29M6L4K7L1j44J19
$$ -49 -59 16 36 -85 4 -133 -30 45 -120 23 54 -6 42 5 71 -123 3 89 64 -65 -19 15 42 73 -71 48
7741D8q1K6qq6J93n6j31K7O0k4R5j11k7J18j43J0J01J6p6J57j84ON2K3P3j36J23
$$ 48 -33 -7 -15 -101 92 36 -95 -68 -8 -32 63 -48 -75 43 -100 -90 11 27 -49 108 -76 -70 -18 5 78 -58 65
7768F5j16M4LL2j06N4qj30K33n3l2k2L0J4J1N4m3m3K2j2j29J27m8j3J01o8nL0
$$ 65 -51 -7 -4 28 -78 -24 -32 -162 71 18 -14 -36 -6 8 19 73 30 -13 9 -3 -132 -5 -53 -66 35 -33 -38 -8
7796ho7M9k6l5J80r1pOM9j38J39j78J67k1l7N4P1j04k1l7Q8P8j41r7J94j40JM4
$$ -8 -75 -26 -52 -87 93 2 -5 1 50 -88 51 -127 40 19 -18 36 107 3 -18 -55 33 111 -30 -127 67 -73 -72 -28
7824b8K8K8k09J80N4j60K10r2r0J36L5j56Oj8O8J43r8kl4J0L5j24p4J03M5j29
$$ -28 0 28 -181 -1 53 -107 103 11 -79 57 92 -64 -58 -76 -8 135 37 35 1 11 46 -78 -152 -49 -4 -133
7850a33Q0M1j5Q7pp0j7L3Rj13J38j0J8o4P7J12j18j0k1j18l9J92M1j03N5n3K6
$$ -133 -53 -12 -27 60 53 -17 -34 -1 8 -105 33 23 41 -23 54 166 48 38 17 -101 -140 52 93 -10 45 -8 18
7877A8L2o8K2J0mM3M9p4K5j56P2K5n8J8O2J7Nm8j7j9M1p5R2j69K05o4n5k4J4L3
$$ 18 50 -18 4 14 10 53 102 28 53 -103 -31 -6 -64 -46 16 33 38 -10 -27 -46 -5 -80 12 -157 48 -16 -71 -95 -81 -48
7907d8J7j1N9N7j34l5Q3j3k1N4j05J93j93R4L6q1J37k67Q9J27j2r3J05j01L5l5
$$ -48 -31 -42 17 74 -60 -95 -12 -25 -46 8 -97 96 -97 -3 33 -48 89 -178 -89 38 26 -67 38 -63 -28 -63
7933f3N1l3j78J28n0J26n0M0Lk2J48Mj36L7m0J4Q8NLNj65J81j6N4k26M8P7j1o1
$$ -63 -12 -45 -223 -95 -145 -19 -69 -29 -26 -48 100 104 -32 5 -35 -21 67 72 75 80 -85 96 80 134 -92 -44 33 22 -39
7962c9pk2P2K0r3J33j73J30m1N2o3o4J28o1L2n3J30j67J34J1p3j57K02n9j0M6
$$ -39 -46 -68 4 24 -69 64 -109 21 -20 32 -31 -95 33 -28 4 -49 81 -86 48 59 -14 -171 31 -28 -38 8
7988Hq9J21o2M1o7Q6J7m4L5J9L8l7p8P1j44N5l6J64p6n8O5j53Q3n2O4l1l7j02
$$ 8 -81 40 -22 19 -48 38 55 11 46 65 103 66 -12 59 -85 -30 -66 98 22 -36 29 -124 -41 -93 -29 -60 -97 -199
8016a99J37R6RO8j97J41l0q8Q7N8m7m7RO1j67N8J04j27K7qP8p4Q0j17J68j21O8
$$ -199 -62 34 43 111 -86 55 25 -63 24 82 35 -12 -3 58 -109 -51 53 -74 -47 -55 23 -51 29 -88 80 -41 27
8043B7j7J2J17j17o0L3N6p8l2O0K6J05j26o5J8N2j1q7Q2k1k9n2N1m7P8P6k7r9
$$ 27 10 22 139 22 -38 -5 51 -27 -59 1 27 132 6 -59 -41 11 0 -87 -5 -26 -55 -107 -56 -103 -25 51 24 -75
8071g5Q4p3K00j79j9L6L7J03k4J1k9o6K0j1L7L6J9k49P6J69j8m2j3j38O8O5m9
$$ -75 9 -64 136 -43 -62 -26 11 114 90 101 72 6 26 15 52 88 107 -142 -66 103 85 43 30 -108 -40 25 -24
8098b4k7j1l4J81r8M9J6n8j2R2o2p1n%l6P6K9l3%N6L8p6K8o7Q7Oj97Q8l4J21l6
$$ -24 -51 -62 -96 85 -13 36 52 -6 -18 74 12 -59 -64 -64 -100 -24 5 -28 -28 28 66 -10 18 -49 38 44 -153 -65 -99 22 -14
8129a4LL2O9l0j07j1Q6l9l7j3J19no9Q6j53J12jo8L1N0j38Q2q1O0MO6J9q2K7k9
$$ -14 -11 21 90 60 -47 -58 28 -11 -48 -61 58 53 -16 70 -83 29 28 -40 -9 41 -97 -15 -96 -36 -32 34 53 -29 -2 -31
8159c1O6n6j20J95m3k9J4L1j24K4O3M8j52Q0L5k9N3j19M5j1N6o5J19m2l9L5m1
$$ -31 35 -21 -141 54 11 -18 -4 27 -97 -73 -10 38 -114 -34 1 -28 25 -94 -49 -60 -4 -69 50 8 -31 4 -37
8186c7ON9J9m4o5
$$ -37 -31 28 47 3 -62
8191f2
$$ Imaginary data points
##PAGE= N=2
##DATA TABLE= (X++(I..I)), XYDATA
0@%%%%%%%%%%%%%j6L2l2L2l2M8o4O4q0R6j12J28j44J76k08K40k72L04l50L98m48
$$ 0 0 0 0 0 0 0 0 0 0 0 0 0 0 -16 16 -16 16 -16 32 -32 32 -48 48 -64 64 -80 96 -112 128 -144 160 -190 208 -240
34b40N12n76O41p21Q08q98J003j113J231j365J511j669J842k032K240k467K717
$$ -240 272 -304 337 -384 424 -474 529 -584 647 -718 793 -876 966 -1066 1174 -1293 1424
51A424k992L297l639M024m453M941n503O152o918P836q955J0364j2197J4687j8290
$$ 1424 -1568 1729 -1910 2114 -2339 2602 -2901 3251 -3667 4169 -4786 5578 -6619 8068 -10222
66a0222K3980l4370N9399k27287k84614M23046K30516j13160j07515J90888P9039
$$ -10222 13758 -20612 38787 -188500 -473114 -50068 180448 67288 -40227 150661 229700
77B29700j59604j07776J28390N9918p7711J4705J45839n7479k70416j38016J06035
$$ 229700 70096 -37680 90710 150628 72917 87622 233461 175982 -94434 -232450 -126415
88a26415L5705j04003K1091J92677M6100j52769n8063J30577O4710o9914r279
$$ -126415 -90710 -194713 -173622 19055 65155 -87614 -145677 -15100 49610 -20304 -29583
99b9583R9528L6238l9571J0927K8108p3666p7220P0394J05025o4030j38730J6461
$$ -29583 69945 106183 66612 77539 105647 31981 -45239 25155 130180 66150 -72580 -56119
111e6119J27644J0771j08875m7526K4027l3383n7994L8699P3360j7891l1175P6542
$$ -56119 71525 82296 -26579 -74105 -50078 -83461 -141455 -102756 -29396 -47287 -78462 -1920
123a920P8854n6413p6907O4274J16044M326n0463K4275L6163p5867j19037j1682
$$ -1920 76934 20521 -56386 7888 123932 128258 77795 102070 138233 62366 -56671 -68353
135f8353O9191J3112m9368j5531J8026k2438m1943J4244M7017J2279O078M8324
$$ -68353 838 13950 -35418 -50949 -32923 -55361 -97304 -83060 -36043 -23764 -17686 30638
147C0638K9181n5531o9745J5088O9583L6533p04O247P526k1441l5805j1065J7482
$$ 30638 59819 4288 -65457 -50369 19214 55747 55043 61290 68816 47375 11570 505 17987
160A7987J6711M276L63j1815m3297n9252l0800J0574K4043K1270K2157J5377l874
$$ 17987 34698 38974 39337 27522 -15775 -75027 -105827 -95253 -71210 -49940 -27783 -12406 -16280
173a6280j0265N724K5968L5464K9295J0647n327r485j5356k5888k1214j382N412
$$ -16280 -26545 -20821 5147 40611 69906 80553 75226 65741 50385 24497 3283 1901 7313
186G313m899j2375j3777j7541j1194R918K1313Q333p995p238K429L599N85Q563
$$ 7313 2414 -9961 -23738 -41279 -52473 -42555 -21242 -12909 -20904 -28142 -25713 -22114 -21529 -12966
200a2966K2799K0319j310j0531J546O721O16Q377K2290O600k5526l1391j8210
$$ -12966 9833 30152 28842 18311 19857 26578 27194 35571 57861 64461 38935 7544 -10666
213a0666j8711j9481L041K1939O445j8382j7212p2O308P908K4801M2251L0128
$$ -10666 -29377 -48858 -45817 -23878 -17433 -35815 -53027 -53099 -46791 -38883 -14082 28169 58297
226E8297l525j8166q857p667j2849M263K7416J2621k3046k9224j3520j4541j7870
$$ 58297 54772 36606 27749 20082 7233 11496 38912 51533 28487 -737 -14257 -28798 -46668
239d6668O618L2357J9587r613j7652r722r759r942Q577L0746K6041J251q863N2
$$ -46668 -40050 -7693 11894 2281 -15371 -25093 -34852 -44794 -36217 -5471 20570 21821 12958 13010
253A3010Np112N768K7961J8594j1487j9436j0768j5990k3649p417J2075M678j2748
$$ 13010 13015 5903 11671 39632 58226 46739 27303 16535 545 -23104 -30521 -18446 -13768 -26516
267b6516j1622q23N20P98J2813K5258J9711J701n330J360K330l486K669J4201
$$ -26516 -38138 -38961 -38441 -37643 -24830 428 20139 21840 16510 17870 20200 16714 19383 33584
281C3584N249j6312j8826p144m351n516N337J3510K166j3086j4526q889n297J108
$$ 33584 38833 22521 3695 -3449 -7800 -13316 -7979 5531 7697 -5389 -19915 -28804 -34101 -32993
295c2993J1315J5402Q342m123r508l174N287J1140J8252K2752J1186q478j6586
$$ -32993 -21678 -6276 2066 -2057 -11565 -14739 -9452 1688 19940 42692 53878 45400 28814
308B8814j3259j1358o871M314P964l201j5071j7667j5504r323M228J7988K1258
$$ 28814 15555 4197 -2674 1640 9604 6403 -8668 -26335 -41839 -51162 -46934 -28946 -7688
321g688J4447K855n758p152j559M815J1680J5683R511m367j2297j1560r084l674
$$ -7688 6759 9614 3856 -3296 -4855 -40 11640 27323 36834 32467 20170 8610 -474 -4148
335d148O888J1068L389o029j1356j4123j2059k986N005O350M222K84m730m783
$$ -4148 2740 13808 17197 11168 -188 -14311 -26370 -29356 -24351 -18001 -13779 -13495 -18225 -23008
349b3008K698J0118J4048J5476J1405K237m656n376l915j301K554J187o964j2572
$$ -23008 -20310 -10192 3856 19332 30737 32974 28318 22942 19027 17726 20280 21467 14503 1931
363A931j3515j2720p399L269R729O904K212p93m353m578K764J0116J2404J0019
$$ 1931 -11584 -24304 -31703 -28434 -18705 -11801 -9589 -10382 -14735 -19313 -16549 -6433 5971 15990
377A5990L949m237q074n030J77O042J0828R250q30r165j1476j1846q553j34N171
$$ 15990 19939 15702 7628 2598 2775 8817 19645 28895 28065 18900 7424 -4422 -12975 -13109 -7938
392g938K139l563p603j0129q137P59J0260J4671J4823J0295J485l925k347J208
$$ -7938 -5799 -9362 -16965 -27094 -35231 -34472 -24212 -9541 5282 15577 17062 13137 10790 11998
406A1998M631P825O240k490j0561j2791j1962p719P91O200M606l81m082p698p148
$$ 11998 16629 24454 30694 28204 17643 4852 -7110 -14829 -14038 -7838 -3232 -3613 -7695 -15393 -22541
421b2541o55O818Q862P594M215k368n994k601L178P358J0804R599K606m218o863
$$ -22541 -23196 -16378 -7516 78 4293 1925 -4069 -6670 -3492 3866 14670 24269 26875 22657 15794
436A5794o648m714Q05L165j007o768r522j0671r371j223P046Q738O767L971k4
$$ 15794 9146 4432 5237 8402 7395 627 -8895 -19566 -28937 -30160 -23114 -14376 -7609 -3638 -3662
451c662k423J121N488Q679R232O371j634p819q077n908k296L643O351J907m465
$$ -3662 -6085 -4964 524 9203 18435 24806 23172 15353 7276 1368 -928 2715 9066 10973 6508
466F508p526r229p173K94O855N899K530n77n084q210l957M751J0330J0837Q363
$$ 6508 -1018 -10247 -17420 -17126 -10271 -4372 -1842 -2419 -7503 -15713 -19670 -14919 -4589 6248 14611
481A4611L242l089n824m369Q66O674O228O3n057p572j1954j1768k119O449N569
$$ 14611 17853 14764 8940 4571 5437 12111 18339 18402 13345 5773 -6181 -17949 -20068 -13619 -8050
496h050J804J813q49o280m531M539J0019Q183M950J650k719o765o127P86P250
$$ -8050 -6246 -4433 -5282 -11562 -16093 -11554 -1535 6648 11598 13248 10529 3764 -2363 -1577 5673
511E673N966K68j754k196p264q864l51O982L449j932j452l156q447o597L992Q846
$$ 5673 11639 11907 10153 7957 693 -8171 -8522 -1540 1909 -23 -1475 -4631 -13078 -19675 -15683 -6837
527f837O053L273K693l20m208k560M504Q966N240r21k699m458r688r093R36P151
$$ -6837 -784 2489 5182 4862 654 -1906 2598 11564 16804 15883 13184 8726 -962 -10055 -9119 -1968
543a968K141k242j15k010q307n105P005J0625M295R67J857j653p762n183M316
$$ -1968 173 -2069 -2184 -4194 -12501 -17606 -10601 24 4319 5286 7143 5490 -2272 -7455 -3139
558c139R093M168o05j57j728q165p499L627Q871J623l671p5k066r887p659M615
$$ -3139 5954 10122 9517 9360 7632 -533 -8032 -4405 4466 6089 2418 2343 277 -9610 -17269 -12654
574a2654Q809K532J70K969K29n524k925N872R074L727q61j79k080p948p660K286
$$ -12654 -3845 -1313 -1143 1826 2055 -3469 -6394 -522 8552 12279 11418 11239 9159 1211 -6449 -4163
590d163O601N35l793n70j763p371m436N937Q259K290L62J537k137o124j791N417
$$ -4163 2438 2973 -820 -1390 -3153 -10524 -14960 -9023 -764 1526 1888 3425 1288 -4836 -6627 -1210
606a210O889K553M68l49k999n916l149M418N666O38k295j365n141q672k984N019
$$ -1210 5679 8232 8700 8351 5352 -564 -3713 705 6371 7009 4714 3349 -1792 -10464 -13448 -8429
622h429M342J78J453J792l341m955J839Q043O115K444K039J16m566o438j727L935
$$ -8429 -4087 -3909 -2456 -664 -4005 -8960 -7121 922 7037 9481 11520 11636 7070 632 -1095 2840
638B840L267r46k029j807n339o857j338N530M384J295J179k27m736m560J891N309
$$ 2840 6107 5161 3132 1325 -4014 -10871 -12209 -6679 -2295 -1000 179 -48 -4784 -9344 -7453 -2144
654b144M311L900K535j873m778k236J605L219L254K892R0m662p222n223p66J067
$$ -2144 2167 6067 8602 6729 1951 -285 1320 4539 7793 10685 10775 6113 -1109 -6332 -7098 -6031
670f031R05J804J554l266o352j464M608M300L239O184M600k879n381j89K945J072
$$ -6031 -5126 -3322 -1768 -5034 -11386 -12850 -8242 -3942 -703 5481 10081 7202 1821 1632 4577 5649
686E649J505L387J27o280p283k207P84M46J449L409P92n780o798m16L421J318
$$ 5649 7154 10541 10668 4388 -2895 -5102 -4318 -3872 -2423 986 1778 -4002 -10800 -11216 -7795 -6477
702f477K330O429L228n011m953K669M109J133L699O896J049p237o655r48L46j214
$$ -6477 -4147 2282 5510 499 -4454 -1785 2324 3457 7156 14052 15101 7864 1209 261 607 -607
718f07L53K843n99p127o663o16K592J230L118O391K681m535l588K421L087J084
$$ -607 -254 2589 1990 -5137 -11800 -12416 -9824 -8594 -5476 915 3596 -939 -4527 -2106 981 2065
734B065L843N710k71n971l975J26l12J44K898K579k294o565m692r59k52l5L099
$$ 2065 5908 11618 11347 5376 1401 1527 1215 1359 4257 6836 4542 -2023 -6715 -7674 -7926 -7961 -4862
751d862M567q26n640k151L035K302J587N922O794m90n233k066J354l26m22K970
$$ -4862 -295 -1121 -6761 -8912 -5877 -3575 -1988 3934 10728 10238 5005 2939 4293 3967 3545 6515
767F515K745l074p131n016p59O0J34K436L810k16m890l084J711K536J793M011
$$ 6515 9260 6186 -945 -5961 -6720 -6660 -6526 -4090 -280 -496 -5386 -8470 -6759 -4223 -2430 1581
783A581M619k50l956j835P68R40K080L312J721j788m263l849j957k2J246J346
$$ 1581 6200 5950 1994 159 927 1867 3947 7259 8980 7192 2929 -920 -2877 -2899 -1653 -307
799c07N59j808m208l064J08J794K663M205L253m53k533o56O84J173K888L626Q60
$$ -307 252 -1556 -5764 -8828 -8720 -6926 -4263 -58 3195 2742 209 -447 237 1410 4298 7924 8784
816H784k529l477k854j909J58J702J807K14k052l685k773j36J484J965L050K051
$$ 8784 6255 2778 -76 -1985 -1827 -125 1682 1896 -156 -3841 -6614 -6750 -5266 -3301 -251 1800
832A800j287k843q14R64J591L043L491R76j774k684k084q39R58K243R45p85k023
$$ 1800 513 -2330 -3144 -2180 -589 2454 5945 6921 5147 2463 379 -460 498 2741 3686 2901 878
849H78l666l313n08K060K469J944J054j142k308j337Q18K072L477K921J15k098
$$ 878 -2788 -6101 -6609 -4549 -2080 -136 918 -224 -2532 -3869 -3051 -979 2498 5419 5534 3436
865C436j932k249j067J639L028J263q28j755k805k672q85K027K304J691n9j679
$$ 3436 1504 -745 -1812 -173 2855 4118 3290 1535 -1270 -3942 -4827 -2800 -496 1195 1136 -543
881e43k231j328K64J821L347K825j73j813j367j449n43J721L102Q94j104k392
$$ -543 -2774 -4102 -3838 -2017 1330 4155 3982 2169 802 -647 -1190 531 3633 4527 3423 1031
897A031k673k625k30K031K384J281o7j758k286j267J053K433L063K208m74k198
$$ 1031 -1642 -4267 -4497 -2466 -82 1199 1132 -626 -2912 -4179 -3126 -693 2370 4578 4104 1906
913A906k018j452n29K072K872J084j318j820k478k466j29K451K476R93j54j563
$$ 1906 -112 -1564 -2093 -21 2851 3935 2617 797 -1681 -4147 -4276 -1825 651 1644 1490 -73
929g3k466j566P07K279K810K294m43j683j767j131k13J883K735Q09j266k047k267
$$ -73 -2539 -4105 -3398 -1119 1691 3985 3542 1859 92 -1039 -1252 631 3366 4175 2909 862 -1405
946a405k337n12K072J974Q62j99j582k139r52J180K315K600K195k53j898j599
$$ -1405 -3742 -4254 -2182 -208 654 455 -1127 -3266 -4218 -3038 -723 1877 4072 3819 1921 322
962C22q62j00J790K432Q50j358j962k286k014j48J825J668M81o07j535k410j031
$$ 322 -540 -640 1150 3582 4432 3074 1112 -1174 -3188 -3336 -1511 157 638 31 -1504 -3914 -4945
979d945J094J989K484J780K97j418j308j10N59J922K305P26j356j978k064k148
$$ -4945 -3851 -1862 622 2402 2699 1281 -27 -137 422 2344 4649 5375 4019 2041 -23 -2171
995b171j89J388J099k7p44j807k103q85J336K005K162J504J14j282j113LQ70J875
$$ -2171 -2360 -972 127 100 -644 -2451 -4554 -5439 -4103 -2098 64 1568 1682 400 -713 -710 160 2035
1013B035K405O65j010j739j557j499j46J470J084k66j214j867k507r97O55J611
$$ 2035 4440 5105 4095 2356 799 -700 -846 624 1708 1442 228 -1639 -4146 -5143 -4488 -2877
1029b877J366J281l2j093q77N08J365J792K425J231p42j289j094j086j3J270O19
$$ -2877 -1511 -230 -262 -1355 -2232 -1724 -359 1433 3858 5089 4347 3058 1964 878 865 2135 2754
1046B754n65j480j742k423j100P89J401Q34N06k85j281q69N30J489K066K079Q52
$$ 2754 2189 709 -1033 -3456 -4556 -3767 -2366 -1532 -1026 -1311 -2592 -3461 -2931 -1442 624 2703 3555
1063C555o14r10p80l06O77J849Q34q18j354j795k238j277P71J009L74k8q33j523
$$ 3555 2941 2031 1251 945 1622 3471 4305 3487 2133 338 -1900 -3177 -2406 -1397 -1023 -1051 -1884 -3407
1081c407j284N44J648K064J805R24l92j015m74J45J098K023R25o07j295j616j890
$$ -3407 -4691 -4147 -2499 -435 1370 2294 1902 887 413 558 1656 3679 4604 3997 2702 1086 -804
1098h04q67Q47R98m8m38p36k003j533K99J491J439J346O89o03r59k70M28J680
$$ -804 -1671 -824 174 126 -312 -1048 -3051 -4584 -4285 -2794 -1355 -9 680 77 -882 -1152 -724 956
1116I56K092J162j56r48j263j796m21J119Q95k75m53j439j976j706K24J232J225
$$ 956 3048 4210 4054 3106 1843 47 -374 745 1640 1365 912 -527 -2503 -4209 -3985 -2753 -1528
1133a528J098M38o25j203k47P93J465J877J198n4o65j259j293j06J340R25j66
$$ -1528 -430 8 -617 -1820 -2067 -1274 191 2068 3266 3212 2547 1288 -5 -111 1229 2154 1988
1150A988l29q55k180j588L49J124O77N32L31j016j440o83Q60J387J853J158M9
$$ 1988 1659 804 -1376 -2964 -2615 -1491 -814 -282 49 -967 -2407 -3090 -2230 -843 1010 2168 2217
1167B217p49j076o50J92J492J165M4k66j002k173j424M85R61K74O84K12j214j699
$$ 2217 1468 392 -258 -66 1426 2591 2635 2369 1367 -806 -2230 -1745 -784 -510 174 386 -828 -2527
1185b527k49P46R89J371J183J92r66j093n86N52J397R36K11j2q82j910j032O95
$$ -2527 -2776 -2030 -1041 330 1513 1705 739 -354 -940 -388 1009 1945 2156 2144 1262 -648 -1680 -985
1203i85R49J60M35L64j259j807l45R43R26Q04R20J35r49j228k49O05J362P76K92
$$ -985 -36 124 559 923 -336 -2143 -2488 -1545 -619 185 1105 1240 291 -937 -1186 -581 781 1557 1849
1222A849k06p70j648q52O03J206K65K51K56j073j521k15Q32P76R49P38j23j309
$$ 1849 1643 873 -775 -1627 -1024 182 447 698 954 -119 -1640 -1855 -1023 -247 702 1440 1317 8
1240Hq15j13L16J023Q96J69k10j030j199m67P30O88L99K51J09j246j390J70R80
$$ 8 -807 -920 -604 419 1315 1484 1274 244 -955 -1422 -692 -4 395 646 755 -491 -1881 -1711 -731
1259g31M61Q14R20k03j285o65L26N83O40P27J43m85j127j365j18O96M80J75J86
$$ -731 -270 544 1464 1261 -24 -689 -363 220 860 1587 1730 1245 118 -1247 -1365 -669 -189 -14 172
1278A72K1j247j158L84J139O56M89R93l36j071n63L83P11O56P60L1o15j189j014
$$ 172 193 -1054 -2212 -1828 -689 -33 456 1449 1113 42 -521 -138 573 1229 1989 2020 1405 216 -798
1297g98k67N03P35J41j71l57j253r63K33R27P08P65N61l16q57k93O23N55R81J045
$$ -798 -1065 -562 173 314 143 -214 -1467 -2430 -2197 -1270 -562 203 764 448 -409 -702 -79 476 1457 2502
1317B502k4q83j118m84l44K75O16L56m93p37j269q85K62O17N48P46N64o12r24
$$ 2502 2478 1595 477 -7 -351 -76 540 896 403 -334 -1603 -2488 -2226 -1609 -1061 -315 249 -363 -1287
1336a287O9O46O56R64J137L09q97p33l57k7J77P22K06m20j057j209j086O9M63
$$ -1287 -1218 -572 84 1048 2185 2494 1597 864 507 480 657 1379 1585 1165 108 -1101 -2187 -2118 -1655
1355a655N13N75J42n69q49k4O94O91J142J271J54p02n73k03q2M98P97K56m14j014
$$ -1655 -1142 -567 -425 -994 -1843 -1867 -1173 -482 660 1931 2085 1383 810 607 525 1023 1820 2076 1662 648
1375F48j064q94k69M52P02J24m2r57p88l47M73P73J190R29J31n17j96mQP58J178
$$ 648 -416 -1310 -1579 -1127 -425 -301 -343 -1300 -2088 -2435 -1962 -1189 1 930 1061 544 348 344 352 1110 2288
1396B288M36o36o71q54r94l23M49L68N2l60r69r16l11K82N62P74J052l8m13o1
$$ 2288 2724 2088 1417 563 -431 -754 -305 63 115 -245 -1214 -2130 -2441 -2159 -1597 -823 229 191 -222 -283
1416b83J25J28P85J242M09l79p92n28n71n1L13L61o1m34q33r94m69J54L11O35
$$ -283 -158 -30 755 1997 2406 2027 1235 707 136 85 398 759 698 264 -569 -1563 -2032 -1878 -1567 -932
1436i32O34J9n36k61R5L62R02J068N53j78m43l44n21n6N92J90l1l15q70q31n25
$$ -932 -298 -279 -815 -1076 -981 -619 283 1351 1904 1726 1283 939 418 362 954 1144 1113 798 -72 -903 -1428
1457a428LL77N82J81j77n22m01N3J34Q87Q93M26k05k33p7k94R4N70P25k60k50
$$ -1428 -1425 -1048 -466 -285 -462 -984 -1385 -1332 -1198 -311 582 1008 803 570 493 199 293 863 1588 1328 1078
1478A078n23q23l83N7K83J82J64n14o72k58J4L28N50Q70K41m06k3l03P6J81Q30
$$ 1078 555 -268 -651 -594 -311 -129 35 -479 -1151 -1409 -1395 -1067 -517 353 594 188 165 -138 -62 119 949
1499I49K82M3l18n71m00m13K04L28K78M5l64o66n93J14K30N53O59J18m07n38k4
$$ 949 1231 1274 956 385 -15 -428 -224 104 382 427 63 -603 -1196 -1082 -852 -299 360 478 71 -467 -491
1520d91o8L78N98N94j21l09l36m72k23L77N63J35O1m87n52m98k2L86M63M39k7
$$ -491 -559 -181 417 1011 890 581 245 -227 -450 -73 490 625 686 199 -353 -851 -873 -487 -24 415 388
1541C88m13m69p6n3L17P39M59k12l76l74n72N0M89N23K12j44k85m60m78J11M77
$$ 388 -25 -494 -570 -623 -306 433 892 680 304 -70 -642 -592 -103 420 632 488 203 -257 -735 -624 -147
1562a47K82N37J4m76n34k46J39K03N48N99k72m43m14m41k05O70L83J80j40k29
$$ -147 135 672 686 210 -324 -570 -431 -228 320 919 647 204 -210 -651 -856 -186 197 377 237 8
1582Hn22l30J53M51L55N00P3l41m63k04J97L60N89K30l07o19l95k37k40M62M50
$$ 8 -514 -844 -691 -240 115 615 688 347 -116 -320 -123 237 826 1056 749 130 -265 -502 -742 -280 170
1603A70R1n3m95l57m07L81L25M47N01J9k62p35N5J06L43P13K29k30l51l81l17
$$ 170 261 208 -287 -644 -1051 -670 -345 102 603 622 360 -375 -320 -214 129 842 1071 841 490 109 -208
1624b08j93L10K66K4j82k66n81l30J68K38L81M37J14k61j96q2L02L49M87L28r7
$$ -208 -401 -91 175 199 17 -249 -830 -1160 -992 -754 -373 64 178 -83 -279 -361 -59 290 777 1105 1008
1645A008l64k17k14l15L67J93m3j35l83o08m29J27K69K87K26K83n20k20l2K84
$$ 1008 644 427 213 -102 265 458 415 280 -103 -711 -1140 -1013 -744 -457 -231 52 -468 -688 -720 -436
1665d36M88M95L94j7l49q7j54qM23J77p8l10l83n14l34j49K69K05J00j73k58k93
$$ -436 52 547 941 924 575 488 334 326 749 926 848 538 155 -359 -693 -842 -573 -368 -268 -441 -699 -992
1687i92P5J77O43K19L80L3j80n0m1M6M48L43j22k37k72m10l93R7K48n8j80r2l43
$$ -992 -917 -740 -97 122 502 535 355 305 264 310 758 1101 979 742 470 60 -333 -236 12 -46 -226 -318 -661
1710f61m21K4J45K64M81K51o8j9r2J02L78L72L07L7k34j63m53k41N6K08L0o1l28
$$ -661 -1082 -1058 -913 -649 -168 83 15 -4 -96 6 384 756 1063 1100 866 703 250 9 65 273 303 242 -86
1733h6l45n81QJ86K80K40Q5O9k89m9Q7K96M62M03J40j56k01k30j30J05M99Nj54
$$ -86 -431 -1012 -1004 -818 -538 -298 -213 -144 -433 -482 -395 -99 363 766 906 750 549 319 189 294 793 798 644
1756F44k99n94m25L2L8L29P3J12k75k73k09K41J43N44N29j1k63k43J16j27K83
$$ 644 345 -249 -674 -642 -604 -275 -202 -90 -365 -638 -847 -606 -463 81 610 599 336 93 209 82 365
1777C65M69j52Qj22m95l26o6R9L6K07j8k19n49r1N6L15L44K96K07k87j30j46K1
$$ 365 834 682 690 568 73 -253 -319 -220 -184 23 5 -214 -763 -854 -798 -483 -139 157 364 77 -53 -199 -178
1800a78L75L75K08k2j82l54m04L5K63R9J7O3k58n80j06k6K22K59L67l5k25k94
$$ -178 197 572 780 758 576 222 -182 -147 116 215 232 295 37 -543 -649 -675 -453 -194 173 138 -87 -381
1822c81J33K4Q3M50L15j16k82r3k83J32J11J97J54R6m63l11j26O9q7K44L74k21
$$ -381 -248 -224 -141 309 624 508 226 133 -150 -18 93 290 444 540 77 -234 -360 -291 -378 -134 240 19
1844A9k89q7p7n0J70L82L43j89l1k17k79K82J03L41O3j04j54j83l21K55J9J81
$$ 19 -270 -357 -434 -484 -314 68 411 222 191 -26 -305 -23 80 421 484 380 226 43 -278 -23 -4 177
1866A77P6J34m12j77q3q8J51K43J89k63j9j15o4J3J80K46Q5q1j61j23m6J86j00
$$ 177 253 387 -25 -202 -285 -373 -222 21 210 -53 -72 -187 -251 -238 -58 188 273 192 31 -92 -138 48 -52
1889e2K54K06p1j99k93l0o8M3L86R3k79k10J2j36OK31M2J14R3j92k29L1K00K20
$$ -52 202 408 337 138 -155 -185 -253 -210 176 269 -10 -220 -208 -344 -338 -107 -65 49 142 -50 -279 -248 -48 172
1913A72kJ94J20m29o0p6K60n0K1K87k86k12l6j35j3J51J14j9j78L5l09Q5QK77
$$ 172 170 364 484 55 -5 -81 179 129 150 437 151 -61 -97 -232 -245 -94 20 1 -177 -142 -451 -366 -358 -81
1937h1J59O7k8%k53J60lJ47K58J06k40j02j84j63K9J52J82j46k89p1j29n6J43
$$ -81 78 145 117 117 -136 24 21 168 426 532 292 190 6 -157 -128 24 206 60 -229 -300 -429 -485 -342
1960c42R6K06J37j16k47J63m5R0J85M26m9j53k26mp1r2L65q5o8j78j12j26k93
$$ -342 -246 -40 97 -19 -266 -103 -148 -58 127 553 504 351 125 121 50 -42 323 238 170 -8 -120 -246 -539
1983e39K04J96N9n1L8k70p1K38m0K68K50J68j75j25j9p3R2J15K98k58j46j36j29
$$ -539 -335 -139 -80 -131 -93 -363 -434 -196 -236 32 282 450 275 150 131 58 150 265 563 305 159 23 -106
2006a06l05K48Q8l5o1Lj54k13M0K05K07J60J67j85n6L9l1P3L06J51j57M0j62k49
$$ -106 -411 -163 -75 -110 -171 -168 -322 -535 -495 -290 -83 77 244 59 3 42 11 84 390 541 384 424 262 13
2030A3o9M5N7J36l8l14k08j15L2J00P1J72J93k22j7J28p1L3K76K32L3l40J25k91
$$ 13 -56 -11 46 182 144 -170 -378 -493 -461 -361 -290 -118 75 -147 -164 -36 -107 -74 202 434 467 127 252 -39
2054c9L0P2J34M0oj53j25k83N0L4J6N6L8j20j67M4J30Q3J97K55L2j74r0J50o3
$$ -39 -9 63 197 237 231 78 -47 -330 -280 -246 -230 -174 -136 -256 -423 -379 -249 -166 31 286 318 144 54 204 141
2079A41l1K58k9l5q8k15m4j84J90p8M1m5n2k05P1p9J81J00J33k5N4j16l2Q6K22
$$ 141 110 368 339 304 216 1 -43 -227 -37 -115 -74 -119 -171 -376 -305 -384 -203 -103 30 5 59 -57 -89 -3 219
2104B19M5M8oj23j5j98O9J06qq8M0k37m8j30J19J20l1J36j69K2k2O7j80L22N2
$$ 219 264 312 306 183 168 -30 39 145 137 49 89 -148 -196 -326 -207 -87 -118 18 -151 -129 -151 -84 -264 58 110
2129A10KM4L7q1j6lQ0L2O2j17O5l75L3M2n7Q8J7k3k15n0L5l2K81MO0o7Q9J5j6
$$ 110 112 156 193 112 96 93 173 205 267 150 215 -160 -127 -85 -142 -54 -37 -60 -275 -325 -290 -322 -41 -37 23 -44 45 60 44
2158D4P3R5P9m5J4j69M3j95R2j7kl9J08k23r5j11J29K07j3K8m6j27J68k52R8K37
$$ 44 117 212 291 246 260 91 134 -61 31 14 12 -27 81 -142 -237 -348 -219 -12 -25 3 -43 -170 -2 -254 -156 81
2184H1N6Mj7L8j41k5N0K22j30J03%k28j21J10r1j9R5pkj89n0P9O0J8n4K27P7j45
$$ 81 137 141 124 162 21 -4 46 268 138 241 241 13 -108 2 -89 -108 -13 -20 -22 -211 -261 -182 -122 -104 -158 69 146 1
2212Ak3k3J48LJ15j01J83l12R8j51QR0J83j68Rj16j30j79J43J29N6j35J64m1j93
$$ 1 -22 -45 103 106 221 120 303 -9 89 -62 -54 36 219 51 60 -56 -186 -365 -222 -93 -37 -172 -8 -49 -242
2237b42K48k1L0J37M4n2j56K2J8j7R4N1L6q9j30Kj16p2J36O8r6R5j45j79J47j5
$$ -242 6 -15 15 152 196 144 -12 10 28 11 105 156 192 103 -27 -25 -141 -213 -77 -9 -105 -10 -155 -334 -187 -202
2263b02R0R8K25l4j31p0J42n4N9K13j36j89K07k38o6J77J5N0j35j00j49j1j34
$$ -202 -112 -14 211 177 46 -24 118 64 123 336 200 11 218 -20 -86 91 106 156 21 -79 -228 -239 -373
2286c73K30r2J89M0Km2j98J84M6K17L3n5J1j18o3J9j4J84j8j08M3j95Lo9J30r1
$$ -373 -143 -235 -46 -6 -4 -46 -244 -60 -14 203 236 181 192 74 11 30 16 200 182 74 117 -78 -75 -144 -14 -105
2312a05J3M2K1j37o5O0Q4O1J43q9M5j9J0p2J15L8L6J8m4j56J44j79r0L0M4M5j05
$$ -105 -92 -50 -29 -166 -231 -171 -87 -26 117 28 73 54 64 -8 107 145 181 199 155 -1 143 -36 -126 -96 -52 -7 -112
2339a12l3l6r5J48j17J70O8p4Q4l3J12r3J21J30j16j2n8M9n8P9K4j2l1j70j36
$$ -112 -145 -181 -276 -128 -245 -75 -7 -81 3 -30 82 -11 110 240 124 112 54 103 45 124 148 136 105 -65 -201
2364b01o9J27o2J57o2Nr3N3J48L8r0N2K03r7o7P9L7m4J02q5mj8q5M0j67j03K11
$$ -201 -270 -143 -205 -48 -110 -105 -198 -145 3 41 -49 3 206 109 42 121 158 114 216 131 127 109 24 64 -103 -206 5
2391Ep7K1P0k91Q2P8O9k7l4lK4Q4j8J2P1P3M4o6J66k09L8o2m9m8J2J90n1k11j49
$$ 5 -72 -51 19 -272 -190 -112 -43 -70 -104 -107 -83 1 -17 -5 66 139 183 117 283 74 112 50 1 -47 -35 155 104 -107 -256
2420b56J19J6J6O4J18k12R5p8M1o7K92n0J5k6P3l5r2M4m0R3j22mL9j58J87k09
$$ -256 -137 -121 -105 -41 77 -135 -40 -118 -77 -144 148 98 113 87 160 125 33 77 37 130 8 4 43 -115 72 -137
2446a37K2J38m2j13j3j2O5r7N6J49n7PP6P7j38J90r5R6n3M8o8l3k00qJ26j77J93
$$ -137 -115 23 -19 -132 -145 -157 -92 -189 -133 16 -41 -34 42 119 -19 171 76 172 119 167 99 66 -134 -142 -16 -193 0
2473@p1j43K9J19q3M1QQ9j6R0m0l1R0L6Kj46J49p5n9K8QQ3r5J24j78m1L6r3O0
$$ 0 -71 -214 -185 -66 -149 -108 -100 -11 -27 63 23 -8 82 118 120 -26 123 48 -11 17 25 108 13 137 -41 -82 -46 -139 -79
2502g9O4kj1k7j7p4L5M1NJ00J36o5r9k8r2J12K46j24j48p9J52q6j09J5J36j6n4
$$ -79 -15 -17 -28 -55 -72 -146 -111 -70 -65 35 171 106 7 -21 -113 -1 245 121 -27 -106 46 -40 -149 -134 2 -14 -68
2529f8K2Nq4K8o0J27l9K12n2n9m0K7K5ll0J19n3j04N9Q8j16P6o2J7q0m6J18j39
$$ -68 -46 -41 -125 -97 -157 -30 -69 143 91 32 -8 19 44 41 11 130 77 -27 32 120 4 80 18 35 -45 -91 27 -112
2557a12Qj00J04l2P8mj61L9K04l6J02J1j55J27M0j01l7MK9k9M5L5r9J0JP2j14
$$ -112 -104 -204 -100 -132 -54 -58 -219 -180 24 -12 90 101 -54 73 113 12 -25 -21 8 -21 24 59 -40 -30 -29 43 -71
2584g1n8J81nn9ln7J80k37J54l9J7P3o4L0J47p4n9j1M3K8j31N8nJ04j46jj7o9
$$ -71 -129 52 47 -12 -15 -72 108 -129 25 -14 3 76 12 42 189 115 56 45 88 116 -15 43 38 142 -4 -5 -22 -91
2612i1J04j35qO0N9o3RR6o9n3J81mJ4q8K4KK4r4J28l5O3q1o3J0j22R5j1R1r3r4
$$ -91 13 -122 -130 -70 -11 -74 -65 31 -38 -91 90 86 100 12 36 38 62 -32 96 61 124 43 -20 -10 -132 -37 -48 43 -50 -144
2642a44k4N6J28m6p2J99Nj17O1p2N7nN5l1jM2K7r7p3n9J79n2j72nO9M8j1j42J75
$$ -144 -168 -112 16 -30 -102 97 102 -15 46 -26 31 26 81 50 49 91 118 21 -52 -111 68 16 -156 -161 -92 -44 -55 -197 -22
2671b2M4l6M5j25R9N9j63J76k3L1j00K6Q7j48qK34p7n4rj23%J52j65o3J43L9p7
$$ -22 22 -14 31 -94 5 64 -99 77 54 85 -15 11 98 -50 -58 176 99 45 36 -87 -87 65 -100 -163 -20 19 -58
2698e8r0J19j3l0P4J28j52P6o2K4N6m9J5r3K5J73j80j20J71p2J23r7j03P6m6J02
$$ -58 -148 -29 -42 -72 2 130 -22 54 -8 16 72 23 38 -55 -30 143 -37 -157 14 -58 65 -32 -135 -59 -105 -3
2724cN0k15J21J52k08K3J22R7q0M2j11N3j0K8l7N0o6N6r2O6Pk2k3Jn8Q4j21L2
$$ -3 47 -168 -47 105 -103 -80 42 139 59 101 -10 43 33 61 24 74 8 64 -28 38 45 23 0 1 -57 27 -94 -62
2752f2O2q0mJ21j19P2K0P6P9j59R0j84n5K05m2QM0j31N3k3j21j1K30o7O2k71J22
$$ -62 0 -80 -84 37 -82 -10 10 86 165 6 96 -88 -143 62 20 28 68 -63 -10 -33 -154 -165 65 -2 60 -211 -89
2779h9J29j00o8Q2M8M2j1K5j36R1P3m4O2M4j5j17l9p1N3J0O7J68k25J00k7j90
$$ -89 40 -60 -128 -46 2 44 33 58 -78 13 86 42 104 148 133 16 -23 -94 -41 -31 36 204 -21 79 52 -138
2805a38J37j4q2J39m1r3O6j5R4n6O4j1J2p3M9l8p7J16p5%Ro0n1O6KJ27pl9j33
$$ -138 -1 -15 -97 42 1 -92 -26 -41 53 -3 61 50 62 -11 38 0 -77 39 -36 -36 -27 -87 -138 -72 -70 57 50 11 -122
2834a22J69q6P9m8Q0n8R5q8J3J31L6j29o0J85r6q2L4p5N0m5j48J42r5O1M2p2L5
$$ -122 47 -39 40 -8 72 14 109 21 34 165 201 72 12 197 101 19 53 -22 28 -17 -165 -23 -118 -57 -15 -87 -52
2861e2O5q6J02k3j46P5R2j14K09j12o8J18k2j1j26R3Q6j54O8j9m6K5OK7j18J37
$$ -52 13 -73 29 6 -140 -65 27 -87 122 10 -58 60 38 27 -99 -6 80 -74 -6 -25 -71 -46 -40 -13 -131 6
2887FK7J4p0N1l7k3J6j8oQ2p2J0j07J34J8L7K1n2k1k1P0j01L5r3K8j0K8M2J8j6
$$ 6 33 47 -23 28 -9 -32 -16 -34 -40 42 -30 -20 -127 7 25 62 83 31 10 -11 59 -42 -7 -100 -72 -82 -54 -12 6 -10
2917a0n0K3K5J84j23O9j95N9Q4j20J85j29Pp8j8K4Q1j9k6JO5l9q0J8P3kj40K07
$$ -10 -60 -37 -12 172 49 118 -77 -18 66 -54 131 2 9 -69 -87 -63 18 -1 -27 -26 39 0 -80 -62 11 9 -131 76
2945G6j32J66n6K7l7L0l0N8N3n0j43P6l7o5K9M3J4N5r9j17O8j3P3R6n9L6k2q9
$$ 76 -56 110 54 81 44 74 44 102 155 105 -38 38 1 -64 -35 8 22 77 -22 -139 -71 -84 -11 85 26 62 40 -49
2973d9L9J03L2m9j34J03N1j42R5M2j50l9M8p0J52n6Q8P2k13QJ1O7J6o9l8J06n
$$ -49 -10 93 125 76 -58 45 96 -46 49 91 -59 -98 -50 -120 32 -24 64 136 -77 -69 -58 9 25 -44 -82 24 19
3000A9Q7Jj26o1K2J30JN1j96P1J42k08R2j2m1Q0j12o5J80o2o8J8N1N7j83J00Q8
$$ 19 106 107 -19 -80 -58 72 73 124 -72 -1 141 -67 25 13 -28 52 -60 -125 55 -7 -75 -57 -6 51 -132 -32 56
3027E6n7J40j64M0O8Mj25J82j21J5r6N7J14j07M9m8q4N8n8K7J14k6k00J97o5k6
$$ 56 -1 139 -25 15 83 87 -38 144 23 38 -58 -1 113 6 55 7 -77 -19 -77 -50 64 38 -162 35 -30 -56
3053e6Op4K49j41mJ38r1P2p9OP8Lj37p7L9K9j0l2j8J03r4J5J08j73J43M6r5J3
$$ -56 -50 -124 125 -16 -20 118 27 99 20 26 104 107 -30 -107 -68 -39 -49 -81 -99 4 -90 -75 33 -140 3 49 -46 -33
3081c3Q4j08P9J7Knk9J10j35l2K2Q5q2J3L6j3J0k6j41N4K5J2J12k6jqpp5M2m7
$$ -33 51 -57 22 39 41 36 7 117 -18 -50 -28 57 -25 -12 24 11 21 -5 -146 -92 -67 -55 57 31 30 22 15 -60 -18 -65
3111f5J69M1%o9J0r0j9j8J67j28oP4j77P7L1r5m1K21j4l3j10K8P8k9NJ05n0j04
$$ -65 104 145 145 76 86 -4 -23 -41 126 -2 -8 66 -111 -34 -3 -98 -139 82 68 35 -75 -47 31 2 7 112 62 -42
3139d2P7J4M5K8M0j36qJ00n5k2j04J62j31n9L7N3k5n3j6J85q3P8O9j07l4qm2R3
$$ -42 35 49 94 122 162 26 18 118 63 41 -63 99 -32 -91 -54 -1 -26 -79 -95 90 7 85 154 47 13 5 -37 56
3167E6l7J05q5l5J7j8M2L7j04J6rj09N1O7L7p5lO6p4J8k0RJ28K1K7p0m9M6r4R6
$$ 56 19 124 39 4 21 3 45 82 -22 -6 -15 -124 -73 -6 31 -44 -47 19 -55 -37 -57 -48 80 101 128 58 9 55 -39 57
3197E7j9J3j0j18J89n9j34MNJ5O2j5qK6ON9j63L2n8J38k4O7j29R2%j1R4m2k5p0
$$ 57 38 51 41 -77 112 53 -81 -77 -72 -57 5 -10 -18 8 14 73 -90 -58 -116 22 -2 65 -64 28 28 17 111 69 44 -26
3227b6l5M2Q2j23L0l2L5j12N8m3K4pN4J45j42O4k1J49j75O7R3o6N1p7l1L7J0l8
$$ -26 -61 -19 63 -60 -30 -62 -27 -139 -81 -124 -100 -107 -53 92 -50 14 -7 142 -33 34 127 61 112 35 4 41 51 13
3255A3Q1j66P0r9m1O2l1p6K42l8j16J21q2P3L4m5r1K53p4l6m6K1K2J1k1n9rJ5
$$ 13 94 -72 -2 -101 -142 -80 -111 -187 55 17 -99 22 -60 13 47 2 -89 164 90 54 8 29 51 62 41 -18 -27 -12
3283a2j8o2N9l8P9r0o6J25j23O3m9k2J58m6L7J52r2jNj8j4J43j24r7P6L3n6P0
$$ -12 -30 -92 -33 -71 8 -82 -148 -23 -146 -83 -132 -154 4 -42 -5 147 55 54 59 41 27 170 46 -51 25 58 2 72
3311G2p8l3K1k7L9l6K2n5M3K4M3Q1k11J58r5J14O9n6Q7j83qQ6kKk5k2k4j2k3j23
$$ 72 -6 -39 -18 -45 -6 -42 -20 -75 -32 -8 35 116 -95 63 -32 82 151 95 182 -1 -9 77 75 77 52 30 6 -6 -29 -152
3341a52J3P8J3Qn6O4n3l1m8J50J08l6j54R4m1K0m2J61k3m7k0K2j4J9l9j15J82
$$ -152 -139 -61 -48 -40 -96 -32 -85 -116 -164 -14 94 58 -96 -2 -43 -23 -65 96 73 26 6 28 14 33 -6 -121 61
3368F1J1j52J4QJ3n6n7K26o7J79k15R9k1J59q3m7J0L7k44R4Q4Q5j05n8J32j91
$$ 61 72 -80 -66 -58 -45 -101 -158 68 1 180 -35 64 43 202 119 72 82 119 -125 -31 53 138 33 -25 107 -84
3394h4j8P6n9R3J4j64N9P0j6j40J65R2k8K3p4k1J2l1M7k4N0Pj4K6j53J26j7l4
$$ -84 -102 -26 -85 8 22 -142 -83 -13 -29 -169 -4 88 60 83 9 -12 0 -31 16 -8 42 49 35 61 -92 34 17 -17
3422a7Mp8K4J06j87J04O7l6J5r3R4j0r8K63k46J58n9k5N0m7J07j06J09j61J43
$$ -17 -13 -91 -67 39 -148 -44 23 -13 2 -91 3 -7 -105 158 -88 70 11 -14 36 -11 96 -10 99 -62 81
3447H1j1j47L7O9m8J4P2k19J54o7J64r4n5M0N7j47J47lr5K31k20J30j41R0K4r2
$$ 81 70 -77 -40 29 -19 -5 67 -152 2 -65 99 5 -50 -10 47 -100 47 44 -51 180 -40 90 -51 39 63 -29
3473b9J04j06l5R6j34N7j4p1J01l8n0J39j12O8K6k1M5n3J96j09K1n4L1j56K13
$$ -29 75 -31 -66 30 -104 -47 -61 -132 -31 -69 -119 20 -92 -24 2 -19 26 -27 169 60 81 27 58 -98 115
3498A15m5L5o0l0m7j00R7r0J01j2m0Q0k3p2j3J7R1N9J12k9Rl4J1m4o5J32p6O5
$$ 115 70 105 45 15 -32 -132 -35 -125 -24 -36 -76 4 -19 -91 -104 -87 4 63 175 146 155 121 132 88 23 155 79 144
3526A44j03K6L0n0m2J12q3P4k26R6n2m0l4Q5j1R2r3L9J9j5L3l2J25j04J29p1J44
$$ 144 41 67 97 47 5 117 34 108 -118 -22 -74 -114 -148 -63 -74 18 -75 -36 -17 -32 1 -31 94 -10 119 48 192
3553A92r8k82J67k8k6Q0k4jl2q3P6k3P9Mj01j8M3M8pJ2Q9J02j08n8K6R3j17J32
$$ 192 94 -188 -21 -49 -75 5 -19 -20 -52 -135 -59 -82 -3 1 -100 -118 -75 -27 -34 -22 67 169 61 3 29 122 5 137
3581A37p7j7J5l6j83J05n8J17o2r8J12j44J31n3N6q8O1J75P1j01Lo3K9K7K9Mk7
$$ 137 60 43 58 22 -161 -56 -114 3 -59 -157 -45 -189 -58 -111 -55 -143 -82 93 164 63 66 3 32 59 88 92 65
3608F5rl6j02P4o4J27j7r1j10m7J34P7j3j44K7Q2O0j23K14lr6J55k06J34J6p4
$$ 65 56 20 -82 -8 -72 55 38 -53 -163 -210 -76 1 -12 -156 -129 -47 13 -110 104 101 5 160 -46 88 104 30
3634C0J9OJ23k42J30r6M6q5N4k9r1J15Kl8q5Q7K8J8j33K12r0J7Q4%k7J44j47N1
$$ 30 49 55 178 -64 66 -30 16 -69 -15 -44 -135 -20 -18 -56 -141 -54 -26 -8 -141 71 -19 -2 82 82 55 199 52 103
3662A03k04J27K7Rl6j05j6O7l5j06OJ8J48O8n9K5j30R7j01O9L9R7n0M4N8k3n4
$$ 103 -101 26 53 62 26 -79 -95 -28 -63 -169 -163 -145 3 71 12 37 -93 4 -97 -28 11 108 58 102 160 137 83
3689H3r5L5J6k5L2m6k7j10N6L3j83J33L0N7P8p0j51K18l4J11j29J40q5m9K0n8
$$ 83 -12 23 39 14 46 0 -27 -137 -81 -48 -231 -98 -68 -11 67 -3 -154 64 30 141 12 152 67 18 38 -20
3715b0J64j39n4L4pk3J00p7q5MJ7K3O5l8N0p3N2k0j8O0M1J9j30R7KP4j55J28k9
$$ -20 144 5 -49 -15 -22 -45 55 -22 -107 -103 -86 -63 2 -36 14 -59 -7 -27 -45 15 56 75 -55 42 44 118 -37 91 62
3744F2N6%p6m2pk1k3o8m8J53k5M9m4o5k4J27Nk08J85JK4KJ0mM5L9N1j12R8j6j35
$$ 62 118 118 42 0 -7 -28 -51 -119 -167 -14 -39 10 -34 -99 -123 4 9 -199 -14 -13 11 13 23 19 64 103 154 42 140 124 -11
3775a1Q4p7q1R9J8J1j25M5k9J06j05n8n3J78j18J21j9k4J19Pp4k3J27l0l4L1n7
$$ -11 73 -4 -85 14 32 43 -82 -37 -66 40 -65 -123 -176 2 -116 5 -14 -38 81 88 14 -9 118 88 54 85 28
3802B8j05M7Lr6J2R8j06n6j20J60R0J5r3K4P5J30k02J44o7O1j6J47o0j2p8P7j13
$$ 28 -77 -30 -27 -123 -111 -13 -119 -175 -295 -135 -45 -30 -123 -99 -24 106 -96 48 -19 42 26 173 113 101 23 100 -13
3829a3P4r0L0r6o1K9J42j15J43n4j9N1N0o4j19J56j2l2m8J25N1L7r3l4Q5k03J96
$$ -13 61 -29 1 -95 -156 -127 15 -100 43 -11 -30 21 71 7 -112 44 32 0 -48 77 128 165 72 38 123 -80 116
3856A16n9j67J13M2j43l2M9J23j7j5r5N0j18J46Pj1p3K08j93J11M8J7J1K6r1N0
$$ 116 57 -110 3 45 -98 -130 -81 42 25 10 -85 -35 -153 -7 0 -11 -84 124 -69 42 90 107 118 144 53 103
3882A03j13O4M4l9o9p4Rl9jKk7J69m1j58Q6m9J02LJ08j57R8L8J0O5q9N5M7Q9k89
$$ 103 -10 54 98 59 -10 -84 -75 -114 -115 -113 -140 29 -12 -170 -84 -133 -31 -28 80 -77 21 59 69 134 45 100 147 236 -53
3911e3N4Q1j34P2j45K3m0P2o4m3P1L0k7M8J06rl2j4M7j49K43j21o3Q0J13o3j52
$$ -53 1 82 -52 20 -125 -102 -142 -70 -134 -177 -106 -76 -103 -55 51 42 10 -4 43 -106 137 16 -47 33 146 83 -69
3938f9J11K9ll0q3Q0k4k9q9O6O7n2K8n4J2L6K4j14J81j12J13j9o1N2J53k05J01
$$ -69 42 71 68 38 -45 35 11 -18 -107 -41 26 -26 2 -52 -40 -4 20 -94 87 -25 88 69 8 60 213 8 109
3965A09o3j41L1L2p0j1R5q5j1M9k3p9J99m5J04j8k0q3K4J09k9k2J42l00K60o7
$$ 109 46 -95 -64 -32 -102 -113 -18 -103 -114 -65 -88 -167 32 -13 91 73 53 -30 -6 103 74 52 194 -106 154 87
3991H7nj03r4J55o5J10p2p7K5N2o8r9N3J12m8Qj18K7J19j4K8P7j69J23L2j14L2
$$ 87 82 -21 -115 40 -25 85 13 -64 -39 13 -55 -154 -101 11 -37 -29 -147 -120 -1 -15 13 90 -79 44 76 -38 -6
4018fJ16j11LJ41r3j17J10o2j06P6k9J13j69K1J50no8L9l1Q7ll4m1M0Kl4J47j14
$$ -6 110 -1 2 143 50 -67 43 -19 -125 -49 -78 35 -134 -113 37 32 -36 3 -28 59 56 22 -19 21 23 -11 136 22
4046B2M2jp4N3J4q7J2J2q1o7P1J7O8o2l2J36J2j14kO3o6O2p4P5N1Q5j87J13p8
$$ 22 64 63 -11 42 56 -31 -19 -7 -88 -155 -84 -67 1 -61 -93 43 55 -59 -61 2 -64 -2 -76 -1 50 135 -52 61 -17
4075a7PN0j16R2m5m4k1%P7j52J39K2m2PJ6k7N7N6q0J06j32L3J22j21O7M1R3j53
$$ -17 -10 40 -76 16 -29 -73 -94 -94 -17 -169 -30 -8 -50 -43 -27 -54 3 59 -21 85 -47 -14 108 -13 54 95 188 35
4103C5j45J75n4j25J77k9q3k3j87J74J06m9j19J60j18R5nN9o5J39o4N2jj7L5r4
$$ 35 -110 65 11 -114 63 34 -49 -72 -259 -85 21 -28 -147 13 -105 -10 -15 44 -21 118 54 106 105 88 123 29
4129B9mPK3n3P7o2j21p6O0J31j54Q1J14k05J14l4J78p3R4Pj3j94J75R3j83j4N9
$$ 29 25 32 55 2 79 17 -104 -180 -120 11 -143 -62 52 -153 -39 -73 105 32 126 133 120 -74 101 194 11 -3 56
4156E6mR6q1k4q7j4P7Jk0J1n2j10R6k%J8O4n0L5N5j26J8J10M1%j13J11rr0o7J59
$$ 56 52 148 67 43 -44 -58 19 20 0 11 -41 -151 -55 -57 -57 -39 25 -25 10 65 -61 -43 67 108 108 -5 106 97 7 -60 99
4187I9k03J35j18N8L3n8j2M6j32J54J1M5o3J04r8J2J84j92J9K1J05m4j5K4M0j05
$$ 99 -104 31 -87 -29 4 -54 -66 -20 -152 2 13 58 -5 99 1 13 197 5 24 45 150 106 91 115 155 50
4213E0%q4L8p5N0K8j71n9K00j83Q8R1n1N7l1K00j78j5RJ15j8J00j04Jj5J08j00
$$ 50 50 -34 4 -71 -21 7 -164 -223 -23 -206 -118 -27 -78 -21 -52 148 -30 -45 -36 79 61 161 57 58 43 151 51
4240E1k4Oj54K02o2n5J7N2j15nN3J95j72k5m2mM7n6J28LJ32j47j2J6M7k7pkl2
$$ 51 27 33 -121 81 19 -36 -19 33 -82 -87 -34 161 -11 -36 -78 -82 -35 -91 37 40 172 25 13 29 76 49 42 40 8
4269HK8mj3m3M6j42Q9m6%O9l0M1M4p9Q9Mp3J3Q8l6o7J32j7N6k02K00r9M2j13o0
$$ 8 36 32 19 -24 22 -120 -31 -77 -77 -8 -38 3 47 -32 57 61 -12 1 89 53 -14 118 101 157 -45 155 56 98 -15 -75
4299g5O9o2P7n5N7q8Lj8K9P5O0l8p2P8l4J63nqj6n8p7J4l7J03k8p7j5O3l1j44
$$ -75 -6 -68 9 -46 11 -77 -74 -92 -63 12 72 34 -38 40 6 169 164 156 140 82 5 19 -18 85 57 -20 -35 28 -3 -147
4329a47J26J09k09oQ5l3M2j7O7L0m9N9pq4Q5N4l9M1L4r3mm3P9L6j44k3r4J84j53
$$ -147 -21 88 -121 -127 -42 -75 -33 -50 17 47 -2 57 50 -34 51 105 66 107 141 48 44 1 80 116 -28 -51 -145 39 -114
4358a14M4J27n3n1P2r4k0o0O7J55J7k35L25j75R1l5J04j61J4Qmo9M3m1j01k1O3
$$ -114 -70 57 4 -47 25 -69 -89 -149 -82 73 90 -145 180 5 96 61 165 4 18 26 22 -47 -4 -45 -146 -167 -104
4385a04k9O7k0O4l5L8j07J86Op7J72j75R6k79L32nJ19j12o4p3P5r0Pn1J2O1j03
$$ -104 -133 -66 -86 -22 -57 -19 -126 60 66 -11 161 -14 82 -197 135 130 249 137 73 0 75 -15 -8 -59 -47 14 -89
4412h9J52j30Nm7M2j6N7P1j40L2L2P4O1K2p9L4j07P2j4O9j30N6m2m5O6q4O0j21
$$ -89 63 -67 -62 -109 -67 -83 -26 45 -95 -63 -31 43 104 126 47 81 -26 46 32 101 -29 27 -15 -60 6 -78 -18 -139
4440a39J11j1j05J21J37j45N7p4L5J13p4J27j31pk1P5N4j52J38N3r0p6k1k7L2
$$ -139 -28 -39 -144 -23 114 -31 26 -48 -13 100 26 153 22 15 -6 69 123 -29 109 162 72 -4 -25 -52 -20
4465b0q9J99j31Pm3N5j08J75j83J41L7o3J34j34R6n3J0l2J02j73R3O0q9k1J12
$$ -20 -109 90 -41 -34 -77 -22 -130 45 -138 3 40 -23 111 -23 73 20 30 -2 100 -73 20 80 -9 -30 82
4490H2j32J38j42O7q1j17N3J76o8J18r9j8p4K0K8J75j06Q9j01L3J86j67j17P7
$$ 82 -50 88 -54 13 -68 -185 -132 44 -24 94 -5 -23 -97 -77 -49 126 20 109 8 41 227 60 -57 20
4514B0mLR1j98Kk2MP5K8q1K7k9L6o6P9J25n2k7M2r2k1J40k7j29J18P4j69R0j42
$$ 20 16 19 110 -88 -86 -108 -104 -29 -1 -82 -55 -84 -48 -114 -35 90 38 11 53 -39 -60 80 53 -76 42 116 -53 37 -105
4543a05R2O7l5q4L7l2kM8J8j00j1M5K16j21n7N5j6J0J20j74P7K9n9L4j8K3j14
$$ -105 -13 54 19 -65 -28 -60 -62 -14 4 -96 -107 -62 154 33 -24 31 15 25 145 -29 48 77 18 52 34 57 -57
4570e7k4J33p5j7J35k47R0J4M6p9N8N2K8p7O8k4p2m2J99o5O3m1k9J44j30m2l2
$$ -57 -81 52 -23 -40 95 -152 -62 -48 -2 -81 -23 29 57 -20 48 24 -48 -90 109 44 107 66 37 181 51 9 -23
4597b3KN0J4o1p9l0Rp9J55l2J51n7l7OQ9k5O2j93J58n2M8o6qO7j4J27j61jK0R
$$ -23 -21 29 43 -18 -97 -127 -118 -197 -42 -74 77 20 -17 -11 78 53 115 -78 80 28 76 10 2 69 55 182 21 20 40 49
4627D9j15l6m9J13j0o0J9J02Oj39J51j50M6J91j66J25j39J24p2L3N2l6L6K0j8
$$ 49 -66 -102 -151 -38 -48 -108 -89 13 19 -120 31 -119 -73 118 -48 77 -62 62 -10 23 75 39 75 95 77
4652G7o6J1Oj84K08n0j3m5J02j05m2J05o0J13k2P7k4M2k42J42J06o7J65j77J0
$$ 77 11 22 28 -156 52 2 -11 -56 46 -59 -101 4 -56 57 35 112 88 130 -112 30 136 69 234 57 67
4677F7k4l4q8M5Nq8J35q5O7j03O6k5Rk1m5J05q9J14R7k0M8j09P0j7k9m1n7M3K18
$$ 67 43 9 -79 -34 -29 -117 18 -67 0 -103 -37 -62 -53 -74 -119 -14 -103 11 108 88 136 27 97 80 51 10 -47 -4 214
4706B14j92j39Q4j1n6K8L3J40j86k0M0N0j52J26M9P0o6J35r6p8J01l2j6P5L9j54
$$ 214 22 -117 -33 -44 -100 -72 -39 101 -85 -105 -65 -15 -167 -41 8 78 12 147 51 -27 74 42 26 101 140 -14
4732a4p0O7J1j6M1p8q3O0P5j3n8r8J02r2J08J15q6m4J40k30J82n7R3r3J45K4M
$$ -14 -84 -17 -6 -22 19 -59 -142 -82 -7 -20 -78 -176 -74 -166 -58 57 -29 -73 67 -163 19 -38 55 -38 107 131 135
4759A35j51J1N3J39j84j08J1J20Pj03m9j2K56j25k1O6k9k7j01M9O2O2k8j6J33
$$ 135 -16 -5 48 187 3 -105 -94 26 33 -70 -119 -131 125 0 -21 45 16 -11 -112 -63 -1 61 33 17 150
4784A50j83o2J47K5o8N3n8om6M4L6m0m7K0J25k42%J68p7P6m0Q6j22L1kJ12LN5
$$ 150 -33 -95 52 77 9 62 4 -2 -48 -4 32 -8 -55 -35 90 -152 -152 16 -61 15 -25 61 -61 -30 -32 80 83 138
4812A38j05K24k76P0l7o4J66j22j1Q1p1L9m8RkJ3M2j00pj3JK3K71j77p8J08J6
$$ 138 33 257 -19 51 14 -50 116 -6 -17 64 -7 32 -16 -7 -9 4 46 -54 -61 -74 -73 -50 221 44 -34 74 90
4839I0n1q9J18MK8j76P2M3n4o4P2o8J9J40j61J41j51M7N6jl8O7M5r5j6R6K2k4
$$ 90 39 -50 68 72 100 -76 -4 39 -15 -79 -7 -75 -56 84 -77 64 -87 -40 16 15 -23 44 89 -6 -22 74 96 72
4867G2N8k4k3q5R9j05M0j30L5p1K42j97o%J29l1j48J44J9O0k5O1l1j39L07k99
$$ 72 130 106 83 -2 97 -8 32 -98 -63 -134 108 -89 -95 -95 34 3 -145 -1 18 78 53 114 83 -56 251 -48
4893d8J35p3Q1n9j01M7O3O0J6k20m9Q4o3J32n3j2M4q9Q7r9J17j12J37N2j03J40
$$ -48 87 14 95 36 -65 -18 45 105 121 -99 -148 -64 -127 5 -48 -60 -16 -105 -18 -117 0 -112 25 77 -26 114
4919A14%Q3k13J09r0%O1j26J15mm1q3M9o4j1L6p5J36m8M2j25J88j28J44p2k3j1
$$ 114 114 197 -16 93 3 3 64 -62 53 49 8 -75 -26 -90 -101 -65 -140 -4 -52 -10 -135 53 -75 69 -3 -26 -37
4946c7O4m8J0J29r1O9l7l6j03J8oJ67k23J1n5J30L8j7qK4m2J11j66J55l4P3p5
$$ -37 27 -21 -11 118 27 96 59 23 -80 -62 -68 99 -124 -113 -168 -38 0 -17 -25 -1 -43 68 -98 57 23 96 21
4973B1J23K9o0j01j3J21k15J53q5N6k9j9L9n6p1l3N2P7Jj5q4J90p3k8KK8n5J01
$$ 21 144 173 113 12 -1 120 -95 58 -27 29 0 -19 20 -36 -107 -140 -88 -11 -10 -25 -109 81 8 -20 -18 10 -45 56
5001E6j19R0Q2Oj16J19j36J37j51J5q5N4j8j26K59k08O9oP4l0R7Ro0jP6j62j2
$$ 56 -63 27 109 115 -1 118 -18 119 -32 -17 -102 -48 -66 -192 67 -141 -72 -78 -4 -34 63 72 12 11 87 -75 -87
5028h7J01J02j01P7j0j44J68j14Njl8N4j5p0M5K2r0k7O5O8M6o8mj4J1J13l9L3
$$ -87 14 116 15 92 82 -62 106 -8 -3 -4 -42 12 -3 -73 -28 -6 -96 -123 -58 10 56 -12 -16 -30 -19 94 55 88
5056H8n3j29R1k3k2J08j49M3L8L5J0LJ6m6K8j16L7o4L1L9J11n9Lq5mJ50j16J4
$$ 88 35 -94 -3 -26 -48 60 -89 -46 -8 27 37 40 56 10 38 -78 -41 -105 -74 -35 76 17 20 -65 -69 81 -35 -21
5084b1K6N8K9j43Q5o0m3lN8J6K2q4L9k2J11j46J5L9Q8m7J4K6m8J3o9P4ln2Q6j11
$$ -21 5 63 92 -51 34 -26 -69 -72 -14 2 24 -60 -21 -43 68 -78 -63 -24 64 17 31 57 9 22 -47 27 24 -28 58 -53
5114e3J35k13J55N4q6j57K18r6j6l5J03m8J4J25j40p2J38j9l6j6L5J35l9r4O1
$$ -53 82 -131 24 78 -8 -165 53 -43 -59 -94 9 -39 -25 100 -40 -112 26 7 -29 -45 -10 125 86 -8 53
5139E3l9O2j75J48Q6j81L1J39k04L1J50j49l8n2K30k04j2N8j6M5l8K1O8R3p9P8
$$ 53 14 76 -99 49 135 -46 -15 124 -80 -49 101 -48 -86 -138 92 -112 -124 -66 -82 -37 -75 -54 14 107 28 106
5165A06j45n0L4J1QJ46o6j3m1O1j25N4L8j13J91k00R8l4r6J34j09P7kJ22k07J09
$$ 106 -39 -89 -55 -44 -36 110 44 31 -10 51 -74 -20 18 -95 96 -104 -6 -40 -136 -2 -111 -34 -36 86 -121 -12
5191a2J33lj33JJ30n7J02p8j0n5n5n8O7j29J60k2j13On0N3N0R8l7K3o4m7J07K3
$$ -12 121 118 -15 -14 116 59 161 83 73 18 -37 -95 -28 -157 3 -19 -132 -126 -176 -123 -73 25 -12 11 -53 -100 7 30
5219C0m9j3k5J52j37J59n6n8N9m7j86K27q7J31j89l8k8K6K37j09l6k7Q6o3J05
$$ 30 -19 -32 -57 95 -42 117 61 3 62 15 -171 56 -31 100 -89 -127 -155 -129 108 -1 -37 -64 22 -41 64
5244F4j44K53j05p5J6o3O5J20p2k9q7p5Q5jl6O3r4M8m9P5kK3k3l7J7N6M7NO2m1
$$ 64 -80 173 68 -7 9 -54 11 131 59 30 -57 -132 -47 -48 -84 -21 -115 -67 -116 -41 -43 -20 -43 -80 -63 -7 40 45 107 66
5274F6J5Jq1m1k4J31p2%np8J15j52J80k39J01L6q4l4N3J43rP7j98K15q6j7K0p7
$$ 66 81 82 1 -40 -64 67 -5 -5 -10 -88 27 -125 55 -184 -83 -47 -131 -165 -112 31 22 99 -99 116 30 13 33 -44
5302d4J88q4N1j23J40L3j48n8K9j17J04j3J4K1l5n4P9Kk2j3M6L9m7P0r4J17m4
$$ -44 144 60 111 -12 128 161 13 -45 -16 -133 -29 -42 -28 -7 -42 -96 -17 -15 -37 -50 -4 35 -12 58 -36 81 37
5329C7R5n6J65j54J5j06oO6q2O5o6J63j06j05J1k8N5r8J37K1NMj57J12J04j14
$$ 37 132 76 241 87 102 -4 -10 56 -26 39 -27 136 30 -75 -64 -92 -37 -135 2 23 28 32 -125 -13 91 -23
5355b3J77p6qj15K6J12o3kK5m8k6j1n9Q8r9N8M5k9k4lm8P2NqJ01K0j55J52j11
$$ -23 154 78 70 -45 -19 93 30 28 53 5 -21 -32 -91 -3 -102 -44 1 -28 -52 -55 -103 -31 -26 -34 67 87 -68 84 -27
5384b7M3r1J01nj50R8K4N7q3Q9j51N7J61j09j01%L1L2k46K14M2l2N9j0l1J09j81
$$ -27 16 -75 26 21 -129 -31 -7 50 -33 56 -95 -38 123 14 -87 -87 -56 -24 -270 -56 -14 -46 13 3 -28 81 -100
5411a00N5q5J88Lr2Q0j83J08L5k1R0j61K1K4M4r4OJ40l5j39L5O3R4j02J05o8Q5
$$ -100 -45 -130 58 61 -31 49 -134 -26 9 -12 78 -83 -62 -38 6 -88 -82 58 23 -116 -81 -18 76 -26 79 11 96
5438I6Nj08m7R6R8j81J16J18k45J0M3L9j03q5J3Q9O9o6J38n8n9K6rO6j08J49q3
$$ 96 101 -7 -54 42 140 -41 75 193 -52 -42 1 40 -63 -148 -135 -46 23 -43 95 37 -22 4 -5 61 -47 102 19
5465A9J78j42Lp8J31j29P2J6j14M7o2k4M9K8JJ06k74J09J01K3J23pk00RN4J2q0
$$ 19 197 55 58 -20 111 -18 54 70 -44 3 -59 -83 -34 -6 -5 101 -173 -64 37 60 183 176 -24 -15 39 51 -29
5492b9LJ27K8n5o0O8p7n4J70j31Jq9J03J21k09M6J61j76Mp0L1J7k3J86j25L4K6
$$ -29 -26 101 129 74 14 82 5 -49 121 -10 -9 -98 5 126 -83 -37 124 -52 -48 -118 -87 -70 -93 93 -32 2 28
5519B8J5N2r0N8j5j22L0J83r6m1m8m3P6P4j52J1Q4l9O3j00k5J17l4nQ0r8R9L3
$$ 28 43 95 5 63 48 -74 -44 139 43 2 -46 -89 -13 61 -91 -80 4 -35 28 -72 -97 20 -14 -19 61 -37 62 95
5547I5n9L4j62K08j28%K0l4j9J02nj04Q1M0j1q4O0l1M2q4pQ1KP4jj71J34J1m7
$$ 95 36 70 -92 116 -12 -12 8 -26 -45 57 52 -52 29 69 58 -26 34 3 45 -39 -46 35 37 111 110 -61 73 84 37
5576C7q7N9K9N9m9m7j14L35j79j88K02r5J25j18j6N2N6j28Q4n9J2Q3k9J08n9K7
$$ 37 -50 9 38 97 48 1 -113 222 43 -145 57 -38 87 -31 -47 5 61 -67 17 -42 -30 53 24 132 73 100
5602A00o4j37J00J13k0j2J0j46O2J7l8l1P0m1jN4p6r2Q7O6l1k3j6J64j88J61j28
$$ 100 36 -101 -1 112 92 80 90 -56 6 23 -15 -46 24 -17 -18 36 -40 -132 -45 21 -10 -33 -49 115 -73 88 -40
5629d0J08l7o3Q4j69J33p1J27k5N8r2l3Jj4r2J79Mn8O9o3m9K2M2J6j18J13l7J17
$$ -40 68 31 -32 52 -117 16 -55 72 47 105 13 -20 -19 -33 -125 54 58 0 69 6 -43 -21 21 37 -81 32 -5 112
5657A12k9N7j21K4j02Q8j33J58k7K0L5r0r4P9K6p2l0o3J82J2p1L8rk7J44J5j04
$$ 112 83 140 19 43 -59 29 -104 54 27 47 82 -8 -102 -23 3 -69 -99 -162 20 32 -39 -1 -10 -37 107 122 18
5684A8j2J07q9O6k6Mo8j7kJ76j27J0j73M2J08r2L6R6n6J1J3o8N6M1m0l0R5p1L9
$$ 18 6 113 24 90 64 68 0 -17 -19 157 30 40 -133 -91 17 -75 -39 57 1 12 25 -43 13 54 14 -16 79 8 47
5713D7m5J84p8j45J47j14P7P4k03J06o4p1O9k2l6K5J0j6L2k7O5o1J38l3l0N3m2
$$ 47 2 186 108 -37 110 -4 73 147 -56 50 -14 -85 -16 -38 -74 -49 -39 -55 -23 -50 15 -46 92 59 29 82 40
5740D0O8P7k76K17q8k6k6M1n4l8J79j59k3N0pJ25r5M6q3n4J6k1J55q5k2J29K9
$$ 40 108 185 -91 126 38 12 -14 27 -27 -65 114 -45 -68 -18 -25 100 5 51 -32 -86 -70 -91 64 -21 -43 86 115
5767A15r2k4R3n4K4j40M6n9N5m4M2p6%O3P5j17Mk2J24q2J57j88O5J60o0j3k6K7
$$ 115 23 -1 92 38 62 -78 -32 -91 -36 -80 -38 -114 -114 -51 24 -93 -89 -111 13 -69 88 -100 -35 125 65 52 26 53
5795E3q5l6J20j0j9O1j23J13q5L2n3n6J92Pj33mM9r7J87j34o6O3o4K22j38L8k7
$$ 53 -32 -68 52 42 23 84 -39 74 -11 21 -32 -88 104 111 -22 -26 23 -74 113 -21 -87 -24 -88 134 -4 34 7
5822Gq9J53Lp0R2r2l6Q9j04p9P6P4q1J19j00M2j41K01l1P3j77L3M0j02P0Q5Lo
$$ 7 -82 71 74 4 96 4 -32 57 -47 -126 -50 24 -57 62 -38 4 -137 64 33 106 -71 -38 2 -100 -30 55 58 52
5850E2K6l1j02J18j27M4q0M7O5k31L11j56K5k2K5M1Kj1n6Q4p3M8l8L4R1k9m1k4
$$ 52 78 47 -55 63 -64 -20 -100 -53 12 -219 92 -64 -39 -61 -36 5 7 -4 -60 24 -49 -1 -39 -5 86 57 16 -8
5878hm5k2P4n9P5r3M5O7j4j66P3n2K14j47m5R4j4j11J94o1L6PJ07l9r5M1k7N6
$$ -8 -53 -75 -1 -60 15 -78 -33 34 20 -146 -73 -125 89 -58 -103 -9 -23 -134 60 -1 35 42 149 110 15 56 29 85
5906H5r4m8q5J51l4J78j62K4j5o3l9Q3L1n5O9m4l5J08l7N7k8J60k85nO5pJ11l
$$ 85 -9 -57 -142 9 -25 153 -9 15 0 -63 -102 -19 12 -43 26 -18 -53 55 18 75 47 207 -78 -83 -18 -25 86 83
5934H3O3j46mN4l2k7K6o3J17k7l1R7j53N7l4L8p4J17r9J26Q1k00K00j25k3m4L04
$$ 83 146 0 -4 50 18 -9 17 -46 71 44 13 110 -43 14 -20 18 -56 61 -38 88 169 -31 169 44 21 -23 281
5961B81j51k02qQ2J6L0q2P4O8j07m1M9J0m9J28k03k9K02k15R7Q5o7J5L4J6J4K6
$$ 281 130 -72 -80 2 18 48 -34 40 108 1 -40 9 19 -30 98 -105 -134 68 -147 -50 35 -32 -17 17 33 47 73
5988G3r2J5QL2p2J6r8J24r4O9k8n3J14j15J1%k8R5K2qJ5o8L9o1J45q4K5J02l7
$$ 73 -19 -4 4 36 -36 -20 -118 6 -88 -19 -47 -100 14 -101 -90 -90 -118 -23 -1 -9 6 -62 -23 -84 61 -23 2 104 67
6017F7n5j01P7N9r1M5o7J26m4R9j15N6k7Pj22MM6n3J22m3M7Qj4j1K0j3%j1O5o4
$$ 67 12 -89 -12 47 -44 1 -66 60 16 115 0 56 29 36 -86 -82 -36 -89 33 -10 37 45 31 20 40 27 27 16 81 17
6047A7L2K8j24J52j30Olm9K9o0J96l4l4q7P4Lj08O9J51j46L0M9k1l7L5p8J51o
$$ 17 49 77 -47 105 -25 -19 -22 -71 -42 -102 94 60 26 -61 13 16 -92 -23 128 -18 12 61 40 3 38 -40 111 105
6075A05j31l8J97j54l2J57j32O2k02N7J02n8O0k6Q4j42P3j33Q6O3K5n8n1J88j30
$$ 105 -26 -64 133 -21 -53 104 -28 34 -168 -111 -9 -67 -7 -33 51 -91 -18 -151 -65 -2 23 -35 -86 102 -28
6100b8M3j49R4J54j22M6k7Pj10Q4%Q9q8J2OpN1K6Oo6kP9p0rJ2r4J80j35o2Kj0
$$ -28 15 -134 -40 114 -8 38 11 18 -92 -8 -8 81 -7 5 11 4 55 81 87 21 19 98 28 19 31 -63 117 -18 -80 -78 -88
6131h8J13o3L7k5o1K8N6j50N6J60p8n9M3o5oK9M8P6p9O0L0k03J63O7p8n4r3J72
$$ -88 25 -38 -1 -26 -87 -59 -3 -153 -97 63 -15 -74 -31 -96 -102 -73 -25 51 -28 32 62 -141 22 89 11 -43 -136 36
6159C6o1O1m3k2N0j36J99j93J25k9L3l1j29R1qL4Q6j03K1j1J15m8q2J8P0j01J40
$$ 36 -25 36 -7 -29 21 -115 84 -109 16 -13 20 -11 -140 -49 -57 -23 63 -40 -19 -30 85 37 -45 -27 43 -58 82
6186H2j03J6J6m6J0L2M5j61Q4Kpo1J02J4k07J29O4j1L0M0m7k1j0Q8n4QRj42M8
$$ 82 -21 -5 11 -35 -25 7 52 -109 -25 -23 -30 -91 11 25 -182 -53 11 0 30 70 23 2 -8 80 26 34 43 -99 -51
6215e1%O4m5J11q3J6l6J3P8k8Kk30K30j19J47Pl2J03K5j10O6j77J29l1j44kJ12
$$ -51 -51 13 -32 79 -4 12 -24 -11 67 39 41 -189 41 -78 69 76 44 147 172 62 128 -49 80 49 -95 -97 15
6242A5j37R4m4K8J16l8J5lon1rP4r9J41M3o3q5N3n7J37j32R6K1j20l8ON6m2j55
$$ 15 -122 -28 -72 -44 72 34 49 46 40 -11 -20 54 -45 96 139 76 -9 44 -13 124 -8 88 109 -11 -49 -43 13 -29 -184
6271a84J88k2r4O0QL3o9P3P5J1n0q4R4L6J6q2P7q2p9J51m6p7J27k5m2j18k0Q8
$$ -184 4 -18 -112 -52 -44 -11 -80 -7 68 79 29 -55 39 75 91 9 86 4 -75 76 30 -47 80 55 13 -105 -125 -37
6299c7J91j94p1N8J50j30l9J21ol1o3K05n4r7L3J8j15L9r4J87n6J3j29J3J48r9
$$ -37 154 -40 -111 -53 97 -33 -72 49 43 12 -51 154 100 3 36 54 -61 -22 -116 71 15 28 -101 -88 60 -39
6325c9p4J74j70Q0k7J2J08PK6k43K31r3O3j9o3J15r5P2q5Q7j14j14J17O0n3N6
$$ -39 -113 61 -109 -29 -56 -44 64 71 97 -146 85 -8 55 36 -27 88 -7 65 -20 67 -47 -161 -44 16 -37 19
6351A9j50J26K9l3K6k3P3o5j2J0Rj37J05Pk4oJ64j05j8p7J97l5j05J01l4n5on2
$$ 19 -131 -5 24 -9 17 -6 67 2 -10 0 9 -128 -23 -16 -40 -46 118 13 -5 -82 115 80 -25 76 42 -13 -19 -71
6379g1N3N0j8q5M7O4l8J02j26M0n0p7k5P0l9L6J10j04N4P2j3m8o3J23o4j71J68
$$ -71 -18 32 14 -71 -24 40 2 104 -22 18 -32 -109 -134 -64 -103 -67 43 -61 -7 65 52 4 -59 64 0 -171 -3
$$ [...]
8191B
##END NTUPLES=NMR FID
##END=
