##TITLE=1H ikalashn
LR-787-OM-C1M
17.10.2024
##JCAMPDX= 6.0         $$ Bruker NMR JCAMP-DX V2.0
##DATA TYPE= NMR FID
##DATA CLASS= NTUPLES
##ORIGIN= UXNMR, Bruker Analytische Messtechnik GmbH
##OWNER= root
$$ TOPSPIN		Version 1.3
$$ 2024-10-17 09:40:00.453 +0400  Irina@DPX200
$$ Compression mode = diff/dup
##.OBSERVE FREQUENCY= 200.131392401
##.OBSERVE NUCLEUS= ^1H
##.DELAY= (6, 6)
##.ACQUISITION MODE= SIMULTANEOUS
##.ACQUISITION SCHEME= undefined
##.AVERAGES= 32
##.DIGITISER RES= 18
##SPECTROMETER/DATA SYSTEM= spect
##.PULSE SEQUENCE= zg
##.SOLVENT NAME= CDCl3
##.SHIFT REFERENCE= INTERNAL, CDCl3, 1, 17.95386
##AUDIT TRAIL= $$ (NUMBER, WHEN, WHO, WHERE, WHAT)
$$ ##TITLE= Audit trail, TOPSPIN		Version 1.3
$$ ##JCAMPDX= 5.01
$$ ##ORIGIN= Bruker BioSpin GmbH
$$ ##OWNER= Irina
$$ $$ F:/spectra/data/iren/nmr/1H/4/audita.txt
$$ ##AUDIT TRAIL=  $$ (NUMBER, WHEN, WHO, WHERE, VERSION, WHAT)
(   1,<2024-10-17 09:39:07.953 +0400>,<Irina>,<DPX200>,<TOPSPIN 1.3>,
      <created by zg
	started at 2024-10-17 09:36:59.828 +0400,
	POWCHK disabled, PULCHK disabled
       configuration hash MD5:
       BE 6D 3F 07 2A EA 11 49 91 17 2B D3 AF B3 58 0D
       data hash MD5: 16K
       A5 06 6B A7 61 D2 91 98 3D 21 64 BD E0 9E 89 38>)
$$ ##END=
$$ 
$$ $$ hash MD5
$$ $$ B1 4D E9 27 A1 26 22 DB 58 38 56 C2 B2 8E B1 CE
##$RELAX= 
##$RELAX= 
##$RELAX= 
##$RELAX= 
##$RELAX= 
##$RELAX= 
##$RELAX= 
##$RELAX= 
##$RELAX= 
$$ Bruker specific parameters
$$ --------------------------
##$DU= <F:/spectra>
##$EXPNO= 4
##$NAME= <1H>
##$PROCNO= 1
##$TYPE= <nmr>
##$USER= <iren>
##$AMP= (0..31)
100 100 100 100 100 100 100 100 100 100 100 100 100 100 100 100 100 100 
100 100 100 100 100 100 100 100 100 100 100 100 100 100 
##$ANAVPT= -1
##$AQSEQ= 0
##$AQ_mod= 1
##$AUNM= <au_zg>
##$AUTOPOS= <>
##$BF1= 200.13
##$BF2= 200.13
##$BF3= 200.13
##$BF4= 200.13
##$BF5= 200.13
##$BF6= 200.13
##$BF7= 200.13
##$BF8= 200.13
##$BYTORDA= 1
##$CFDGTYP= 0
##$CFRGTYP= 5
##$CHEMSTR= <none>
##$CNST= (0..63)
1 1 145 1 1 1 1 1 1 1 1 1 1 1 1 1 1 1 1 1 1 1 1 1 1 1 1 1 1 1 1 1 1 1 
1 1 1 1 1 1 1 1 1 1 1 1 1 1 1 1 1 1 1 1 1 1 1 1 1 1 1 1 1 1 
##$CPDPRG= <>
##$CPDPRG1= <>
##$CPDPRG2= <>
##$CPDPRG3= <>
##$CPDPRG4= <mlev>
##$CPDPRG5= <mlev>
##$CPDPRG6= <mlev>
##$CPDPRG7= <mlev>
##$CPDPRG8= <mlev>
##$CPDPRGB= <>
##$CPDPRGT= <>
##$D= (0..63)
0 2 0 0 0 0 0 0 0 0.06 0 0.03 0 0 0 0 0.0002 0 0 0 0 0 0 0 0 0 0 0 0 0 
0 0 0 0 0 0 0 0 0 0 0 0 0 0 0 0 0 0 0 0 0 0 0 0 0 0 0 0 0 0 0 0 0 0 
##$DATE= 1729143547
##$DBL= (0..7)
120 120 120 120 120 120 120 120 
##$DBP= (0..7)
150 150 150 150 150 150 150 150 
##$DBP07= 0
##$DBPNAM0= <>
##$DBPNAM1= <>
##$DBPNAM2= <>
##$DBPNAM3= <>
##$DBPNAM4= <>
##$DBPNAM5= <>
##$DBPNAM6= <>
##$DBPNAM7= <>
##$DBPOAL= (0..7)
0.5 0.5 0.5 0.5 0.5 0.5 0.5 0.5 
##$DBPOFFS= (0..7)
0 0 0 0 0 0 0 0 
##$DE= 6
##$DECBNUC= <off>
##$DECIM= 32
##$DECNUC= <off>
##$DECSTAT= 4
##$DIGMOD= 1
##$DIGTYP= 9
##$DL= (0..7)
0 120 120 120 120 120 120 120 
##$DP= (0..7)
150 150 150 150 150 150 150 150 
##$DP07= 0
##$DPNAME0= <>
$$ [...]
##$SW= 21.9925939549014
##$SWIBOX= (0..15)
0 0 2 0 0 0 0 0 0 0 0 0 0 0 0 0 
##$SW_h= 4401.40845070422
##$TD= 16384
##$TD0= 1
##$TE= 300
##$TE2= 300
##$TE3= 300
##$TEG= 300
##$TL= (0..7)
0 120 120 120 120 120 120 120 
##$TP= (0..7)
150 150 150 150 150 150 150 150 
##$TP07= 0
##$TPNAME0= <>
##$TPNAME1= <>
##$TPNAME2= <>
##$TPNAME3= <>
##$TPNAME4= <>
##$TPNAME5= <>
##$TPNAME6= <>
##$TPNAME7= <>
##$TPOAL= (0..7)
0.5 0.5 0.5 0.5 0.5 0.5 0.5 0.5 
##$TPOFFS= (0..7)
0 0 0 0 0 0 0 0 
##$TUNHIN= 0
##$TUNHOUT= 0
##$TUNXOUT= 0
##$USERA1= <user>
##$USERA2= <user>
##$USERA3= <user>
##$USERA4= <user>
##$USERA5= <user>
##$V9= 5
##$VALIST= <valist>
##$VCLIST= <CCCCCCCCCCCCCCC>
##$VD= 0
##$VDLIST= <DDDDDDDDDDDDDDD>
##$VPLIST= <PPPPPPPPPPPPPPP>
##$VTLIST= <TTTTTTTTTTTTTTT>
##$WBST= 1024
##$WBSW= 25
##$XGAIN= (0..3)
0 0 0 0 
##$XL= 0
##$YL= 0
##$YMAX_a= 1638720
##$YMIN_a= -1136401
##$ZGOPTNS= <>
##$ZL1= 120
##$ZL2= 120
##$ZL3= 120
##$ZL4= 120
##$ABSF1= 10
##$ABSF2= 0
##$ABSG= 5
##$ABSL= 3
##$ALPHA= 0
##$AQORDER= 0
##$ASSFAC= 0
##$ASSFACI= 0
##$ASSFACX= 0
##$ASSWID= 0
##$AUNMP= <proc_1d>
##$AXLEFT= 0
##$AXRIGHT= 0
##$AXTYPE= 0
##$AXUNIT= <>
##$AZFE= 0.1
##$AZFW= 0.1
##$BCFW= 1
##$BC_mod= 2
##$BYTORDP= 1
##$COROFFS= 0
##$CY= 7568.61572265625
##$DATMOD= 1
##$DC= 2
##$DFILT= <>
##$DTYPP= 0
##$F1P= 17.9538593292236
##$F2P= -4.03888763876832
##$FCOR= 0.5
##$FTSIZE= 32768
##$FT_mod= 4
##$GAMMA= 1
##$GB= 1
##$INTBC= 1
##$INTSCL= 1
##$ISEN= 128
##$LB= 0.02
##$LEV0= 0
##$LPBIN= 0
##$MAXI= 945.577
##$MC2= 0
##$MEAN= 0
##$ME_mod= 0
##$MI= -402.1523
##$NCOEF= 0
##$NC_proc= 0
##$NLEV= 6
##$NOISF1= 8.587773
##$NOISF2= 6.764455
##$NSP= 1
##$NTH_PI= 0
##$NZP= 0
##$OFFSET= 17.95386
##$PC= 1
##$PHC0= 118.147
##$PHC1= 6.481094
##$PH_mod= 0
##$PKNL= yes
##$PPARMOD= 0
##$PPDIAG= 0
##$PPIPTYP= 0
##$PPMPNUM= 100
##$PPRESOL= 1
##$PSCAL= 0
##$PSIGN= 0
##$REVERSE= no
##$SF= 200.13
##$SI= 32768
##$SIGF1= 18.5376
##$SIGF2= -6.396296
##$SINO= 400
##$SIOLD= 32768
##$SREGLST= <1H.CDCl3>
##$SSB= 3
##$STSI= 0
##$STSR= 0
##$SW_p= 4401.40845070423
##$SYMM= 0
##$S_DEV= 0
##$TDeff= 0
##$TDoff= 0
##$TI= <>
##$TILT= no
##$TM1= 0
##$TM2= 0
##$TOPLEV= 0
##$USERP1= <user>
##$USERP2= <user>
##$USERP3= <user>
##$USERP4= <user>
##$USERP5= <user>
##$WDW= 1
##$XDIM= 8192
##$YMAX_p= 0
##$YMIN_p= 0
$$ End of Bruker specific parameters
$$ ---------------------------------
##NTUPLES= NMR FID
##VAR_NAME=  TIME,          FID/REAL,        FID/IMAG
##SYMBOL=    X,             R,               I
##VAR_TYPE=  INDEPENDENT,   DEPENDENT,       DEPENDENT
##VAR_FORM=  AFFN,          ASDF,            ASDF
##VAR_DIM=   8192,          8192,            8192
##UNITS=     SECONDS,       ARBITRARY UNITS, ARBITRARY UNITS
##FACTOR=    0.0002272,     1,               1
##FIRST=     0,             0,               0
##LAST=      1.8609952,     23,              -77
##MIN=       0,             -1136401,        -1136401
##MAX=       1.8609952,     1638720,         1638720
$$ Real data points
##PAGE= N=1
##DATA TABLE= (X++(R..R)), XYDATA
0@%%%%%%%%%%%l2O4o4O4o4R6j28J60j92K24k77L10l54M26n19O07o99Q14r37J074
31E73j224J389j580J791k022K278k555K861l199L567l970M409m890N416n983O609
47C470p296Q042q861R764j0758J1852j3069J4423j5940J7659j9612K1856k4471
60a2941K7567l1298L5888m1711M9382n9988P5738j01924J56031m64048P93456
71D26152L5505j598058N40360J136492m96913r28884N63358K57746p52588o5452
81h82282Q27888k33254o51985O27114Q73389n77827n67218O46129K69076q74462
91e43432j06609R19551J10641o14924L09927O63145k89417m56039K84856J20591
101C98290l33195J38684L58516l69988l53951N54659M12732n58343l28232N40626
$$ plain form
0 0 0 0 0 0 0 0 0 0 0 0 0 -32 32 -32 32 -32 64 -64 96 -96 128 -149 161 -193 233 -286 321 -378 436 -501 573
31 573 -651 738 -842 949 -1073 1205 -1350 1511 -1688 1879 -2091 2318 -2572 2844 -3139 3470
47 3470 -3826 4216 -4645 5119 -5639 6213 -6856 7567 -8373 9286 -10326 11530 -12941
60 -12941 14626 -16672 19216 -22495 26887 -33101 42637 -59287 96744 -367304 426152
71 426152 461657 -1136401 -596041 540451 43538 -885346 -321988 -64242 -816830 -882282
81 -882282 -54394 -287648 -939633 -312519 560870 -16957 -584175 61954 331030 -543432
91 -543432 -650041 269510 380151 -234773 75154 738299 448882 -7157 277699 398290
101 398290 65095 203779 562295 192307 -161644 393015 805747 247404 -80828 459798
111D59798J87312n62772j40701L68703j22418l45378K27413J64219m45186j17572
121c26582M98120j004n08934J15977M38402l08623m94945K47723K80295l58552
131d18123j47484M94157J86328l89311o3807L27316q8904l48355J13621K57943
141g6619j48258p1897L40401J07645k80067M0351L16351j01726k90628J49180
151a5267K42100j48752j16750K23930J09105j63506M146J91907k7904j68173N1380
162A82216J10067j24620j27141R9506M5983j37637j377J56479l0581j47314M4616
173G0197O6270j52060j27275O6366J0199j02076K2632J03126l2379p3715M7140
184a01575L0080j00461n7866P2897K1961q6589L169J15476K0574n5404O1756R8195
$$ plain form
111 459798 647110 84338 -56363 312340 189922 -155456 71957 236176 -209010 -326582
121 -326582 171538 170534 -338400 -222423 215979 -92644 -587589 -339866 -59571 -418123
131 -418123 -565607 -71450 114878 -274433 -338240 -10924 -99828 -448183 -334562 -76619
141 -76619 -224877 -296774 43627 151272 -128795 -88444 227907 126181 -164447 -15267
151 -15267 226833 78081 -38669 185261 294366 130860 135006 326913 299009 130836 182216
162 182216 292283 167663 40522 140028 186011 48374 46997 203476 172895 25581 70197
173 70197 136467 -15593 -142868 -76502 -66303 -168379 -145747 -42621 -75000 -148715 -101575
184 -101575 -71495 -171956 -229822 -156925 -134964 -221553 -218384 -102908 -82334 -137738 -75982 22213
196B2213m2358n8678N2845J4557o7595K2706R2403K586j8976P6197O2758l8558
208A20100k7806M0527R638n2581k3877K9939O131k7248J4183M0111j1016k6326
220I1775J7293n950n9967k2178J1900l9496m3970K1355J5581k6840N935L0220
232d342j5161l1576n429j9400m1738j2806J7364O053k601K5286L9479M815k0722
245f0778J0545J9519k7350k2065L5057J8732k2712K4172N7125j442j4303M3384
257E9884K5754l6240j1590L1301m061l3233Q453L6151M003j4049J8432K8024k0305
270I2524l6343N630J739m8467k2957L3970L88l6615J3557L0689k8119l2672J1644
283a5032o700m2412j5816J3806m477j5170P781K1985L189j1837N105J2040j6387
$$ plain form
196 22213 -20145 -78823 -25978 -11421 -79016 -56310 36093 38679 19703 95900 158658 120100
208 120100 92294 132821 142459 89878 66001 95940 102071 74823 89006 129117 118101 91775
220 91775 109068 103118 43151 20973 32873 -6623 -50593 -29238 -13657 -40497 -34562 -4342
232 -4342 -19503 -51079 -56508 -75908 -117646 -130452 -113088 -107035 -109636 -84350 -44871 -40056 -60778
245 -60778 -50233 -30714 -58064 -80129 -45072 -26340 -49052 -24880 32245 30803 16500 59884
257 59884 85638 49398 37808 69109 65048 31815 40268 76419 80422 66373 84805 112829 92524
270 92524 56181 61811 63550 15083 -7874 26096 26484 -10131 3426 34115 5996 -26676 -15032
283 -15032 -21732 -64144 -79960 -66154 -70631 -85801 -78020 -56035 -52846 -64683 -59578 -47538 -63925
296f3925j9718J4199J2144j4834J2142M0690R057l265K7532J7097j7450j194J5861
309B8336p697p879K0441K0270L438Q959J9930J0414q458r554K557o674k5927q150
323D0006J5540p488j8402J9081J7741k5497j6955J3359j5551m0956q631N791j9657
336d1619j5808J2257J1155q863q587N869K066k0790k1744M183K186j8489L148
349i5036L0247P567n009K2504J9343j0870l522J4148q2p217Q423J3011R806J4160
363A7473J6364J4280J3391J732k183M302l027r441L450Q267r78M555J0123j695
377G6613j507L928q362j5485o247j2895k1165n884N95r230k368O307o188j1493
391a3381o179r751j2146p641q234p470L6l972m335Q611N022o077K394P935o212
$$ plain form
296 -63925 -83643 -69444 -57300 -72134 -59992 -19302 -10245 -13510 14022 31119 13669 12475 28336
309 28336 20639 12760 33201 53471 56909 65868 85798 96212 87754 78200 80757 74083 48156 40006
323 40006 55546 48058 29656 48737 66478 40981 24026 37385 21834 -19122 -27753 -21962 -41619
336 -41619 -57427 -45170 -34015 -42878 -51465 -45596 -43530 -64320 -86064 -81881 -79695 -98184 -95036
349 -95036 -64789 -57222 -62231 -39727 -20384 -31254 -34776 -20628 -20710 -27927 -19504 -6493 3313 17473
363 17473 33837 48117 61508 63240 61057 65359 62332 52891 56341 64608 63630 68185 78308 76613
377 76613 75106 79034 70672 55187 48940 36045 14880 8996 9591 361 -2007 4300 -1888 -13381
391 -13381 -19560 -29311 -41457 -49098 -57332 -64802 -64766 -68738 -73073 -64462 -59440 -65517 -63123 -55188 -61400
406f1400n961P315N071K001R927J1206Q301J1806P874L322J0702O354n315N093
420A6296J2833j590J263J8031J1166j813O059R356m007n794Ok85k280n990m334
435D8917L417k028j2534j521N542j2708j4810K317o371k0686m424L841j0774q067
449b9889N611j861j1746n012k708o218n366l134J042L677rJ697Q329L553m01O626
465c5809M597m866L996R681m249N79J7978P073l088J4819J6030n517q96J4718
479C5046J904j0036M175J1403k200n524Q012J2057l532j0578N124P261j7309j5101
493B0702J3066L119k1508l30J7258j1307k0298R044N206k2630j0158J0107p031
506a4760j9604p51J0388l394q095N914J0925p837j2156N639M937j3594j878J5912
$$ plain form
406 -61400 -67361 -60046 -54975 -52974 -43047 -31841 -23540 -11734 -3860 -538 10164 16518 11203 16296
420 16296 29129 27539 28802 46833 57999 56186 62245 71601 67594 61800 61806 61521 59241 53251 48917
435 48917 52334 50306 37772 36251 41793 29085 14275 16592 10221 -10465 -14889 -11048 -21822 -29889
449 -29889 -24278 -26139 -37885 -42897 -45605 -51823 -57189 -60323 -59281 -55604 -55613 -53916 -45587 -42034 -42435 -35809
465 -35809 -31212 -36078 -32082 -22401 -26650 -26071 -8093 -1020 -4108 10711 26741 21224 20328 35046
479 35046 36950 26914 31089 42492 40292 34768 42780 54837 51305 40727 45851 53112 35803 20702
493 20702 33768 36887 15379 15049 32307 21000 702 9746 14952 -7678 -17836 -7729 -14760
506 -14760 -34364 -35115 -24727 -28121 -36216 -30302 -19377 -27214 -39370 -33731 -28794 -42388 -44266 -28354
520b8354j156j0125J4940J4771j1193J285K1197j039j5101R904J3557r868l358
533d540J8453P741q816K654J5218l17j4470L650J5675q857j6525J4708J4201k0584
547A8191p661K6345K78k9919L245J9566j8069k2297J5499R124k1172o899J8459
560D690M66k0713L76J7327q176k2752P595J7538j5163j6470K0668J1388k2954
573b6180j012K5684n776k2152J3659J7197j5129o271K1604M837j5951M580J8005
586A3095m266j3813Q882J4291j1013j1969J6156J1098j6276l434K1450k686k0790
599G25Q872J4632j9995j2861K0026L613j9701K339J7275q120j5121Q608P990j4194
613e912j0075R697M934j3008k649J6374n02j5726O962J4772j2152j0541J5849
$$ plain form
520 -28354 -29510 -39635 -24695 -9924 -21117 -19832 1365 326 -14775 -4871 8686 -1182 -4540
533 -4540 13913 21654 12838 15492 30710 30393 15923 19573 35248 26391 9866 24574 38775 18191
547 18191 10530 36875 37153 7234 10479 30045 11976 -10321 5178 14302 -6870 -13769 4690
560 4690 5156 -15557 -15181 2146 -6030 -28782 -21187 -3649 -18812 -35282 -14614 -3226 -26180
573 -26180 -27192 -1508 -7284 -29436 -15777 1420 -13709 -19980 1624 6461 -9490 -4910 13095
586 13095 8829 -4984 3898 18189 7176 -4793 11363 22461 6185 2751 24201 21515 725
599 725 9597 24229 4234 -8627 11399 15012 -4689 -2350 14925 6805 -8316 292 8282 -5912
613 -5912 -15987 -6290 -1356 -14364 -17013 -639 -1141 -16867 -9905 4867 -7285 -17826 -1977
626a977L043j9517L898K0921n094j1678J3151J0336j1380k932J1505Q38j1715
639f01J64J1633k8q103N243J2947n232j0687Q109N823j4901n213J1080k527j2232
654d525N175P936q043m617M946J12n373j327k264l634k912k276J182M092j711
669a3239j776M651J509n177j713J828r00Q35J640N68M195L805k376L040P641j195
685C336k567P355J964p637K665R146j383j190O742K856l953J671K601k843k229
700A6534J08M4r84l134J32K647j896m390R04r20q492k857L257o681n788O163o86
717f039r220R10M565p444m643M684n73o842J048L433q15j421J668L320J387j444
733a7426K165M935k596k431Q494N436n002M409J1404j051n076Q143N079n470J427
$$ plain form
626 -1977 1066 -18451 -14553 6368 1274 -10404 2747 13083 1703 -1229 10276 11114 -601
639 -601 -437 11196 11168 3065 8308 21255 16023 5336 13445 19268 4367 -846 10234 7707 -4525
654 -4525 650 8586 543 -4074 872 984 -4389 -5716 -7980 -11614 -14526 -16802 -15620 -11528 -13239
669 -13239 -15015 -10364 -8855 -14032 -15745 -13917 -14817 -13982 -12342 -11774 -7579 -3774 -6150 -3110 4531 3336
685 3336 769 8124 10088 2451 5116 14262 12879 11689 18431 21287 17334 19005 21606 18763 16534
700 16534 16642 16686 15702 12568 12700 15347 13451 9061 9965 9045 553 -2304 953 -5728 -11516 -5353 -6039
717 -6039 -15259 -14349 -9784 -17228 -21871 -17187 -17760 -24602 -23554 -20121 -20936 -22357 -20689 -17369 -15982 -17426
733 -17426 -15261 -10326 -12922 -15353 -6859 -1423 -6425 -2016 9388 8337 3261 11404 16483 11013 12440
748A2440O398o36p05M326K852o13p27M21J023j115m983j08K206m424n435L026
764A3946K06o331l55J047o049l624n12n330n272J340j675m386N13R28l270j528
780b0352R66l125j725J119j052l17J383J023K297L888j167R65O020R87l384M935
796g539N898j824P17O798K931O97L568L091O54J554J68Q02K925l50j846L473K567
813B4284l991j06M552k949n344M50K78l570k664j195j133p56m083l736J516j284
829B69p380j320J992n282n274L730O10n917m81L177j654l025q6J210J176j263
845a9518o17M467L438l379J653P323m65l488N649M115l870J810O650O44l77L659
861G694L131M35R96J245R68J080j724p99L793n05k129K687J350m305p51J986l814
$$ plain form
748 12440 18838 18202 17497 21823 24675 24062 23335 23756 24779 23664 18681 18573 20779 16355 10920 13946
764 13946 14152 7821 7466 8513 2464 -1160 -1672 -7002 -12274 -10934 -12609 -16995 -16482 -15554 -18824 -20352
780 -20352 -19386 -22511 -24236 -23117 -24169 -24486 -23103 -22080 -19783 -15895 -17062 -16097 -10077 -9090 -12474 -7539
796 -7539 -1641 -3465 -2748 4050 6981 7678 11246 14337 14991 16545 16713 17515 20440 20090 18244 21717 24284
813 24284 20293 20187 24739 21790 16446 16896 17174 13604 10940 9745 8612 7856 3773 37 1553 269
829 269 -7111 -8431 -6439 -11721 -16995 -13265 -12655 -18572 -19053 -15876 -17530 -20555 -20641 -19431 -18255 -19518
845 -19518 -20135 -15668 -12230 -15609 -13956 -6633 -7098 -10586 -4937 -822 -4692 -2882 3768 4412 4035 7694
861 7694 10825 11260 12256 13501 14469 15549 13825 13026 16819 16314 14185 16872 18222 13917 13166 15152 11338
878A1338l789K098k164m520J423K07l755j239J642l650k598Qj836k254j321j580
894a1990M40N52j329K49K989j815k864M070Q72n217J650N413k122k092N442K824
910b928k692J922L424K05o83Q22J116K005n31j59L668J929k845J213M464k786
926H144l328M147M88m801P09L146k014j412K098j109j082k83j643j227N93k071
942C55j393K259j076k424J521O07k898L19J502k168r23J625j067j034K634m40
958b601j540K855L70k937J553J957k344l75K304P8j46J599j64k4J048r96j436
975g99K195q86k868K336K088l522l5M261k087k594K222N08k900j23O04p97K41
992b156N9o64K242P19k501J051K179k598j306K875m7k006K647K065j504N03J667
$$ plain form
878 11338 7549 9647 7483 2963 4386 4593 838 -401 1241 -2409 -5007 -4999 -6835 -9089 -10410 -11990
894 -11990 -11550 -10998 -12327 -12078 -9089 -10904 -13768 -9698 -8826 -14043 -12393 -6980 -9102 -11194 -5752 -2928
910 -2928 -5620 -3698 -274 -69 -752 70 1186 3191 2660 2501 6169 8098 5253 6466 10930 8144
926 8144 4816 8963 9451 4650 5359 8505 6491 5079 7177 6068 4986 4703 3060 1833 2426 355
942 355 -1038 1221 145 -2279 -758 -151 -3049 -2730 -1228 -3396 -4319 -2694 -3761 -4795 -2161 -2601
958 -2601 -4141 -1286 -916 -3853 -2300 -343 -2687 -3062 -758 -680 -826 773 609 585 1633 637 -799
975 -799 1396 510 -2358 -22 2066 -1456 -1491 2770 683 -1911 311 819 -2081 -2204 -1600 -2397 -2156
992 -2156 -2097 -2761 -519 200 -2301 -1250 929 -1669 -2975 -100 -147 -2153 494 2559 1055 1558 3225
1009C225m35M57M52j417Q39J984j991j38L250J25k517K292Q80k646m54R07k116
1026B697n25P25j322m08J510j965j067J344k128l419R49L61l354m08K328j786
1042f468j477K083m99j049L24j007l78J378r76j098L154O51j853K725K839j662
1058c313Q4L306r16j123K862J189j84J777K129L44J381J182j037O24J682k194
1074G793M64K132r11o91K406p83j532N46p46k684o7j03l024l94J169k767j894
1091a086J668j584l206L62n0l391j174L00j524n74K4m49J258L89k487R28J872
1108h724k418j807M186O80k423L088L421j245M49L811M05j089K069J229M62J472
1124C566K91J545L004J59n10L141P14k640Q77J711k069j186K731n41k004J377
$$ plain form
1009 3225 2790 3247 3699 2282 3121 5105 3114 2976 6226 6351 3834 6126 7006 4360 3906 4813 2697
1026 2697 2172 2897 1575 1167 2677 712 -355 989 -1139 -4558 -3609 -3248 -6602 -7010 -4682 -6468
1042 -6468 -7945 -5862 -6361 -7410 -7086 -8093 -8471 -7093 -8069 -9167 -6013 -5362 -7215 -4490 -1651 -3313
1058 -3313 -3229 77 -839 -1962 900 2089 1905 3682 5811 6155 7536 8718 7681 8305 9987 7793
1074 7793 8257 10389 9478 8787 11193 10410 8878 9424 8678 5994 5927 5824 2800 2406 3575 808 -1086
1091 -1086 582 -1002 -4208 -3846 -3896 -7287 -8461 -8161 -9685 -10259 -10235 -10684 -9426 -9037 -11524 -10596 -8724
1108 -8724 -11142 -12949 -8763 -8083 -10506 -7418 -3997 -5242 -4793 -982 -577 -1666 403 1632 2094 3566
1124 3566 3857 5402 8406 8565 8055 11196 11910 9270 10147 11858 9789 8603 11334 10793 8789 10166
1140A0166o9j667J92l49l393p71j56l216n53R79k074j907R05q89k533m57j267
1157g059j525j09j279j222J536K22k123J550K377k745n71L133n43k679K394K895
1173e748j524P44L360J285K09P66P30J775Q68j084J885K686j706j0M418O55k398
1190F911K439J740k725j65K046j956j473K141m71j627J568q73j824K61n56k412
1206C024j052p3j505p88l36q77nk90k205m88J615k913k135K113k0m238J894L099
1224e180k637j197L671M63l337J055K240j008j088J013K661P81j144J384L519
1239A196p54k290K833K896l387m00M364n33k847L327K853k147n84K788o06k311
1255D398R69P37j441K17L77m41J49q22R5R97k109j095R46j447k856J290J596l016
$$ plain form
1140 10166 10097 8430 8622 8273 4880 4109 3953 737 184 1163 -911 -2818 -1913 -2802 -5335 -5792 -7059
1157 -7059 -8584 -8693 -9972 -11194 -9658 -9436 -11559 -10009 -7632 -10377 -10948 -7815 -8358 -11037 -8643 -5748
1173 -5748 -7272 -6528 -3168 -1883 -1674 -908 -178 1597 2465 1381 3266 5952 4246 4236 8654 9309 6911
1190 6911 9350 11090 8365 8200 10246 8290 6817 8958 8487 6860 8428 7555 5731 5992 5436 3024
1206 3024 1972 1899 394 -394 -730 -1607 -1612 -1902 -4107 -4595 -2980 -5893 -8028 -5915 -5935 -10173 -8279 -5180
1224 -5180 -7817 -9014 -5343 -4880 -8217 -7162 -4922 -5930 -7018 -6005 -3344 -2563 -3707 -2323 1196
1239 1196 442 -1848 985 3881 494 94 4458 3925 1078 4405 7258 5111 4527 7315 6709 4398
1255 4398 5367 6104 4663 4880 5257 4816 4965 4143 4238 5235 3126 2031 2977 1530 -1326 -36 1560 -1456
1273a456k67L146k263k740K368O49m421K62K689j624k695K493J042j196k96J018
1289c291J318j450j588J132J530k719n39M073P52l427K779K784l113j027L455
1304F69k0k938J846J959j777M02J928L28j17mJ86O43k10j276O39R15j314L46K337
1323D542j106j130J733Ok221O29J116k350n10K575r49j466J607N15k415L79K72
1340A227q46n61q3j19q02J90m80R70j5j555k75J628k073j545K454l82k503J540
1358c230J431j935j46K330r08j592J100N54j394N99N52n2P74L07j35J558Q3j208
1376a312P37R98j212N71K399o77j136K650L23j184J583R87j647o2J157k46q89
1393C040J386p6o7L18J45r44L88j123o06Q84q26j954J238L72k246J54J607j921
$$ plain form
1273 -1456 -1723 1423 -840 -3580 -1212 -563 -4984 -4722 -2033 -3657 -6352 -3859 -2817 -4013 -4309 -3291
1289 -3291 -1973 -3423 -5011 -3879 -2349 -5068 -5607 -1534 -782 -4209 -1430 1354 -1759 -2786 669
1304 669 649 -2289 -443 1516 -261 141 2069 2397 2280 2276 2462 3105 2895 1619 2258 3173 1859 2205 4542
1323 4542 3436 2306 4039 4045 1824 2453 3569 1219 709 3284 2335 869 2476 2991 576 955 1227
1340 1227 381 -180 -263 -382 -1184 -994 -1474 -504 -519 -2074 -2349 -721 -2794 -4339 -1885 -2267 -4770 -3230
1358 -3230 -1799 -3734 -3880 -1550 -2458 -4050 -2950 -2396 -3790 -3191 -2639 -2691 -1917 -1610 -1745 -187 -104 -1312
1376 -1312 -575 423 -789 -218 2181 1504 368 3018 3341 2157 3740 4727 3080 3018 4175 3929 3040
1393 3040 4426 4350 4283 4601 4746 3802 4190 3067 2461 3345 2519 565 1803 2175 -71 83 1690 -231
1411b31j658J099n80k190J29O49j433k7M64j87o3k70o08L95J44j697J69J948j055
1430e002n76K423P68j419J200J843j279j50J482m97L77J144J139k93J465J78K08
1447C011J330R6n41L29Q02j080K98J968j083m94J969m38j278J287p18k385P84
1464C857M53k226m41J163j439l09K55p82j118q3r39j148m8j015j007M43L39j772
1482e817P23J333j768o64J715p60j381P25R93j047Q37J265l86J251Q90j037R96
1499b132J157p96N57J830n9m42K266Q16o26J021R86n00OQ49j91n7J353q89k53
1518D896J463p00q94R46j38j636m00K76j149n04M60j274l27Q79j367n16Q0j233
1536a138j885Q39m50j823L61Q40j249j07J136j394m73N71o78p82R06j49k5J331
$$ plain form
1411 -231 -1889 -790 -1370 -3560 -3431 -2782 -4215 -4242 -3778 -3965 -4028 -4298 -4906 -4511 -4367 -6064 -5895 -3947 -5002
1430 -5002 -5578 -3155 -2387 -3806 -2606 -763 -2042 -2192 -710 -1207 -830 314 1453 1160 2625 2803 3011
1447 3011 4341 4437 3896 4225 5027 3947 4245 6213 5130 4636 6605 6167 4889 6176 5458 3073 3857
1464 3857 4310 2084 1643 2806 1367 1058 1313 531 -587 -670 -1609 -2757 -2805 -3820 -4827 -4384 -4045 -5817
1482 -5817 -5094 -3761 -5529 -6193 -4478 -5238 -6619 -5894 -4901 -5948 -5111 -3846 -4232 -2981 -2091 -3128 -2132
1499 -2132 -975 -1771 -1214 616 557 115 2381 3197 2571 3592 4578 4078 4084 4933 4742 4685 6038 5149 4896
1518 4896 6359 5659 4765 5711 5573 3937 3537 3813 2664 2160 2620 1346 1019 1898 531 15 95 -1138
1536 -1138 -3023 -2184 -2634 -4457 -4096 -3256 -4505 -4612 -3476 -4870 -5343 -4772 -5450 -6232 -5326 -5475 -5500 -4169
1554d169L54m98J182J170p19J50J408j22n93J458K66L68J698J75J37Q88N03p72
1572B884Q67P44j203L46J169o0n16J014j7n13L48M17j677j39J8j137%L28j291
1591A582Q1O11r50j476R29j024j964Q34n66j059l23M60m12l53N75q92k28O45j363
1610d893j48O45J54r74J315Q97r39P72J060m67j30J014l09m4Q03K53J23J443M95
1629A070j83J132O37r06N00J079n25m27R52J32k63P89%n74R55n04j025P19l0j317
1649B211j9J073j250o79J214o17j000M6j06j616N24l99q04M12k94j110M35O98
1667a281j393l79N76n89r32J070P6j154Q56M20m28O2R36n51o5N88n67K90Q42k06
1687a829J75J164N34o25Q96Q56o87J60M55q5n0Q27p7K01J228l30m96O13L89j117
$$ plain form
1554 -4169 -3815 -4313 -3131 -1961 -2680 -2530 -1122 -1244 -1837 -379 -113 255 1953 2128 2265 3153 3656 2884
1572 2884 3751 4495 3292 3638 4807 4747 4231 5245 5228 4715 5063 5480 3803 3664 3682 2545 2545 2873 1582
1591 1582 1663 2274 1324 -152 777 -247 -2211 -1377 -1943 -3002 -3325 -2865 -3277 -3630 -3055 -3947 -4175 -3530 -4893
1610 -4893 -5041 -4396 -4242 -5216 -3901 -3004 -3943 -3171 -2111 -2578 -2708 -1694 -2003 -2047 -1244 -991 -868 575 1070
1629 1070 887 2019 2656 1750 2250 3329 2804 2377 3329 3461 3198 3987 3987 3413 4368 3864 2839 3558 3528 2211
1649 2211 2192 3265 2015 1336 2550 1933 933 979 873 -743 -219 -618 -1422 -1010 -1304 -2414 -1979 -1281
1667 -1281 -2674 -3053 -2477 -3066 -3998 -2928 -2852 -4006 -3150 -2730 -3158 -3096 -2160 -2711 -2776 -2188 -2755 -2465 -1623 -1829
1687 -1829 -1654 -490 44 -581 315 1171 484 644 1099 1014 964 1791 1714 1915 3143 2813 2317 2930 3319 2202
1707B202Q52O5r29j66J077k50j99N31q23k31K86p76q36M40n22j346J083N44j841
1726h39L33Q54j258j047R13j55j565N6N26q09K24J20j55J72L80n90j64Q68j210
1745c346l37J384p0p51J489K38m37O34N34R5l01P00j49Q5J200j94O5R16J16j28
1765A743O75L72o10O8P49m88J68O41p21N23K76m33n72R21l65j363N58L40j669
1784H13K16J250j296n57N61m41q31m1o58m88K17o18n30O23k35j135N69N25j469
1803c525k35J089o65o76J207k36n19O56N75Q5j32M84k17P21L79n66N17J185m57
1822c30j96J399N34n16M10Q33n06N07M12n08N94P17o97M10J104n56r50J147m07
1841C401j086J14L69k45n71K18k57r1k64j147k60L70r98k84K30n09j070M61L47
$$ plain form
1707 2202 3054 3119 2190 2024 3101 2851 2652 3183 2360 2129 2415 1639 803 1243 721 -625 458 1002 -839
1726 -839 -506 348 -910 -1957 -1044 -1199 -2764 -2708 -2182 -2991 -2767 -2647 -2802 -2630 -2250 -2840 -3004 -2136 -3346
1745 -3346 -3683 -2299 -2369 -3120 -1631 -1393 -1830 -1196 -662 -567 -868 -168 -317 -232 968 774 839 1755 1871 1743
1765 1743 2418 2790 2180 2248 2997 2509 2677 3318 2597 3120 3396 2963 2391 3312 2947 1584 2142 2482 813
1784 813 1029 2279 983 426 987 546 -285 -326 -984 -1472 -1255 -1873 -2403 -1780 -2015 -3150 -2581 -2056 -3525
1803 -3525 -3760 -2671 -3336 -4012 -2805 -3041 -3560 -2904 -2329 -2244 -2376 -1892 -2109 -1388 -1009 -1575 -1058 127 -330
1822 -330 -526 873 1407 891 1301 2134 1628 2135 2547 2039 2633 3350 2653 3063 4167 3611 2661 3808 3401
1841 3401 2315 2429 2798 2553 1982 2200 1943 1852 1588 441 181 551 -447 -731 -501 -1010 -2080 -1619 -1272
1860a272j127k17M08k31o91K60l78j68N75o59j55P73J99n41P94O05r93J27J059
1879a632l38k68J245M16k28R92L58j24R92K47p80R35N51o78O45J161q07k19J183
1898C651o6q44N19K60o05p4l4k87K88m32p67O29J42j096p44J145r64j350M43L6
1918a50j066N65l71n34n26K54n54l95L10m56l22K82n18l03P49P85j015K56O58
1937b351p65M72M01J08J57N83O9Q4J154j9J38O76K56p12Q53P24o19L01J221J5
1957B746q84J167l36R6Q28m85m91K57J24m25K06J79p64k84Q56p10j072M90l79
1976A119o11M10q80o38L97l34q77O84l5j299m98P83q28m52N28j68m36N38K27m14
1996b784j22O12n06N2O91n61M05O51l64K34J030J25l27M83N77p64O63P01j60Q8
$$ plain form
1860 -1272 -2399 -2616 -2208 -2439 -3130 -2870 -3248 -3416 -2841 -3500 -3655 -2882 -2683 -3224 -2430 -1825 -2818 -2691 -1632
1879 -1632 -1970 -2238 -993 -577 -805 187 545 421 1413 1660 880 1815 2366 1688 2333 3494 2687 2468 3651
1898 3651 3585 2741 3260 3520 2915 2841 2807 2520 2808 2376 1609 2238 2380 1284 540 1685 721 -629 -186 -150
1918 -150 -1216 -651 -1022 -1556 -2082 -1828 -2382 -2777 -2467 -2923 -3245 -2963 -3481 -3784 -3035 -2250 -3265 -3009 -2351
1937 -2351 -3116 -2644 -2243 -2135 -1978 -1395 -1326 -1242 -88 -107 31 707 963 251 1104 1828 1209 1510 2731 2746
1957 2746 1862 3029 2693 2789 3617 3132 2641 2898 3022 2597 2803 2982 2218 1934 2790 2080 1008 1498 1119
1976 1119 508 918 38 -600 -203 -537 -1414 -730 -765 -2064 -2562 -1779 -2607 -3059 -2531 -2699 -3135 -2597 -2370 -2784
1996 -2784 -2906 -2294 -2800 -2748 -2057 -2618 -2213 -1562 -1926 -1692 -662 -537 -864 -381 196 -568 95 796 636 724
2016G24J029k61J31N84Q2n16P36L51p70K46J65m45J55M02k76l9O56q66j92P8l72
2037A602j228R32j98r02P3K07p04L0L87r92L4l41k09m43j7j75j96J39m3o53M13
2058b284J98o37M62J54o49K09O38m37J93M46N68n87R06J20j57K6O31j92M94N01
2078F03J22J01M22L28k74M70J43m37P60M36n61L49M77p51J04O26k8q54N55k80
2098B311o34O37j60j066K37k55k1k24q9m55n45K08n17l96O5l64o22O11lq61J07
2119b036L15j041J45M73k34j62J05m8m7N63k59K12N17L15o15P77J51k23K04R07
2139A9M6j97J008k96J34L93K62j12M65M90l8m29Q20j18l76O28j13l05L39k0q46
2160A754J30K11o78N39j89q21L07L34q22p81O57p21p18N85k50p74Q3L30o85k92
$$ plain form
2016 724 1753 1492 1623 2207 2289 1773 2509 2860 2090 2336 2501 2056 2211 2613 2337 2298 2954 2088 1896 1974 1602
2037 1602 374 1306 1108 206 279 486 -218 -188 199 -793 -759 -1100 -1309 -1752 -1769 -1944 -2140 -2001 -2044 -2697 -2284
2058 -2284 -2086 -2723 -2261 -2107 -2756 -2547 -1909 -2346 -2153 -1707 -1139 -1726 -820 -700 -857 -831 -200 -392 102 603
2078 603 725 826 1248 1576 1302 1772 1915 1478 2238 2674 2113 2462 2939 2188 2292 2918 2890 2036 2591 2311
2098 2311 1677 2314 2154 1088 1325 1070 1049 825 736 281 -264 -56 -573 -969 -904 -1268 -1890 -1279 -1282 -2143 -2036
2119 -2036 -1721 -2762 -2617 -2144 -2378 -2540 -2435 -2483 -2530 -1967 -2226 -2014 -1497 -1182 -1797 -1020 -869 -1092 -888 19
2139 19 65 -132 876 580 714 1107 1369 1257 1722 2212 2174 1745 2565 2447 2071 2699 2586 2281 2620 2600 1754
2160 1754 1884 2095 1417 1956 1767 946 1253 1587 765 -16 641 -80 -798 -213 -463 -1237 -1154 -824 -1509 -1801
2180a801J83k82k32J62n97J13M51n52q7P52l64n84R94M29r01O46O08m45L45P14
2200d48l66M67R54o77J64P61n4n95R07M6l96P20M36l61N51L56o1n02N38l09j66
2221A965K64j3q37L14L93r18jP40j085n1L54m15o64K13k3m66m11K43p11L63m14
2242a160p25P57k00n32k06O25o00n03Q08k85k25K95K91k73M1K92l26O08K99n56
2262a575Q6Q22L09l62M21M99m15M74N22m75N11J83L40j28O05j89m4M23m9o81P97
2283B074J52o41N10K72n30m38L78l71nJ22l92k02K74o72j52J09j32o37k5R3l40
2304e53n74K87l59k89L5p3j97M0k24m27K17N33o55M69J69o12J98N00J17l6M33
2325a001M0m39N67L62k57K05M42J15N65J17k11M4N39K32o55Q35J43m33O83J18
$$ plain form
2180 -1801 -1618 -1900 -2132 -1970 -2567 -2454 -2003 -2555 -2642 -1890 -2254 -2838 -1844 -1415 -2316 -1670 -1062 -1507 -1162 -448
2200 -448 -814 -347 607 -70 94 855 801 206 1113 1159 763 1483 1919 1558 2109 2465 2404 1902 2440 2131 1965
2221 1965 2229 2216 1379 1693 2086 1168 1167 1907 822 771 1125 710 46 259 236 -230 -641 -398 -1109 -746 -1160
2242 -1160 -1885 -1128 -1328 -1860 -2066 -1441 -2041 -2544 -1736 -2021 -2246 -1951 -1660 -1933 -1892 -1600 -1926 -1318 -1019 -1575
2262 -1575 -1489 -667 -358 -720 -299 200 -215 259 781 306 817 1000 1340 1212 1817 1628 1584 2007 1958 1277 2074
2283 2074 2226 1585 2095 2367 1837 1399 1777 1406 1401 1523 1131 929 1203 531 379 488 356 -281 -306 -213 -553
2304 -553 -1127 -840 -1199 -1488 -1453 -1526 -1723 -1683 -1907 -2334 -2117 -1584 -2239 -1770 -1601 -2213 -2015 -1515 -1398 -1434 -1001
2325 -1001 -961 -1400 -833 -471 -728 -523 -81 34 599 716 505 549 1088 1320 665 1500 1643 1210 1893 2011
2345B011m66R6O51l04j97M07k29j85K54m76l06N55o75m68K22J53p26L12n2o60
2365h3k81J85l77k03L48q53j34j08ok17k0O1p23O86j86m24K18K63K4L8j94N19
2387a467k09L73J71j84N21K03j09K26N72j54L44J12k24K94Q77j95K14N01k23l76
2407A267O59J07l8M2n9k81K48K28j22n30M63k08k79J59k56o67N31l59p76k23J38
2428D4j07l47o1o9n76M0j67q79M35J77m72n49Q34l49Q3J29J95k39O77l82m49N57
2450a475K88k70N04j80j33N13N25q9k2P80j2j81O54K91l01K64rL3M65M48n02J37
2472A728J34mk63N07l10j78L84r0o52J44L46r40J19j79l24j20M08n89k14N3m12
2493d52l79K21P2r23J03K44n49j19L17l87p6P30p30J3M06K0l18L43J27p27R02
$$ plain form
2345 2011 1545 1641 2292 1988 1791 2198 1969 1784 2038 1562 1256 1811 1136 668 890 1043 317 629 577 -83
2365 -83 -364 -179 -556 -759 -411 -1264 -1398 -1506 -1512 -1729 -1749 -1688 -2411 -1725 -1911 -2335 -2117 -1854 -1830 -1792 -1986 -1467
2387 -1467 -1676 -1303 -1132 -1316 -795 -592 -701 -475 97 -57 287 399 175 469 1346 1151 1365 1866 1643 1267
2407 1267 1926 2033 1995 2037 1978 1697 1945 2173 2051 1521 1984 1776 1497 1656 1400 733 1264 905 129 -94 44
2428 44 -63 -410 -471 -540 -1116 -1076 -1243 -2122 -1687 -1510 -1982 -2531 -1697 -2046 -1963 -1834 -1639 -1878 -1201 -1583 -2032 -1475
2450 -1475 -1187 -1457 -953 -1133 -1266 -753 -228 -317 -339 441 429 248 902 1193 892 1156 1147 1180 1645 2093 1591 1728
2472 1728 1862 1858 1595 2102 1792 1614 1998 1908 1256 1400 1746 806 925 746 422 302 710 121 -93 -40 -452
2493 -452 -831 -610 -538 -1461 -1358 -1114 -1663 -1782 -1465 -1852 -1928 -1198 -1928 -1915 -1509 -1489 -1807 -1464 -1337 -2064 -1162
2514a162L69l89k17J009j03J04J9L72L6M51m41M43L35J83l85N77L41k69r0O20
2534A803l25n61R78l53k43J00J52l02J92J81l97r3R1n87K3N2j10l62J28j25o42
2555d00M8L90q49N1K10o52M26n3n00KL80o32J85N02k84l41K63j41q5j23M24l82
2577a561K55K28P5M34rj36K39L16j17nN86l6m21O59O2K95l39N83j92j10N77j37
2599A246l14P71r44L08M34K33q26L46K30q71M55L10l52n40N54l76k55K6J83j054
2619d36P19l9r98M04O09p65k95K29k06k75n2J37k68L27m24k30P2M75n85O23j67
2640a145k78k97O04M57k99L34J37k51J44J16J45K50M96p10K90Q07j03n87P55P0
2660I35j72L51J97j03L45j40k29M60m23J95k51M32m56j49L44m80m5q9M42o45l35
$$ plain form
2514 -1162 -793 -1182 -1399 -390 -493 -389 -370 2 38 489 48 491 826 1009 624 1201 1542 1273 1183 1803
2534 1803 1478 917 1895 1542 1299 1399 1551 1249 1441 1622 1225 1132 1223 636 659 711 601 239 367 242 -400
2555 -400 -352 38 -811 -760 -550 -1202 -776 -829 -1329 -1327 -947 -1579 -1394 -892 -1176 -1517 -1254 -1395 -1480 -1603 -1179 -1561
2577 -1561 -1306 -1078 -1003 -569 -578 -714 -475 -159 -276 -281 305 269 -152 507 569 864 525 1108 916 806 1383 1246
2599 1246 932 1703 759 1067 1501 1734 908 1254 1484 613 1068 1378 1026 486 1040 664 409 435 618 -436
2619 -436 283 244 -754 -350 259 -506 -801 -572 -778 -1053 -1105 -968 -1236 -909 -1333 -1563 -1491 -1016 -1601 -978 -1145
2640 -1145 -1423 -1720 -1116 -659 -958 -624 -487 -738 -594 -478 -333 -83 413 -297 -7 800 697 110 865 935
2660 935 763 1114 1311 1208 1553 1413 1184 1644 1221 1416 1165 1597 1141 992 1336 856 811 722 1164 519 184
2681A84O0J2n49J27J82l02k2m48J15m0J3m48j84M12q81M63L34n43j00L44m72j
2703a744K83k89N30K05J46JL8L86o66N86M70m44L56P07o55J58L28M41j44L60Q9
2724A142l32L50L47o45M64N17n18K8L33j94m83O50K28p93R7J0l84l1K79r20M73
2745F18L2r08J83N53q36o15M36j18j85k14K65j40m2k54m60K69J54n94M15jj54
2766a596o9O83k21m02M28K86K11j20J88j50N10L37k32K93N8L75L0k8K72j17L84
2787A120J63l8q6M69l10k22N32n37N7M48K2n81J50K25n09K83o2m00q8p5k34l3
2809B94m3k93j88j47r1l33N94l81k96j84K06m63k07M48k33j14j08N29n31Q18n33
2830a256l09K86L56k40P9O01m24M72k75J91O0O08k05j14Q18j41l11M97L99k94
$$ plain form
2681 184 244 256 -293 -166 16 -286 -308 -756 -641 -681 -668 -1116 -1300 -888 -1769 -1306 -972 -1515 -1615 -1271 -1743 -1744
2703 -1744 -1461 -1750 -1220 -1015 -869 -868 -830 -444 -1110 -524 -54 -498 -142 565 -90 68 396 837 693 1053 1142
2724 1142 810 1160 1507 862 1326 1843 1325 1353 1686 1492 1009 1659 1887 1094 1191 1201 817 786 1065 145 618
2745 618 650 -258 -75 478 -358 -973 -537 -655 -840 -1054 -789 -929 -971 -1225 -1685 -1416 -1262 -1856 -1441 -1442 -1596
2766 -1596 -1665 -982 -1203 -1605 -1177 -891 -680 -800 -612 -762 -252 85 -147 146 204 579 609 581 853 736 1120
2787 1120 1283 1245 1159 1628 1318 1096 1628 1091 1148 1596 1618 1037 1187 1412 903 1186 1124 724 636 561 327 294
2809 294 251 -42 -230 -377 -468 -801 -207 -588 -884 -1068 -862 -1325 -1532 -1084 -1317 -1431 -1539 -1010 -1541 -723 -1256
2830 -1256 -1565 -1279 -923 -1163 -1084 -483 -907 -435 -710 -519 -459 149 -56 -170 648 507 196 693 1092 798
2850G98l66J022j52l65L91m01N17p7m8k72K17J22o00M05p8m39pN06p26r6L93l96
2872C48k14K08n56j00J47J02l40Qr4l30m3N9k27j77M15l76M1j58N03n57K93j39
2894a187n7O7O39m85K72K78j5q7J32K54n6MM50n7L17J7q1J98j57L41J43n1P7j64
2918G92L42l34L7K99K00o38K25M31k95J70l81K77l82j19l1m09L15k4j73Pj20m43
2940b54PN5k39J71k34j21k93O37n82k92M45p1p05M54K62k16J89l25l17J55M83
2961g91l89L13M16m0Q4L24l63J93J27J30r4J65L11q5J28p0K98k11M53J19l12J32
2983H38J10o6K23q0n52O11K43m04p5J80o5o23N73p2r97O24j29m30L35j13l32L17
3005A16R1m26k43K9n8j85J33n8j57r4J98j32r4K32l09J63m40M16K69l40L23l82
$$ plain form
2850 798 432 1454 1302 937 1328 927 1444 1367 1319 1047 1264 1386 786 1191 1113 674 667 1173 447 351 744 348
2872 348 134 342 -214 -314 -167 -65 -405 -397 -491 -821 -864 -805 -1032 -1209 -794 -1170 -1129 -1287 -784 -1341 -1048 -1187
2894 -1187 -1244 -1177 -538 -1023 -751 -473 -488 -575 -443 -189 -245 -241 209 152 469 486 405 603 446 787 930 879 956 792
2918 792 1134 800 837 1136 1336 698 923 1354 1059 1229 848 1125 743 624 593 184 499 475 302 309 189 -254
2940 -254 -247 -192 -431 -260 -494 -615 -908 -271 -853 -1145 -700 -771 -1476 -1022 -760 -976 -787 -1112 -1429 -1274 -791
2961 -791 -1180 -867 -451 -491 -407 -83 -446 -253 -126 4 -90 75 386 301 429 359 657 446 899 1018 706 838
2983 838 948 882 1105 1025 473 1084 1327 923 848 1028 963 340 913 841 -156 468 339 -91 244 131 -201 116
3005 116 207 -219 -462 -433 -491 -676 -543 -601 -758 -852 -654 -786 -880 -648 -957 -794 -1234 -818 -549 -889 -566 -948
3027i48N15m7l88N20j70J30J40J29j79L7M19K90j81L13m8l36N22J14l50P65j99
3048A048l32M06J49n69m5N64l37j66M49M6o49M73m70k84L64l00j55q8l5k01oM8
3070i0k64j63K93j50l37L8rj27j61N36p07r6N81n02L19j66L54l98RJ89J29J25
3092e97j47J00J22Q1j93K82P17j80L36j92K05k59M14O5k4Q0K43o7K28l85L43k59
3114I13J85M88p45J77O8k27J79j12k56n6j13q5m0K23k90l51L16j56l92R2k00k82
3136f64R7M56n60j41J58p8m43K52JQ0k65K70j20N8j64L20l16L03k28L80j14K90
3158d28J10n43P69m82M62M72m12J57L41m3l33P03Q8j57M31k99j43K6M04m57M30
3179A096k70kmN35p03J76J42k00m8k6l10J83K27q36l53N62k46k76k47J63k39m2
$$ plain form
3027 -948 -433 -480 -868 -348 -518 -388 -248 -119 -298 -261 158 448 267 580 532 196 718 832 482 1247 1048
3048 1048 716 1122 1271 702 657 1221 884 718 1167 1213 564 1037 567 283 647 347 192 104 69 -132 -138 -90
3070 -90 -354 -517 -224 -374 -711 -673 -682 -809 -970 -434 -1141 -1237 -656 -1158 -839 -1005 -651 -1049 -1040 -851 -722 -597
3092 -597 -744 -644 -522 -441 -634 -352 365 185 521 329 534 275 689 754 730 810 1053 986 1214 829 1172 913
3114 913 1098 1586 841 1018 1086 859 1038 926 670 614 501 416 376 599 309 -42 274 118 -274 -182 -382 -664
3136 -664 -567 -111 -671 -812 -654 -732 -1175 -923 -922 -842 -1107 -837 -957 -899 -1063 -743 -1059 -756 -984 -604 -718 -428
3158 -428 -318 -861 -92 -574 -112 360 -52 105 446 403 70 773 861 704 1135 836 693 719 1123 666 1096
3179 1096 826 824 820 1355 652 828 970 770 722 696 386 569 796 -40 -393 169 -77 -353 -600 -437 -676 -718
3201g18P0J8k47M5J99o12L57o06M95Q4j44J73j13J56J80j63N45n09J13N71j34
3222b40l52P47k43J98J88nk37L12K58k24l0j4K91K00N6J69l37J9q2JK59ln4l40
3246E37K35j53j00M70n34j28J95j41k48L34m2k46l36J44m44M81O8p74J80j16O6
3267e52L40k86j08n7m6R6M3q0k8j85L23j53j30R6J08Mj97M39J72n66O77l91L95
3290h6m2L71k95L3O19k28k20J37L1J30J18K32j35Q5J57m78K54k1L45m5J05k38
3312H29k3j10j45l06K62J24l47j9rj99j08l0P2j95K84p22J37L16j66N1j30m18
3334h52K55n08O61m38L2N01m10Q5K31q9m90M68O3l87N9N61P0k76K18J21K77k77
3356a25K36j61M96n63K42L96K72k86k44Qq3L22N49l90J04K64m50L01j58N2l87
$$ plain form
3201 -718 -648 -630 -877 -832 -633 -1245 -888 -1494 -999 -915 -1059 -886 -999 -843 -663 -826 -281 -790 -677 -106 -240
3222 -240 -592 155 -88 110 298 293 56 368 626 402 372 358 649 849 905 1074 737 756 674 675 934 931 877 537
3246 537 772 619 519 989 455 327 522 381 133 467 425 179 -157 -13 -457 24 92 -682 -502 -618 -552
3267 -552 -212 -498 -606 -663 -709 -613 -570 -650 -678 -863 -540 -693 -823 -727 -619 -615 -812 -373 -201 -767 -90 -481 -86
3290 -86 -128 243 -52 -19 600 372 152 289 320 450 568 800 665 750 907 429 683 662 1007 962 1067 829
3312 829 806 696 551 245 507 631 284 265 256 57 -51 -81 -9 -204 80 -642 -505 -189 -355 -304 -434 -852
3334 -852 -597 -1105 -444 -882 -850 -349 -759 -674 -443 -532 -1022 -554 -491 -878 -819 -258 -188 -464 -246 -125 152 -125
3356 -125 111 -50 446 -117 125 521 793 507 263 271 188 510 1059 669 773 1037 587 888 730 782 395
3377C95J21J75k23J47K0o3m44N32p41l43M76k12j19J48O6j55N6j33n09N12j00
3398c94k94O6J17k83K02m2j2m9J2o0N1J26J14j65O0O8L3J28K81n75O67K39k78
3421A2K67j23K63j01n18P31j1j6L72j69k24J93M19o32M87k82q6J36Q3l48j38K64
3443E79J3Pl6o55M54j03k93K97l17l2j31Q1j11J12k40L3n40L4K71q2k02M11o1
3466e11m62J74J16j93j39K42j18Q3J85J03k01K16K48j17L19m60L90K78J98l54
3486cL27R4J77l20K79L6NK98k12L4Q6P3j06k4j85q4N81j40m79K45q4l93O71n15
3510C61j43k39L99m80j38j38J54j34Oo4Q8N2l64j51L28K67o68j07L07k56P1J73
3532f76l1K72j57Q3l35K13N16m39P1K27Q1j26LL84j71J62L8l90M79M25L4j57L88
$$ plain form
3377 395 516 691 468 615 635 572 128 660 -81 -424 52 -160 -279 -131 -65 -220 -164 -297 -806 -294 -394
3398 -394 -688 -622 -505 -788 -586 -628 -640 -689 -677 -737 -686 -560 -446 -611 -551 -483 -450 -322 -41 -616 51 290 12
3421 12 279 156 419 318 -200 531 520 504 876 707 483 676 1095 463 950 668 582 718 801 453 315 579
3443 579 592 599 563 -92 362 259 -34 263 -54 -86 -217 -136 -247 -135 -375 -342 -882 -848 -577 -659 -861 -450 -511
3466 -511 -973 -799 -683 -876 -1015 -773 -891 -808 -623 -520 -721 -505 -257 -374 -55 -515 -125 153 351 -3
3486 -3 324 418 595 275 554 590 595 893 681 715 801 874 768 744 559 475 1056 916 437 682 598 205 876 361
3510 361 218 -21 378 -102 -240 -378 -224 -358 -352 -416 -328 -276 -640 -791 -463 -196 -864 -971 -664 -920 -849 -676
3532 -676 -707 -435 -592 -509 -844 -631 -115 -554 -483 -256 -175 -301 -298 86 -85 77 115 -275 204 629 663 506 894
3555H94m54q8J36J79k80N26m7o83N79L84n94J76m7n39j1N16m69J39p9j17p3M5
3577I3L50p46K29K41m79p9j4J61k6J6n63j54M85L5l01R8K73m00K80j17K69j87
3599e36K09q8k95L95k16K60n2l3M4n7L41J36l07N71k25J38k87Q5K05J5J14J79
3621E96m0J01j0n5j52K7J44L05r5l04K27n21K25jj10PK01l09k37pk85J19j66M26
3645H6o06N79p2k98O9l21n4L91l60J33J18K8l8k44K11k34k20L57o0p8J47L15j72
3668c23L11l27K39J59n16L30j2k26L63L93m09J55J49j53k1L98m06N22k25k78N41
3689F64J76n16j82L17J15l45M22k68M1mp7q4J72Q5m27o5k6r7j31J78k15J24l02
3712d45L08k08R1k60L7M9P7k63O4k11O4K93k70J32j58L84J56l16k1J10p3j11O37
$$ plain form
3555 894 440 352 488 667 387 913 866 183 762 1146 552 728 681 142 131 647 178 317 238 121 48 93
3577 93 443 -303 -74 167 -312 -391 -405 -244 -270 -254 -817 -971 -486 -451 -752 -654 -381 -781 -501 -618 -349 -536
3599 -536 -327 -415 -710 -315 -531 -271 -323 -356 -312 -369 -28 108 -199 372 147 285 -2 83 288 303 417 596
3621 596 556 657 647 592 440 467 611 916 821 517 744 223 448 447 337 344 545 236 -1 -8 -293 -174 -340 86
3645 86 -520 59 -13 -311 -242 -563 -617 -226 -586 -453 -335 -307 -345 -589 -378 -612 -832 -475 -535 -613 -466 -151 -323
3668 -323 -12 -339 -100 59 -457 -127 -139 -365 -2 391 -18 137 286 133 112 510 104 626 401 123 664
3689 664 840 324 142 459 574 229 651 383 424 420 343 259 431 516 89 24 -2 -99 -230 -52 -267 -143 -445
3712 -445 -137 -345 -254 -514 -477 -428 -351 -614 -550 -761 -697 -404 -674 -542 -700 -316 -160 -476 -497 -387 -460 -571 66
3735F6l76o2J44l53M07M94l99J09m2M09j36j5J75J58M3R8m76J05L96j71j30O1
3757E05j44M57j69j14o4M9k92q2J1M22k62k42K31j47m14J86M1k3k34O7p3mN9j98
3781d34j03j13J54r6J17NlQr9O1k98L81n7l3J99o6K07N3k88qK77K06j2q1O47l42
3807B82J97r4J02j55j35K16j87L14K74o84M31L00k45l14M6j99R4J57p0l1M60n82
3829A77k15K80k7m85K80j08k29J86k82J57K42k09k95L01k70j20K85j45l66N9J59
3850f25K8J9J45l03L59j76K4K94k95K48j77J19M52j67O6m9L32l93J26j70M70P7
3872D04J52m0k28M57r6Q8l26R4J79M6k88J69R1Pk55Q8J6l19K9R0o3j84j0j33o1
3897i3J47k88L95o36M34Q6l03j63J65Rr9J95k73J54l33M80m61L44o37J62M63j61
$$ plain form
3735 66 -310 -372 -228 -581 -174 320 -79 30 -12 397 261 246 421 579 622 720 244 349 745 574 444 505
3757 505 361 818 649 535 471 520 228 146 157 579 317 75 306 159 -255 -69 -28 -51 -285 -218 -291 -295 -236 -434
3781 -434 -537 -650 -496 -592 -475 -470 -473 -465 -564 -503 -801 -420 -477 -510 -311 -377 -170 -117 -405 -413 -136 70 58 -23 624 282
3807 282 479 385 487 332 197 413 226 540 814 130 561 861 616 302 348 149 243 400 330 299 759 177
3829 177 -38 242 215 -270 10 -98 -327 -141 -423 -266 -24 -233 -528 -227 -497 -617 -332 -477 -843 -784 -625
3850 -625 -597 -578 -433 -736 -377 -553 -529 -235 -530 -282 -459 -340 112 -55 11 -38 294 -99 27 -143 327 404
3872 404 556 516 288 745 649 737 411 505 684 730 442 611 702 709 454 542 558 239 268 358 295 111 101 -32 -93
3897 -93 54 -234 161 -475 -41 45 -258 -421 -256 -247 -346 -151 -424 -270 -603 -123 -584 -240 -877 -715 -252 -413
3919d13J12K16k89j57J72j39K29j56L34K17j51L73m51P3K01K3m44M03k22J65J74
3940B70m6J64m3M71m07l6J38l4L6j47P1k50J05j26J0L25l35J48j39j63OK09m3
3963A84k06J09m23MJ49J06k84K34k03k2k32N5O2n5k8P7j57L6LL84k56K33L7l37
3987e30L48l44N10j80K01m1j23M13q5j22J2L57n85O71J7k92j31L29j31K74k34
4008C34K75n0L0N1L40n21j15K16L3q2l72J53m02K88J2R2j4j5ol05j80k27L71l76
4032d70L71M4n24J71l36L26k18P0j20N02k36K6K3R2l71J25L02j96J69M1r5nK22
4055h7j47l1L3N25O6j56l11k4M52q3J28k37L03J30l86o9K73r6J77L03j64j11K64
4078G52q1j61M4k35n1K05j58O7m31K40k24K14l79K20l5J32m66nm7J07J72k27R5
$$ plain form
3919 -413 -301 -85 -374 -531 -359 -498 -269 -425 -91 126 -25 348 -103 -30 171 194 -250 153 -69 96 270
3940 270 224 388 345 816 409 373 511 477 513 366 437 187 292 166 176 501 166 314 175 12 18 227 184
3963 184 -22 87 -336 -332 -183 -77 -361 -127 -330 -352 -584 -529 -467 -522 -550 -473 -630 -594 -591 -207 -463 -230 -193 -530
3987 -530 -182 -526 -16 -196 5 -36 -159 254 169 47 59 416 -169 502 519 227 96 425 294 568 334
4008 334 609 559 589 640 980 459 344 560 593 511 139 292 -110 178 190 282 268 253 247 -58 -238 -465 -94 -470
4032 -470 -99 -55 -579 -408 -744 -418 -636 -566 -686 -184 -420 -394 -371 -279 -650 -525 -223 -419 -250 -209 -304 -309 -87
4055 -87 -234 -265 -232 293 359 203 -108 -132 320 237 365 128 431 561 175 106 379 283 460 763 599 488 752
4078 752 671 510 554 319 268 473 315 382 -49 191 -33 181 -198 22 -13 119 -347 -352 -399 -292 -120 -347 -252
4101b52l1j30N4k21j23L10R4j81J80K23k91J45n00N1M07J14Q9K02M3j82l40M6
4123b93J64L02j35n1K28j87K66K78R8l06L08m60K65m2K9k28J32L61k34Nn17K71
4145B54M7j91O0j91N4l9K10J67o31L25k86N6L1M4j19k06K09p4kj13L22m86J19
4168d40L01j03j79k6J02O6Rp9J26q7q1nM56L6k83M18k75m8Pk1K32N1j19k34L68
4193A92J68l16N6L33L0J95k74k46J12q1K11L7J53J17m00j14N16n21L71m37JQ2
4215A85nk83J01K18n31L65j70J60l36q4J98j93J71l06K94m7J3j44p3o8L58l40
4237e17l25Q03m90J97k10J66j54L28Q8m5k15K26J36j94J05J92l89K26J80J70m1
4258B37J18J9j32l5j89O04k51l09K10m9J32p3l7J60k98jK53k74j9M18k64l85J82
$$ plain form
4101 -252 -283 -413 -359 -580 -703 -393 -299 -480 -300 -77 -368 -223 -723 -672 -265 -151 -62 140 183 1 -339 -293
4123 -293 -129 173 38 -13 215 28 294 572 670 364 672 212 477 435 464 236 368 729 495 500 -17 254
4145 254 301 110 170 -21 33 -6 204 371 -260 65 -221 -165 -134 -90 -209 -415 -206 -280 -282 -395 -73 -559 -440
4168 -440 -139 -242 -421 -447 -345 -279 -270 -349 -223 -310 -391 -396 60 96 -187 231 -44 -92 -85 -106 126 177 58 -176 192
4193 192 360 44 100 433 463 658 384 138 250 169 380 417 570 687 287 173 689 168 539 102 103 185
4215 185 180 -103 -2 216 -315 50 -120 40 -296 -380 -182 -375 -204 -510 -216 -263 -250 -394 -467 -535 -177 -517
4237 -517 -842 -39 -529 -332 -542 -376 -530 -202 -114 -159 -374 -148 -12 -206 -101 91 -298 -72 108 278 237
4258 237 355 374 242 207 18 622 371 62 272 223 355 282 245 405 107 106 359 85 66 484 220 -165 17
4281A7P2J74m63K92R8k65j83J26K45n44J04M2q0k32J94j64M7Q6l09J82k16K83
4303d94K00p4OL7L41m96K64J45l81R1J14L84k3l32J79K03J53j06j52P0J22k08
4325D3L35k24L00r4q9j09J11L0j95K42J10Q1N2o0n82o9M52n68M29L6m0k24L3k45
4349b45J69J67o81M59l0j58l06P08m28j48L19j22k34L9N6m5M30l8m23j92M50J52
4371a01j76j61L42k74kL23p1K53r8K26l6k06J32M01k19k80K54O0m5m6J8K7p5K80
4395E26k13j34K3J89l36K56J09m38O4j10N22j64l78p7N7n3J60k21J77M9j66K8
4417a30j77j18j59M62O4k31j35l2J08j29lK67k21J08K28n59O48m36L78J34j09
4438d2J8J7k63M29m5j1K58l06K40r1J28M3l50M5j67L80m9K87J26j81q3n32P98
$$ plain form
4281 17 89 263 -200 92 190 -75 -258 -132 113 -431 -327 -285 -365 -597 -403 -567 -520 -434 -743 -561 -777 -494
4303 -494 -294 -368 -362 -325 16 -480 -216 -71 -452 -361 -247 137 114 -218 -39 164 317 211 59 129 251 43
4325 43 378 154 454 360 271 162 273 303 108 350 460 541 593 533 -49 -118 334 -234 195 231 191 -33 0 -245
4349 -245 -76 91 -590 -131 -161 -319 -625 83 -345 -493 -174 -296 -530 -491 -435 -480 -50 -88 -511 -703 -253 -101
4371 -101 -277 -438 -96 -370 -372 -49 -120 133 35 261 225 19 151 552 333 53 307 367 322 276 294 321 246 526
4395 526 313 179 202 391 55 311 420 -18 46 -64 458 294 -84 -161 -104 -157 3 -218 -41 8 -158 -130
4417 -130 -307 -425 -584 -122 -58 -289 -424 -456 -348 -477 -480 -213 -434 -326 -98 -657 -9 -445 -67 67 -42
4438 -42 -24 -7 -270 159 114 103 361 55 295 204 332 375 25 70 -97 283 234 521 647 466 383 -149 649
4461F49l2k75j95N7K0j69L06k92k2J51k93L50m99N34l64O2k2p5Nl89J79K29n9
4484a44j99J76j83l06L43j24p7J55j32J61k1r3L05P0l04K48j87M72l32L96l14
4505i0M04m51J1K44oo5oL00j8k08K94l48j3L21J11J9j23j36K47j8o5K87o09J67
4529B49o0K35k45o4J55k62K15j6L7n5k44R3j85O7j48K29l46J13j41Q5J25q1J43
4552a01j6k83J60m78K57Q0J95l11K27K04j36j62j00L21K2m4n5j46M06k32M57j54
4574A11r2L61n65K9M31l9J13n16N02J19P6j99k08J06K56l29k4J00j22K27n0O0
4596C47q9J42k23j0K9m0l84L63k36j87L96r0qJ03n80K29J27j04O8m1j65J53j37
4619c37j1k50L37k26P5J27L00N3j20o4j23j51K72j97J55M69m45J51j0J15j39J79
$$ plain form
4461 649 617 342 147 204 224 55 361 69 47 198 -95 255 -244 290 -74 -12 -34 -109 -104 -493 -314 -85 -144
4484 -144 -343 -167 -350 -656 -313 -437 -514 -359 -491 -330 -351 -444 -139 -69 -373 -125 -312 160 -172 224 -90
4505 -90 314 -137 -126 118 112 47 41 341 323 115 409 61 48 369 480 499 376 240 487 469 404 691 82 249
4529 249 189 424 179 115 270 8 223 207 244 189 -55 38 -147 -80 -228 1 -345 -232 -373 -288 -163 -244 -101
4552 -101 -117 -400 -240 -718 -461 -381 -186 -497 -270 -66 -202 -364 -464 -143 -121 -165 -220 -366 40 -192 265 111
4574 111 19 380 -185 -156 275 236 349 -167 335 454 530 331 123 229 485 156 132 232 110 337 287 347
4596 347 258 400 177 167 196 156 -228 135 -101 -288 108 18 10 113 -467 -238 -111 -215 -147 -188 -353 -200 -337
4619 -337 -348 -598 -261 -487 -412 -285 15 68 -52 -116 -239 -390 -118 -315 -160 309 -136 15 5 120 -19 160
4641A60r8J02lp8JL24r3K45p3j66N7l89K25l5k46J57j55L99Q4m12j9M9L3O7j76
4666d0jj22J97j16j96K56l67K63Q5j92J23M2J44j98k83j35O9L33r8m3J51J3o1
4689a76k67J57jk5L74k65J67J95J40j8l15M41m00j88O60j23k16K02j19KJ50k10
4711A65O56l45m33Q2L11k67Q9J01L6l06j45J56J42k33L70m27K1J94j1l27j43L04
4733a0k25M4J09L84m82n6j44K90N9L1j2j11R1m06Q7J36M01j2m63J58k50J77J78
4756b6K17j05J12Kj41k75K14o2J13P1k28R0N58m61K75j17M7k15N5j81K76K06j94
4779B31rl9J19l95O18l73K0k70L10l31N01j88l99K2M05n81N33k08j71K90l20J59
4801g6k36l1K99K2k22k4J06J70l24L25j55R7O7l27q8m6K93j33l59M12J67RL0J16
$$ plain form
4641 160 62 164 161 83 84 408 315 560 487 321 378 -11 214 179 -67 90 -65 334 418 6 -13 36 69 136 -40
4666 -40 -41 -163 34 -82 -278 -22 -389 -126 -41 -233 -110 -68 76 -122 -405 -540 -471 -138 -236 -279 -128 -115 -176
4689 -176 -443 -286 -287 -312 62 -203 -36 159 299 281 -34 407 7 -181 479 356 140 342 223 225 375 165
4711 165 821 476 43 125 436 169 258 359 395 89 -56 100 242 9 379 -48 -27 167 156 -171 -314 -10
4733 -10 -235 -191 -82 302 -180 -236 -380 -90 -31 0 -12 -123 -32 -438 -351 -215 186 174 -289 -131 -381 -204 -26
4756 -26 191 86 198 200 59 -216 -2 -64 49 120 -108 -18 540 79 354 237 284 69 124 -57 219 425 231
4779 231 222 183 302 -93 525 152 172 -98 212 -119 382 194 -205 -183 222 -359 174 -34 -205 85 -235 -76
4801 -76 -312 -343 -44 -22 -244 -268 -162 8 -316 9 -146 -49 18 -309 -397 -443 -150 -283 -642 -230 -63 -54 -24 92
4825I2j95L48L4m64K97j00K76k90j68J46j4N27j31n14N43p8r8j02J60K58o3j40
4847C24J74o0l45J94N0j06l19J7J52j7k15k76K61M0j36J63L05n00K44l67L18l67
4869d66J9L02L92k92l39L62J12j68m23O94m81K25k17K25M13k33l27K5K15j76K40
4890A02ok65J06J14K24j55K34j59J66k29J86l2K05l42m8K81k17j48L82J36o18
4911h3n0J88K25m1J51m54J35j71K29j93J16qK37j14j63P0o1Qk22n0J10k0L7k52
4935c76J00N1J30n1l34KK96k4j08K88l54O09k87K83k17J67k70k28o5N26j66L24
4957B96N5j74J92j56Q4n09K27K23j22J05K85j28N8l96L3L48l02j86L45j22j39
4978A7K60l89K71k77K17m75K89J43r7r3P2o0Pk72M34pl4J18k61p5j9K86j37L3
$$ plain form
4825 92 -103 245 279 -185 112 12 288 -2 -170 -24 -38 489 358 -156 387 309 211 109 269 527 464 324
4847 324 498 438 93 287 337 231 -88 -71 81 64 -151 -427 -166 -126 -262 -99 206 -294 -50 -417 -99 -466
4869 -466 -447 -145 247 -45 -384 -22 90 -78 -501 193 -288 -63 -280 -55 358 125 -202 -177 38 -138 102
4890 102 96 -169 -63 51 275 120 354 195 361 132 318 286 491 149 101 382 165 17 399 535 -83
4911 -83 -133 55 280 239 390 -64 71 -100 129 -64 52 44 281 167 4 74 13 21 -201 -251 -141 -161 -124 -376
4935 -376 -276 -225 -95 -146 -480 -478 -182 -206 -314 -26 -380 229 -58 225 8 175 -95 -323 -388 138 -28 296
4957 296 351 177 369 213 297 -212 15 238 116 221 506 378 436 40 73 421 119 -67 278 156 17
4978 17 277 -112 159 -118 99 -376 -87 56 -41 -134 -62 -122 -115 -387 47 40 6 124 -137 -212 -231 55 -82 -49
5002d9r0l67K45Q8j12k33O81l12K9j30o0N60m32J54J80Q1j55J97r6K84l44J13
5024B32q9N17l35j43l57L76J70Q3J23j55l07j1L44k24P0j35j72K96J71l97j14
5045e7n9L29n35J62K27K22l73j15J50J71m58K21m3m9K26k90L95o49L33l4m85O43
5067f8j98J6k46L84k41Q1J50j9m2K73l0J15j57k06J65J31l18kK97qJ40l41K49
5090A25O8l64N32p3m04O06k02J99k89k52K12j53K48N6O3m06r1O56m98J22l44j60
5112c49K63j36N28n40n5M52j22k0qn13J56J31L89l77M63k59n76J58L29J43l42
5133b85o2K03j5r5K51l24L8j93O95j97j02n4M2M20l33j4K31L7o1J2k39J77K93
5156D25j13j42o5L16L10k61n35N85j45k41k7J00j83M8J15M6j88qN6L1l85j53L82
$$ plain form
5002 -49 -139 -506 -261 -173 -285 -518 163 -149 -120 -250 -310 250 -182 -28 152 233 78 275 179 463 119 232
5024 232 143 660 325 182 -175 201 371 454 577 422 115 104 448 224 294 159 -13 283 454 57 -57
5045 -57 -116 213 -322 -160 67 289 -84 -199 -49 122 -336 -115 -158 -207 19 -271 124 -525 -192 -226 -711 -68
5067 -68 -266 -250 -496 -112 -353 -272 -122 -141 -183 90 60 175 18 -188 -23 108 -210 -212 85 77 217 -124 125
5090 125 193 -171 361 288 -116 490 288 487 198 -54 158 5 253 309 372 -34 -125 531 33 155 -189 -349
5112 -349 -86 -222 306 -234 -289 163 41 21 13 -500 -344 -213 176 -201 262 3 -573 -415 -86 57 -285
5133 -285 -347 -144 -159 -254 -3 -327 -289 -482 213 16 -86 -140 -98 322 -11 -25 206 243 182 194 -45 132 425
5156 425 312 170 105 421 731 470 -65 520 375 134 107 207 24 72 187 233 45 37 93 124 -261 -414 -32
5179c2j40K22l68L66j02m4K0K7J71l78n9J07J11r7j88o2M14j60M53m68k2j24L4
5202c19L57k05k2p0N6N16k63k89L02J38l39J29K03j36K21k1P5j33k4K97k55K50
5224D68k88J91j94j36J74l29J97M76n14j38p2p4K64n1j19M31k27j84L01j92k56
5245b72J3J14P9n35P37k89k56j13M84k85n2K95n04J65K84k62J59R6j00J30j07
5266b19N3q0L35PJ09j11j50J77q2J82J00J23k8l58K01J91k89K79l59L4j09J57
5288A63P6k89J75m99L24M55j85J17n00J67J51n4k9k85M56k9l74P1OQ5j91k4l7
5311b50P9N01o11O2N9L0J33m76Q1L34MO1j47N3k3j13N0k0J05m2J74J88J66m54
5335e6j86N07j2l02O5J59k96P2L4R4K25j89k91K33J71J2r9j34j79K29J69j21k49
$$ plain form
5179 -32 -172 50 -318 48 -54 -98 -78 -51 120 -258 -317 -210 -99 -196 -384 -446 -32 -192 261 -207 -229 -353 -319
5202 -319 38 -167 -189 -259 -203 313 50 -239 63 201 -138 -9 194 58 279 258 333 200 176 473 218 468
5224 468 180 371 177 41 215 -114 83 559 45 -93 -165 -239 25 -26 -145 286 59 -125 176 -16 -272
5245 -272 -259 -145 -66 -601 136 -153 -409 -522 -38 -323 -375 -80 -584 -419 -135 -397 -238 -142 -242 -112 -219
5266 -219 -166 -246 89 96 205 94 -56 121 39 221 321 444 416 58 259 450 161 440 81 115 6 163
5288 163 239 -50 125 -374 -50 405 220 337 -163 4 155 101 72 -213 243 214 -160 -89 -83 2 -189 -213 -250
5311 -250 -171 330 -281 -219 -160 -130 3 -473 -392 -58 -54 7 -140 -87 -110 -223 -173 -193 -88 -130 44 232 398 -56
5335 -56 -242 265 253 -49 16 175 -121 -49 -15 79 304 115 -176 57 228 240 141 7 -172 57 226 105 -144
5358a44N16l28J20p3j90O4J18J41k68j62M86rk81K8l81J76k8K23n3J7l26m0M31
5381C7Kl48j74N40j18J56k40K32l76n0J89J99m61J78j03M99l04k7n8o4K59J10
5403G8J31m07N08m78K86o4M23k53n52K59J37M23q49Q53m32l45O81K50o72j43J12
5424e4K02j76j7JK65l73j28O38j32p0j76K36m82K69k01L79j46j39N2R3O4j68m5
5447a08l46R5K99m05K67J98N9l67L49m5k51K12m6q8n3K34j41K30k51M3K30J83
5469B98k74Po1OQ1P8J00K48l16n36M55j40Q8N9n6j62R0J70r9o1P8K5O8J91m68
5494a31N84k09k14J90q62K72J43K38k3J74L2m21K2R9j93J54j93J65J83j9m65O21
5516A47j96j04J08J42k69r4L26J24m50J96P3L88j75J23j25j43J34J1K09p8k27
$$ plain form
5358 -144 372 44 164 91 -99 -35 83 224 -44 -206 280 271 -10 18 -363 -187 -215 8 -45 -28 -354 -394 37
5381 37 39 -309 -483 57 -61 95 -145 87 -289 -339 -150 49 -412 -234 -337 162 -142 -169 -227 -291 -32 78
5403 78 209 -198 310 -168 118 54 477 224 -328 -69 68 491 -358 495 63 -282 399 649 -23 -166 -54
5424 -54 148 -28 -45 -44 221 -152 -280 358 226 156 -20 216 -266 3 -198 181 35 -104 -52 41 105 -63 -108
5447 -108 -454 -359 -60 -465 -198 0 59 -308 41 -4 -255 -43 -89 -177 -230 4 -137 93 -158 -115 115 298
5469 298 24 31 -30 -24 57 135 235 483 167 -369 86 -54 34 93 37 -125 -35 135 36 -25 53 78 146 337 -131
5494 -131 453 244 30 220 -642 -370 -227 11 -12 162 194 -227 -205 -106 -299 -145 -338 -173 10 -9 -474 147
5516 147 -49 -153 -45 97 -172 -266 60 184 -266 -70 3 391 216 339 214 71 205 216 425 347 120
5537A20k71M8M97l98J96mj03R9j58J02L6j90K27J5j83R8j55L35j77l88M43M2k18
5560A3J81l49K59J2J24k69j00j04O9J18r7j4P4m0j1j55L03k28J97j58j42K76k70
5583c11M6N26m17N24l55j44J66j78Q9K48k29L87k11j86K98j34O5k3j25j11L92
5604C17n44P32l07M1K75p60M11J7j95j6M0L14m78J79j9J02l88P8M15l72N3q3k00
5627c88J76j2L18J04o91M94j26k4l1l70K75R1N0m44O49%k46j38L21n82L53J47
5649g4L7K72k7l99K01j04Lj00M87n51P9J45J6k76Q96n14p7l0J87o4K49n6l02P3
5673G1p8O49o23j69K83J44M8l4k72K33k07J2J09m04J28K31j66j24J94J55k75N2
5695d3J84n03R9K5K44k94l8L24m22J44N75n42J20Q5J5k31K0K14k4j65K11j73P5
$$ plain form
5537 120 -151 -103 394 -4 192 188 85 184 26 128 164 -26 201 216 33 131 -24 311 134 -254 189 231 13
5560 13 194 -155 104 116 240 -29 -129 -233 -164 -46 -143 -157 -83 -123 -134 -289 14 -214 -17 -175 -317 -41 -311
5583 -311 -265 261 -156 368 13 -131 35 -143 -54 194 -35 352 141 -45 253 119 184 161 36 -75 317
5604 317 -227 505 198 239 514 -246 165 182 -13 -29 11 325 -153 26 7 109 -279 -201 214 -158 -105 -188 -388
5627 -388 -212 -224 94 198 -493 1 -125 -149 -180 -550 -275 -184 -134 -578 71 71 -175 -313 8 -574 -221 -74
5649 -74 -37 235 208 -191 10 -94 -91 -191 296 -255 -176 -31 -15 -291 605 91 14 -16 171 107 356 300 -2 71
5673 71 -7 642 19 -150 133 277 325 291 19 252 45 57 166 -238 -110 121 -45 -169 25 180 -95 -43
5695 -43 141 -362 -263 -238 6 -288 -326 -2 -424 -280 295 -247 -127 -42 -27 -258 -238 -24 -48 -213 -2 -175 -100
5718a00RK00P4l22L39J07k51J64m76L55o1j38J07j4K45j98M26k34k05q4K10K86
5740D39l20M9J96m5n34J87m2O7j38J72L50l73l12J79O5L00o16K32Q6k67N16n60
5762c69K10R5j86l0k21P35o91j11L27R8k20l09M98R7K39m93M30J88l67k78J29
5783b29K45j44P2j21K93J59%l02L04j71L07k67l1J23j61K5M6J0l9K05k40L26m11
5806aj18O31m52j30k52N1L11K33o66M90k50j04J47j67M8o3K8J96J74j3j68l18
5828c93M51ln39L04J72j65j26L18l74O6M60q9j99J40k1l2J63p9r3J33l33K84l43
5851b98L63L20L8j02j33J2p3K14m13L22k97J94o3j80Q5L5k97K70j12K13j56j40
5873a98L37j43J40j31J82l78m2J15L0q5PK53o6j56K4m03M68M0m2o8K34k22K77
$$ plain form
5718 -100 -91 109 183 -139 200 307 56 220 -256 99 38 -100 7 -7 238 40 466 232 27 -57 153 439
5740 439 119 168 364 319 -215 -28 -70 -3 -141 31 381 8 -304 -125 -60 240 -376 -144 -58 -325 191 -369
5762 -369 -159 -64 -250 -280 -501 234 -457 -568 -241 -143 -363 -672 -174 -77 162 -331 99 287 -80 -358 -229
5783 -229 16 -128 -56 -177 116 275 275 -27 277 106 413 146 115 238 77 102 148 158 119 324 84 410 -1
5806 -1 -119 512 60 -70 -322 -271 40 273 -393 97 -153 -257 -110 -277 -229 -292 -264 -68 106 93 -75 -393
5828 -393 58 55 -484 -180 -8 -173 -299 19 -355 -289 171 82 -117 23 2 -30 133 54 -39 94 -239 45 -298
5851 -298 65 385 423 321 188 200 127 341 -72 250 -47 147 84 -96 -11 24 -273 -3 -115 98 -58 -198
5873 -198 139 -4 136 5 187 -191 -233 -118 -88 -173 -166 87 21 -135 -111 -514 -46 -6 -48 -116 118 -104 173
5896A73l42Q4J85o33M93j46J4O1N1K07m28K41J60j68r9q7K97o1K85l68L74k18
5918G5Q5Q9k03L1j04J95J33k52L6L1N8o5k08K47l80O76m77j54L16N5K09o26J35
5941i8M49J07p55K7K62K89k67Q9NKm3j02J43k93L0p2J54k0j14J8Lj9K25m9j6j81
5967b26N35k50m31M68J03j10J36l23K34P7m11O3K92k03J56o8J12n2j4q0L34j24
5989B18K3j91k04O70l55j39j16K60k43J99j11R8j62J22j90J08j4J92J13n17J22
6010a17L33o20K42K61j05k03L31m26L99K6m90L39Q6j13J24r1k35J54j97Q2Q0j38
6032b78J95k24M66k7j78J39J08j36o5K39j90K97m26J34J92j56J23j43j0p7J09
6053I2p4J32J57m56L27m06K60K07l81K27p4j0k6j69J44m7k15J72K72l35M2J84
$$ plain form
5896 173 -169 -85 100 -533 -40 -186 -172 -111 -60 147 -281 -40 120 -48 -147 -234 63 2 287 -81 293 75
5918 75 160 249 46 77 -27 168 301 49 85 116 174 109 -99 148 -232 444 -33 -187 129 184 393 -233 -98
5941 -98 351 458 -297 -270 -8 281 14 103 108 110 67 -35 108 -185 -155 -227 -73 -93 -207 -189 -186 -205 20 -29 -45 -226
5967 -226 309 59 -372 96 199 89 225 -98 136 213 -198 -135 157 -46 110 42 154 102 88 8 342 218
5989 218 241 50 -154 516 161 22 -94 166 -77 122 11 109 -53 69 -121 -13 -27 165 278 -239 -117
6010 -117 216 -404 -162 99 -6 -209 122 -304 95 121 -369 -30 56 -57 67 -24 -259 -105 -302 -220 -140 -278
6032 -278 -83 -307 159 132 -46 93 201 65 0 239 49 346 -80 54 246 90 213 70 60 -17 92
6053 92 18 150 307 -149 178 -228 32 239 -142 85 11 1 -25 -194 -50 -97 -312 -140 132 -203 -161 23
6075B3J36m16L97l92K14J45m63O7K07k56j9K97J32m05K24k90L33j77l71M73J20
6096b1K65j71k57J43q1o9L1L64m73L59J82J81k91L6o6M42m71L5J20k72N8K16j45
6119A15J50K62n47R3J2m1j51J62j34K38k4j95J94k86L04m38J87K34k33L31n56
6140c23K86j89p4j36L32n7j57M21k91J24k8J53K82m75P2M3K14k21p4K46R1R9m41
6163a03j28K26M29o08N63l13J32k68l7L89o20M03K42K5l38L74LJ41n35K25m64
6184b62L02L20n26L53Q7r8R2n97K9J89j52K55K43n29L44Pk73L33k44P6j52J09
6206i4j50m4Q1M84m49J19J4j48K32k99M6J7J18J6n7L51k3Mo9k26k20M74M11o88
6230a00L65k23j56j42M97Ml03J30j17L8j30m6Q9R3J15N0j70J07r7k12J79J77J15
$$ plain form
6075 23 159 -257 140 -252 -38 107 -356 -289 -82 -338 -357 -60 72 -333 -109 -399 -66 -243 -614 -141 -21
6096 -21 244 73 -184 -41 -122 -191 -160 204 -269 90 272 453 162 198 132 574 103 138 258 -14 44 260 115
6119 115 265 527 -20 73 85 44 -107 55 -79 159 135 -60 134 -152 152 -286 -99 135 -98 233 -323
6140 -323 -37 -226 -300 -436 -104 -161 -318 103 -188 -64 -92 61 343 -132 -60 -17 197 -24 -98 148 239 338 -103
6163 -103 -231 -5 424 -184 379 66 198 -70 -107 282 -338 65 307 332 -6 368 371 512 -23 202 -262
6184 -262 40 360 -166 187 274 176 268 -329 -300 -111 -263 -8 235 -294 50 57 -216 117 -127 -51 -203 -94
6206 -94 -244 -288 -207 277 -172 -53 -39 -187 45 -254 -208 -191 -73 -57 -114 237 214 218 149 -77 -297 177 588 -100
6230 -100 265 42 -114 -256 241 245 -58 72 -45 -7 -137 -183 -94 -1 114 164 -6 101 4 -208 -29 148 263
6253B63m27K54J7q0k18J93n1J36K3p0O5j94R6k44L28j50M4j36k25m2K24k91K86
6276a99j00J95l7j66K82J73q6L1k23j03K53J14l51q6J04L14j20r9M54l57K68J30
6298C91p3m89K61L10l18j36K51m5J60J55l03r4l9j98M67j14n0p3j59L80l84M48
6320C48j22M6l71K5j72N5K74k50K25l1J72j88oJ8K8o4j76J67K38Q2k77k54M9K11
6344B7M3R1l41j98N55k23Q0K49k23p6k32J56K29j29j45L95j08j21J37j9j28K31
6366B50j88k65L18N8J26l8O0m03M09k40k76K35J89j40k54M91K50m19L7Jm05K23
6388A9K7J98k2l5l64M0P9l26J50J19J08l13K37j07q9L47o4k07j69J46r2J38j0
6411a90k37O56m05J77P3j52J10k47N40n5m61L45j12P7l97K91L58O0j79J25k54
$$ plain form
6253 263 -164 90 107 27 -191 2 -49 87 110 40 105 -89 7 -237 91 -59 -15 -151 -376 -418 -194 -485 -199
6276 -199 -299 -104 -141 -307 -25 148 62 93 -130 -233 20 134 -217 -303 -199 115 -5 -104 350 -7 261 391
6298 391 318 -171 90 400 82 -54 197 152 312 467 164 70 31 -167 300 186 136 63 -96 284 -100 348
6320 348 226 272 -99 -74 -246 -191 83 -167 58 27 199 11 5 23 51 -13 -189 -22 216 298 21 -233 -184 27
6344 27 70 161 -180 -378 177 -46 34 283 60 -16 -248 -92 137 8 -137 258 150 29 166 147 19 250
6366 250 62 -203 115 173 299 261 321 -82 327 87 -189 46 235 95 -159 332 582 163 200 201 -204 19
6388 19 46 244 222 187 -177 -137 -58 -384 -234 -115 -7 -320 -83 -190 -279 68 4 -203 -372 -226 -318 -180 -190
6411 -190 -427 229 -176 1 74 -78 32 -215 325 270 -191 154 42 119 -278 13 371 431 252 377 123
6432A23K28k68oq1L27k06j69R0j16K29J01k48K46j93J09j21j38K7m2L90n75L70
6454G7r9P0k16R1L48k31l12L5L76m14K27l33N25m54J31k90M96j19J72L13m48k54
6476c09M34q4l04L44k2j55L8j80J90K75P5r3J25l29n3J22m6J77j61L8M4J59j06
6499A79k97J42L15n3L2k69J33Mr5M1M7k49N06k94j40j48NK60J5m98M51q0k49K29
6523a3l87M54k7L39l33r7J43j62k02M50l54L11k80q8p5J18R9Q0k48M31j76k74
6545b91R4M57j75k8N1O6l1j38M63R4l95k7L2j15M9l21K73k8j45K75J23n47L98
6568A34Mj25K55l15J40m9j80J89m4j16K27m59M42LJ63l38pJ17k25K35k51L24o8
6591E6k60M18l44j57JK38j58J38K87j33o1j81J83J55j13m33O00k85k37O14j71
$$ plain form
6432 123 351 83 77 -4 323 117 -52 38 -78 151 252 4 250 57 166 45 -93 -66 -108 282 -293 77
6454 77 -22 48 -168 -77 271 40 -272 -237 139 -275 -48 -381 144 -310 -179 -469 27 -92 80 393 -55 -309
6476 -309 125 41 -263 81 59 -96 -58 -238 -48 227 302 209 334 5 -48 74 28 205 44 82 126 285 179
6499 179 -118 24 339 286 318 49 182 186 91 132 179 -70 436 142 2 -146 -141 119 134 -364 87 7 -242 -13
6523 -13 -400 54 27 366 33 -64 79 -83 -285 165 -189 122 -158 -246 -321 -203 -104 -24 -272 159 -17 -291
6545 -291 -197 260 85 57 108 174 143 5 468 562 167 140 172 57 106 -215 58 30 -115 160 283 -264 134
6568 134 138 13 268 -47 93 44 -136 53 9 -107 120 -339 103 106 269 -69 -76 41 -184 51 -200 124 56
6591 56 -204 214 -130 -287 -286 -48 -206 -68 219 86 25 -156 27 182 69 -364 236 -49 -286 328 157
6612A57m1J48k98K16l80K30K91l68K71k42L58j16n7L6l75K22Kj15J42j53M9J64
6634A41lo4Q9o5k60J53J4o7O5j24K36m4q0Oo0J71k24m2J83r6N1k71K36J7m33J15
6660c56K86k24K76k24J94l92R7L92r3K5j0l12M41j62J18l08O37j96l3K31m32J80
6682A35L4J39j27r7j7P0rK15l79K28j65J66Pj10O3m4j20K76l93J78p7L25k27J16
6706A87p0l16j8j20R0n4M39l68L45J68m40j82N33n13L33J05Q8l81k6p7N07o9k65
6729a04n0j7K24m7Qk17K54k95K90L6l70K97k26K77L13Q8l78k4n8K3j32K74J52
6752C18k90K07l52o1K18K19j61J46k78k4K80n91K26J09K6K44k21L06l08k46N46
6773C13j98O0m17J09J01J18k50j17n0M21k01M3J01J0J00m6j33m48M67q5q8m7m6
$$ plain form
6612 157 116 264 -34 182 -198 32 323 -45 226 -16 342 226 169 205 -170 52 54 -61 81 -72 -23 141
6634 141 138 74 163 98 -162 -9 5 -62 3 -121 115 71 -9 -3 -63 108 -116 -158 25 -71 -20 -291 -55 -38 -471 -356
6660 -356 -70 -294 -18 -242 -48 -440 -343 49 -44 -19 -29 -341 100 -62 56 -252 385 189 156 387 -45 135
6682 135 169 308 181 84 67 137 128 343 -36 192 27 193 200 90 153 109 -11 265 -128 50 -27 298 71 187
6706 187 117 -199 -217 -337 -247 -301 138 -230 115 283 -157 -339 194 -319 14 119 207 -174 -200 -277 230 161 -104
6729 -104 -154 -171 53 6 14 -203 51 -244 46 82 -288 9 -217 60 373 461 83 59 1 24 -108 166 318
6752 318 28 235 -117 -178 40 259 98 244 -34 -58 222 -369 -143 -34 -8 236 15 321 13 -233 313
6773 313 115 175 -242 -133 -32 86 -164 -281 -331 90 -111 -68 33 43 143 97 -36 -484 -17 -102 -190 -237 -283
6796b83M70k62K15r4M24m82K30m47p2K39O5J1j33J92K21J5j07j88j40K78q3K12
6818B81k86L22k54R6J17n31P73m66j51j47K29m4M1J10k5j4l92N52k04J48k31j27
6840b03K12M4j03n6K98j17k28J56k56K07l4o7r9L77j23q2Kl7K2%o6m2J83k40N93
6865C41l98l44L56R3Mp5J20J33R1j49j16k53M18k7k90k3J46J67k54J86J15K4p2
6888A93k39j02L15O2m16M46l42J99l52L08j25j27K93k15k37K24P7J37P8j71n2
6909d6j99R7R6k75L61k29J0L73l75lM25k07k45Q0M12l70J56k81j36J89k9K51J89
6932B44j92l91K27K58k55J27J76l35L73R1m73J83j32J95m6J97j62NK28k46j7J73
6954B28j94k8L83k71R6j04J0j11l5nJ74j59m6K72p12L70L46j30k52k23M69l50
$$ plain form
6796 -283 187 -75 140 46 470 -12 218 -229 -301 -62 3 14 -119 73 294 309 202 14 -126 152 69 281
6818 281 -5 317 63 159 276 -255 518 52 -99 -246 -17 -61 -20 90 65 51 -341 211 7 155 -76 -203
6840 -203 9 53 -50 -106 192 75 -153 3 -253 -46 -80 -147 -246 131 8 -74 -72 -109 -87 -87 -153 -195 -12 -252 341
6865 341 -57 -401 -45 48 52 -23 97 230 321 172 56 -197 221 194 -96 -119 27 194 -60 126 241 265 193
6888 193 -46 -148 167 229 -187 259 -83 116 -236 72 -53 -180 113 -102 -339 -115 -38 99 177 6 -46
6909 -46 -245 -148 -52 -327 34 -195 -185 188 -187 -190 235 28 -217 -137 275 -95 61 -220 -356 -167 -196 55 244
6932 244 52 -339 -112 146 -109 18 194 -141 232 323 -150 33 -99 96 50 247 85 90 318 72 55 228
6954 228 34 6 389 118 214 110 120 9 -26 -31 143 -16 -62 210 -502 -132 214 84 -168 -391 78 -272
6976b72L56J32l55k80J80K68kql07J92M9K3l37L39J06O1j51L13l93K88rj67J22
6999A48K9J34k0j40l01J0L79j07O8k23L48m32J48J19k08J63j53K45k53k2m0P2
7021c6J92k29Q5l70N13O9j17j95J21J28j48q4k29L72K27n50K55J37M7l04J04J7
7043EJ35k63j17o0J31Q8R1p8L02n5m43J63J76K94n92L53l46m0L18j31J03j91M56
7066B99k66j32K28n7p9K6P8K48j57kqj0m83O15m60oL43j22j4K32j59N8p1J12k09
7091DL5k19J41J0j81J10k03J69k8r9k7L40q4k48L23J31l5m40L47r4M1l07K16N
7115i3k7J70k7k9q9P5m4Q7j42q4O6j8J96N4k42M9K86l26j71J69L12j62J96k31
7139b5J54M05o42L44O4Q9k98j20O0q4O1l39L09N1k50J80PK46l73J49j33M99l39
$$ plain form
6976 -272 84 216 -139 -419 -239 29 27 19 -288 -96 -47 -24 -361 -22 84 145 -6 307 -86 202 193 26 148
6999 148 177 311 291 151 -150 -140 239 132 200 -23 325 -107 41 160 -48 115 -38 207 -46 -68 -108 -36
7021 -36 156 -73 12 -358 155 224 107 -88 33 161 13 -71 -300 72 299 -251 4 141 188 -116 -12 5
7043 5 140 -123 -240 -300 -169 -81 10 -68 234 179 -264 -101 75 369 -223 130 -216 -256 62 -69 34 -157 299
7066 299 33 -99 129 72 -7 19 97 345 188 186 178 168 -315 300 -160 -166 177 55 41 273 114 172 101 213 4
7091 4 39 -180 -39 -29 -210 -100 -303 -134 -162 -261 -288 52 -32 -280 43 174 139 -301 46 -48 -7 -314 -98 -93
7115 -93 -120 50 23 -6 -95 -20 -64 23 -119 -203 -137 -155 41 95 -147 -98 188 -138 -309 -140 172 10 206 -25
7139 -25 129 534 -108 236 300 389 91 -29 31 -53 8 -331 -22 29 -221 -41 -34 212 -161 -12 -145 354 15
7162A5m85M31J56l77R1M15l37j23J74j15kJ15O0R0j90J09j61Q8J36r5q6L8L89
7185C36k32q9m39O62k78o8J29M9l8K63K68l08k86l2M59m77K82J0k34J43r3M23
7207D50j48o8J98j81j92K20k82Q4J31o3l42K23K33j87J83l84K23l34K79k32m7
7228b36N23m37L7J28O5k07l94N34j6K22o30L15J04K8l02K29M67o81J89J11k66
7249b17L3L98k89R3q7l7J02p2L54k38J27m46L06L40l06K37J51l62J85m57%K89
7271A04j61J10J10j81k88K99L05Rj94q1j44J65L0j63J06j59q1m4K67j16m2k59
7293d08L96j71J87J70j62J72L5k71J64j24j70J12O0L25l81N7r4K5K88p7k64M57
7315C26m07J73j38J84m51P00n47K54j58O0L82n09M04k40J06m49K30Rj69K70K81
$$ plain form
7162 15 -470 -39 117 -260 -169 246 -91 -214 -40 -155 -157 -42 18 108 -82 27 -134 -46 90 -5 -91 -53 336
7185 336 104 15 -424 238 -40 -108 21 70 32 295 563 255 -31 -63 396 -81 201 211 -23 120 27 450
7207 450 302 234 432 251 59 279 -3 81 212 149 -193 30 263 76 259 -125 98 -236 43 -189 -236
7228 -236 287 -150 -113 15 80 -127 -521 13 -3 219 -411 -96 8 36 -266 -37 430 -251 -62 49 -217
7249 -217 -184 214 -75 18 -69 -106 -4 -76 278 40 167 -279 27 367 61 298 449 87 272 -185 -185 104
7271 104 -57 53 163 -18 -306 -7 298 307 113 32 -112 53 83 -80 26 -133 -214 -258 9 -107 -149 -408
7293 -408 -12 -183 4 174 12 184 219 -52 112 -12 -182 -70 -10 315 -66 -9 -103 -78 210 133 -131 326
7315 326 -81 92 -46 138 -313 387 -160 94 -64 -4 378 -131 273 33 139 -310 -80 -71 -240 30 311
7336C11l39k18L96l60k3L25k82K4p7J87J03J81n06K59p7l73N21q5j13L16j46j66
7358a42M43m74R9j8J78l63L61k76R1n6J19N6r8j08J67L18m44L76k22J26p1k33
7380a71K24q0P3J24j83L9K23Rj1K00k11j7J27k48j05J36j23K69k83m1O4M5J50
7403B10k08N5j84m2M71k98n5J38R7l28L30l12J9N1J13j98J90J6J8k23P3m9l1l75
7427e22O15J8r9k85K21p2J64j76J76M4k13L35n18J47j04M15k25L1L05j37j18K60
7449B62j40J67L1m62K89L02n21K27j49l19K63ql09N25j75K77J33o06K46q1O8q4
7471f4J0j46J40J16Q4k11jl1j44J33K82l78J07l7J14l9o5O0J04j98L79j20K9j67
7495d3k01J7M10M7k03R4J01o8j63j28J79J69l60r5L66l3Q8l45M17k65J17j31j3
$$ plain form
7336 311 -28 -246 150 -210 -233 92 -190 -166 -243 -56 47 228 -278 -19 -96 -469 52 -33 -146 170 24 -142
7358 -142 301 -173 -74 -92 86 -277 84 -192 -101 -157 -38 18 -80 -188 -21 297 -147 229 7 133 62 -171
7380 -171 53 -27 46 170 -13 26 249 258 247 447 236 219 346 98 -7 129 6 275 -8 -49 15 60 210
7403 210 2 57 -127 -169 302 4 -51 87 184 -144 186 -126 -107 -56 57 -141 49 65 83 -140 -67 -116 -147 -522
7427 -522 93 111 12 -273 -52 -124 40 -136 40 84 -129 206 -312 -165 -269 146 -79 -48 257 120 2 262
7449 262 122 289 320 -142 147 449 -72 155 6 -313 -50 -58 -367 158 -17 260 393 -213 33 -48 20 -64
7471 -64 -54 -200 -60 56 140 -71 -72 -103 -247 -114 168 -210 -103 -140 -26 -65 -130 -70 34 -164 215 95 124 -43
7495 -43 -244 -227 183 230 27 121 222 154 -9 -137 42 211 -149 -244 122 89 177 -168 249 -16 101 -30 -43
7518d3L9J40L11p89K94P1m52L95k32J08K58j44n1p2L32R9k06L6m5r9L1j78K26
7541B9J24j74Ol61O07j45j41k63M16L5L32o10K03k03l3J99p2Oj35L84l33N22j31
7564B62j65rj86J33J96R1j83j38l15L54r1kK16L1J0J2m7j84j15M89o61L56l05
7587b51P8K11r5M94p42M78m49N52Qo91N68r8l29J67Q1j56L89l8j05l24o6L86j3
7610E5M8j46j0k6Q8N5j73o8L30J5r0k71Q3J71m95M16J68J05j68J09m02K38j16
7633h4nJ26K9p9K26k61k3J52j3No8P2j84J05j50J86P0j75K70j39K27m52L98m57
7657b24M19l87J2j64M44j09k70M87j55J63m71K79j12M49q42L22j4P6P4q9Q7l2
7679e7p9L41o7k91M8j73M62n4j1j20J28j67J07J35n04O31l10j27L2J07o0k91P02
$$ plain form
7518 -43 -4 136 447 -342 -48 23 -429 -34 -266 -158 100 -44 -95 -167 165 264 58 94 49 -50 -19 -197 29
7541 29 153 -21 -15 -376 231 86 -55 -318 98 133 465 -145 58 -145 -178 21 -51 -45 -180 204 -129 393 262
7564 262 97 88 -98 35 231 322 139 1 -314 40 -51 -53 163 194 204 216 169 -15 -130 359 -302 54 -251
7587 -251 -173 38 -57 437 -305 173 -276 276 284 -407 161 63 -266 -99 -18 -174 215 177 72 -252 -318 68 55
7610 55 103 -43 -53 -79 9 64 -109 -177 153 168 78 -193 -110 61 -434 -18 150 255 87 196 -206 32 -84
7633 -84 -89 37 66 -13 213 -48 -71 81 68 73 5 77 -107 -2 -152 34 104 -71 199 60 287 -165 233 -224
7657 -224 195 -192 -180 -344 100 -9 -279 208 53 216 -255 24 -88 361 -481 -159 -173 -97 -23 -112 -25 -57
7679 -57 -136 205 138 -153 -105 -278 184 130 119 -1 127 -40 67 202 -302 329 19 -108 -76 31 -29 -320 382
7702C82n42N54m11J52m20M39K8o0L94k09O5l72K15j70K02l06N8R5j50J06p0R9
7724G9J8j15J57l32L08n06N85k92P3Rn08Q40l22j14m0K92L00o05L36l83L44M26
7746E50n81l26J41J95n8j49o4K34J61n4K7K6j59O6J1J19j51j57N11k56j44J87
7768A29J22k78LRJ79k59K04K11m47O27k15r5R5k86r9K05n6J8K93o90L99j7J15
7791A67J42j14j78k44N21m70J72L1K70l90M2o2M58l37l06K73k04L32L04m27J53
7812A33m48L54m44M71Q5p50K84P23n19K53L3j40K32k89K54n16L60k51K36j10o
7833e5J27J30O1k18n6j8L44n59L90j63O7k94L95R1m26L88k60j3m08K12K31NJ77
7856A48l53j08J7K98j04j12K44l24L64l65J91K92k99j65rL29k77J44j24O3J76
$$ plain form
7702 382 -160 394 -17 135 -285 154 182 122 516 307 372 0 215 45 247 -59 -1 94 -56 50 -20 79
7724 79 97 -18 139 -193 115 -391 194 -98 -25 -16 -524 316 -6 -120 -160 132 432 -173 163 -220 124 550
7746 550 -31 -357 -216 -21 -79 -228 -292 -58 103 49 76 102 -57 9 20 139 -12 -169 342 86 -58 129
7768 129 251 -27 -24 -15 164 -95 109 320 -127 500 285 190 285 -1 -100 105 49 67 360 -330 69 52 167
7791 167 309 195 17 -227 294 -176 -4 27 297 -93 -51 -113 345 8 -298 -25 -229 103 407 -20 133
7812 133 -315 39 -405 66 151 -599 -315 408 -111 142 175 35 267 -22 232 -284 76 -175 61 -49 -55
7833 -55 72 202 263 45 -11 -29 315 -244 146 -17 50 -244 151 242 -184 204 -56 -69 -477 -265 -34 -29 148
7856 148 -205 -313 -296 2 -102 -214 30 -294 70 -295 -104 188 -111 -276 -285 44 -233 -89 -213 -150 26
7877B6J47m07K01m3J07J02j89r1L26O0k02J7R3m23J19M92l32J0N3j14j19K84l14
7900a97J47M13m16J82J75m19K40k71P4K91j29r1j22p3J05L25k05K03q8J6l84L41
7922A17j96J81j91j32L51j11j32K16q6j6J6j62K20J07l69N6N01m84O3m2L50k71
7944a4N7o4M7O9j57K10K48j1l48j63L0K8J33r9j9j92P5KJ63lJ10n4l2J27jj86
7970d4j5J36K69m53K09K04p0l43J5p2K19j36m82L00L14R6l81L72j33j45k41L25
7992e6L5R0j77L04l40J93j75j84M26kl59K17M2n1j21n9J57k06N39j44L8k37Jo2
8016a31r0M21p1J1k31J16Q4ML75n64k07L62J9K5j05O3k28J59L0j35J52k53PM03
8040B16p0l85M16l14K48j3n90O61k14M13n64K39j54J65j03K55m70J20R7j12j00
$$ plain form
7877 26 173 -234 -33 -76 31 133 -56 -147 179 239 37 54 147 -276 -157 335 3 13 66 -48 -167 117 -197
7900 -197 -50 363 -53 129 304 -115 125 -146 -72 219 90 -1 -123 -196 -91 234 29 232 144 160 -224 117
7922 117 -79 102 -89 -221 130 19 -113 103 17 1 17 -145 75 182 -187 -131 370 -114 -51 -93 257 -14
7944 -14 43 -21 26 95 -62 148 396 385 37 -126 -96 -68 65 -34 -53 -245 -170 -168 -5 -8 102 48 16 143 142 -44
7970 -44 -59 77 346 -107 102 306 236 -107 -92 -164 55 -81 -563 -263 51 147 -234 138 5 -140 -381 -56
7992 -56 -21 69 -108 196 -144 49 -126 -310 116 114 -245 -28 14 -37 -158 -217 -60 -266 273 129 167 -70 -69 -131
8016 -131 -221 200 129 140 -91 25 109 113 488 -76 -283 79 98 123 18 81 -147 12 42 -93 59 -194 -187 216
8040 216 146 -239 177 -137 111 98 -492 169 -45 368 -196 43 -111 54 -49 206 -264 -144 -47 -159 -259
8061b59J60K69J25m32J22r2J97k07K73q2k52J05k12K60j25L12l90M63l3k20j28
8082a46L58k44L29j59m3N8k30L14l67K22j9M6O0k76n8L01m30J86O0K85m31l8K35
8105A3k06R0j59K83k1NJ79k10j10O7J07l59K66K50j88Q0k01R0J84k27J53n4M7
8128G9j12k27N54r7L29n27J45j01k25N72n86K36J34N4k41R3r4M13k53Kr3L6k22
8151a31M91m21j09J56J12r2j82k3L02l24p5M21l46O63m58l55L84J40k39K23k70
8172a33K71m17M51n6l01L36k21KL11l03Rk02K21j80K19j37K12k63K04
$$ plain form
8061 -259 -99 170 295 -137 -15 -107 90 -117 156 74 -178 -73 -285 -25 -150 162 -228 235 202 -18 -146
8082 -146 212 -32 297 138 95 153 -77 237 -130 92 73 119 179 -97 -155 146 -284 -98 -38 247 -184 -222 13
8105 13 -193 -103 -262 21 0 5 184 -26 -136 -69 38 -321 -55 195 7 87 -114 -24 160 -67 86 32 79
8128 79 -33 -260 294 197 526 -1 144 43 -182 390 -196 40 174 228 -13 80 -14 399 146 148 55 91 -131
8151 -131 360 -61 -170 -14 98 6 -176 -199 103 -221 -296 125 -221 442 -16 -371 13 153 -86 137 -133
8172 -133 138 -279 172 116 -185 151 -70 -68 243 -60 -51 -253 -32 -212 7 -130 82 -181 23
8191B3
$$ Imaginary data points
##PAGE= N=2
##DATA TABLE= (X++(I..I)), XYDATA
0@%%%%%%%%%%l2O4o4O4r6J28j60K03k35K88l52M17n13O09p05Q32r61J121j310
29g02J503j708J944k220K521k842L199l597M035m512N033n604O232o923P669q477
45d449R369j0351J1412j2571J3851j5263J6816j8534K0444k2582K4993k7728L0859
58A6266l4481L8742m3845N0071n7857O7935q1570J01116j31670J86488l14643
69b03448J137975P04193k186428K45612J073297m47734j071001O97251N96852
78E46569o17492k97051O77619k96496q38123L66665Q28994n62717o41570O22102
88b11500M07909q57528k64067Q21931R4914p50043K01544P45728k06977n22699
98e40788K99087K47002l60302k9713L62150j92634k28846O16071N15903m97434
$$ plain form
0 0 0 0 0 0 0 0 0 0 0 0 -32 32 -32 32 -64 64 -96 107 -128 160 -192 225 -288 321 -384 448 -513 608 -702
29 -702 801 -907 1037 -1183 1338 -1504 1695 -1902 2133 -2379 2654 -2950 3282 -3641 4028 -4449
45 -4449 4920 -5431 5981 -6590 7261 -8002 8814 -9720 10724 -11858 13135 -14593 16266
58 16266 -18215 20527 -23318 26753 -31104 36831 -44739 56377 -75293 111195 -203448
69 -203448 934527 1638720 -547708 -302096 771201 323467 -747534 -50283 546569
78 546569 -70923 -367974 309645 13149 -824974 -458309 370685 -192032 -833602 -211500
88 -211500 196409 -661119 -925186 -103255 -8341 -758384 -556840 188888 -18089 -540788
98 -540788 -241701 5301 -355001 -384714 -22564 -215198 -444044 172027 687930 190496
108A90496l67608N09128J97229o12106j79678N06581R0336k68884K50205K88871
118F04570l50629j83338M25023Q570n42275M8917M85970k04634m68013K68357
128I2518L60510l48155k59731L85338J26409m76624j48308L40225l7313l71213
138c36344O5694K69039j60443j82284K43350R6216l04860k6785K99056q8000l27747
149d53108J10902K65363j36098j46291K35817J63630j51012k2201J90295j9146
159C8151j86814M1757J53805n7825p4933J63789J35966q3158l130J53849k2724
170B58733j66792K8288J04717r6089q8156J21786P5059q7949m252Q3910n3382
181A75873j13605J7598L1091r2471o2276O6936J8009j01131k8796Q6704m37r4085
$$ plain form
108 190496 -177112 332016 529245 -82861 -262539 244042 334378 65494 315699 604570
118 604570 253941 70603 495626 504196 -38079 10838 496808 292174 -175839 92518
128 92518 453028 104873 -154858 230480 356889 -119735 -268043 72182 34869 -336344
138 -336344 -270650 -1611 -162054 -344338 -100988 -4772 -309632 -336417 -37361 -125361 -453108
149 -453108 -342206 -76843 -212941 -359232 -123415 40215 -110797 -132998 57297 38151
159 38151 -148663 -106906 46899 -10926 -85859 77930 213896 130738 127608 281457 258733
170 258733 91941 120229 224946 128857 40701 162487 237546 149597 145345 229255 175873
181 175873 62268 79866 110957 18486 -43790 23146 41155 -59976 -88772 -2068 -2505 -96590
193i6590J1663O5403p1430j01834K7938K3573o4683J2609R8323R626l5871N3350
205f7923M8367n7522m6840L9064K2143l4979K817O7247M3919p69K6187M9033m096
218H6648l0942J5441J2390l5213j510M6013k59k0425L6634L2588k6510r882K0296
231A25269k3293m5937r521r031l0661o405K2565L727j4941K526J1624k2787m5639
244d2504j3947M327l2072l0581K6886K2065k5653P725M6354r566l5934K1858J8092
257d2950m2546j7569L9825J3314j8617K2991N0773J2637j3042J5282K5662j5099
269C0661k9182J6734K6732j7841j640N2844K1159k9769R011L3453k5282l8082
281D8798J4089O572l3286r034K4592J460j8534J179J0354j1716k8148j2695k243
$$ plain form
193 -96590 -84927 -19524 -90954 -192788 -164850 -141277 -205960 -193351 -95028 -85402 -121273 -67923
205 -67923 -19556 -77078 -123918 -84854 -62711 -97690 -94873 -27626 16293 15524 41711 90744 86648
218 86648 55706 71147 83537 48324 46814 92827 92568 72143 108777 141365 114855 104973 125269
231 125269 101976 56039 46518 37487 6826 421 22986 26713 11772 14298 25922 3135 -42504
244 -42504 -56451 -52124 -84196 -114777 -87891 -65826 -91479 -83754 -37400 -46966 -82900 -61042 -42950
257 -42950 -85496 -103065 -63240 -49926 -68543 -45552 5221 17858 4816 20098 45760 30661
269 30661 1479 18213 44945 27104 25464 78308 99467 69698 78709 112162 86880 48798
281 48798 62887 69459 36173 27139 51731 53191 34657 35836 46190 34474 6326 -6369 -8612
294h612k3816k7470P282J0537j7899j591K7072m354k6670M207L989k8711j2371
307i8407J7435J0m105K4741K5491J551L980J5272N523r774n726J0778R197m085
321h119J0556L4029J3913n862K2472K4769j9584j7633J9344j61k8795M313K5003
334G4245l845r880J6383J0108j6108j7752l594p262k5788k3539K707M381j6874
347a6818m169J9699l199k5301j580K126k8222k1388N429l937j3489N454J2711
360g2684M985O325O958K897L26m931n812M760O236J447J3717K1107R149R921J6289
375B0690N265O69R099J379o487O221O242j760J1007J8612M619K493R361k535j3114
390G1761m273m486r723m165l639n554j163l721q876j130l206j6878j1713k822
$$ plain form
294 -8612 -32428 -59898 -52616 -42079 -59978 -61569 -34497 -38851 -65521 -61314 -57325 -86036 -98407
307 -98407 -80972 -80962 -85067 -60326 -34835 -33284 -29304 -14032 -8509 -18283 -24009 -13231 -4034 -8119
321 -8119 2437 36466 50379 44517 66989 91758 72174 54541 73885 73724 44929 49242 74245
334 74245 70400 60520 76903 87011 70903 53151 49557 42295 16507 -7032 -4325 56 -16818
347 -16818 -20987 -1288 -4487 -29788 -31368 -29242 -57464 -78852 -73423 -77360 -90849 -85395 -72684
360 -72684 -67699 -61374 -54416 -51519 -51193 -56124 -61936 -57176 -50940 -49493 -35776 -14669 -5520 4401 20690
375 20690 25955 26624 35723 37102 30615 36836 43078 41318 52325 70937 75556 78049 87410 84875 71761
390 71761 67488 63002 53279 49114 45475 39921 38758 35037 26161 25031 21825 4947 -6766 -9588
404i588j4154j6276j93N2p677n78P16m417l425l390p792j592N07p708J172J2945
420f1398K046R57J7063J2137l771L381J0986M78j028R064R869O816N491O614J2160
435C0865Q518j672N288J3707k254q317Q803N652j0527J239J3369l590p260N218
449E9039j416j4039p858j674p464o862l970k624j879n393p253k923n993j1357
463b1666n592l803j2138m979M140o407n874J1360M900j1074M528J0285r303p694
477e3317J2091M164q737N255J6046L397k004J1379J4396K61p393Q812J3233o709
491A0874o579K0004J4574j2813J814K3716l961j9149J0581J2357j7431q916J4715
504C9786K6j6410K262J3414k886j1802N10M083j2463j7952O44M274j3795p249
$$ plain form
404 -9588 -23742 -40018 -40211 -40159 -47836 -48414 -47698 -52115 -55540 -58930 -66722 -68314 -67807 -75515 -74343 -61398
420 -61398 -59352 -58395 -41332 -29195 -32966 -29585 -18599 -18121 -19149 -10085 -216 6600 12091 18705 30865
435 30865 39383 37711 42999 56706 54452 46135 54938 60590 50063 51302 64671 61081 53821 59039
449 59039 57623 43584 35726 34052 26588 19726 15756 13132 11253 5860 -1393 -4316 -10309 -21666
463 -21666 -27258 -31061 -43199 -48178 -44038 -50445 -56319 -44959 -40059 -51133 -46605 -36320 -45623 -53317
477 -53317 -41226 -37062 -45799 -40544 -24498 -21101 -23105 -11726 2670 2931 -4462 4350 17583 10874
491 10874 4295 24299 38873 26060 27874 51590 47629 28480 39061 51418 33987 25071 39786
504 39786 39812 23402 25664 39078 36192 24390 24900 28983 16520 -1432 -788 3486 -10309 -17558
518a7558J1922j945j6127N804J0426j6407r601J4205m188k0158M680J4433r646
531c4160o485J6381Q233j1489j001J3714R42j2602M625J8594k759j2506J6414
544b099J9591j3911q263K6846N823k6607K116K6671r373k0260J8480J7384j7148
557A9250p464K0412K599k1163j448J6410o426k2815N195J9024j3230j9853J6530
570G021J1915k4439q354K1792m661k6705P982J8706j5110j2437J7644M653j9097
583b1090l00J6280m711j5464P172J4550q493j0907J5320J4386j4759n654K0716
596G046J432k0344P379J9207j3626j2048K1875J0203j8972P42J9171n793j6587
609c15Q173J0161j2094j0262J1790P780j2054m969J3956J57j7364J836J3123j1269
$$ plain form
518 -17558 -5636 -7581 -23708 -17904 -7478 -23885 -33486 -19281 -23469 -43627 -38947 -24514 -34160
531 -34160 -40645 -24264 -16031 -27520 -28521 -14807 -13865 -26467 -21842 -3248 -6007 -18513 -2099
544 -2099 17492 3581 -4682 22164 27987 1380 3496 30167 20794 534 19014 36398 19250
557 19250 11786 32198 34797 13634 12186 28596 22170 -645 4550 23574 10344 -9509 7021
570 7021 18936 -5503 -13857 7935 3274 -23431 -15449 3257 -11853 -24290 -6646 -1993 -21090
583 -21090 -21390 -5110 -9821 -25285 -18113 -3563 -12056 -22963 -7643 6743 -8016 -13670 7046
596 7046 8478 -11866 -4487 14720 1094 -10954 10921 21124 2152 2894 22065 16272 -315
609 -315 7858 18019 5925 -4337 7453 15233 3179 -1790 12166 12323 -5041 -3205 9918 -1351
623a351j5482J3090N811j8738L44K0635m811j6689Q497J0780j3220p003J1395
636f742J707j0648J256J3395J667p506M378J2158m366j1547Q067Q905j0529m894
650d699J5291L419j0501O031J1065n951n386O118R33n218k138L85j901p13m05
665F330J453L051l112m264R87j104q272l618J094j452j664N09j218K39J031m473
681a4483j467L847k935n870L617K404p114K077J0242l95l757O840L193m266J529
696f538N352k63n06L964L595J967J310L197M674R39k668K904K053m437O8O264
712B1875j441m336O022K215q791n92N407o810o169L647l28p980j259K411l330
727E41m729j283n02k595n169j985J056m401n400M674L690p115j563Q208k770q278
$$ plain form
623 -1351 -16833 -3743 2068 -16670 -16326 4309 -502 -17191 -8694 2086 -11134 -18137 -6742
636 -6742 -5035 -15683 -14427 -1032 635 -6871 -2493 9665 5299 -6248 1819 10724 195 -4699
650 -4699 10592 14011 3510 9541 20606 14655 9269 15387 16320 11102 8964 9349 7448 6735 6330
665 6330 7783 10834 7722 3458 4445 3341 -4931 -8549 -7455 -8907 -10571 -10062 -11280 -11041 -10010 -14483
681 -14483 -15950 -12103 -15038 -20908 -17291 -14887 -22001 -19924 -9682 -10077 -13834 -6994 -3801 -8067 -6538
696 -6538 -1186 -1449 -1955 2009 5604 7571 8881 12078 16752 17691 15023 17927 19980 15543 15611 21875
712 21875 20434 16098 22120 24335 15544 14952 20359 13549 7380 11027 10699 2719 1460 3871 541
727 541 -4188 -5471 -5973 -8568 -13737 -15722 -14666 -19067 -24467 -19793 -16103 -23218 -24781 -16573 -19343 -27621
743b7621M796N911n241o83Q155J459j209N375M642j88O36L424L503J213k32K896
759F836O442K11j127O243M188k410N10M055k141k458L014j044l205L028J063l956
775A9249k80R34m494l944l21l950l875r01k561k982j130j757j970p32m426m074
791a7214J603j959o281O50M304m203k696N242R84k212J514K256j044J070J547
806a6439Q34L958K340L1M711N247j473J282O885Q30l487M727M590l37P84K993
822A7476J747J440k23j569L481R16m780j235M309k583n299L113J557o764k080
837I506J977l280n554j656L00k151l145k930P85j48n985k261L975k774o563J721
853a8183L574n262j284N226N15k906K428K555q84P2J682J045J899L96J336M410
$$ plain form
743 -27621 -22825 -16914 -22155 -22838 -14683 -13224 -14433 -9058 -4416 -4604 -3968 -544 2959 4172 3940 6836
759 6836 13278 13489 12362 18605 22793 20383 20893 24948 22807 20349 23363 22319 19114 22142 23205 19249
775 19249 18969 19903 15409 11465 11144 7194 3319 2418 -143 -3125 -4255 -6012 -7982 -8714 -13140 -17214
791 -17214 -15611 -17570 -23851 -23201 -18897 -23100 -25796 -20554 -19570 -21782 -20268 -18012 -19056 -17986 -16439
806 -16439 -15605 -11647 -9307 -9276 -4565 682 -791 491 7376 8206 4719 9446 14036 13699 14483 17476
822 17476 19223 20663 20440 18871 22352 23268 18488 17253 21562 18979 13680 16793 18350 11586 9506
837 9506 11483 8203 2649 993 1293 -858 -4003 -6933 -6148 -6296 -12281 -14542 -10567 -13341 -19904 -18183
853 -18183 -14609 -19871 -21155 -15929 -15414 -18320 -15892 -13337 -14221 -14149 -12467 -11422 -9523 -9127 -7791 -3381
869c381K667r16L293L618j686L19M699m39j443M539J617j615K493K920k860l31
885A3494K507j753k749J073o23k458l92k09k11K59k294j696P39l090m858J562
901f99M60n639j389M671k539m937L624J502m713r20K391j414k204R62J123P99
917h922k53k60K749J812k074L85M556j518l322M682K892l507J383N066l04j418
933A947K171J027j349N97k07k86J235k91n86K170L49k749J257J548l034r19J858
950D738j758k014J663n22k126K105J33k996J016R37l147n86K361j587j455K336
966i02K11j206J407o2j267R56m84j093J811M04k026J985K917k911m97L980j522
983A701l201K277Q41k472nJ445q69K58k37k79N99M43k972l72K144k663j971K898
$$ plain form
869 -3381 -714 -1630 1663 5281 3595 3914 8613 8174 6731 11270 12887 11272 13765 16685 13825 13494
885 13494 16001 14248 11499 12572 11949 9491 9099 8890 8679 8938 6644 4948 5687 2597 -2261 -699
901 -699 -239 -5878 -7267 -2596 -5135 -10072 -6448 -4946 -9659 -10579 -8188 -9602 -11806 -10844 -9721 -8922
917 -8922 -9175 -9435 -6686 -4874 -6948 -6563 -2007 -3525 -6847 -2165 727 -2780 -1397 3669 3365 1947
933 1947 4118 5145 3796 4393 4186 3900 5135 4844 4258 6428 6777 4028 5285 6833 3799 2880 4738
950 4738 2980 966 2629 2107 -19 2086 2219 -777 239 1176 -1971 -2557 -196 -1783 -3238 -902
966 -902 -691 -1897 -490 -552 -1819 -863 -1347 -2440 -629 -225 -2251 -266 2651 -260 -757 3223 1701
983 1701 -1500 777 1618 -854 -859 586 -283 -25 -262 -541 58 501 -2471 -2843 -699 -3362 -5333 -2435
1001b435O19k585J439J550j576r86J686j353p68J450q49P84J586K48r41L203Q23
1018A895k186J434K054k598L94K452j23J95K078L40L87J550o93j175J516o94k425
1035D401R47J730k020r84L122j388k633J123n27k537n96q67j790O15j057k332
1051d793J486L76l960N34J872l155k509K429p53k912J869J567q99LK055m49N02
1068f737J40m39Q98K215p49O59L616O05j17K776J504j113J801J589j514J156K700
1085H990j017O87K536o20j290K565K51k896K57Q16k453p99P15q82q88N2j324l63
1103D337j109l172j488P61k861k728K159j79m207N28K222k585k899J858l59k843
1119a2565L09J077o83O66Q19P74K002L4o29K255J206k123Q22L714K70M0L881J679
$$ plain form
1001 -2435 -1816 -4401 -2962 -1412 -2988 -3974 -2288 -3641 -4409 -2959 -3808 -3024 -1438 -1190 -2131 1072 1895
1018 1895 -291 1143 3197 599 993 3445 3322 3517 5595 5935 6322 7872 7179 6004 7520 6826 4401
1035 4401 5348 7078 5058 4074 7196 5808 3175 4298 3771 1234 638 -229 -2019 -1404 -2461 -4793
1051 -4793 -3307 -2931 -6891 -6357 -4485 -7640 -10149 -7720 -8473 -11385 -9516 -7949 -8848 -8845 -6790 -7239 -6737
1068 -6737 -6597 -7036 -6138 -3923 -4672 -4013 -397 208 91 2867 4371 3258 5059 6648 5134 6290 8990
1085 8990 7973 8660 11196 10576 9286 11851 12102 9206 9463 10279 7826 7027 7742 6860 5972 6024 4700 4337
1103 4337 3228 56 -1432 -671 -3532 -6260 -4101 -4280 -8487 -7959 -5737 -8322 -11221 -9363 -9722 -12565
1119 -12565 -12256 -11179 -11862 -11196 -10377 -9603 -7601 -7567 -8196 -5941 -4735 -6858 -6036 -2322 -2052 -2012 1869 3548
1137C548p65K586J649j277Q35J588q42M75K423r60N15K215k31j672J243l8k263
1154I029j60l48j377j96j042j460O94k14k980p04J421l979l144J902j121m078
1170g757P85K270k837j245K267j135k193m03L10j93L2o52O57K485r27l12L453
1187e395J294k163J618K404j440n50L880J2l51K607K331r91J438J749r95N99J270
1204G317q54k39J369N07j74R59K2K30j81j563r10P36j693k798K600L45m104J10
1222A679L337l114l307K233o3m412q50K482j964k541R68J204n05j519l42K177
1238d537j316l277J823K586k674j637M556L92l474L005L343k628j069L369rk074
1254c621J614K254k67N47R54Q43O87k15K00J030k4j070J333L93j886J454K413
$$ plain form
1137 3548 2783 5369 7018 5741 6576 8164 7322 7797 10220 9260 9775 11990 11759 10087 11330 11292 9029
1154 9029 8869 8521 7144 6948 5906 4446 5140 4926 1946 1242 2663 -1316 -4460 -2558 -3679 -7757
1170 -7757 -6972 -4702 -7539 -8784 -6517 -7652 -9845 -10248 -9938 -10131 -10099 -10751 -10094 -7609 -8536 -8848 -5395
1187 -5395 -4101 -6264 -4646 -2242 -3682 -4232 -352 -340 -691 1916 4247 3256 4694 6443 5448 6047 7317
1204 7317 6463 6224 7593 8100 7926 8885 8907 9137 8956 7393 6483 7219 5526 2728 5328 5673 1569 1679
1222 1679 5016 1902 -1405 828 765 -3647 -4497 -2015 -3979 -6520 -5552 -4348 -4853 -6372 -6714 -4537
1238 -4537 -5853 -9130 -7307 -4721 -7395 -9032 -4476 -4084 -7558 -4553 -1210 -3838 -4907 -1538 -1547 -3621
1254 -3621 -2007 247 -20 527 1481 2324 3011 2796 2996 4026 4002 2932 4265 4658 2772 4226 6639
1271F639j829n92L286j553l871J944J347l436o62L485j338k923J780J560k544
1286A293j224Q60P3j613j960Q72J089j992j260L031R53m474P99L178l358k424
1302f157L390K89l112J377K414j236p67J800n6p45m7L35j23Q9l29R97J268q28
1320a441K70J893j74j702J711N17j647M75K262j686l60K821M2j526J832N03j863
1337A927J30J413p82o12R76q1J23M6j21P94N76k220m40J289j136j620J776O88
1355B726k714L23K423k320j591K148l43k925O63N83j485L13J94k12j85J34o27
1372b895K5j93j474N42Q65j617R4J951m91j496J909P40j518N52J462j210k67J651
1390a370j32r5K015N36l14N97P23l17K14N40m25J334L9m13J300J241j676K82K527
$$ plain form
1271 6639 4810 4218 7504 5951 2080 4024 5371 1935 1273 4758 3420 497 2277 3837 1293
1286 1293 69 929 1002 -611 -2571 -1699 -610 -2602 -3862 -831 122 -4352 -3553 -375 -3733 -6157
1302 -6157 -2767 -2478 -5590 -4213 -1799 -3035 -3802 -2002 -2058 -2803 -2850 -2515 -2638 -2549 -2878 -1881 -613 -1441
1320 -1441 -1171 722 548 -1154 557 1074 -573 -98 2164 478 118 2939 2981 1455 3287 3790 1927
1337 1927 2057 3470 2688 2076 3052 2971 3094 3140 3019 3813 4389 2169 1729 3018 1882 262 2038 2726
1355 2726 12 335 2758 438 -1153 995 652 -2273 -1610 -1027 -2512 -2199 -2005 -2217 -2402 -2268 -2895
1372 -2895 -2870 -3063 -4537 -3995 -3130 -4747 -4653 -2702 -3193 -4689 -2780 -2040 -3558 -3006 -1544 -2754 -3021 -1370
1390 -1370 -1502 -1597 418 954 640 1237 1960 1643 1857 2397 1972 3306 3345 2932 4232 5473 3797 4079 6606
1409F606j386k243J442N68j883M65J049q30p80O97l28r25n13q22r22Q6j406p22
1427a847J057m43j937J086Q37k578n11J085j413j603J131or21O86N07l70P50N51
1445c939p56P60K0o72M67J294j09J48K319j37J84K096k46o44J375N90j298R97
1463B449J879p01j9K016L75n43P46k0j078J5l8q38N91m4j171O23L35j395l11P26
1483C597j471j933Q63j028j900L20O14j355o71J86m46o14n7j584nN87j233m53
1501f583J673m13j344J962O75j378L52J305q34k3J156K94M04J408L86J67J699
1518I06L64p54J310R72j375R92J556l02k09J781j27k63J089j82o35M16k26j345
1536C968O49M58j006J72P86j496q65R27j166j469Q6n53j817Q75J1j567N55J06
$$ plain form
1409 6606 5220 2977 4419 4987 3104 3569 4618 3788 3008 3705 3377 2452 1939 1117 195 281 -1125 -1847
1427 -1847 -790 -1233 -3170 -2084 -1247 -3825 -4336 -3251 -4664 -6267 -5136 -5142 -6063 -5377 -4870 -5240 -4490 -3939
1445 -3939 -4695 -3935 -3915 -4587 -4120 -2826 -2935 -2787 -468 -605 -421 1675 1429 785 2160 2750 1452 2449
1463 2449 4328 3627 3608 5624 5999 5456 6202 6182 5104 5119 5081 4243 4834 4790 3619 4242 4577 3182 2871 3597
1483 3597 2126 193 1056 28 -1872 -1552 -938 -2293 -2964 -2778 -3224 -3838 -3895 -5479 -5484 -4897 -6130 -6583
1501 -6583 -4910 -5323 -6667 -4705 -4030 -5408 -5056 -3751 -4585 -4608 -3452 -3158 -2754 -1346 -960 -793 906
1518 906 1270 516 1826 2798 1423 2415 3971 3669 3460 5241 5114 4851 5940 5758 5123 5539 5313 3968
1536 3968 4617 5075 4069 4241 5027 3531 2666 3593 2427 958 1044 491 -1326 -451 -440 -2007 -1452 -1346
1554a346j802k53N27j406r98R01q05m28M31J088r38P00Q38q69L70J67j178Q30
1572d171R71m73L39K117P0q10K053N58p34Q65P06m46O23O62j53O87J666m31K84
1591D383J103q80p22R16J90j792Q59P36j271k03J284o04j065L95r53r95j26l67
1609H88j137L57k04j237O87K51j529l72Q63j202j198Q08p52p39O33J82o93Q51
1627c543J62j011Q19P01r84l96J870q60k81J750N16m13O85M62m4K81N89n91J043
1646G55J062p61M04J873m52q94J522j9p81L43N61p09K15M71m01O45k11m74p0J4
1666C093m26j325P59m62j519Q05M71j245j48P95j209o76P50j142k96Ro95n20P51
1685b230n82n72Q67L35j521O86N04r08k51O97j85k23J407j94j4J106k60p88J044
$$ plain form
1554 -1346 -3148 -3401 -2874 -4280 -5278 -4377 -5182 -5610 -5179 -4091 -5029 -4329 -3491 -4360 -3990 -3823 -5001 -4171
1572 -4171 -3200 -3673 -3334 -1217 -1147 -1957 96 654 -80 785 1491 1045 1668 2330 2177 2864 4530 4099 4383
1591 4383 5486 4606 3884 4800 4990 3198 4057 4793 3522 3319 4603 3999 2934 3329 2376 1381 1255 888
1609 888 -249 108 -96 -1333 -646 -395 -1924 -2296 -1433 -2635 -3833 -3025 -3777 -4516 -3883 -3701 -4394 -3543
1627 -3543 -3381 -4392 -3573 -2872 -3856 -4252 -2382 -3242 -3523 -1773 -1257 -1670 -985 -523 -567 -286 303 -288 755
1646 755 1817 1056 1460 3333 2881 1987 3509 3490 2709 3052 3613 2904 3119 3590 3189 3834 3623 3149 3079 3093
1666 3093 2667 1342 2101 1639 120 925 1396 151 3 798 -411 -1087 -337 -1479 -1775 -1766 -2461 -2981 -2230
1685 -2230 -2812 -3384 -2517 -2182 -3703 -3017 -2513 -3421 -3672 -2975 -3160 -3383 -1976 -2170 -2184 -1078 -1338 -2126 -1082
1704a082L49o14L65J231j27j85R21O85n97N29N79l10L44L3j93P10K07m20O71O29
1724C725j060k78J439n71j499N72J90q23M0L54l00j27M50q40n09J51j110l30K31
1743b95n25p34P88k83j140R32k4j415LM78q56j53L91k05n69Q17m1JN18K95j175
1764c192N90O47p20M80P25k80O26P42N19j09R64n00n7J172l16n42J162Q24r19
1783A816M23J236j76m13M75J77q17M37l22k34N92n92RK23j7j272M00L80j553o92
1803H0Q11o39q61L47N9j022K7J51p41k59J3p63l11J011j136k18Q97k03r96R79
1823b774R0r63N14J84o4J95N52l8L19R31k37M55P26k2m52Q36Q22p95M76J176j35
1844A796K47N78J08P6J04j73J51M20k99n24J278L2j323N62Q54j239p49R14o39
$$ plain form
1704 -1082 -733 -1347 -982 249 122 -63 858 1543 946 1475 2054 1744 2088 2121 1928 2638 2845 2425 3096 3725
1724 3725 2665 2387 3826 3255 1756 2328 2518 1695 1735 2089 1789 1662 2112 1272 763 914 -196 -526 -295
1743 -295 -820 -1554 -766 -1049 -2189 -1257 -1281 -2696 -2693 -2215 -3071 -3224 -2833 -3038 -3607 -2790 -2831 -2830 -2312 -2017 -3192
1764 -3192 -2602 -1955 -2675 -2195 -1470 -1750 -1124 -382 137 28 992 492 435 1607 1291 749 1911 2735 1816
1783 1816 2239 3475 3299 2886 3361 3538 2721 3158 2836 2602 3194 2602 2611 2834 2817 1545 1945 2325 772 80
1803 80 891 252 -609 -262 -203 -1225 -1198 -1047 -1788 -2047 -2034 -2797 -3108 -2097 -3233 -3451 -2554 -2757 -3753 -2774
1823 -2774 -2684 -3647 -3133 -2949 -3013 -2818 -2266 -2304 -1985 -1054 -1291 -836 -110 -132 -584 252 1074 279 755 1931 1796
1844 1796 2043 2621 2729 2805 2909 2736 2887 3307 3008 2484 3762 3794 2471 3033 3887 2648 1899 2813 2174
1863B174r53k4Qo33j64j18o29L89m51n35l9k79j287k37Q16n00o89K67m2m89L81
1884c034L52o65j15L47m45Q4J012o01P35J184n73o13J178J067r98Q45O18k05K08
1903C81N64L10N04R3N6L74J017o14m01R85J65r82M03R91p27k94Q32n87n49J47
1923B668n20j16N2o84o07O17p9j314P45j56j589k11Q13j241n88L94m54m39O16
1942b093m11m41O41j71q17J74J15p18K61O50n12N12R96k67LP30J1j69N33P70l17
1963e20N06P19o41O06J345m24n44J201P7l40O48L9j60L25K41o29K91M30j35o33
1983B402J050j394l2K61j10j104O07J73j080k22j78k96m17m4l28n28L38q85o5
2002a852K41k67o72M36L08r68J73K21q64K47Q57o64K69N19j29l52O66K13n43R36
$$ plain form
1863 2174 1221 1197 1205 572 408 290 -339 50 -401 -936 -975 -1254 -2541 -2778 -1962 -2462 -3151 -2884 -2926 -3415 -3034
1884 -3034 -2682 -3347 -3462 -3115 -3560 -3476 -2464 -3065 -2330 -1146 -1719 -2332 -1154 -87 -1085 -240 378 173 381
1903 381 945 1255 1759 1852 1908 2282 3299 2685 2284 3269 3434 2452 2855 3846 3119 2825 3657 3070 2521 2668
1923 2668 2148 2032 2084 1400 793 1410 1331 17 762 606 -983 -1194 -381 -1622 -2210 -1816 -2270 -2709 -2093
1942 -2093 -2504 -2945 -2304 -2475 -3292 -3118 -3003 -3721 -3460 -2810 -3322 -2810 -1814 -2081 -2078 -1348 -1337 -1506 -973 -203 -520
1963 -520 -14 705 64 670 2015 1591 1047 2248 2325 1985 2633 2672 2512 2837 3078 2449 2740 3170 3035 2402
1983 2402 3452 2058 2026 2287 2177 1073 1680 1853 773 551 373 77 -340 -384 -712 -1240 -902 -1787 -1852
2002 -1852 -1611 -1878 -2550 -2114 -1806 -2774 -2601 -2380 -3244 -2997 -2140 -2804 -2535 -2016 -2145 -2497 -1831 -1618 -2161 -1225
2022a225J33k82N40O78j88L45P24K44l47R33l61j57J088k89j95P36K20m91K49
2041B355N87l38n69Q34J44r30K43k44l25L32j70k89N5q6q30l9J55r77l44Q24q42
2062d54q34N21K2q07L15K6o99l89K59j87p7L6l47J83J61J02l21O00r7k95L87J66
2084a729q22J097M38l82K15P80L02l16Q14l34M10N27l1j67M10N73j94K52O60l90
2104B113K63L13l02o97P90r4q88J123K8q75L21J67n11p43N41n29o60N5R2o84J09
2125f8j61n43J68m52l24K7n4m83k53L45n33l09M48J03n90L97J08p33M74M72m25
2146b386M46M80J7L89lK05R4P95m3n85R75K27p0K82M40n39O59N31k26l7Q97l24
2168B224n51J077j20q66O08N8k83L6M39p78j83ml31l18J27l23j60N4l1j058M56
$$ plain form
2022 -1225 -1092 -1374 -834 -156 -344 1 725 969 622 1555 1194 1037 2125 1836 1641 2377 2597 2106 2355
2041 2355 2942 2604 2035 2869 3013 2083 2326 2082 1757 2089 1919 1630 1685 1599 769 730 885 -92 -436 388 -454
2062 -454 -1288 -767 -745 -1552 -1237 -1211 -1910 -2299 -2040 -2227 -2304 -2268 -2615 -2432 -2271 -2169 -2490 -1890 -1987 -2282 -1895 -1729
2084 -1729 -2551 -1454 -1016 -1398 -1183 -403 -101 -417 397 63 473 1000 969 802 1212 1785 1591 1843 2503 2113
2104 2113 2376 2689 2387 1690 2480 2386 1498 2621 2649 1774 2095 2262 1751 1008 1549 1020 360 415 507 -177 -68
2125 -68 -229 -772 -604 -1056 -1380 -1353 -1407 -1890 -2143 -1798 -2331 -2640 -2192 -2089 -2679 -2282 -2174 -2907 -2433 -1961 -2386
2146 -2386 -1940 -1460 -1443 -1054 -1057 -852 -758 37 -6 -591 384 611 541 823 1263 724 1383 1914 1688 1651 2548 2224
2168 2224 1673 2750 2630 1764 2372 2430 2147 2183 2622 1844 1661 1657 1326 1008 1135 812 652 706 675 -383 73
2189G3l04o75J34k29k45o23O96o27n09L51k24M8R4k47j50N96k25p49Q34K55j74
2210a900R0R91p74J20M15L39j69N57M92k99L73N79m88K88Q36r7k90R40j18m83
2230A402O62j50l43O15M16p88P1N65o92J36L07o90q0N00n88L0O2l04p84N28l47
2251E28q48M5K24n23o25L66k57l64L57n41k88M49l39m13O06O2q96J70R56n20j9
2272a870J35QL2L94l7L05L36ll90Q80N77k75J2M52k31q3J092m45j17L91M00J0
2294A573L14k87J27K85K07o90K07K42j96l33N79k33j53p9j12o21q8L98m99j08
$$ plain form
2189 73 -231 -906 -772 -1001 -1246 -1869 -1173 -1800 -2309 -1958 -2182 -2134 -2040 -2287 -2437 -1841 -2066 -2815 -1981 -1726 -1900
2210 -1900 -1810 -819 -1593 -1473 -1058 -719 -888 -331 161 -138 235 814 326 614 1450 1353 1063 2003 1885 1402
2230 1402 2064 1914 1571 2186 2602 1814 1885 2450 1758 1894 2201 1511 1431 1931 1343 1373 1435 1131 347 875 528
2251 528 -320 -275 -51 -574 -1199 -833 -1090 -1454 -1097 -1638 -1926 -1477 -1816 -2229 -1623 -1561 -2457 -2287 -1331 -1851 -1870
2272 -1870 -1735 -1727 -1695 -1301 -1338 -1033 -697 -700 -1090 -210 367 92 104 556 325 242 1334 889 772 1163 1563 1573
2294 1573 1887 1600 1727 2012 2219 1529 1736 1978 1782 1449 2028 1795 1642 1563 1451 830 742 1140 641 533
$$ [...]
8191g7
##END NTUPLES=NMR FID
##END=
