##TITLE=1H ikalashn
LR-787-OM-C1
14.10.2024
##JCAMPDX= 6.0         $$ Bruker NMR JCAMP-DX V2.0
##DATA TYPE= NMR FID
##DATA CLASS= NTUPLES
##ORIGIN= UXNMR, Bruker Analytische Messtechnik GmbH
##OWNER= root
$$ TOPSPIN		Version 1.3
$$ 2024-10-14 16:09:47.953 +0400  Irina@DPX200
$$ Compression mode = diff/dup
##.OBSERVE FREQUENCY= 200.131392401
##.OBSERVE NUCLEUS= ^1H
##.DELAY= (6, 6)
##.ACQUISITION MODE= SIMULTANEOUS
##.ACQUISITION SCHEME= undefined
##.AVERAGES= 16
##.DIGITISER RES= 18
##SPECTROMETER/DATA SYSTEM= spect
##.PULSE SEQUENCE= zg
##.SOLVENT NAME= CDCl3
##.SHIFT REFERENCE= INTERNAL, CDCl3, 1, 17.95386
##AUDIT TRAIL= $$ (NUMBER, WHEN, WHO, WHERE, WHAT)
$$ ##TITLE= Audit trail, TOPSPIN		Version 1.3
$$ ##JCAMPDX= 5.01
$$ ##ORIGIN= Bruker BioSpin GmbH
$$ ##OWNER= Irina
$$ $$ F:/spectra/data/iren/nmr/1H/4/audita.txt
$$ ##AUDIT TRAIL=  $$ (NUMBER, WHEN, WHO, WHERE, VERSION, WHAT)
(   1,<2024-10-14 16:08:23.234 +0400>,<Irina>,<DPX200>,<TOPSPIN 1.3>,
      <created by zg
	started at 2024-10-14 16:07:15.062 +0400,
	POWCHK disabled, PULCHK disabled
       terminated by command 'halt'
       configuration hash MD5:
       BE 6D 3F 07 2A EA 11 49 91 17 2B D3 AF B3 58 0D
       data hash MD5: 16K
       25 5F 72 F8 54 05 B6 E5 C8 B1 A2 6C 0A D3 A9 05>)
$$ ##END=
$$ 
$$ $$ hash MD5
$$ $$ 26 9B 2C 6A 8B 56 D4 A6 89 3C 6C 4B D8 E8 F9 2E
##$RELAX= 
##$RELAX= 
##$RELAX= 
##$RELAX= 
##$RELAX= 
##$RELAX= 
##$RELAX= 
##$RELAX= 
##$RELAX= 
$$ Bruker specific parameters
$$ --------------------------
##$DU= <F:/spectra>
##$EXPNO= 4
##$NAME= <1H>
##$PROCNO= 1
##$TYPE= <nmr>
##$USER= <iren>
##$AMP= (0..31)
100 100 100 100 100 100 100 100 100 100 100 100 100 100 100 100 100 100 
100 100 100 100 100 100 100 100 100 100 100 100 100 100 
##$ANAVPT= -1
##$AQSEQ= 0
##$AQ_mod= 1
##$AUNM= <au_zg>
##$AUTOPOS= <>
##$BF1= 200.13
##$BF2= 200.13
##$BF3= 200.13
##$BF4= 200.13
##$BF5= 200.13
##$BF6= 200.13
##$BF7= 200.13
##$BF8= 200.13
##$BYTORDA= 1
##$CFDGTYP= 0
##$CFRGTYP= 5
##$CHEMSTR= <none>
##$CNST= (0..63)
1 1 145 1 1 1 1 1 1 1 1 1 1 1 1 1 1 1 1 1 1 1 1 1 1 1 1 1 1 1 1 1 1 1 
1 1 1 1 1 1 1 1 1 1 1 1 1 1 1 1 1 1 1 1 1 1 1 1 1 1 1 1 1 1 
##$CPDPRG= <>
##$CPDPRG1= <>
##$CPDPRG2= <>
##$CPDPRG3= <>
##$CPDPRG4= <mlev>
##$CPDPRG5= <mlev>
##$CPDPRG6= <mlev>
##$CPDPRG7= <mlev>
##$CPDPRG8= <mlev>
##$CPDPRGB= <>
##$CPDPRGT= <>
##$D= (0..63)
0 2 0 0 0 0 0 0 0 0.06 0 0.03 0 0 0 0 0.0002 0 0 0 0 0 0 0 0 0 0 0 0 0 
0 0 0 0 0 0 0 0 0 0 0 0 0 0 0 0 0 0 0 0 0 0 0 0 0 0 0 0 0 0 0 0 0 0 
##$DATE= 1728907699
##$DBL= (0..7)
120 120 120 120 120 120 120 120 
##$DBP= (0..7)
150 150 150 150 150 150 150 150 
##$DBP07= 0
##$DBPNAM0= <>
##$DBPNAM1= <>
##$DBPNAM2= <>
##$DBPNAM3= <>
##$DBPNAM4= <>
##$DBPNAM5= <>
##$DBPNAM6= <>
##$DBPNAM7= <>
##$DBPOAL= (0..7)
0.5 0.5 0.5 0.5 0.5 0.5 0.5 0.5 
##$DBPOFFS= (0..7)
0 0 0 0 0 0 0 0 
##$DE= 6
##$DECBNUC= <off>
##$DECIM= 32
##$DECNUC= <off>
##$DECSTAT= 4
##$DIGMOD= 1
##$DIGTYP= 9
##$DL= (0..7)
0 120 120 120 120 120 120 120 
##$DP= (0..7)
$$ [...]
##$SW= 21.9925939549014
##$SWIBOX= (0..15)
0 0 2 0 0 0 0 0 0 0 0 0 0 0 0 0 
##$SW_h= 4401.40845070422
##$TD= 16384
##$TD0= 1
##$TE= 300
##$TE2= 300
##$TE3= 300
##$TEG= 300
##$TL= (0..7)
0 120 120 120 120 120 120 120 
##$TP= (0..7)
150 150 150 150 150 150 150 150 
##$TP07= 0
##$TPNAME0= <>
##$TPNAME1= <>
##$TPNAME2= <>
##$TPNAME3= <>
##$TPNAME4= <>
##$TPNAME5= <>
##$TPNAME6= <>
##$TPNAME7= <>
##$TPOAL= (0..7)
0.5 0.5 0.5 0.5 0.5 0.5 0.5 0.5 
##$TPOFFS= (0..7)
0 0 0 0 0 0 0 0 
##$TUNHIN= 0
##$TUNHOUT= 0
##$TUNXOUT= 0
##$USERA1= <user>
##$USERA2= <user>
##$USERA3= <user>
##$USERA4= <user>
##$USERA5= <user>
##$V9= 5
##$VALIST= <valist>
##$VCLIST= <CCCCCCCCCCCCCCC>
##$VD= 0
##$VDLIST= <DDDDDDDDDDDDDDD>
##$VPLIST= <PPPPPPPPPPPPPPP>
##$VTLIST= <TTTTTTTTTTTTTTT>
##$WBST= 1024
##$WBSW= 25
##$XGAIN= (0..3)
0 0 0 0 
##$XL= 0
##$YL= 0
##$YMAX_a= 97200
##$YMIN_a= -169725
##$ZGOPTNS= <>
##$ZL1= 120
##$ZL2= 120
##$ZL3= 120
##$ZL4= 120
##$ABSF1= 10
##$ABSF2= 0
##$ABSG= 5
##$ABSL= 3
##$ALPHA= 0
##$AQORDER= 0
##$ASSFAC= 0
##$ASSFACI= 0
##$ASSFACX= 0
##$ASSWID= 0
##$AUNMP= <proc_1d>
##$AXLEFT= 0
##$AXRIGHT= 0
##$AXTYPE= 0
##$AXUNIT= <>
##$AZFE= 0.1
##$AZFW= 0.1
##$BCFW= 1
##$BC_mod= 2
##$BYTORDP= 1
##$COROFFS= 0
##$CY= 7568.61572265625
##$DATMOD= 1
##$DC= 2
##$DFILT= <>
##$DTYPP= 0
##$F1P= 17.9538593292236
##$F2P= -4.03888763876832
##$FCOR= 0.5
##$FTSIZE= 32768
##$FT_mod= 4
##$GAMMA= 1
##$GB= 1
##$INTBC= 1
##$INTSCL= 1
##$ISEN= 128
##$LB= 0.02
##$LEV0= 0
##$LPBIN= 0
##$MAXI= 945.577
##$MC2= 0
##$MEAN= 0
##$ME_mod= 0
##$MI= -402.1523
##$NCOEF= 0
##$NC_proc= 0
##$NLEV= 6
##$NOISF1= 8.587773
##$NOISF2= 6.764455
##$NSP= 1
##$NTH_PI= 0
##$NZP= 0
##$OFFSET= 17.95386
##$PC= 1
##$PHC0= 209.2215
##$PHC1= 10.92628
##$PH_mod= 0
##$PKNL= yes
##$PPARMOD= 0
##$PPDIAG= 0
##$PPIPTYP= 0
##$PPMPNUM= 100
##$PPRESOL= 1
##$PSCAL= 0
##$PSIGN= 0
##$REVERSE= no
##$SF= 200.13
##$SI= 32768
##$SIGF1= 18.5376
##$SIGF2= -6.396296
##$SINO= 400
##$SIOLD= 32768
##$SREGLST= <1H.CDCl3>
##$SSB= 3
##$STSI= 0
##$STSR= 0
##$SW_p= 4401.40845070423
##$SYMM= 0
##$S_DEV= 0
##$TDeff= 0
##$TDoff= 0
##$TI= <>
##$TILT= no
##$TM1= 0
##$TM2= 0
##$TOPLEV= 0
##$USERP1= <user>
##$USERP2= <user>
##$USERP3= <user>
##$USERP4= <user>
##$USERP5= <user>
##$WDW= 1
##$XDIM= 8192
##$YMAX_p= 0
##$YMIN_p= 0
$$ End of Bruker specific parameters
$$ ---------------------------------
##NTUPLES= NMR FID
##VAR_NAME=  TIME,          FID/REAL,        FID/IMAG
##SYMBOL=    X,             R,               I
##VAR_TYPE=  INDEPENDENT,   DEPENDENT,       DEPENDENT
##VAR_FORM=  AFFN,          ASDF,            ASDF
##VAR_DIM=   8192,          8192,            8192
##UNITS=     SECONDS,       ARBITRARY UNITS, ARBITRARY UNITS
##FACTOR=    0.0002272,     1,               1
##FIRST=     0,             0,               0
##LAST=      1.8609952,     -1,              -19
##MIN=       0,             -169725,         -169725
##MAX=       1.8609952,     97200,           97200
$$ Real data points
##PAGE= N=1
##DATA TABLE= (X++(R..R)), XYDATA
$$ [...]
587A037K92n741p88N177M09l961J195L727k686m493J923L612j168j236K873J661
603A833k797k189J863J820p45l18K023J009j945j637J816K295j73q54J368R52
619D321k868k901K077L110j464j378L308J086n304k387M254R06m105J092M591
634D338k887o217K091M470l303l108N472K979o860l896N173J275n619J200P292
649B400j108o654J548M753l279l472N086L707m370k340L635O93l078J633M627
664C781l62k871N92J051j930n07K493J268k79N05o71k308N04K238r49j183K520
681C892M36m644j440L506l40l069K959L897m329m955L143J933n404p69P016M12
697B244p222M37O056l362o232N474O545n999n349O248K634p583m93R171P03p415
$$ plain form
587 1037 1329 -4412 -5200 -23 386 -3575 -2380 1347 -1339 -5832 -3909 -297 -1465 -2701 172 1833
603 1833 -964 -3153 -1290 530 -215 -533 1490 2499 554 -1083 733 3028 2855 2001 3369 4321
619 4321 1453 -1448 629 3739 2275 897 4205 5291 -13 -2400 1854 2760 -1345 -253 4338
634 4338 1451 -4766 -2675 1795 -1508 -4616 856 3835 -3025 -6921 -1748 -473 -6092 -4892 2400
649 2400 1292 -5362 -3814 939 -2340 -5812 -726 2981 -1389 -3729 -94 599 -2479 -846 3781
664 3781 3419 548 1140 2191 261 -246 2247 3515 3236 3741 3070 762 1266 3504 2555 1372 3892
681 3892 4328 -316 -1756 1750 1410 -1659 1300 5197 868 -4087 -944 989 -4415 -5184 1832 2244
697 2244 -4978 -4541 1515 -1847 -8079 -2605 3940 -2059 -7408 -1160 1474 -6109 -6602 2569 3272 -4143
713d143J881O502m200o521N571O650m892m068N947K696o463j280O851J043m955
728F19P70L780k952m179K742L297j674q26K176m33l002n55R76n94m7J354m86j897
746i31mK75j547K97K704m51l120N19J958k887k560L933L111l256j454L739j19
763B07m691Q17M836j031l575K554L237l557k619M562K818l662o92M264p30n081
779b343J150M675j433l023L325K878l871k720L404J494l273l48L304n35l712J40
795h88K724p90k032J506J926j926k368N87Q29r27k41J126N53n90p73m18K57N11
813i34m10k85R92L84j639n79J772Q74j137L30K000n15k333L21J942o57j320J905
831G11J730k038j488K206R02k228Q7K624m73k712N25J864j141j397J864J323k061
$$ plain form
713 -4143 -2262 4240 40 -6481 -910 5740 848 -3220 2727 5423 -1040 -2320 4531 5574 619
728 619 1389 5169 2217 -1962 780 4077 2403 1577 3753 3320 318 -237 739 145 98 1452 966 -931
746 -931 -935 -660 -2207 -1910 794 343 -2777 -2258 -300 -3187 -5747 -1814 1297 -1959 -3413 326 207
763 207 -4484 -3667 1169 138 -3437 -883 2354 -1203 -3822 740 3558 -104 -796 3468 2738 -2343
779 -2343 -1193 3482 2049 -974 2351 5229 1358 -1362 2042 3536 263 -85 3219 2684 -1028 -888
795 -888 1836 1046 -986 520 2446 520 -1848 -1261 -432 -1359 -1600 -474 79 -511 -1284 -1702 -1445 -934
813 -934 -1344 -1629 -637 -253 -1892 -2471 -699 175 -962 -632 1368 853 -1480 -1159 783 126 -1194 711
831 711 2441 403 -1085 1121 2023 -205 -118 2506 2033 -679 -154 1710 569 -828 1036 2359 298
848B98j231J448K47j960O8J991j84j748M39J145q99r25J053O08j014l73N73k34
866f98l83M21M01l0K85K17l97j19N18M3n39L56P91m17p96Q13P25j007m83J423
886A124L32j607QJ591n07j632Q99J462j192j285J313O16j832o48J634J62j597
903a159N3J577o30j506Q28J292j083r30J286L65j593o9J508j58j112P70J047q55
921c69o96J055N67p93J7J042K3q75L03Q69l53n17P06L34p74r9P73j73n42N44L99
942A441p45k59O36k01q12J94N00o58p52N71L04q30k47P79k9j075m6Q42l94r18
962a699N88O61q04m81Q90K34p74J09Q09l06n32N91N68l36j23Q09K08n71J25P51
982G17j1m98M50O40m87l89P78L55n87J36O38k38o67K99K74m32l11M19j8n24n8
$$ plain form
848 298 -933 515 762 -1198 -1130 861 677 -1071 -632 513 -386 -1311 -258 350 -664 -1037 -464 -698
866 -698 -1081 -660 -259 -289 -4 213 -184 -303 215 258 -281 75 866 449 -347 466 1191 184 -299 1124
886 1124 1456 -151 -143 1448 941 -691 208 1670 478 -807 506 1122 -710 -1358 276 438 -1159
903 -1159 -1106 471 -159 -1665 -837 455 -628 -1558 -272 93 -1500 -1569 -61 -219 -1331 -561 486 -369
921 -369 -1065 -10 557 -236 -219 823 846 -29 274 1143 790 273 979 1313 539 440 1213 1040 498 1042 1441
942 1441 696 437 1073 872 60 254 754 96 -656 -85 219 -611 -858 -79 -108 -1183 -1229 -387 -781 -1699
962 -1699 -1111 -450 -1254 -1735 -845 -611 -1385 -1276 -467 -773 -1305 -714 -146 -482 -605 204 412 -159 -34 717
982 717 706 208 658 1298 811 422 1200 1555 968 1104 1742 1504 837 1136 1410 978 667 1086 1068 544 486
1003D86J77j73m43P8mm81l11L08o0n08K7M08m15n06K92K60n23j09N46p2n76L32
1025a267M75k21j70N00L00l41o2N26R6l35L09O06j00k79N49M41m03j41O06L0m69
1046F50K06N54j86l64L06K85m35l51L45J19m12j96K04n2m79j07K29j68l26N1O0
1067f7l87k17P0j24m7P2r8j73J31K1k44j5L09m6j93J98K36j45j04M15L56k48j94
1090d94M45K11m30J09P33K1m54L06N37n12l95O54M68o23j82P08qp61m2P01r3o53
1112B46K18N71n32q26L82N56n02m18N56K15p48l19L81M5m00M1L28l8l83j14K60
1133d81J57j71n7K68P0l74k31K90M28l8j50L76K76n28l97N71M51n84j04R38j9
1154F91j042L0J087j94p94N85Q32q92j004P34P12q71l70J297M30j506m66J239
$$ plain form
1003 486 663 490 47 125 121 -360 -671 -363 -423 -931 -904 -496 -911 -1417 -1125 -865 -1388 -1497 -951 -1023 -1599 -1267
1025 -1267 -792 -1013 -1183 -683 -383 -724 -786 -260 -164 -499 -190 416 316 37 586 1027 624 483 1089 1119 650
1046 650 856 1410 1224 860 1166 1451 1016 665 1010 1129 717 521 725 673 194 87 316 148 -178 -127 -67
1067 -67 -454 -671 -601 -725 -772 -700 -798 -971 -840 -819 -1063 -1078 -769 -815 -1008 -810 -574 -719 -823 -408 -52 -300 -494
1090 -494 -49 162 -268 -159 574 595 141 447 984 472 77 731 1199 576 394 1102 1094 333 291 992 899 246
1112 246 464 1035 503 -323 59 615 113 -305 251 466 -282 -601 -220 -175 -575 -534 -206 -244 -627 -741 -481
1133 -481 -324 -495 -552 -284 -214 -588 -819 -529 -101 -139 -289 87 363 -165 -562 9 460 -124 -228 710 691
1154 691 -351 -321 766 572 -222 363 1195 303 -701 33 745 -126 -496 801 1231 -275 -741 498
1172D98n5j323L62J504o29j386O05R97q36p01J208P33j080p61Q10K54r16R7J203
1191E84J70r18k8N72l25n25M49P13j09n55p7K28m2k36J46O71J24o71n01L71K8
1212F9o11J20R66J09r40k17O22j55r56M44J188m50j272M51R13r72p47J450R88
1231A000j316p61J202J29j528J28J828J54j435K36J264o45j270Q98J524p40j102
1248d34R11O57j307n12J504P57j038l52Q98j43j281o9J204K57r06n5P27m13j087
1267f82K04J066p6q35M9M93n73r47L71J015p6p24K33N79q56r23P03J054n68n57
1287a050Q59L74j175l94J238N51p88p2J005j32j274O4J333J89p76M87R80p21j082
1306c84N48R30m38l89P69L68r46n94O74M57m34j54P08L2j133n85P28K50n68N2
$$ plain form
1172 498 443 -880 -518 986 357 -1029 -424 573 -263 -964 244 977 -103 -864 -54 200 -716 -619 584
1191 584 754 -164 -192 380 55 -470 -21 692 583 28 -49 179 137 -99 47 718 842 171 -330 41 69
1212 69 -542 -422 544 653 -287 -504 118 -37 -993 -549 639 189 -1083 -632 281 -691 -1438 12 1000
1231 1000 -316 -1077 125 254 -1274 -1146 682 836 -599 -363 901 256 -1014 -116 1408 668 -434
1248 -434 477 1134 -173 -685 819 1576 538 186 1084 941 -340 -409 795 1052 146 91 818 405 -682
1267 -682 -478 588 512 -323 -274 219 -354 -1301 -930 85 9 -715 -482 97 -759 -1682 -979 75 -493 -1050
1287 -1050 -191 183 -992 -1386 -148 403 -385 -457 548 416 -858 -794 539 728 -48 439 1419 698 -384
1306 -384 164 1094 656 267 1036 1404 458 -136 538 995 561 407 1115 1147 14 -571 157 407 -161 -109
1326a09P31r9j149l54P17Q5o27J05Q81k50j285l1J044r7p74O26J053q27j224N92
1346i92R59o32m55J250P42j207p22J086M65r34J0J495N8j375J6J121k72q00Q05
1365F18J098p73r24M79M34p24k68R99M82r13m89N88m2p87N5Q92q5q44j04L63k95
1386b40m77L18N89q2n76j32J97j63m56K66O59o0n19k5M90k81m13L52P45j54o33
1407e95J43N44l22m45O66P73m55n64M97L43o75k46Q89L51o42j59N60k8o96J40
1427G9P98p9p64J33N20m49o61N60O14m90m14M24J60p16k16N97J24n37N0M09k04
1448f2n12J02N58j17m36K17L40m23l77M13L60k35j47L79M9l24j65K80K04k03l1
1469a30K73M3k46r3L27Q0j63pJ93r2k29n0J94J48j68m2K16O6m09r4L13N5l49Q2
$$ plain form
1326 -109 622 523 -626 -980 -263 -178 -805 -700 181 -69 -1354 -1385 -341 -438 -1212 -586 467 -360 -1584 -992
1346 -992 -33 -665 -1120 130 872 -335 -1057 29 494 -440 -430 1065 1123 -252 -236 885 613 -187 618
1365 618 1716 943 19 498 932 208 -60 939 1421 508 19 607 565 -222 -167 725 640 -204 -308 55 -240
1386 -240 -717 -399 190 108 -468 -600 -403 -566 -1022 -756 -97 -157 -676 -701 -211 -492 -905 -553 192 38 -595
1407 -595 -452 92 -230 -675 -9 764 309 -255 242 585 -90 -336 553 904 262 103 663 635 -61 79
1427 79 877 798 34 167 687 238 -423 137 751 261 -153 271 431 -285 -501 96 220 -317 -267 142 -62
1448 -62 -574 -472 86 -31 -467 -250 90 -333 -710 -297 63 -172 -319 60 109 -215 -380 -100 104 -99 -130
1469 -130 143 186 -60 -153 174 254 91 84 277 185 -44 -94 100 248 80 38 254 320 -89 -183 130 185 -164 -82
1493h2K64j12k88J22K93j26k00J27J64j91k25J64K41j94r8L46P1l34l1L00m2k58
1515h9J04K22j30j91J16J82p9j06J05J25k51r8J42P0j90qJ69l5j67M1N9m9j17
1538a75L1L2n2q5J2N2J4l1NJ04k5n1pN9j1n5K6J25P0o3QJ35N3j25L5J68n7j44
1566D8J32R8k0l1J39O1j29l3P7m9o4l7R8l3j36O0J15j38j15J09k5j90o8J12j00
1591a19j50P7J9o0o5N2J3n4q1Krm1L5O3j1J6J4J13o0%J51m4m8J29J00p5L9J36
1619A42L7l7J03O9j5o3N1P6j2n1J18M6r8K7P1j00q7R8k9j35r4J52r2j80R3N7j23
1646B4j27M9qj52o9J04jj77o7J86k8j71mJ73r1q1O1J04q4k4R4Q2rJ9P3L1N4m0
1674g9L5J10L4j0M3R2J5j6N3K9j7K4LP3m4p9N1O7o7o4R2K2j92m3J08p2k15R1J31
$$ plain form
1493 -82 182 70 -218 -96 197 71 -129 -2 162 -29 -254 -90 151 -43 -141 205 276 -58 -89 211 169 -89
1515 -89 15 237 107 -84 32 214 135 29 134 259 8 -90 52 122 -68 -76 93 58 -109 -68 -9 -58 -175
1538 -175 -144 -112 -164 -249 -237 -185 -171 -202 -197 -93 -118 -169 -176 -117 -128 -183 -157 -32 38 -25 -17 118 171 46 81 249 192 48
1566 48 180 278 258 227 366 427 298 265 342 293 229 192 290 257 121 181 296 158 43 152 127 -63 -131 -19 -119
1591 -119 -269 -192 -173 -233 -298 -246 -233 -287 -368 -366 -375 -416 -381 -318 -329 -313 -299 -186 -246 -246 -95 -139 -187 -58 42 -33 6 142
1619 142 179 142 245 314 299 236 287 363 351 300 418 464 366 393 464 364 277 375 346 211 117 269 177 -3 90 147 24
1646 24 -103 -54 -62 -214 -283 -179 -180 -357 -424 -238 -266 -437 -441 -268 -359 -440 -379 -275 -359 -383 -289 -207 -216 -197 -124 -93 -39 -79
1674 -79 -44 66 100 90 133 225 240 224 277 306 289 313 316 389 345 266 317 384 317 253 345 367 175 132 240 168 -47 44 175
1703A75j54j54P7J07j66j40P5J67k05j43J44O7k33l8K85K8k71j3K33n7j19L5K38
1726f2K7j77P0J37k7j42R3K48o4j69R4J16p1j09K04J71j47o9P1R9j46r7K22Q6
1750C58j85j07J89kk67JK83Jl06J9J93j33j95J28J91q8k39R9J41k07j73J93K21
1773A15k23j73K36N0k20r0K64J39k02r3J98L3l32k1L50J28l32M3K55o7k96Q1L47
1796A90m1k61J02K34k26k51K18L39j79k58K60K07l78k09L92K01l33n2L33k0m86
1817b18L8L85j1k80J02K96j80m03J80L69j79k18K90J65l72k27K53K18k18l3K49
1838B06K8l48j37K46J31j87m0K60k9l45p1K79O3k55J01K59q5l73KK53L5j90J02
1861i5L06j72m55J71L47j67k17L47K66m09l20L89K01l23m8M83J05n06j02M42j
$$ plain form
1703 175 21 -133 -56 51 -115 -255 -180 -13 -218 -361 -217 -150 -383 -421 -136 -108 -379 -392 -159 -216 -335 -300 -62
1726 -62 -35 -212 -142 -5 -32 -174 -81 167 103 -66 28 144 73 -36 168 339 192 123 194 293 147 50 272 358
1750 358 173 66 255 253 -14 -13 270 271 -35 -16 177 44 -151 -23 168 80 -159 -60 81 -126 -299 -106 115
1773 115 -108 -281 -45 5 -215 -305 -41 98 -104 -197 1 34 -298 -319 31 159 -173 -130 125 58 -238 -157 190
1796 190 149 -112 -10 224 -2 -253 -35 304 125 -133 127 334 -44 -253 139 340 7 -45 288 268 -218
1817 -218 -180 205 194 -86 16 312 132 -271 -91 278 99 -119 171 336 -36 -263 -10 208 -10 -43 206
1838 206 234 -114 -251 -5 126 -61 -101 159 130 -215 -286 -7 56 -199 -98 161 76 -297 -295 -42 -7 -197 -95
1861 -95 211 39 -416 -245 102 -65 -282 65 331 -78 -398 -9 192 -131 -179 304 409 -97 -199 243 242
1882B42m06J87N06j89m64J71L14k81k21L73K94l48l21L06J06l40p3L93J22l66
1902Ej59K23l6k79Q8L46k1l76m0J64q6j88J32K85l6k73j5K05j17k24K13L44j75
1925b0k74J44J71k50j34L61K98k61j91J88J04k87l6M68J52m15J7K77r1l68J71
1946B4M50j35k86R7K36k60k36K77L16k76k16K49J5l79q7L47J35k57j09K22r9l08
1968b80RK99Lk23J6J46r2k60N6K73j7j91Q1J57j96j65R4L14p8j78K05J63k18k26
1992c08K56K67k20j04K73N3l08l4L49R8k90Q7K52r5l27N6L20o6k73K14K03k68
2014A35k53K42J66k30j12K77L7l25p5K46L0k10OK34q9k70JJ64p2j14J19J24j05
2037g4j80Q1Q2m4m0P5J00j05j18L0R8K0m5J03J30j16j58R9J38j15n6K06M4j61
$$ plain form
1882 242 -164 23 529 340 -124 47 361 80 -141 232 526 178 -143 163 269 -71 -144 249 371 5
1902 5 -154 69 33 -246 -158 188 167 -209 -249 -85 -171 -359 -227 58 22 -251 -266 -61 -178 -402 -189 155 -20
1925 -20 -294 -150 21 -229 -363 -2 296 35 -156 32 136 -151 -187 281 433 18 35 312 221 -147 24
1946 24 474 339 53 150 386 126 -110 167 483 207 -9 240 255 -124 -211 136 271 14 -95 127 28 -280
1968 -280 -271 28 31 -192 -176 -30 -122 -382 -326 -53 -70 -261 -180 -23 -219 -384 -290 24 -54 -232 -27 136 -82 -308
1992 -308 -52 215 -5 -109 164 217 -91 -125 224 322 32 119 371 276 -51 5 325 259 -14 200 403 135
2014 135 -118 124 290 60 -52 225 262 -63 -138 108 138 -72 -66 168 79 -191 -190 -26 -98 -212 -93 31 -74
2037 -74 -254 -173 -91 -135 -175 -100 0 -105 -223 -193 -95 -75 -120 -17 113 -3 -161 -62 76 -39 -95 111 155 -6
2061fl9J56Q4j45k9J89M6k60k4K61n5k09J23K54j90k31J62J58k28o9J66O8j59
2084B3j31J97K6k13K0J95j2k37L7J25p0j24R2J44j39n0Q4%o9m7J02Kp8J3O6Oo9
2111a07J8R9Np2J5K3l8jM9K0K9k0l5N1K5m8n8R7N4r0jO8L1r7J7J48m1j18M4Q8
2141A55q7q4O1J29j00j06J77L9j18p6J07J4j30j7J03j8r9nJ20o6p9J10j5j27j6
2166a28P4lj11N1N5j3qL1J2o5J5k6N8o0P7l6LO3J2MPm5N9j3j7K1Ll6N6N4lp3P2
2199I0L1n3QO3J7j20P6L7j6qrN6p7n8L2L1q1k2O9j1n1k3Q2m2j11M9J0q0oQ1j0
2230d6q8K4O2k5n0j3N2o1l0O4kl5J1Q6j2l6J4P2n3j2N5llQ2j8OJ5M0j4pNM2o2
2263F0J6M3K9m0j3Q8l2r2L0O3j03l2O9L0j12LO2np5K0M8o4n8ML9n0l7M3J9n4j
$$ plain form
2061 -6 -45 111 195 50 21 210 256 -4 -28 233 178 -31 92 346 156 -75 87 245 17 -52 114 182 23
2084 23 -108 89 115 -98 -78 117 105 -132 -95 30 -40 -164 -72 72 -67 -117 -33 -33 -102 -149 -47 -45 -123 -110 -44 -38 -107
2111 -107 -89 10 15 -57 -42 -19 -57 -58 -9 11 40 20 -15 36 61 13 -45 52 106 16 15 83 114 17 34 182 141 23 67 155
2141 155 68 -16 45 174 74 -32 145 184 66 -10 97 111 -19 -36 67 49 -50 -55 65 -1 -80 30 15 -112 -128
2166 -128 -54 -57 -168 -117 -62 -75 -83 -52 -40 -105 -90 -116 -58 -118 -41 -77 -74 -11 1 5 12 -33 26 13 -4 17 20 -16 40 94 91 18 90
2199 90 121 68 76 139 156 36 112 149 133 125 116 172 95 37 69 100 19 -3 66 55 4 -19 63 21 -90 -41 -31 -111 -117 -36 -46
2230 -46 -134 -110 -48 -73 -123 -136 -84 -145 -175 -111 -113 -148 -137 -51 -63 -99 -85 -13 -66 -78 -23 -26 -29 53 35 41 56 96 82 75 80 122 60
2263 60 76 119 148 108 95 183 151 59 89 152 49 17 86 116 4 7 69 64 -11 9 57 -7 -65 -61 -22 -72 -109 -66 -47 -101 -102
2294a02N2Rr6oN9k8j02J15M2k5j6L0jj1L8j6oK2RqO1%J3N0j6Nj3m2P4J6Ol4N9
2327A38qn3mQ1m1o2Q2K2r7m5Q5J5j12PJ00l1p6j6P4m2o7J9P7j17j7N7Q1j02k9
2356h1O6j8j08l8J34k9j7nQ9m3n5K3P3o1qRR5o9n9Q0P3l5j6L7N8n4l7J7P8j1m3
2387D5L3M0l5r0R4Rl4k0Q0J8j10k5R8pp9rJ40k5j33nQ5j6j34P0J04n7j33Q3Q0
2416F7j62j5J10O5j09j25J40Kj07K0J45pr8m4J23q1o0R3N5j1q0J3O9k7q8J20R2
2443A00n5j06Q3R2j25m5J51O0j09n0N2M6q4k8J50N0j66j5J44l7j90J34J35q0j60
2468e3J06Q4j54q8J14J30p8j11Q7O4j85o2J13J35j56n2J52j8j78PJ68j2j16M0
2492f3R4p6j16K5J61qj41M5J31q9j07Q3J25n2r7J51L6j35n9J53Q2j15k8J50j4
$$ plain form
2294 -102 -50 -41 -137 -143 -84 -112 -214 -99 -57 -82 -98 -68 -69 -80 -42 -58 -64 -42 -33 -41 20 20 33 83 67 72 59 17 91 107 113 79 138
2327 138 130 77 73 154 113 51 133 155 58 13 98 113 1 8 108 77 1 -15 59 17 -50 -31 46 -71 -88 -31 50 -52 -81
2356 -81 -15 -33 -141 -179 -45 -74 -91 -96 -7 -50 -105 -82 -9 -70 -78 -69 26 -43 -102 -22 51 16 0 37 95 41 4 21 99 88 45
2387 45 78 118 83 -7 87 96 62 42 122 140 30 5 103 96 17 8 148 123 -10 -15 70 54 -80 -10 94 37 -96 -13 67
2416 67 -95 -110 0 65 -44 -169 -29 -27 -134 -114 31 24 -74 -118 5 -76 -136 -43 12 1 -79 -66 3 -24 -112 8 100
2443 100 45 -61 22 114 -11 -56 95 155 46 -4 48 94 10 -18 132 182 16 1 145 108 -82 52 187 107 -53
2468 -53 53 137 -17 -105 9 139 61 -50 37 101 -84 -146 -33 102 -54 -106 46 28 -150 -143 25 13 -103 -63
2492 -63 31 -45 -161 -136 25 17 -124 -79 52 -37 -144 -61 64 12 -85 66 102 -33 -92 61 143 28 0 150 136
2517A36j64m8K08K4j26J2J64o4j77L0J51p7p8R2J28j35j69J17Q7p3n3Q8Q1k00
2541d6o4J35L9j32k0J38J4j83J1J13K0j23J9J26p3j31J3J77n6j17J42N2r6j28
2565a70P8J20p0m7R0J15j58o5J41N3j14k3J58Qj35%J22rq8L4J44o1j13m1J68o
2591A31q2L8J23j14j51J19M3q4m5J14M7j22j07J25K6q6m0J57nj40l5P5k2r1L1
2616i5J23j0j42J2Q1m9n8Q1P0l5j05M1L9j5l2O3J00j19oL4O1q2PJ19L0r5k7J17
2644A08k3q0qJ32l5m4N6L8o2o9N9N1j2o7mM0n4m3P8M2q5mN4J6j23%N5K2r1KL6
2675a5Kq4L1O7m4l9M4M2n9m5K6J7j8K7L3j1ol0L0J2QqJ0N2n6j4P0J2m8OO5J5q7
2708EjR1j8k5KR1p1n6O1L4m8o4M4K3j1o5N0M6l6m7N1m8n2O0j9LprK3l3l2rM1j6
$$ plain form
2517 136 -28 -76 132 156 30 42 206 142 -35 -5 146 69 -9 83 211 76 -93 24 111 38 -15 73 154 -46
2541 -46 -110 25 64 -68 -88 50 64 -119 -108 5 25 -98 -79 47 -26 -157 -144 33 -23 -140 2 54 -42 -170
2565 -170 -92 28 -42 -89 1 116 -42 -107 34 87 -27 -50 108 116 -19 -19 103 94 6 40 184 123 10 -31 137 131
2591 131 49 87 210 96 -55 64 107 23 -22 92 139 17 -90 35 61 -25 -65 92 87 -53 -88 -13 -35 -126 -95
2616 -95 28 18 -124 -112 -31 -80 -138 -57 13 -22 -127 -86 -47 -62 -94 -31 69 -50 -56 -22 39 -43 -36 83 113 18 -9 108
2644 108 85 5 -3 129 94 50 106 144 82 13 72 123 111 44 40 80 26 -17 61 103 18 14 68 84 -39 -39 16 38 -53 -51 -15
2675 -15 -13 -97 -66 1 -43 -82 -38 4 -55 -100 -74 -57 -75 -48 -15 -26 -32 -62 -32 -20 -12 -20 -10 42 -14 -28 42 54 6 12 77 92 5
2708 5 4 95 77 52 54 145 74 18 79 113 65 1 45 68 57 -8 42 88 52 5 56 8 -44 16 -3 0 -7 -16 7 -26 -58 -67 -26 -42
2742d2l3L5Ml6J8k9M8kn6O2J0m3MM1J4k8nN7J5j8j5J4%nQLK8j1k0N3j4k4L6k4
2776D5O3n5l0K9k2k6O1L1m8l4M0j1n1L4QK9p2PJ5J2k3l2K2k5l7N4qj4o0Q0j6j8
2808e2J7j6Mj9K3J9j4j0j1N5m1jJ8O%%j7K3J0K4l9K0KqQK2J2jj0L3k4m2O0kLm5
2844GM7Kj3kMj2K0j8LJ5j6JJ2l8K9j6JQm1J8j9J3l5K1K5j3l3j1j1j1K9L6l8k2
2878e8K7Rj9l3L4K9rj6L3l6Ok0M7oJNjJ1J8k0J4PK9nl7K8MM5l1oj2k7M4L4n4l
2914C2M2lm9MK8qrJ4J8m1o6N8J1k9n1K9L4l4lJ6k9mo9J10l6j5oj2K0l6qM9k3R
2948e7j8L2L4m6L8nj5K6J2j5PRL1K0K9m9nK4J7k3kK8l1J3j5Q4r7J1M8k6l7J3K1
2981E6j5k5pM6Rp3K4L0p8j7K7J0l4kL3J3l9m1Q1l8K8n5N3J7j10N1L9k5rJ2J7R
$$ plain form
2742 -42 -75 -40 -36 -72 -54 -83 -35 -37 -93 -31 -21 -64 -60 -19 -5 -33 -38 19 34 16 1 15 15 10 18 21 49 38 18 71 57 33 69 45
2776 45 108 53 23 52 30 4 65 96 48 14 54 43 -8 26 34 63 -9 -2 13 25 2 -30 -8 -33 -70 -16 -24 -38 -98 -18 -34 -52
2808 -52 -35 -51 -47 -66 -43 -24 -38 -48 -59 -4 -45 -46 -28 -22 -22 -22 -39 -16 -6 18 -21 -1 1 -7 1 23 35 34 24 57 33 -9 51 49 52 7
2844 7 54 56 43 41 45 33 53 35 38 53 37 38 50 12 41 25 26 34 -7 11 -8 5 -30 -9 16 3 -30 -41 -52 -63 -34 2 -36 -58
2878 -58 -31 -22 -41 -74 -40 -11 -20 -36 -3 -39 -33 -53 -6 -12 -11 -6 -7 4 22 2 16 23 52 47 10 38 42 87 56 50 38 11 55 89 35 32
2914 32 74 71 22 26 54 46 37 51 69 28 -38 20 31 2 -49 -20 14 -20 -23 -7 -36 -40 -109 1 -35 -50 -56 -68 -48 -84 -92 -43 -66 -57
2948 -57 -75 -43 -9 -55 -17 -22 -37 -11 1 -14 -7 2 33 53 82 33 28 52 69 46 44 72 41 54 39 123 26 37 85 59 22 35 56
2981 56 41 16 9 55 64 -9 15 45 -33 -50 -23 -13 -47 -49 -16 -3 -42 -83 -2 -40 -12 -67 -14 3 -107 -56 -17 -42 -51 -39 -22 -13
3013a3m1K0M2l1k3N3K8n6m7P4L5m0J0O5l1l7RlQ8p6J3pO4p2k4Q3l4j4MJ6J8o8
3045ENN5p1L0J0Kn5j0LM7l1n0P3l2k0m2O5mk5J2M4Or1J2N1m4O1n1Q1o7m5J4O0
3078bLl3L7K8k5o8M8Q2n9k5L8J6Kn5L5J7m4k4Q0J3m5J2L8mm4L1N2p2m6J6M5j3
3110C4o4P8Ll4k3L0K2n4l7Q4j2k9l5J6ml0%P1Qm5JK6K7n7j5L1m4qL7J8k6m2O9
3143dJ2m6rN1Pl0rL1K4n7j6O7mk4MO0Pl6lJ0k0lL4K6nn1qO3m2qK9J3o5k4K3N2
3179D9m9k9K5L6j6m5K7Km2L3J5j4k8LN6l9o6J2P3m7kO0k3m6k3M5K3l9j1O9Pn0
3211c4KM4K4m2j7O5n4L5k9N1J4j7l3L9K9p8L8M6k1m5K9L2k5j5j5K9j8l7L9L0j01
3242c5L0L6qm6L8Pj1l7RK6l6JQK7k5o2N9L8n8MJ3oK1k5J0J3pk0M0J1l7m4M5N1
$$ plain form
3013 -13 -54 -34 8 -23 -46 7 35 -21 -68 6 41 1 11 76 45 8 17 14 102 26 39 32 96 24 0 83 49 35 39 55 73 5
3045 5 10 65 -6 24 34 36 -19 -29 -26 21 -10 -60 13 -19 -39 -81 -16 -20 -45 -33 11 17 -74 -62 -11 -55 6 -45 36 -31 -76 -62 -2
3078 -2 1 -32 5 33 8 -60 -12 70 11 -14 24 40 42 -13 22 39 -5 -29 51 64 19 31 69 65 21 52 104 32 -14 2 47 34
3110 34 -30 48 51 17 -6 24 46 -8 -45 39 27 -2 -37 -21 -25 -55 -55 16 24 -21 -20 6 33 -24 -39 -8 -52 -60 -23 -5 -31 -73 -4
3143 -4 8 -38 -47 4 11 -19 -28 3 27 -30 -46 21 17 -7 -3 57 64 28 25 35 15 12 46 72 67 16 8 71 29 21 50 63 -2 -26 -3 49
3179 49 0 -29 -4 32 16 -29 -2 0 -42 -9 6 -8 -36 -33 23 -16 -82 -70 3 -44 -46 14 -9 -55 -78 -33 -10 -49 -60 9 16 -34
3211 -34 -32 12 36 -6 -23 42 -12 23 -6 45 59 42 9 48 77 -1 37 83 62 17 46 78 53 38 23 52 34 -3 36 66 -35
3242 -35 -5 31 23 -23 15 22 11 -26 -17 9 -27 -26 -18 9 -16 -78 -19 19 -39 -35 -22 -28 -7 -32 -22 -9 -16 -36 4 15 -22 -66 -21 30
3276C0m8J3N0l9k5QQ0o0j1L6M3k5n6L4L9m0l5L8N2j1p2L2K2m1LN0jo5k0P0n0j8
3308a7K6JKj5oQKm5kQ1o2OK9j6K7m0Kj9K9k3K8rJ0o5O0J2oLj0j0L1k3J0L1l0j5
3344a5N3j6m6M2L1l4Lk8J4K4k3nJ7K9J0l5L1l1K6%Mm9QK8J2l6KL2m8j6K6LnKk1
3379a1lK8k1Mn0K8j8M4J2m8L8l6Ooj0J9j1N5k4k9L3m0M3L3m6j6J9J5mlnK5K1k5
3413A7J6K3k4j9kL6rj4QK0j9K4l6Nj9M0ok2J9l4L4j1j6J6k3PPqMk2OJ2Qk8rLl3
3450d9N2k2qqoJ4Krk0N1kKj1J2m1N6k4J9k2K6kJ0j5J5L3j6J2o1J6N2j4jRKo0O
3486bL3lmK8k7k1L7j3k6NMl6L8j6KrJ1pk1OJ1mJ5m2J0j9M2J3qJm1k1K9J2j8L7
3522dj5mL0K1m9K1J7k1%k5O7l0l2K2JM1k6k3L3K5l4NMK8kl9J8QK5n5%L8J8l0j4
$$ plain form
3276 30 -18 -5 45 6 -19 -11 69 9 -2 34 77 52 -4 30 69 29 -6 32 84 73 1 33 55 14 17 67 66 1 -19 51 1 -17
3308 -17 9 10 12 -3 -9 -1 1 -44 -46 35 -27 -21 8 -8 19 -21 -19 -38 -9 -32 -4 -13 -3 -68 -8 4 -2 1 -9 -19 12 -11 -1 30 0 -15
3344 -15 38 22 -24 18 49 15 18 -10 4 28 5 0 17 46 56 21 52 21 47 47 51 2 10 38 50 14 16 48 0 -16 10 13 8 10 -11
3379 -11 -14 14 -7 -3 -53 -25 -43 1 13 -35 3 -33 -27 -33 -43 -24 -35 20 -4 -33 0 -40 3 36 -10 -26 -7 8 4 1 -4 21 42 17
3413 17 33 56 32 13 11 47 38 24 32 52 33 57 21 26 7 47 41 19 38 4 38 27 11 27 4 11 18 10 14 -8 -2 10 18 -10 -19 -16 -49
3450 -49 3 -19 -27 -35 -41 -27 -25 -34 -54 -3 -5 -3 -14 -2 -43 13 -11 8 -14 12 10 20 5 20 53 37 49 -12 4 56 42 41 50 52 -8 -2
3486 -2 31 28 24 52 25 4 41 28 2 7 11 -25 13 -3 -1 -10 1 -6 -27 -21 -10 -14 1 -41 -31 -50 -8 5 -3 -2 -43 -64 -35 -23 -41 -4
3522 -4 -19 -23 7 28 -21 0 17 -4 -4 -29 38 8 -24 -2 -1 40 14 -9 24 49 15 20 24 52 50 11 29 37 62 7 7 45 63 33 19
3557A9L1j2jl0L3o1M8m3K6J0n6K8K4k0pJ5k1kj7K9mk5K1Pm6K6j6N6jm2OM0m4L2
3591Cj4k6J2K9k8J2nK3j7K7k5k1M9J8k5m7L8O5n2j8K9Rmj7J4KK8n3L6jn3J9J5
3624B2j0k2L9k6K3l0N0m0qlNL0n6J3PPJ4n9J6rL3l5K0K1l4J9j4O%k4L0J0j5K0
3658@j3j0j2M3mj0LJ6LQk5M3j9j8JK9Nj0j4K7jj3k1L4l0j0M8j5Qj6nj%m1L1J5
3694B6k6j9j5L3k0L6m5K5Om2K9j2jJ3k9L4l5k1O5k9k2QM1j8j4L8j6j8PK0K0k1
3726bqoK9k1MN6k2j2k0K6J4j2n1O9k1m0L5L1Rk8Mkk9LjM8o8RL5k8l9K4QJ1l7m
3762c6K6lLm1M4krk8N7j5m0M3j2Oj0j3M0l5pK9K0pl3kM1m0K1J4J3KOl4L6k8n0
3797d4N5J3k3j5L8l%L9rm5J4Lk0L4k9J5Plj3Nn5MJ5K0J0j1j3MRkj3L9k8j9L7n
$$ plain form
3557 19 50 38 37 7 40 -21 27 -16 10 20 -36 -8 16 -4 -11 4 -17 -19 -36 -7 -11 -36 -15 -8 -54 -28 -44 12 11 -31 -25 15 -29 3
3591 3 -11 -37 -25 4 -24 -12 -17 6 -11 16 -9 -30 19 37 12 -35 3 68 16 -2 27 36 32 15 29 31 59 6 42 41 -12 7 22
3624 22 12 -10 29 3 26 -4 46 6 -2 -5 0 30 -26 -13 -6 1 15 -44 -28 -37 -4 -39 -19 2 -32 -13 -27 -21 -21 -45 -15 -5 -20 0
3658 0 -13 -23 -35 8 4 -6 -3 13 16 24 -1 42 23 5 6 35 40 30 16 43 42 29 8 42 12 2 50 35 43 27 22 21 21 -20 11 26
3694 26 0 -19 -34 -1 -21 15 -30 -5 1 -41 -12 -24 -25 -12 -41 -7 -42 -63 2 -27 -49 -41 0 -18 -32 6 -10 -28 -21 -1 19 -2
3726 -2 -10 -16 13 -8 -4 52 30 18 -2 24 38 26 -25 44 23 -17 18 49 58 30 34 32 3 6 5 53 -15 -6 29 1 -38 -14 -6 5 -32 -36
3762 -36 -10 -13 -10 -51 -7 -9 -18 -46 11 -4 -44 -1 -13 -7 -17 -30 10 -25 -32 -3 17 10 -23 -25 16 -24 -3 11 24 26 32 -2 34 6 -44
3797 -44 11 24 1 -14 24 21 21 60 51 6 20 23 3 37 8 23 30 27 14 19 -36 -32 -17 3 13 2 -11 -7 2 0 -13 26 -2 -21 16 11
3833A1m4j0M3jJ1n3L4M3m6k5J9J6J4p1R4j2rn3K0P8q0j4N5Ln4mN7K0l2k2J3L0
3865C1l3NJ1j1K0k2kL5m9J6qL1j3K7k8kk2K5jk8k1O2K2n7J0L4k7K1n1LJ8k6PK2
3899aJ3m5LJ1OKK4Nj7j4J1K5l1M5l6J0j4Koj3KOM5l5PK9m4K5qJ2rJ2k3L0mQj2
3936B1j1M1m4K6k5Kj3mL4K5m4rK0mJ1k6J4k0jJ1KLl4OJ7k0j8J3L4m1Ok0N7l5K8
3971Bj0k9J9%%k1N6k1j2M1l4KL2l3M2j0k5J4j4L2Jpj8K0MJ6j8j8KK0K8n2lKJ7
4006B5Kk0J2l1N1k9Lqk0K1kj2NRj1K8l6k6J5L4l2j5LL5oJ0j7j9JJ2RJ0k9L6K6
4041C4n1J1J5j3OL1m2J7K0oK2l8J4k6J7ok2K9j3k4O8n7J2kJ6j8K2J3l5J0jK8l3
4074bJ9Lj9Nkl2J1NJ2kj9L5l1J3K4k6qK3j0j6NKJ9RpLrkjl5M1%nj0J3jJ2j0j0
$$ plain form
3833 11 -33 -43 0 -1 10 -43 -9 34 -12 -37 -18 -2 12 -59 35 23 14 -39 -19 59 -21 -35 20 23 -31 -35 22 42 10 -12 1 31
3865 31 -2 3 14 3 23 1 -1 34 -15 1 -7 24 11 38 10 8 -14 11 10 -18 -39 23 45 -12 -2 32 5 26 -25 -22 -4 -30 -23 -1
3899 -1 12 -33 -30 -19 -13 -11 13 18 1 -13 -2 23 -8 37 1 11 -3 -1 -7 -20 -18 -12 33 -2 5 34 -10 15 7 19 10 22 -1 29 25 33 21
3936 21 10 51 7 33 8 10 -3 -7 27 52 8 -1 19 15 26 0 14 -6 -7 4 6 9 -25 -19 -2 -22 -40 -27 7 -34 -28 -48 9 -26 2
3971 2 -8 -37 -18 -18 -18 -39 17 -4 -16 25 -9 -7 25 -8 34 24 -1 13 -1 31 32 25 7 27 31 47 29 11 13 33 61 9 6 8 25
4006 25 27 7 19 -12 39 10 13 5 -15 6 4 -8 -3 6 -5 23 -13 -39 -24 10 -22 -37 -34 1 -5 5 -12 -31 -30 -18 -9 1 -28 8 34
4041 34 -17 -6 9 -4 2 33 -9 8 28 22 44 6 20 -6 11 5 -17 12 -1 -25 43 -14 -2 -4 12 -6 16 29 -6 4 3 31 -2
4074 -2 17 20 1 6 4 -28 -17 -12 0 -2 -21 14 -17 -4 20 -6 -14 9 -1 -17 -12 -10 9 18 11 14 5 3 2 -33 8 8 3 -7 6 5 17 7 -3
4113cjM2m1PJ3Jj1Rk9L0j1Mmj5K8J2lj1J7j8L2k7j0j0LJ9k3L3k5nnj1MrPM0k7
4150BoJ0k5KJ0%K3m5j9N8l7M7l4j3L3j5J6J3o3L9nknkM1k8J9j2ol7K4L9j3j0K9
4185B8j2pj7M0Pj6M%Knnkj4K0k3QK%%lJj0QJ0K1m9M4l5Rl3NL9m0j6K6K1k5k2j0
4224d9M4J9l6J7Lk6K1J6j6qJ3K8l5km1N8K3rJ8Mm3K6k%j5J3k7N9oj8l3J3J6j5
4258A0M2j4l8KJ9JNmqK1p8L2NMj8j4N2j7o2N3J2l8J6j7J9Olk2M1k2prJ2J5QjJ6
4295A9Pk6RmlOj1K5k7LJ1L2m6K0J5Rm5J2L4l6j0J7K1o1K1J1j1pj1K1J8onj0L1
4330B3m2QM3Om5LK2k7j7L4mrJ4rkJ4NKk7L5m0rRJ5K2nm2K4K2k6rK0mJ3J0l2RO
4368A0PrmJ1k7L3l8K0jJ7j1rK2m8K1%k7PO8Jk6m1JL3j0K6j3Pm8J4L8j1nMQkj2
$$ plain form
4113 -3 -4 38 -3 4 17 18 7 16 -13 17 6 10 6 -9 19 31 28 17 34 16 48 21 11 1 4 23 0 33 8 3 -2 -13 -9 -18 -11 29 2
4150 2 -4 6 -19 -17 -7 -7 16 -29 -48 10 -27 20 -14 -27 6 -9 7 20 -43 -4 -9 -11 -16 -18 23 -5 14 2 -4 -41 -17 22 9 -1 28
4185 28 16 9 -8 32 39 23 27 27 29 24 19 17 3 23 0 8 10 10 10 7 8 -2 6 16 37 -12 32 -3 6 -27 -22 17 -23 -39 -13 8 -17 -39 -49
4224 -49 -5 14 -22 -5 -2 -28 -7 9 -7 -15 -2 26 -9 -11 -52 6 29 20 38 42 -1 25 23 23 8 21 -6 53 47 29 -4 9 25 10
4258 10 52 38 0 2 21 22 27 23 15 36 -42 -10 -5 -1 -19 -33 19 2 -60 -7 5 -33 -17 -34 -15 -9 -12 -34 7 -15 -22 -31 -19 -4 4 3 19
4295 19 26 0 9 5 2 8 -3 22 -5 -2 9 41 -5 15 30 39 -6 6 40 4 -6 11 32 -29 -8 3 -8 -15 -26 -5 13 7 2 -8 23
4330 23 -19 -11 32 38 -7 -4 18 -9 -26 8 4 -5 9 0 -2 12 17 19 -8 27 -13 -22 -13 2 24 19 -23 1 23 -3 -12 8 4 17 27 -5 4 10
4368 10 17 8 4 15 -12 21 -17 3 2 19 8 -1 21 -27 -6 -6 -33 -26 42 43 17 -24 -23 10 0 26 13 20 -28 -14 24 13 8 12 20 18 6
4405FKj6J3nj3M0k4n4N9j9MJrK5Ll6M0QMo2L5j8j9J1K2l0N2j3LJ3n9L4M1l4kp
4441dJ9K2Kl9K4j2j8L0l0K8Jk6L2l4M1j8l3L8j5K3mk8J8Ok3J8l0jnrJ0lj2M5%
4476A3l1l2L6K2qm5L5Mpk6K2J4k8J2J1NK0k6M1j0rJ6k9RK3k4j9L1j8PJJ1k6P8
4510G3rl9k0MPK4l7j0L8PmMm1J5MOl0M2k6Pnl4J7L0l0Nk0MNK7m4L3m6J8M8l6j6
4547b9N6jJj8KLKmk6M6k7QjNmM5l7KM3m8j3pkK2J4k2K1J4n8K6j2Pj2K1rRj5k3
4585b1J4J6Qj0l1OJ9j0j7J8nN7m3QrK0j4jL0l4%J4J1l3OJ0KlJ8j4J6j0j7J9Mk
4621B2j7Ojj5Ok5L1Oj4QJ7l7O0m7N2k7k5%j9K6l8O4l8K5j6pKK2l5K6rJJ0j1Lp
4657aK6l3kJ7L3m2K1l1KK1Mj9L4o0J9J3ROj7k4N3l4%onJ6j1M5m8J0kNj5N0k5j8
$$ plain form
4405 6 8 -8 5 0 -13 27 3 -51 8 -11 -7 -6 -15 10 13 -23 17 25 29 -33 2 -16 -35 -24 -2 -32 20 7 10 23 -36 -2 39 5 3 -4
4441 -4 15 37 39 0 24 12 -6 24 -6 22 23 -3 29 -5 36 18 -15 23 8 31 27 -1 17 23 0 18 -12 -13 -18 -27 -17 -20 -32 13 13
4476 13 -18 -50 -14 8 0 -45 -10 -6 -13 -39 -17 -3 -31 -19 -8 -3 17 -9 32 22 13 29 0 9 32 8 -11 20 2 9 10 21 -5 73
4510 73 64 25 5 9 16 40 3 -7 31 38 34 38 -3 12 16 22 -8 34 8 15 10 -24 -7 23 -7 -2 -22 -18 -13 14 -30 3 -43 -25 23 -13 -29
4547 -29 27 26 27 9 11 14 16 12 -14 32 5 13 12 17 13 58 21 23 66 18 5 -2 -4 18 32 10 31 45 -13 13 1 8 -4 17 8 17 2 -21
4585 -21 -7 9 17 7 -24 -18 1 -9 -26 -8 -13 44 1 9 0 20 6 5 35 1 1 15 26 -7 -1 9 11 8 26 12 28 18 1 20 24 22
4621 22 5 11 10 -5 1 -24 7 13 -1 7 24 -13 47 0 52 25 0 0 -19 7 -31 33 -5 20 4 -3 -1 21 -14 12 3 4 14 3 6 -1
4657 -1 25 -8 -10 7 40 -2 19 -12 -10 11 15 -4 30 -30 -11 2 11 17 0 -24 29 -5 -5 -11 -16 0 -11 34 -14 -4 -6 -1 -16 34 9 -9
4693iR%m4M6K2l9L8j0K1%k3jj1J5l6L6k1K5Qj9KPm4L1%l2K7JPPpk4j9QNM7m2l2
4731e1J5K5MJ1k1jk5L5j0j5K0J5Ml4J7nNrk5M8QJ7m1K8LJk7J2K9l2M3m2K9j5q
4766HL5m4k4M3k8j8M8j9rK9jk1Jlj3j5L5j5Mk5L2k5j3L6m1J9J6J2k7qJ3j3M3m4
4800c2oK9K6j9mj8L2Kll5J9M9m9K1K2k7k2L8lkJ8k6J3J5J7o6J8QPjl9J4mj4K9
4835Gj2mmk0nK3LL3l3L2m4jK9l3L1Ql7J3%lj4K4pk1OM1n4K8j3M5l6j3O0j9J9m
4871B5k3J8j0J9rlj3L5j5j8J2rJk9L1Nkn8L7L8Kl0j7K9j7kj0J0J9k8nJ5K6j3l5
4906b4K2j1j8OL6k1J8K1l4j0J0K0j7Mj2J3j2QL0l8K4Pj5j7J6m0M8j8J5mJ6j9k6
4939b2O5m5Nl5K4j8J0L2On2J6K7j4J4J2j6QMNrlj5K1j2J9j5J5j3J9Kl5N7l6j6
$$ plain form
4693 -9 0 0 -44 2 24 -15 23 13 34 34 11 10 -1 14 -22 14 -7 18 26 7 9 16 -28 3 3 -29 -2 -1 6 13 6 -18 -37 -29 -24 23 -19 -51
4731 -51 -36 -11 -7 4 -17 -18 -43 -8 -18 -33 -13 2 6 -28 -11 -16 -11 -20 -45 3 11 28 -13 15 18 19 -8 4 33 1 44 2 31 16 8
4766 8 43 -1 -25 18 -10 -28 20 1 -8 21 20 -1 0 -3 -16 -31 4 -11 -7 -32 0 -25 -38 -2 -43 -24 -8 4 -23 -31 -18 -31 12 -32
4800 -32 -38 -9 17 -2 -6 -24 8 10 7 -28 -9 40 -9 12 34 7 -15 23 20 18 36 10 23 38 55 -11 7 15 22 21 -18 -4 -8 -22 7
4835 7 -5 -9 -13 -33 -38 -15 -12 21 -12 20 -24 -25 4 -29 2 10 -27 -14 -14 -17 -31 -7 -14 -35 -29 12 -42 -14 -27 18 -18 -31 29 10 29 25
4871 25 2 20 10 29 20 17 4 39 24 6 18 9 10 -19 12 17 15 -43 -6 32 34 4 -13 16 -1 -3 -13 -3 16 -12 -17 -2 24 11 -24
4906 -24 -2 -13 -31 -25 11 -10 8 29 -5 -15 -5 15 -2 2 -10 3 -9 -1 29 -9 15 22 7 -10 6 -34 14 -4 11 7 23 4 -22
4939 -22 43 -2 3 -32 -8 -26 -16 16 22 -30 -14 13 -1 13 25 9 17 21 26 17 14 -1 20 8 27 12 27 14 33 35 0 57 21 5
4973Ek5K3J4k7M0llk7J0k0j9J0jpM6j3Nk4K6l7j3N2k0j9J0K8Ol8J8L5o1M9k0k9
5007b9L8l3O1j4lLmk2J7k6O8l0k8j8L0O2n9MMj9k1M3rMl3J7j5kK4kl0RLolJ0o4
5044g3O8Rj0J6j6pmJ0J6Pj9j8L5J1k7l9J8nN8n5%L6rK7l7L7%nnpMKoKPk8J6j0
5082aK8m1L5Nl0j5K7krK1l8L6l9Mk2M0lj3J5j6K3Mk2J6rK0j2kj4L0j8L6j6j1l1
5117b4L0J6m1L2Nl4K4QJ0k8%K1JmNk2nl9L0%%J4j5pM0k1rK3pj6M1m9NmoL1Mk2
5155a3J8pmK9l1LK9k0j7OMjK3k2J8j0J8m1kJ5J4Ok2M2n8J5M9l0rQk3pN9l7m4M1
5191amMj4K7k6NmRK2J9l0J1j8k2K0jL6pk7J5kk4PLJ7Kl8K9j7M0oml9K4kL1j5k9
5229iJ8k2J7L0l7Oj9l4N7J2m1L9m2k0N4k5mL7m1J5k7J7L4n5K8L5l6JkJ3lj6N6
$$ plain form
4973 5 -20 3 17 -10 30 27 24 -3 7 -13 -32 -22 -23 -30 16 3 8 -16 10 -27 -40 12 -8 -27 -17 11 17 -21 -3 32 -29 20 0 -29
5007 -29 9 -24 37 23 20 23 19 -3 14 -12 56 26 -2 -20 10 72 13 17 21 2 -19 24 15 19 -14 3 -12 -14 10 8 -22 -13 -10 -16 -19 -9 -73
5044 -73 -5 4 -6 10 -6 -13 -17 -7 9 16 -3 -21 14 25 -2 -41 -23 -28 30 -25 -25 11 2 29 -8 29 29 24 19 12 16 18 12 14 21 -7 9 -1
5082 -1 27 -14 21 26 -4 -19 8 6 -3 18 -20 16 -23 -19 -41 -1 -4 -17 -2 -18 5 9 -13 3 -6 14 2 0 -14 16 -2 34 18 7 -24
5117 -24 6 22 -19 13 18 -16 8 16 26 -2 -2 19 20 16 21 -1 -6 -45 -15 -15 -15 -1 -16 -23 17 -4 -13 10 3 -13 28 -21 -16 -20 -26 5 9 -13
5155 -13 5 -2 -6 23 -8 -5 24 4 -13 -7 -3 -4 19 -3 15 5 23 -18 -20 -5 9 15 -7 35 -23 -8 41 11 2 10 -13 -20 39 2 -42 -1
5191 -1 -5 -1 -15 12 -14 -9 -13 -4 18 37 7 18 0 -22 -2 -3 33 26 -1 14 12 -12 -5 -2 15 17 -21 8 -9 31 25 21 -18 6 4 35 20 -9
5229 -9 9 -13 4 34 -3 3 -16 -50 7 19 -22 17 -25 -45 9 -16 -20 17 -24 -9 -36 -19 15 -40 -12 23 -13 -12 -14 -1 -4 -20 36
5262C6mnoLK9m8jk1j2N2j7kpqJ7j5K6k2nJ2M%jOj2NL9m4NJj8oL8k0qK0k8K0oj
5302dJ0k3j0M1Rk4k3J5j0J8Lj4M7m1L3k5J0pLmJL3j2%l6Pk0M2j3Jk1KM4m7L6k
5338A9j0mJ7nk2nMJ8k7L0k6Rj9K3K2o2jj2J3L0j2LJ3k5J8K0k0K8k5Ql2N0k5J0
5372Cj3lK1J4l0Jj2J7J5K0m6O1m2LNj6K0j9lj4M4j9j1jj0J9l4K1K2j4RKpk6M1
5407A8nk5M8n3NJ6MK8n8J4J8%oj4lJ2j2L5Mn3J4K7l5P7k0m4j4K4J0k6k0P2l1J3
5441B0j1J0l9K4J2j5K2k7KJ2k5l7O3Jn6O4j9k4J0L8l1r%OL1j3j3J7Kj2Nk0K8k0
5475dqM4k7K5l6L8j7j9K7L1n1j6K0q1M8M3j9Rj5OQl0M0k0J7jj9Jl0N1j5lJ6m8
5509c5QL0l0M0J4qj6l2Nk5M2JJ2Pj7K4k1J0j1J7K1k0On8N1J6m8K5J9k7Pj3M6j1
$$ plain form
5262 36 32 27 21 24 53 5 4 -17 -29 23 6 4 -3 -11 6 -9 17 -5 -10 2 6 6 5 11 -1 4 43 -1 4 5 -13 -19 19 -1 -9 11 -17 3 -3 -4
5302 -4 6 -17 -27 14 23 -1 -24 -9 -19 -1 2 -12 35 -6 27 2 12 5 8 4 5 38 26 26 -10 -3 -23 19 6 7 -14 -12 32 -15 21 19
5338 19 9 5 22 17 -5 -10 -6 12 -15 15 -11 -2 -21 2 24 -38 -39 -51 -38 -8 -20 -17 -4 -29 -11 9 -11 17 -8 0 -32 18 -7 3
5372 3 -10 -13 8 22 -8 -7 -19 -2 13 33 -13 48 6 9 14 -2 18 -1 -4 -18 26 7 -4 -5 -15 4 -30 -9 13 -1 8 10 3 -23 18
5407 18 13 -12 36 -17 -12 4 8 36 -22 -8 10 10 4 -10 -13 -1 -13 22 26 -27 -13 14 -21 56 36 -8 -22 2 12 -14 -34 38 7 20
5441 20 9 19 -20 4 16 1 23 -4 -2 10 -15 -52 11 12 -44 20 1 -23 -13 25 -6 -15 -15 -9 22 9 -4 13 15 3 8 -12 16 -4
5475 -4 -12 32 5 30 -6 32 15 -4 23 54 3 -13 7 -74 -26 17 -2 7 -8 -2 6 -24 16 -4 13 12 -7 -6 -36 15 0 -3 13 -35
5509 -35 -27 3 -27 13 27 19 3 -29 -24 -49 -7 -6 6 13 -4 20 -1 9 -2 15 36 16 22 -36 15 31 -17 8 27 0 7 -6 40 29
5543B9m1N8k2m7L2k3j1L5Nl6j0L4k2L0m1LK7rj9kK7k5j7M3K5j1k3QnJ0J0K6j9
5576A9k4L0k2L8l4K5lK0Nl2n0J7L9j9j7QL5o7qL3J0k2pmK7j2M3j6J2j4j0Kk4p
5610b9jO0m2J4k9K4M1o7j0M1j5Nj2J4J2oJ8pmLj6pJ4k0K9lJ4jjk1J4lK7k5%k0
5646iK0j2n1N1JlplM0j7j0l4N8k9l4N2j7ll3K3J8K5n7jN1j1Nj4K9m1k1M8J4mJ
5681B5l2L5j1Qj2j1J0J0mj6K1k4K0k6L5qk0J9k5N3n4Oml1M9lJ5k8jMJ0pKL1p6
5716d0Q0j5m0j1K6j2L6L6m7Kj3L3n4K5pJ4Nk5K9j4j5j0J7L2j5j6K8n6N6k0m9L3
5748gmK0J3qqj0l4L2LK3j5Mj4j0L1J5o5mO5l8J6oj2JPK5Kj5mK9k7J1j7mJ5J3k2
5785ANJ8l5K3J8l3L0L6m8L2k3m8LRk3L7NJ6o0L2jlK0k4K4kk1Lm2M6nlJ0J4qNk
$$ plain form
5543 29 -12 46 24 -23 9 -14 -25 10 15 -21 -31 3 -19 11 -30 -27 0 -9 -28 -30 -3 -28 -45 -2 23 12 -11 -3 -8 2 12 38 19
5576 19 -5 25 3 41 7 32 29 49 54 22 -28 -11 28 9 -8 0 35 -32 -40 -7 3 -19 -26 -30 -3 -15 28 12 24 10 0 2 -22 -29
5610 -29 -30 30 -12 2 -27 -3 38 -29 -39 2 -13 -8 -20 -6 6 0 18 11 7 10 -6 -13 1 -19 10 7 21 20 19 -2 12 9 36 11 11 -9
5646 -9 11 -1 -52 -1 0 -3 -10 -13 27 10 0 -34 24 -5 -39 13 -4 -7 -40 -17 1 26 -31 -32 19 8 13 -1 28 -13 -34 14 28 24 25
5681 25 -7 28 17 25 13 2 12 22 18 2 23 -1 19 -7 28 20 0 19 -6 47 -7 -1 -5 -36 13 10 25 -3 -4 0 10 3 5 36 -40
5716 -40 40 25 -15 -26 0 -12 24 60 13 15 2 35 -19 6 -1 13 18 -7 22 8 -7 -17 0 32 17 1 29 -27 29 9 -40 -7
5748 -7 -11 9 22 14 6 -4 -38 -6 -3 20 5 9 -5 -15 16 31 -34 -38 27 -11 5 -1 -13 -12 -5 20 22 7 3 32 5 16 -1 -5 10 23 1
5785 1 6 24 -11 12 30 -3 27 63 15 47 24 -24 -21 -12 -35 2 7 23 -37 -5 -6 -9 11 -13 11 9 -12 -9 -51 -5 -10 -13 -3 11 3 8 6
5822FLj1mk3J2K0o2O3RkpJ3ol2L3KoK9n8K5oK6m8K6L3l1oK1l0J1K6k4j5OnMOj8
5860b0L2k6k1K8k4J0L1J0n0K4mj8J3M4m9J5l4M4j3K0j3mK1j2J7m7j5L6j8J2L0
5891A9n5M8J1jKm4K4l1L2J7k9K6K0o1J2%qM0l2j5KL6nJ5n1K8j2KLMj3J4J0Qjl1
5927a6j2L7MJ1k5K2j2K3l1k1K6OoNL3l2j7lK4ml5L1RJ0l1j9K0J5K4k6k8K6n3L0
5961a5k3K0RJ2Jj3M1l2olK0JOj8Rj5L4n2j0O9l2jJ2j4M1m0K0nk5K9jj4rK5J2j3
5997B0k6j4j0K9lk4K9j7J7k4K7MK6n5K7KKrl8J5m0P3m0L1nPJ0qNj1j4KL4nLoM
6034A8M8o4J0n2N0l3K5N0n2rK1j1k%OM0n5J4k1j2O0m5J5J5Pl8j8N1l0K5nk8j1
6067c1K8j2PJj9M2o3O1k3JK9j1j0K4l9J5J9K1m5J0k9M0j3j2J3qK1Rj7J3pN1m9
$$ plain form
5822 6 9 -2 -6 -29 -17 3 -59 4 13 11 4 17 11 -21 12 14 8 37 -21 4 -2 24 -24 2 35 4 -2 19 -11 0 26 2 -13 -7 -12 -8 -2 -20
5860 -20 12 -14 -35 -7 -31 -21 10 20 -30 -6 -10 -28 -15 29 -20 -5 -39 5 -8 12 -1 -5 16 4 21 -26 -41 -5 -23 -11 19
5891 19 -36 12 23 22 24 -20 4 -27 5 22 -7 19 39 -22 -10 -10 -18 22 -10 -25 -23 13 8 23 -28 0 -12 -10 -7 -3 -16 -2 8 16 15 -16
5927 -16 -28 9 13 24 -1 21 9 32 1 -20 6 12 6 11 44 12 -5 -8 16 12 -23 8 17 27 -4 -23 -3 12 36 10 -18 8 -45 -15
5961 -15 -38 -18 -9 3 4 -9 32 0 -6 -9 11 12 18 0 9 -6 28 -24 -34 35 3 2 14 0 41 1 21 16 -9 20 19 5 -4 21 33 20
5997 20 -6 -20 -30 -1 -4 -28 1 -16 1 -23 4 8 34 -21 6 8 10 1 -37 -22 -62 11 -29 2 -3 4 14 6 11 0 -14 -12 22 17 20 14 18
6034 18 66 2 12 -40 10 -23 2 52 0 -9 12 1 -1 -1 5 45 -10 4 -17 -29 31 -14 1 16 23 -15 -33 18 -12 13 8 -20 -31
6067 -31 -3 -15 -8 -7 -26 16 -47 14 -9 -8 21 10 0 24 -15 0 19 40 -5 5 -24 16 3 -9 4 -4 17 26 9 22 15 66 17
6100A7J6jk6kk4L7l6J1J2jJ5Lk3k1M3m0P%K6qj5j1M5n3MnN3j3k1J8oRN0n7j6R
6136dl3K6K4k5J7Rk8J1L1k2j5K9J0k8J4Rm3L6nlKkj9J4Lj0K5k3J1pj6L3J1l2l
6171cl7M9k6PoK6j7J5%k1LrJ3J2Qk0K0J3j3j9K4qj9j0K8j0J1j4P9p5%J1K4k5k7
6206a6MJ3mJJPlk8J6K5%J7m2J9rK4l4J4llk6K4qPJ5qL1n1J2jK0kNl4L4Kj5rL7
6245C2Nl5j8N3krkQl6J0k3Mk3M4J0%lj3jk3K8J1j8oj4J1mK8k4L%oJ0J0%j6k0L2
6283CJ0l2N3o7M5J8k8RjNj9OK9j0n3M2j7j5J1K6k1j0K6Kl7RM4pLk8j7NK2Jk0m2
6319e5K9rN7mm1J0J3j3oPK3lk6kNL8jomk5kL2ml8J0L7mk2k5L2RJ0Rl6KK6j7K3
6357B9j4Pj9J3j9LJ5k8KJ8%J5kj8j3k3M5o1N2J5k4L5n1LrM5nj9k2L7J2j9J3j8
$$ plain form
6100 17 33 32 6 4 -20 17 -19 -8 4 3 18 21 -2 -23 20 -20 -13 -13 13 5 -10 -21 24 -29 -25 -30 23 10 -11 7 1 10 60 3 -13 -4
6136 -4 -37 -11 13 -12 5 14 -14 -3 28 6 -9 20 30 2 16 25 -18 18 13 10 12 10 -9 5 8 -2 23 0 11 4 -12 21 32 0 -3
6171 -3 -40 9 -17 -10 -16 10 -7 8 8 -13 -10 -19 -6 6 14 -6 14 27 14 -5 19 11 -8 -18 10 0 11 -3 76 1 1 12 36 11 -16
6206 -16 -12 1 -3 -2 -1 6 3 -25 -9 16 16 33 -9 10 1 25 -9 5 2 -1 -27 -3 -11 -4 11 3 34 -17 -5 -6 14 12 17 -17 17 19 4 -5 32
6245 32 37 2 -16 37 35 26 24 32 -4 6 -17 -13 -36 8 18 18 15 2 1 -22 6 17 -1 -7 -21 -10 -14 14 -10 -7 -7 -13 -3 7 7 -9 -29 3
6283 3 13 -19 34 -33 12 30 2 11 10 15 -4 2 31 21 -32 10 -7 -22 -11 15 -6 -16 10 12 -25 -16 28 21 24 -4 -21 -16 6 7 -13 -55
6319 -55 -26 -35 22 18 -23 -13 0 -13 -19 -12 11 8 -18 -20 -15 23 22 16 12 -13 -15 17 13 -25 -15 22 18 -4 -29 3 12 22 31 -5 -3 23 6 29
6357 29 15 22 3 16 -3 0 15 -13 -11 7 7 22 20 2 -11 -34 11 -50 2 17 -7 28 -23 -20 -29 16 11 -8 -30 7 19 0 13 -5
6391ek4j0M4jml2M8mm7K7J6K9l2j2J2MLM4p0J3J0j9N4pk6Jj8kk4jL3k8K7Ljj0
6427il2L8Jk2J7J4MJ9k8ql0J2OK1K5l5KK3j8J0PjJ4k7J9ok6QL0k6N9m9Kkj6Pk8
6464b5K7k2M7l2j1J9j6J9Qm1J2kkK3j8N0m0Kj8K6j0MJ5j1L0rj1l8MK2L0m8jJ0
6498gOK2j8Qj7K9k4Lj4L4l1Rj5K9l6K6l5N2l2J1PKj2L1n4QL0%plJj9K0KMoj1J5
6536Hk8oQlJ4rJ6oL2j7l4K4jK8Rk6J7Mk0qK2K9o4L2ol1k4M6L4p4O7m3J5l9PL4
6572GJ0j1l9J9J8k0L1k9lJ0m7Q9m3k0L9qj4MNK6n4N8J7p3N6j4J9j8lj1K3K2o1
6605a5J2L2m7J5O2m7J9l9J8k2K2rPJj8j4J3k7K1QkK1l9J9lJ1n3L5J0j6%QK8o1
6639e0P5l1j9RJ4KL5k4m6M9j5Pj2qK6L2j4l8K2K5l1K1l2J2m3M4j4k3M8k5P6p6
$$ plain form
6391 -5 -29 -39 5 4 0 -32 16 12 -35 -8 8 37 5 -7 5 9 12 56 -14 -1 9 -10 44 37 11 12 -6 -8 -32 -33 0 -28 -1 2 1 -9
6427 -9 -41 -3 -2 -24 -7 7 11 30 2 -6 -36 -24 -18 3 28 -7 -5 18 0 10 17 16 30 3 22 16 -10 -2 28 2 61 12 14 12 -4 3 -25
6464 -25 2 -20 27 -5 -16 3 -13 6 14 -27 -15 -17 -19 4 -14 36 -4 -2 -20 6 -4 0 15 4 34 25 14 -24 -20 2 32 -16 -17 -7
6498 -7 -1 21 3 11 -6 23 -1 2 -12 22 -9 0 -15 14 -22 4 -31 21 -11 0 7 9 -3 28 -26 -18 12 12 5 2 3 -16 4 6 10 4 -7 8
6536 8 -20 -26 -18 -21 -7 -16 0 -6 26 9 -25 -1 -2 26 35 9 26 30 10 2 24 53 -11 21 15 -16 -40 6 40 -34 33 -10 5 -34 -27 7
6572 7 17 6 -33 -14 4 -16 15 -14 -17 -7 -54 35 -8 -28 11 3 -11 -7 -2 24 -30 28 45 -28 28 14 33 15 12 1 24 46 -15
6605 -15 -3 29 -18 -3 59 12 31 -8 10 -12 10 1 8 9 -9 -23 -10 -37 -16 -8 -10 11 -28 -9 -12 -1 -54 -19 -9 -25 -25 -17 11 -50
6639 -50 25 -6 -25 -16 -2 0 35 11 -35 14 -1 6 -6 -14 12 44 30 -8 14 39 8 29 -3 9 -34 10 -4 -27 21 -4 72 -4
6671dOk8L1PJ5m7pJ3J1j1J0J7l3K8Jm5M5j9J0jk4J0L0j6Lk8K2OK7k5j2PJ3J9m8
6706a7QJ0Kj7J9l9M1j3Nm4P9n1L7j5J8J7n4Nk0L9Lk1oJ3LJ2l0Mk7M6J2j6Qo%L
6742HK3k8m0O5J1J5o7K5k7K7Kpk9M7l5J1jK8J5l4J6j8Koj5k3L9m8M8J9Ml7Pj7
6776b0J6M%j6knL1J4j8j5Lk5J5k7K7mK8J2k3k1K1oM5k8KjqLJM0m2J6K6m3M1k2
6812A9pL5l3lK6l0j3qL0k0lk3oM0j6K8Jj4l0L4j7pJ6k7N6m8kJ5MoJ3l2J2K3m7
6847d0L2j1J4M7q8O1J5m7K2rJ1j6K5Kk3J6J1J3l7kJK9j1j2J7m1J6K2k9Lk7L0J4
6880Hj9j1J2k8L6L1k2k7L8k5J5j4J8qlm0N0J4l4L4l0k6L1K7o4O0j1Lk1k5NM2j0
6913Fj6K5k1J0oM1m1k0K3J5j0QPok1Oj1J4k2k5L8rlj7M5rj3rOJ2j9j0J7QK7K0
$$ plain form
6671 -4 2 -26 5 12 27 -20 -27 -14 -3 -14 -4 13 -20 8 9 -36 9 -10 0 -1 -25 -15 15 -1 2 -26 -4 2 29 4 -8 -1 12 31 -17
6706 -17 -9 1 3 -14 5 -34 7 -6 -1 -45 34 -17 20 5 23 40 -14 -9 -29 10 13 -8 -14 -1 2 14 -16 -12 -39 7 19 3 11 5 5 8
6742 8 31 3 -37 28 39 54 -13 12 -15 12 14 7 -22 25 -10 1 0 28 43 9 25 7 9 3 -12 -35 4 -44 4 23 27 -10 -3 -20
6776 -20 -4 0 0 -16 -18 -23 8 22 4 -11 -8 -33 -18 -45 -18 -22 6 18 -5 -26 -5 -11 34 6 8 7 -1 2 3 43 1 17 43 0 41 19
6812 19 12 47 14 11 37 7 -6 -14 16 -4 -7 -30 -36 4 -12 16 17 3 -27 7 -10 -17 -1 -28 28 -20 -22 -7 -3 -9 4 -28 -16 7 -40
6847 -40 -8 -19 -5 42 -46 15 30 -17 5 -4 7 -9 16 18 -5 11 22 35 -2 -4 -3 26 15 3 20 -21 -5 17 -12 -9 -36 -6 8
6880 8 -11 -22 -10 -38 -2 29 7 -20 18 -7 8 -6 12 4 1 -39 11 25 -9 25 -5 -31 0 27 -37 23 12 15 -6 -31 -26 16 6
6913 6 -10 15 -6 4 -2 39 -2 -22 1 16 6 14 21 15 -6 0 -11 3 -19 -44 -6 -15 -18 -35 10 1 -12 -21 -15 -3 -22 -32 -15 -7 20 40
6949D0p4L2J6j8J4j6RK2k4K5j8k1%M0Jrj6L0k6l6M6l5K3Ok7L1k3L0Jk9L2l0m9
6982e3N7joJ2jn3K5L5j3k6Ok1L6k5Mj2L1qJ5J2j9l7M4M1m7L1m3L5J0k1l7M0L7
7015D8l5J0j0j2j1M0n4L7K1m9K3Oj4kmJ9Lm6qM7k3j3L8k1Omm3L7KJ5J6%oo4N6
7050Ej3JJ8k8K1pP%J7j8M6k9J0j9qJkK5m4O0m1QL3l2Jk2J7L3k9k5J7J9l7qj0K7
7086fOpj9K3L0j4j0Ok2M4k9l7K0KL8k7Qm0J7L0l4L9m3L2Kk2OK2J6k8MlJ5OMq6
7122e7O3j9Qk1J8lM8k4m7L5K7k1k4K1LKl7K4J4j6mJLk7J7J0j6L0j5KRJ3k5j9L9
7157A2j6K0k0K4k7qJ5mK1kJpNJj8J5%lK3m5L8m4L0kp0M6J9j8J6nJ4Kj4k0oj3N4
7194A4Jl0JjJ7l8K6J8oLj1L9j7j9KJ0j7K4k3J0k3K4k6M4m4L5k0RqL2Ojl0KRK7
$$ plain form
6949 40 -34 -2 14 -4 10 -6 3 25 1 26 8 -13 -13 27 28 19 3 33 7 -29 17 -18 5 11 -16 15 -8 22 23 -6 26 -4 -53
6982 -53 4 3 -3 9 8 -45 -20 15 2 -24 -18 -39 -3 -28 -24 -36 -5 -13 2 14 -5 -42 2 43 -4 27 -16 19 29 8 -29 11 48
7015 48 13 23 13 1 -10 30 -24 13 34 -15 8 14 0 -2 -6 13 16 -30 -38 9 -14 -27 11 -10 -4 -8 -51 -14 -12 3 19 19 13 -51 5
7050 5 -8 -7 11 -17 4 -3 4 4 21 3 49 20 30 11 3 4 2 27 -17 43 2 10 43 11 12 -10 7 40 11 -14 3 22 -15 -23 -33 -6
7086 -6 0 -7 -26 -3 27 13 3 9 -13 31 2 -35 -15 -13 25 -2 6 -34 -17 13 -21 18 -25 7 9 -13 -7 15 31 3 7 4 19 25 29 -57
7122 -57 6 -13 -5 -26 -8 -11 37 13 -34 1 28 7 -17 4 7 9 -28 -4 10 -6 -10 -9 -6 -33 -16 -6 -22 8 -7 -5 4 17 -8 -27 12
7157 12 -4 16 -4 20 -7 -15 0 -4 17 15 16 9 14 15 -3 12 12 9 32 -13 25 -19 11 9 -61 -15 4 -14 2 -3 11 13 -1 -21 -27 -40 14
7194 14 15 -15 -14 -15 2 -36 -10 8 2 5 -6 33 16 -3 -1 9 -8 16 -7 3 -20 4 -22 22 -22 13 -7 2 -6 26 32 31 1 3 12 39
7230C9k5j9L0k6l%nJ6J6%j9pj9J8m3J3K6l2K4k3O0k2j1J5J0pk3K3L7n5L6m4L6
7263A6m1P8k4k1J5k1L0J3k3nk6J8Lj9M7n6PL3j7j8LmJJ0lPJJ3j9k4M0j5Noj3L0
7299A5l3PkpKL8k6PRONm6K4Jk5K8j0K0l2L6j6j0J1K0k0J5j7K0qQj9KomJ9j7K6
7336B1k9rmlJ4j5N0o5N3m6K4J7J4k2j2N1o9K8qkOj2K8l7N9rnM8o8J9j1j9L6j4
7370IK1l3K9jk3j0Q%L4j9NK3j0Jl1%J7l7j0L5k0%J3m5K8J0Kl2j5N9%mj9K9k3k6
7406c5J0nN8m1RL0p6J9O1j2j3j2M2k8K8m3k1N6%K0m2l3L7K3m0K2k1j0N7l5k0J6
7438AJ0l0QK6l0LL9j7k2K3Pl1j3M2j4k4J1pPl1O2qol7N4K2m0j4J6j3KM4k7k0L0
7473B3j3k5kJ9%J1kQqJj7n%Oj8L5Qk7qJ1k6k0K4J0L2k8L8m4O2k1j7lK7l1j7J7
$$ plain form
7230 39 14 -5 25 -1 -4 -4 -9 7 23 23 4 -3 -22 -4 -47 -34 -8 -40 -16 -39 21 -1 -12 3 13 6 -17 6 43 -12 24 -20 16
7263 16 -25 53 29 8 23 2 32 45 22 17 -9 9 12 -7 40 -16 -9 24 7 -11 -8 -12 -11 -1 -4 3 4 17 -2 -26 14 -1 4 -2 -15 15
7299 15 -18 -11 -13 -20 -18 20 -6 1 10 16 21 -25 -1 0 -25 3 -7 13 -19 17 1 -9 2 22 2 17 0 20 12 20 1 3 -3 -7 12 -5 21
7336 21 -8 -17 -21 -24 -10 -25 25 -40 13 -33 -9 8 22 0 -12 39 -30 -2 -10 -12 -6 -18 10 -27 32 23 18 66 -2 17 6 -13 23 9
7370 9 30 -3 26 25 2 -8 0 0 34 15 20 43 33 34 3 3 20 -17 -27 8 -12 -12 1 -44 -16 -6 -4 -36 -51 8 8 4 -15 14 -9 -35
7406 -35 -25 -30 28 -13 -4 26 -50 -31 30 18 5 -7 35 7 35 -8 -29 27 27 47 5 -28 9 32 -8 14 -7 -17 40 5 -15 1
7438 1 11 -19 -11 15 -15 -12 27 10 -12 11 18 -13 -26 16 2 -22 -11 -18 -11 -42 20 12 6 -31 23 45 5 -9 7 -6 -4 40 13 -7 23
7473 23 10 -15 -17 2 2 13 11 19 11 12 -5 -10 -10 -4 -22 13 21 -6 -14 -3 -29 -49 -25 -15 17 -11 27 -17 45 24 7 4 31 0 -17 0
7509@J7l7K9%lK5j8j1j9K1k0ML8MJ3l4%Qj7K2l6K5%k7oL6k3L2k3J8okpjJ0l0M3
7546B5J4n4J7jrmL2l5J7m4M5K0o0oL8NLm3O2k0jJ2l0mJ7j0J7J7Lk0j4Nnj2J3J
7582iNL5j8k2L0j9K4k4j7qL0j0J6k2Kj6J1K7J6J7p1K9k1k4L9j6J2K0m1J4K6k9
7614a4J3j9JK9Pj4LK0Lml5L8k1L2m7K8k0%mJ0J2k8k0L3J0rJ1nk0J3Pk1L8l7j3
7649b3J7k2JOJk2RmJ6M1n5M8Mj5k9M5j3j5J6kK1m4pQM5k7j8J5K9Rk5Ql7OKL2J3
7686C4j4k5J7Lj8J5j5J2j8J4pQlj6J0j5%K1%j8JKL7j8KPk5J5J1Qm7K4J2Rl1oj
7723a5l0J7L8lQk6J3k1N5l8K0J0k5j7L0k0nj3K2KjLk4rK6j5K0Kj8M1m1Rj5K8J
7758Ik2jk4L9nmJ4Qk4Qj5%lK5J2qJ8j3J2kj3kl7M0J3k2J2J0k0kL2k8mL1j9Nj4
$$ plain form
7509 0 17 -20 9 9 6 31 13 2 -17 4 -16 -12 26 30 43 9 9 17 0 22 -14 11 11 -16 -22 14 -9 23 0 18 12 10 3 2 12 -18 25
7546 25 39 -15 2 1 -8 -12 20 -15 2 -42 3 23 -37 -43 -5 0 3 -40 22 2 1 13 -17 -21 -4 -14 3 20 23 3 -11 -6 -11 -23 -10 -9
7582 -9 -4 31 13 -9 21 2 26 2 -15 -23 7 -3 13 -9 -7 -23 -12 15 31 48 -23 6 -15 -39 0 -16 -4 16 -25 -11 15 -14
7614 -14 -1 -20 -19 10 17 3 6 26 29 25 -10 28 7 39 -8 20 0 0 -4 6 18 -10 -30 3 13 4 15 10 -10 3 10 -11 27 -10 -23
7649 -23 -6 -28 -27 -21 -20 -42 -33 -37 -21 20 -35 13 17 2 -27 18 5 -10 6 4 25 -19 -26 -18 27 0 -18 -3 26 35 10 18 -19 -13 -11 21 34
7686 34 20 -5 12 15 -3 12 -3 9 -9 5 -2 6 3 -13 -3 -18 -18 3 3 -15 -14 -12 25 7 9 16 -9 6 17 25 -22 2 14 23 -8 -14 -15
7723 -15 -45 -28 10 7 15 -11 2 -19 36 -2 18 28 3 -14 16 -4 -9 -22 0 2 1 4 -20 -29 -3 -18 2 4 -14 27 -14 -5 -20 8 9
7758 9 -13 -14 -38 1 -4 -8 6 14 -10 -2 -17 -17 -20 5 17 9 27 14 26 24 11 9 -28 12 25 3 15 25 5 3 35 7 3 34 15 20 6
7795FJ8m5K5Mjj4jL0l3j0k9O1J6k5j7l1O1J1l9JoM1Mk3ml0L9j1J1J1l1M1n5M4
7829A9%k0j6MK6j1noM1l0K2ll1L0Pk9Nk8K1lQKkK5k8k3J1RL8k4k4J1j6K0qnK0
7866GPMn8L7k7N4m9M8Ok0J4l5J5MJ7jrj7L5K1m2k0L7k1nJ4k5%%L8l1j2KK8jrk3
7903a7J1NJ9J1Jk3j5J6k7l0N3l9J5J9j2Kj9L9k9LK8J3j3l7L1LOk1L1Kqj5MK1L2
7938F0m4j1J4Qk2NJ1pJ0j2l0L2L2r0L2Mk7M6k1J8j5j7K5M9m4J1plnjMJ3l9J8J
7973bK4J1j2j2L4j6k8Nj0K6mm5L5L2l4J4l9J5Mj1J9KRoPPk1qn1N2kmJ7j3J7m3
8009c1L8Ql0MK3k9J5k5K0lk2L8Lk3j0L6Nj2rKk5K9K1j9k2k6O2J7ooL6m2kJ8pl
8045B3pJ2j0J3k5K1n8K3K0Pp%l8J1K9Ln3lM9m1K5LLj7N3m0L3m3K0Lj0J9m7N6j0
$$ plain form
7795 6 24 -21 4 8 7 -7 -8 22 -11 -21 -50 11 27 2 -15 -46 15 26 -13 -12 -18 23 27 4 0 -30 9 -2 9 20 -11 30 -25 19
7829 19 19 -1 -17 -13 13 2 -3 -9 32 2 24 21 -10 20 27 -2 3 -25 -4 -7 1 3 1 26 -2 -25 -14 -5 33 9 -15 -4 -20 0 -8 -13 7
7866 7 14 18 -40 -3 -30 24 -25 23 29 9 23 -12 3 7 24 23 14 -3 32 53 11 -9 28 7 2 16 -9 -9 -9 29 -2 -14 -12 16 15 6 -17
7903 -17 -6 -1 18 29 30 7 -8 8 -19 -49 4 -35 -20 -1 -13 -11 -30 9 -20 -17 11 24 11 -26 5 8 14 -7 24 26 18 3 7 28 60
7938 60 16 5 19 27 5 10 21 14 24 12 -18 14 46 -44 -12 -8 -35 11 -10 8 -7 -24 1 50 6 17 10 7 2 1 5 18 -21 -3 -2
7973 -2 22 33 21 9 43 27 -1 4 -6 20 16 -29 6 38 4 18 -21 -6 -2 -13 6 8 17 11 18 25 4 -4 -55 -3 -5 -9 8 -5 12 -31
8009 -31 7 15 -15 -11 12 -17 -2 -27 -7 -10 -32 6 9 -14 -24 12 17 5 -4 -2 -27 2 23 4 -18 -44 18 35 29 23 59 17 15 33 26 23
8045 23 16 28 18 31 6 27 -31 -8 12 19 12 12 -26 -15 14 17 -36 -39 10 -31 -6 -3 0 -17 36 -4 29 -14 6 9 -1 18 -29 27 17
8080A7k9pN4k4j3L7m9K9j4jj6MNNmK6m3L1OJ6pOJ4o1M3k4k3jL0l2nL8M6n2j8P
8116iM2j3l1mL2k3j4N0k5k8K1j2K0J4j3j3J2J6m3M5Mk3kQJ5Ojn9K3Rj5L8l2L3
8150B8j6j1K0J1j8j7k3L3nJJ7J3m9RJJj2Lj0J2j6J0L0l7L7m3K9L0n8J6k3N5l2
8183a4M0Nj1Ql8J2Qj1
$$ plain form
8080 17 -12 -19 35 11 -2 35 -14 15 1 0 -16 -12 -7 -2 -6 20 -23 8 14 30 23 29 43 -18 25 1 -22 -23 7 -25 -30 8 54 2 -16 -9
8116 -9 33 20 -11 -15 17 -6 -20 30 5 -23 -2 -14 6 20 7 -6 6 22 -21 24 28 5 3 11 26 32 31 -28 -5 4 -11 27 -5 28
8150 28 12 1 21 32 14 -3 -26 7 2 3 20 33 -16 -7 -6 -5 -17 -14 -24 -12 -28 -18 12 -25 12 -31 -2 28 -30 -14 -37 18 -14
8183 -14 26 31 20 28 -10 2 10 -1
8191a
$$ Imaginary data points
##PAGE= N=2
##DATA TABLE= (X++(I..I)), XYDATA
0@%%%%%%%%%%%%%%%%%jJ7l2L2l2L2l3M9o4O4q0R6j12J28j44J61j77K08k40K69
37A41l00L35l69M09m57N07n62O24o88P59q40R28j024J122j234J362j503J660j833
56i63K027k251K512k813L168l597M123m790N674o900Q716j1730J7938n2291R8258
71E7081K1543j86289M9999J34904o4232j36302O7108P4297p0279l3270R4838P73
83A0171q9533K0821Q9488l2814n4268N6542L9400o9503j3971P3302j858o3911
95c6134L4444O6749l6075m6848M5445K5035m6161q22M2925l1828m8299M9859N3813
108G2103m7841l2749O0607K3682o6498k8929L1560p988k5288L0385J6321m3744
120a8379j675N1749k0396o5305K9521O3333m1537n7384M6868L5188o7351k6889
$$ plain form
0 0 0 0 0 0 0 0 0 0 0 0 0 0 0 0 0 0 0 -1 16 -16 16 -16 16 -17 32 -32 32 -48 48 -64 64 -80 81 -96 112 -128 141
37 141 -159 176 -193 216 -241 266 -296 328 -360 399 -441 487 -537 585 -649 713 -790 870 -963
56 -963 1064 -1187 1325 -1488 1680 -1917 2206 -2584 3090 -3810 4906 -6824 11114 -41177 57081
71 57081 78624 -107665 -57666 77238 13006 -123296 -56188 18109 -52170 -85440 9398 10171
83 10171 -79362 -58541 30947 -1867 -56135 407 39807 -29696 -43667 29635 27777 -36134
95 -36134 -1690 65059 28984 -17864 27581 52616 6455 5633 48558 16730 -31569 18290 72103
108 72103 24262 -8487 52120 75802 9304 -19625 11935 3947 -21341 9044 25365 -18379
120 -18379 -20054 31695 11299 -54006 -24485 38848 -2689 -60073 -13205 21983 -45368 -72257
132g2257P7601K3641o7870j678O8418j4181o9798J6200N4289k1893k8260M4810
144I022K4380m5743q502N0306p8m6090J0615M1310j7265l5466J6993K3853j2584
157A0751p86K5190l119k5893K995J2207j8835j4045K1643J2333j8676n638J2723
170A0850q231j5928J1610J2960j3711r356Q815n846j7485N072J3730n065N6J7883
184E354k157k5202j464J7906q092j6556J8069K1909j4561j1959K0738O761k3422
197a2676J357K8192m221k5868J0337K3299j5017j8041K1943J8758j7713q897J9449
210B0902J362k2917j172J7382m637j4239R054J1662j0591p300J0336L63j3143
223b938M59P303r005r004Q612M560r170P76J0501m081j0567M359M970r574m021
$$ plain form
132 -72257 5344 28985 -38885 -40563 27855 13674 -56124 -39924 14365 -7528 -35788 9022
144 9022 33402 -12341 -20843 29463 29385 -16705 -6090 35220 17955 -17511 -518 23335 10751
157 10751 9965 35155 32036 6143 9138 21345 2510 -11535 10108 22441 3765 -1873 10850
170 10850 2619 -13309 -1699 11261 -2450 -11806 -2991 -8837 -26322 -21250 -7520 -12585 -12529 5354
184 5354 3197 -22005 -23469 -5563 -13655 -30211 -12142 9767 -4794 -16753 3985 10746 -12676
197 -12676 -11319 16873 12652 -13216 -2879 20420 5403 -12638 9305 28063 10350 1453 20902
210 20902 22264 -653 -1825 15557 10920 -3319 5735 17397 6806 -494 9842 10205 -2938
223 -2938 -2479 4824 -4181 -13185 -4573 -13 -9183 -8407 2094 -1987 -12554 -8195 -3225 -12799 -16820
238a6820J0629J734r093L899J1536m297p309R395O398j1408l637J2314j70j1479
252h308O693J4431o513q618J2809P641j4528m757J4677n41j6626K848J5560n357
266I411j2277J0443J1425j3025j0545J1185K850j6244k571J4256j579j2777M808
279d640J0007q297q298Q524L422j1053k265Q578k639q808N193Q865m252l546Q369
294h40K457r467j142Q201j947o739O542R006m626l500Q546K873p567L42P462k728
310F873o665M336N165m930j835P781K090o448M00N004n032p982L579M179o762
325b47l148Q088J461q679k75O981m010q507L057M491o590m733O271K762n756m5
341h879O633r11o157J257L808l743l081N164L434l154J325O333l71l881L039L403
$$ plain form
238 -16820 -6191 -4457 -13550 -9651 1885 -2412 -9721 -326 6072 -5336 -8973 3341 3171 -8308
252 -8308 -1615 12816 6303 -2315 10494 18135 3607 -1150 13527 12986 -3640 -792 14768 9411
266 9411 -2866 7577 19002 5977 -4568 6617 9467 -6777 -9348 4908 3329 -9448 -4640
279 -4640 5367 -2930 -11228 -2704 718 -10335 -12600 -4022 -6661 -15469 -10276 -1411 -5663 -9209 -840
294 -840 1617 -7850 -8992 -791 -2738 -9477 -2935 6071 1445 -2055 6491 9364 1797 2139 9601 6873
310 6873 208 4544 9709 4779 2944 10725 12815 6367 6767 11771 6739 -1243 2336 6515 -247
325 -247 -3395 4693 6154 -2525 -2800 4181 171 -8336 -5279 -788 -7378 -12111 -5840 -3078 -8834 -8879
341 -8879 -2246 -3157 -9314 -8057 -4249 -7992 -11073 -5909 -2475 -5629 -4304 2029 1658 -2223 816 4219
357D219m166k215M999J526l676J957O060m01l149K694L075l436l117K469O28l997
373C470n71L562l04k627J754J833l626k959J248j380m046O15K670k022k398K466
389b315J068l693j347K811o81m136k64K531j250k187L060L830j274j293K871Q92
405a377l203l91K985K71j199K023K255n33L67K729R20j091N43J194j167j541J086
422C871J482m49J11J944M19k165q33J050r06k294k46O78r32j095J8J08j45j43
440D73p44j087n73r23j617m20P89k60r13O95J417n33j400P12J538q17j623Q46
458d440J435o94k21K462J501p76N08J701l40j475O11J451J95n9P29O33M5K61N27
477D054K77l9O9j55q94j087l27J32L24K93n9l44p6m86j556n83O93o59j518N97
$$ plain form
357 4219 53 -2162 2837 4363 687 2644 8704 8303 5154 7848 10923 7487 4370 6839 7467 3470
373 3470 2899 6461 6157 3530 5284 7117 3491 532 1780 400 -3646 -3031 -361 -2383 -4781 -2315
389 -2315 -1247 -4940 -6287 -3476 -4157 -8293 -8557 -6026 -7276 -9463 -6403 -2573 -3847 -5140 -2269 -1377
405 -1377 -4580 -4971 -1986 -1715 -2914 -891 1364 831 1198 3927 4847 3756 4299 5493 4326 2785 3871
422 3871 5353 4904 5015 6959 7378 5213 4380 5430 4524 2230 1984 2662 1730 635 653 761 616 473
440 473 -271 -1358 -1931 -2854 -4471 -4891 -4102 -4362 -5275 -4580 -3163 -3696 -5096 -4384 -2846 -3663 -5286 -4440
458 -4440 -3005 -3699 -3920 -1458 43 -733 -225 1476 1136 -339 272 1723 1918 1859 2588 3221 3266 3527 4054
477 4054 4331 4292 4361 4206 3312 2225 1898 2030 2354 2647 2588 2244 2168 1682 126 -457 236 -423 -1941 -1344
497a344P52k022j334K467J261k621r05K512j47l629r6L493O5k578J919L630k215
514g92l388K954L287l120k119M351J898m299j067M468Q03l101J339M075j378m037
530a26R23K571k170k278K849K613k419j836J948J89k746p7K362n70k355L1R53
547a38j033j171Q29J424N5j116r84Qj6p47q9J649J337j158j134J199J013j610
565a682l41L151J185l307j148L151J17l056K062N045j191m090J667K668l720k963
581b452M592L535l875k366L806P41n241o72N453M64m811k3L406k445m437K160
597b165M143j592k595J739Q83l271k147K224K061j167r58J359N99j978j149K141
613a873K343p10j486P27Q47j998j577L046L730j137k010K510J167m319j599N164
$$ plain form
497 -1344 -592 -2614 -3948 -1481 -220 -2841 -3746 -1234 -1381 -5010 -5106 -1613 -1548 -4126 -2207 1423 -792
514 -792 -4180 -1226 2061 -1059 -3178 1173 3071 -1228 -2295 2173 2976 -125 1214 5289 3911 -126
530 -126 797 3368 1198 -1080 1769 4382 1963 127 2075 2264 -482 -559 1803 1233 -1122 -1091 -138
547 -138 -1171 -2342 -1513 -89 -34 -1150 -2134 -2126 -2142 -2889 -2978 -1329 8 -1150 -2284 -1085 -72 -1682
565 -1682 -2023 1128 2313 -994 -2142 1009 1126 -1930 132 5177 3986 -104 1563 4231 511 -2452
581 -2452 2140 5675 1800 -566 3240 3981 -1260 -1932 3521 3985 -826 -849 2557 112 -4325 -2165
597 -2165 1978 386 -2209 -470 413 -2858 -5005 -2781 -720 -1887 -2845 -1486 -887 -2865 -4014 -1873
613 -1873 470 -240 -1726 -999 -152 -2150 -3727 -681 3049 1912 -98 2412 3579 -740 -2339 2825
629B825K104l882J88M213k165n610K612N602k518l771M118K516o773m000N894
644A353K681n351n7O237j697p712Q18N349k609m149M147L292n091l344L823J562
660g48l101P38L966j158m026K86J915q82k61K825J395j226k75j30j258R91K848
677A899j83j505J920Q49l589p54M549J161k837J735L333m019m850L578L556m087
693G56j180O250L81p594n17O283k171o266M249O138o216o611N748L779p039j510
709e520Q436M36q736J27O533l251o471N189O808n069n344N426L444o039j686P052
725A335J456n801r2M449j755l575L505M351j764j793J957N6k654J16K305L03j86
742B213J062l19j805K00J048p28M8K044o56l416Q2K262j849k295L526K782l951
$$ plain form
629 2825 4929 1047 1235 5448 3283 -2327 285 5887 3369 -402 3716 6232 -541 -4541 1353
644 1353 4034 -1317 -1374 4863 3166 -4546 -3728 1621 -988 -5137 -990 2302 -2789 -6133 -2310 -748
660 -748 -3849 -3111 855 -303 -4329 -4043 -2128 -3010 -3271 -446 949 -277 -552 -682 -1940 -949 1899
677 1899 1716 211 2131 2980 -609 -1363 3186 4347 1510 3245 6578 2559 -2291 1287 4843 756
693 756 -424 5826 6207 -1387 -1904 4379 2208 -4058 191 6329 113 -6498 -750 3029 -4010 -5520
709 -5520 2916 3352 -5384 -5257 1276 -1975 -8446 -3257 3551 -1518 -6862 -1436 2008 -4031 -5717 1335
725 1335 2791 -3010 -3102 1347 -408 -3983 -478 3873 2109 316 2273 2329 -325 -209 2096 2399 2213
742 2213 3275 2956 1151 1351 2399 1671 1719 3763 3107 -309 -227 2035 186 -2109 1417 4199 248
759B48k763L053K42m553M09M776j036m352J602L277l154k866M228K878m147j911
775d069L843r7m572J208N320r06l532K523L028l571k720L888K364l025p01L394
791B375k0l461N63L449k46k265J176J864j988k302J179J711p05m56R95K34j125
808I78r38k16L97L50m10n44M86J02j491m94J699P69j481m17J388o54k311L11K241
827b35k74j488J432J563j985j619K259J353k079k51K510k58k622N92K447o68j437
844g60J706J305j957j378J760Q08j618L8K028j50j967K14J336p52j106Q98O60
861A065j234o12P20K3m90L49L77k81j53O3n06k81M81Q0n23K24O65l43p64O85Q30
882C75q09n50J329N49j514n5J693j57j540Q06J614r90j435J289R59j532o00J800
$$ plain form
759 248 -2515 538 780 -3773 -3364 1412 376 -3976 -2374 903 -2251 -5117 -889 1989 -2158 -4069
775 -4069 -226 -323 -4895 -3687 1633 727 -2805 -282 2746 -825 -3545 343 2707 -318 -1019 2375
791 2375 2355 -1106 -543 2906 2660 395 1571 3435 1447 -855 324 2035 1330 874 1869 2103 978
808 978 40 -176 221 571 161 -383 103 205 -1286 -1780 -81 688 -793 -1210 178 -476 -2787 -2476 -235
827 -235 -509 -1997 -565 998 -987 -2606 -347 1006 -1073 -1324 1186 928 -1694 -1102 1345 677 -760
844 -760 946 2251 294 -1084 676 1484 -134 -96 1932 1782 -185 29 1365 613 -493 405 1065
861 1065 -169 -781 -61 -38 -528 -179 198 -83 -236 -173 -679 -960 -479 -399 -922 -698 -33 -376 -1140 -455 375
882 375 -434 -984 345 894 -620 -675 1018 861 -679 127 1741 751 -684 605 1564 32 -568 1232
900A232M19j660k0J535m03j583O20J277j061j241J038M93j475l65J485p7j392
917a178M06R93r14r28R11O13r27l04R44j1r36J89Q92k00o77O20N33o15r1R30J13
938C63n10N00N69n60k53Q04J03o53L40O78m30n51O74N66o54l34P82N8j061j05
958C26Q86l51r67L70O82q34p25O62K20r61k02O60l04q01L55N26n46m23M71J23
978h33p24m8O78Mo30L24O17l49l70Q00N10n08PP52p6n54M14O25k08j26N73K52
1000A130l49J20M09j0l13K06K69k98j60L75O7n14Q3L00m04n68K54K37o19k62L85
1021C38j35o96O8L40l71m61K39R4n23l07L94K2m06O2M52j30m52L63M19m06k52
1042a348O75J64m43K35P36q3l75M02M68k95j69N47L46k59r2M37J24l14M3M24J8
$$ plain form
900 1232 1651 -9 -29 1506 1103 -480 140 1417 356 -885 153 646 -829 -1194 291 214 -1178
917 -1178 -772 221 -693 -1621 -710 -97 -1024 -1328 -384 -395 -1331 -1142 -250 -450 -1127 -507 26 -589 -680 250 363
938 363 -147 353 922 362 109 913 1016 363 703 1381 951 400 1074 1640 986 652 1434 1492 431 326
958 326 1212 861 -106 264 946 112 -613 49 269 -692 -894 -234 -538 -1339 -984 -458 -1004 -1427 -956 -833
978 -833 -1557 -1605 -927 -923 -1553 -1229 -612 -961 -1331 -531 -21 -529 -522 230 154 -400 14 639 431 305 878 1130
1000 1130 781 901 1310 1300 987 1193 1462 1164 1004 1379 1446 932 1015 1315 911 343 597 834 215 -47 338
1021 338 203 -493 -425 -85 -456 -917 -678 -584 -1107 -1414 -1020 -998 -1404 -1342 -890 -1020 -1472 -1109 -690 -1096 -1348
1042 -1348 -673 -509 -952 -717 19 -64 -439 -37 431 136 -33 514 860 601 509 946 1070 756 799 1223 1241
1063A241l18J20J19k69j85J91l9j61M5o2l22k3K6k68j73J66j88l29J6J14k15k94
1085h08J93J51l68l37L72J43m11l7O42J2n93J66N54l52l93P07N36n12k54O90K08
1106C09o42R8Q48N3n94J92O06l44o43M93P72l74m60N33K53p46k90N42J77m10l9
1127C34K22k0m81j06K85J25l49j59J38m7l68k24L62L14j59k77J14J63m77l78N73
1148d15M99n03k39P10O6r76P7J166m6q74L84Q22p48r07Q61R37o79m77J063M13
1168A134j497n06J411K01j266L08J352n48j424N62J139o79q52J018O05j238p70
1185a050Q74N07p63j8J033Qj141j30P22j16n59M67P26l51o51Q5L49Q9j07K00M55
1206F29o9p01l32M62L46l07J15Q15K4j067k47P73M1p76L10J044n00j326L71J082
$$ plain form
1063 1241 923 1043 1162 893 708 899 860 699 744 682 360 337 363 95 -78 88 -100 -429 -413 -299 -514 -808
1085 -808 -615 -464 -832 -1169 -797 -654 -1065 -1102 -460 -448 -1041 -875 -321 -673 -1066 -359 177 -335 -589 101 309
1106 309 -333 -235 613 666 72 264 870 526 -117 376 1148 774 314 847 1100 354 64 606 783 373 334
1127 334 556 536 55 -51 234 359 10 -149 -11 -58 -426 -650 -288 26 -133 -410 -296 -133 -610 -988 -415
1148 -415 84 -419 -658 52 118 -858 -781 385 339 -535 -151 671 -77 -984 -123 814 135 -342 721 1134
1168 1134 -363 -869 542 743 -523 -215 1137 589 -835 -273 866 187 -665 353 958 -280 -1050
1185 -1050 -176 331 -432 -450 583 591 -550 -680 42 -74 -633 -166 560 209 -442 -357 -8 81 -26 174 629
1206 629 560 -141 -473 -11 335 28 143 958 982 -85 -332 441 482 -294 16 1060 560 -766 -395 687
1226F87o97p89J215P89j520j020J205L63j345P8J660Pj670p5J283l99j279Q45
1244f62J471q51j298P88R31j068m37J526P26j234n24R15N6j029K23J390K72j001
1262A94j64Q04j58q55L25J198q9r72m3N92l83p16N36J026k78r22J8M23n92q58
1282i14Q05R64o78q93O06L36j124m06J163N20j075l97P83p4j181J28J411J88j044
1301h82J65P97o08r93P02J167l49n31O18L92p97m26R39O66m44k19N98P7r16k07
1321b51R80N30m89j48O89k41j014j35Q51L18o61m5O82l22j224N8J154r1r50L19
1341A0O91q64j298P18J018n94o92R09M98j357p94J106O33r47j57J204j4j435j3
1360a378J292k7q11O69R23p39j026O44Q17m61j97R58M22r03m77P48K57n89J35
$$ plain form
1226 687 -10 -799 416 1205 -315 -1335 -130 233 -1112 -1034 626 633 -1037 -1112 171 -228 -1507 -662
1244 -662 809 -42 -1340 -552 379 -689 -1126 400 1126 -108 -632 283 339 -690 -467 923 1195 194
1262 194 30 834 676 -179 146 1344 1255 283 240 832 449 -267 269 1295 1017 95 113 536 -56 -914
1282 -914 -109 855 177 -716 -110 226 -898 -1304 -141 379 -696 -1093 -310 -384 -1565 -1437 -26 162 -882
1301 -882 -717 80 -528 -1521 -819 348 -1 -532 86 478 -319 -745 194 860 416 197 795 872 -44 -251
1321 -251 729 1259 770 622 1311 1070 56 -79 772 1090 429 384 1066 744 -480 -422 732 641 -309 10
1341 10 701 -163 -1461 -743 275 -319 -1011 -102 396 -961 -1755 -649 -16 -963 -1120 84 70 -1365 -1378
1360 -1378 -86 -113 -924 -255 668 -71 -1097 -453 364 -97 -294 664 1086 183 -294 454 711 122 257
1379B57Q85m4r49k5N99q8l46K98N15l02o27j69L12j01k96K64M67k29p07q9M17
1400D2k26l85L20M82l55p31J43N05k05m51N34N51n28p27M36M81n31k28Q79L38
1420C44p60k30O61J13o31J95Q03o4p58J14O73k34n09N69P21n28n67M25K66n73
1440C0j69O85J89n57j49M68r0n24J05M89j22n29J11L44l32l76L81L53k92k85K78
1461HN7l80j79L46J82k25r2J99Q0k62p7L02R6k06o9J96Mk26M2K39J91j87p9J70
1485A30J8l27j0L50K4k77K1K65m2k84P5L08j41k37J14J37j82k47K07L21k10j71
1507a58K23Q0l12n3K70L4k64O7K47r6j87J33J98n7j37Q9J29j86j16J98J00j80
1529B2K9K30lj96j0J16o4p6J9M7l4o0jN3Lp5nnm8j16l5O1k4l6j3K8M9p8n4R1J5
$$ plain form
1379 257 1142 1098 149 124 723 635 289 587 1102 800 173 4 316 215 -81 183 650 421 -286 -375 42
1400 42 -184 -569 -249 233 -122 -853 -710 -205 -410 -861 -327 224 -304 -1031 -595 -114 -645 -873 6 344
1420 344 -416 -646 15 128 -503 -308 495 431 -327 -213 460 226 -283 286 1007 479 -88 337 603 30
1440 30 -139 546 735 178 29 497 407 -117 -12 477 355 -174 -63 281 -51 -427 -46 307 15 -270 8
1461 8 65 -315 -494 -148 34 -191 -283 -84 -4 -266 -343 -41 55 -151 -220 -24 -20 -246 -204 35 226 39 -40 130
1485 130 148 -179 -189 161 185 -92 -71 194 152 -132 -57 251 110 -127 -13 124 -58 -305 -98 223 13 -158
1507 -158 65 145 -167 -220 50 84 -180 -113 134 38 -149 -16 182 125 -12 77 206 20 -96 102 202 22
1529 22 51 281 278 82 72 188 124 48 67 114 80 20 19 72 75 0 -5 -10 -58 -174 -209 -148 -172 -208 -221 -193 -144 -222 -276 -185 -170
1560a70j41m3J34K3j09R5J92p4o2J38N7j03MJ37lm2L2J71J4n0L8J19mj39R2J02
1586D08j50n6J86m8o6qJ04r5m5%Kj41l0m3k9l6J7j3m0m3p3L6r5m2L6p5p6Q2K9
1615c04r0j3J11m6m0M8O3n5J7O9L8J9K2J17P4n2K6R9M7q9J12P2m2lK27m9j18P4
1643C34J36r6j05R6O4j46o0J62k4j29m9J11m1j86l7R9n7j45l6P7j10n0J2K4j48
1668c04kM3l3o3nk4M7N0m0M1K0kj7J8O3j4OJ12K2N3j2O7P1Qm0J11R6j30k1J75
1698B96j3j11O8K03j18j26P8J20p4j63P8J20j43j70J40J38k45o4J69ok42p1J39
1721Ck4j98M6J56j2k30j1R2%j42N8J62r5j65J8K24j01o0J42J67j55j47J28J09
1745c5p5l7K02J03j69j11K16Q5j85J9K41M5k53PK29q2j74J65K15j39k49M7K13
$$ plain form
1560 -170 -311 -354 -220 -197 -306 -211 -19 -93 -155 -17 40 -63 -59 78 75 33 65 236 250 200 238 357 353 214 306 408
1586 408 258 202 388 340 274 266 370 275 230 230 232 91 61 18 -11 -47 -30 -43 -83 -126 -199 -163 -258 -300 -264 -339 -415 -333 -304
1615 -304 -394 -407 -296 -342 -382 -334 -271 -326 -309 -240 -202 -183 -161 -44 30 -22 4 103 150 61 173 245 203 200 427 378 260 334
1643 334 470 374 269 365 429 283 223 385 361 232 183 294 253 67 30 129 72 -73 -109 -32 -142 -192 -180 -156 -304
1668 -304 -306 -263 -296 -359 -364 -388 -341 -291 -331 -290 -270 -272 -289 -271 -208 -222 -216 -104 -82 -29 -41 26 97 105 65 176 272 142 121 296
1698 296 283 172 240 443 325 199 277 397 323 160 238 358 215 45 185 323 78 14 183 177 -65 -136 3
1721 3 -21 -219 -173 -17 -29 -259 -270 -178 -178 -320 -262 -100 -195 -360 -342 -118 -219 -279 -137 30 -125 -272 -144 -35
1745 -35 -110 -147 55 158 -11 -122 94 179 -6 13 254 299 46 53 282 200 26 191 406 267 18 65 278
1768B78j34k39K20K37k37j79J72R4k79m4K81O4k87j38J96Q6k78o6L26P9l41NK35
1791E1q4k94Q6L77p5l14J18J70j38k02J68L12j46l07K07K04l06j69L80K59l62
1812f5j10L38l9m12J22L83L9l77Q6K46j44l43J63M37j82k48J93J50k68k30L30
1833F9K67k67m8K04j4l05n9L15J10k06l5K08o0l25m0L63L2k35M6J85j01l45N1
1856a90L10L6k55N0J96j71m01K14L62j23k60K26K33m14l23L94K51k91j22L54P9
1877A55m82j21N01M3l58J35M19k15n23K17M69j61k36L04K39l69k66L01K21k58
1897A5m4L48Q9m08j31L14J18k63O5L18n6l91n8K15jj75J16K77j32l63l3K91j46
1920c5j65J79K90k34l73J18K26j88j56K86K30l29k58K34J33k58m7M18Q5m16j04
$$ plain form
1768 278 144 -95 125 362 125 -54 118 212 -67 -111 170 234 -53 -191 5 91 -187 -253 73 152 -189 -184 51
1791 51 -33 -327 -241 136 61 -253 -135 35 -103 -305 -137 175 29 -278 -71 133 -173 -342 38 297 -65
1812 -65 -175 163 124 -288 -166 217 256 -121 -35 211 67 -276 -113 324 142 -106 87 237 -31 -261 69
1833 69 336 69 21 225 211 -94 -153 162 272 66 31 239 179 -146 -186 177 209 -26 20 205 104 -241 -190
1856 -190 120 156 -99 -49 147 -24 -425 -211 151 28 -232 -6 227 -187 -510 -116 135 -156 -278 76 155
1877 155 -327 -448 53 96 -262 -127 292 77 -446 -229 240 79 -157 147 386 17 -249 52 273 15
1897 15 -29 319 408 0 -131 183 301 38 103 421 365 -26 -84 131 130 -45 71 348 216 -147 -180 111 -35
1920 -35 -200 -21 269 35 -338 -220 6 -182 -338 -52 178 -151 -409 -175 -42 -300 -347 71 156 -260 -364
1941c64K95K8l23J55M23r6l44J15K49j20k51L18L07j94k67K05J09k42p1L83J35
1962D50k98p6J84k2k52L2L12J2k63l4J47p2k50J06L18q1l00K7J35j67j87J76K46
1985A43j56j92R9J16k39j79K29K07k02j58K57M9k78q2L55Q2k46PK49j26k62J24
2007b03L65k0k86J58K53k33j86K09K63j88j31K38O4k82o1K82O9k03j4K13n0k97
2029d0L7K26l7j25K5J59j37k18J20N5m7m9O9L3j59q4R6O6l2j09L9P1p9j69J20
2054a69Q8n5j16J76P7j93l3J26J04j13o8K07M0k11j1K25K8k28J47K39j81k37J58
2077@K17j45j03J54J30j89j16K28N1k10m3K48qk23J4J60q5p4P7J35j30q5J4R1
2101A08j07n4O9O2j18j2O9oo5Q6k7n5n2J9mPm5J7N3J5ln7mP5j24M6R3j1q4LQ2
$$ plain form
1941 -364 -69 -41 -364 -209 214 118 -226 -111 138 18 -233 85 392 198 -69 136 245 3 -68 315 450
1962 450 152 76 260 238 -14 18 330 342 79 45 192 120 -130 -24 294 213 -87 -60 75 -92 -279 -103 143
1985 143 -13 -205 -106 10 -229 -408 -179 28 -174 -332 -75 -26 -304 -386 -31 51 -195 -188 61 -65 -327 -203
2007 -203 162 142 -144 14 267 34 -152 57 320 132 1 239 303 21 -40 242 311 108 94 307 257 -40
2029 -40 -3 223 186 61 86 245 108 -110 10 65 18 -31 38 71 -88 -172 -76 -10 -42 -151 -112 -41 -120 -289 -169
2054 -169 -81 -136 -252 -76 1 -192 -225 -99 5 -108 -176 31 71 -140 -151 74 102 -126 21 260 79 -158 0
2077 0 217 72 -31 123 253 64 -52 176 227 17 -26 222 214 -9 5 165 80 6 83 218 88 3 17 108
2101 108 1 -53 16 78 -40 -52 17 11 -54 32 5 -50 -102 -83 -87 -80 -125 -108 -55 -40 -43 -100 -104 -29 -153 -107 -14 -25 -109 -106 -24
2132b4N8j04kJ39k7j39L4J07k6r6Q6J27q6p9J17R0j47p0J58M2j44J6R6Mr4L6J03
2159A75l0j06K9K7o6n3J13J6q6L8K8mq3J9k2k6j7L1m5L9%l4j5K7Oj5J6q8qK8o0
2190a66J09Rm8J7K0k2lK2J0m0K1M4%QMN3k3m9O2M2qm5L5O3n5oJ10j5p1L0O5m1
2222A32r1P2K7o6k8L9O0o6l1L7j0n0k7J8l4j5L3Km4pRLr0N1k0r0J5O7k5l1O1M
2254i5l6M1j2J6m1K2N6m3qO0M7pn8J20j7q4N1M6J8l6O2L5o3j6J12l7m2L5L5k4
2284A37q3O4M2m8k1L8K1r3j6lJ4o4K8M1l7n0K3J8m8q1Q6No1l5QL4o3QL4rK2k3
2316a12NlJ1qj3M8L0LrN0L0n6L1M2k3o9O0P7q8k6J27L6m4n4Q4L0j09l1J37l2n7
2347F7kR5j0j46P9R4j29l2N5j5p2j8P1L1j07M0O1l5q5o2J21m5p7P6J9k2o5O3J1
$$ plain form
2132 -24 34 -70 -72 67 40 -99 -65 42 16 -80 6 133 47 -32 85 175 28 -42 116 158 14 30 126 130 36 72 175
2159 175 145 39 68 95 29 -24 89 105 19 57 85 81 -2 17 -5 -31 -48 -17 -62 -23 -23 -57 -72 -45 -39 -54 -38 -126 -134 -106 -166
2190 -166 -57 -48 -96 -79 -59 -81 -84 -62 -52 -92 -71 -27 -27 -19 -15 38 15 -34 28 70 62 17 52 115 60 54 164 149 78 108 173 132
2222 132 41 113 140 74 46 85 145 79 48 85 75 25 -2 16 -18 -33 0 2 -42 -49 -40 -37 -127 -76 -96 -186 -171 -104 -129 -160 -99 -95
2254 -95 -131 -90 -102 -86 -127 -105 -49 -92 -100 -40 7 0 -58 62 45 -39 12 58 76 40 102 137 74 58 170 133 91 126 161 137
2284 137 54 118 160 112 91 129 150 57 41 38 52 -12 16 57 20 -30 -7 11 -37 -118 -32 -27 -88 -123 -115 -81 -144 -136 -102 -111 -89 -112
2316 -112 -107 -110 -99 -107 -120 -72 -42 -39 -48 2 32 -24 7 49 26 -43 17 94 6 -20 107 143 99 45 129 159 50 19 156 124 67
2347 67 65 160 150 4 83 177 48 16 71 56 -16 -34 37 68 -39 1 62 27 -58 -120 1 -44 -121 -45 -26 -48 -113 -50 -39
2376c9n1k5M9L0m4m8P0L4J4o5J7N7lr9R4K1k6j4Q8L3j01m0J25N5j43L2J15m0j29
2405c3JJ41k4q5R3R5q0j41R8L3p6n8J70Kj45o5J16M4j09j7J63n1j39L6N6n3o5
2432i3N6J10n7j32K4O7k8n7P1P2p6q7K7J07l7n0J10O4j67l0Q4J6r7J4J52M5j94
2459h6J8J04j2j22J13J33n8j64N8J22p4r9J54J03j22r5O7P2j30n1K20N2j73n6
2483b6J59j2j48K2J17k0j09k5R3l5j30J00J07m4j53O6P9j13o7R4N9n6p3J04Pj05
2509a09o1J38O9j52j6J00M9j59RJ78K6j34n0J92n1j67N4J89j6j75J40L9m4j19
2533g0J39J35j25j07J31Q4k09m3J93N5j31k8R9oj06m0J16O4j58k1J19l5j29L6
2557c7J23r0q8O0N4o1j15J20M2o2j05J01K7m5j29J29J08j68oJ25Rj40J9J10M5
$$ plain form
2376 -39 -90 -115 -66 -36 -80 -128 -58 -24 -10 -75 -58 -1 -4 -103 -9 12 -14 -28 60 93 -8 -48 77 132 -11 21 136 96 -33
2405 -33 -32 109 85 0 93 188 108 -33 65 98 22 -36 134 136 -9 -74 42 86 -23 -40 123 72 -67 -31 25 -28 -93
2432 -93 -37 73 16 -116 -92 -25 -53 -110 -39 33 -43 -130 -103 4 -33 -83 27 91 -76 -106 -22 -6 -103 -89 63 108 -86
2459 -86 -68 36 24 -98 15 148 90 -74 -16 106 32 -67 87 190 68 -27 40 112 -18 -69 151 203 30 -26
2483 -26 133 121 -27 -5 112 92 -17 -42 51 16 -114 -14 93 49 -104 -38 41 -72 -139 -45 14 -42 -115 -11 -4 -109
2509 -109 -170 -32 37 -115 -131 -31 18 -141 -132 46 72 -62 -112 80 29 -138 -84 105 89 -86 54 93 49 -70
2533 -70 69 204 79 -28 103 187 -22 -65 128 183 52 24 123 117 11 -29 87 151 -7 -28 91 56 -73 -37
2557 -37 86 -4 -92 -32 22 -39 -154 -34 8 -54 -159 -58 -31 -76 -205 -76 32 -136 -142 -17 -8 -148 -129 -19 26
2582B6j17J2J25m6j25O4J10J3r9P4R5j22j08J14J25j02q4J46P9j59lQ6K0r9J1
2607C6R9J0j40k3J25oj16O1O7l6j06%J10o6o2O4M9p2p5j5J02o7k2L7K6l9q2R8
2635d3Qp0QO3L7p3m2Q2L5q2J1P8K2r5LP9K2q5M8O9j8r5Q1K5o4J7O2N4l3j00R1
2666I5qm5l4Q9kp2jO9j1n3K1O0r5j4KL1l2m5Q5k6k4l9RO6n9n0O1J5n4l3M7L3m5
2699e9pJ3O6n0m8L9M5o8l0J26k2o7K8N1k1l4L5N9n6k7M7M1l8l6O6Ql2OO3k7m5
2730B6LL6J1m7M1j8l0L0k1N0j7n2J8N0q7j3M3K0j4o9KlnKRJj3J6OMk4l0L9K0n4
2765g0k2M3l1J4j3M2Mj8J5OL1l7kM7J6j6M7jn3l2N1N3l7j1M4j1k3QK9Kj9L5mj7
2799G0rJ2nk5J4NoMJ3pk4o1J1K8%kk8k4J2rlOjJl8K7l2J7j3LL3k5Jj1N5k3k3L9
$$ plain form
2582 26 -91 -79 46 0 -125 -61 49 62 -37 37 132 10 -98 16 141 39 -45 101 180 21 18 104 124 25 36
2607 36 135 145 5 -18 107 101 -15 46 113 77 -29 -29 81 15 -47 17 66 -6 -81 -96 6 -61 -83 -46 -20 -59 -141 -43
2635 -43 -35 -105 -97 -34 3 -70 -112 -30 5 -77 -66 12 34 -61 -58 21 43 -42 6 75 57 -38 43 68 4 21 83 137 104 4 95
2666 95 87 42 8 97 95 23 22 91 80 27 48 108 13 -1 1 32 0 -45 40 14 -10 -49 -40 26 -33 -83 -22 -7 -61 -94 -47 -14 -59
2699 -59 -66 -53 13 -37 -85 -46 -1 -69 -99 27 5 -62 -34 17 -4 -38 -3 56 0 -27 20 61 23 -13 53 61 29 35 98 71 26
2730 26 29 65 76 29 70 52 22 52 31 81 64 12 30 80 -7 -20 23 43 29 -40 -38 -41 -46 -44 -35 -34 -47 -31 -25 -21 -45 -75 -36 -16 -70
2765 -70 -92 -49 -80 -66 -79 -37 -33 -51 -36 -30 1 -36 -38 9 25 9 56 55 2 -30 21 74 37 26 70 59 36 44 73 75 56 91 87 70
2799 70 61 73 68 43 57 62 56 60 73 66 42 -19 -8 20 20 18 -10 -34 -22 -31 -34 -28 -29 -28 -66 -39 -71 -54 -67 -64 -31 -56 -55 -66 -11 -34 -57 -18
2837a8nLj9K8J9j6J5j8J1J3j4LL4k8L8j7rJ9OK0k3j1L3k7l5N5J7rj9L8%k4k7J
2871C4j3pK0j3lj3l2nM0j3l6K1k8K5qJ9kjj6NQl9J5PQlql8M0rKNM3n2M1J3K3n2
2909b2NQ8m8j4K6lj5j7M5mlNJ8m2J1NL9j8l0M2oj5l7Q3l9m0PJ1J0o3M3kk8Rj6
2944a5J5K4p5QJ5M2o1L3%k9qJ0M4m4j5L2j2k8L5j8Rk3J9K2J1k4j5K1M4k9JO2k9
2977B2Jl5M8L4l3k6L6J8m1K7M8o8NJ7K3m2%Qmj1k4O6l4k4j0L7L6r8M7K1m0k8O
3010a8Pj1l6M6j5J6l6M2ll3m4L2M3k0p2N1K7o8J0N3L2n6J5kN4p4M5M1k5j6NP1
3042F1k5o5L9P7k6q2O3N5n1k4L8M6r6J5K9%Po3N1K2p8JL7%n0J7N7m2m9J1K0k1
3074b6m7M8M7p4OL3oj2m5O6J1Lq5M0M2n5j3N4K0j9l5M7K0m5m0R7M0j16Q6L1k7
$$ plain form
2837 -18 -23 -20 -39 -11 8 -8 7 -11 0 13 -1 2 36 8 46 29 20 39 45 65 42 31 64 37 2 57 74 65 46 84 84 60 33 34
2871 34 21 14 34 21 18 5 -27 -32 8 -5 -41 -20 -48 -23 -31 -12 -14 -15 -31 -26 -18 -57 -42 -35 -27 -30 -38 -76 -36 -45 -43 -38 5 -47 -6 7 30 -22
2909 -22 -17 71 23 9 35 32 17 0 45 41 38 43 61 19 30 35 74 56 26 68 62 47 10 93 54 14 21 32 42 -21 22 20 -8 1 -15
2944 -15 0 24 -51 -43 -28 14 -47 -14 -14 -43 -51 -41 3 -41 -56 -24 -36 -64 -29 -47 -38 -61 -42 -20 -9 -33 -48 -27 17 -12 -11 51 22
2977 22 23 -12 36 70 37 11 47 65 24 51 99 31 36 53 76 34 34 42 38 27 3 69 35 11 1 38 74 -24 23 44 4 -24 -18
3010 -18 -11 -22 -58 -12 -27 -11 -47 -5 -8 -41 -85 -53 -10 -30 -102 -51 -24 -92 -82 -29 3 -53 -38 -40 14 -60 -15 26 1 -15 -10 61
3042 61 36 -29 10 87 61 -21 42 97 46 22 60 106 10 25 54 54 61 -2 49 71 -7 -6 31 31 -19 -2 55 13 -36 -25 -5 -26
3074 -26 -73 -25 22 -52 -46 -13 -19 -31 -76 -10 1 4 -81 -41 1 -54 -67 -13 7 -12 -47 0 20 -25 -65 32 72 -44 42 73 46
3105D6l3mN9m8kK7L5k6p4M7O6n3lJ1J5m9o9R0J3m5k4N8nm6J4K7m0j0OK3Mn2L2
3138a0ml7J0K5M9j03K6L0j2j0k6M7L9p2m4P0L8n2KP7k8n2m2R2rm5M2M2k8o0P8
3169C3k3K7n4PO5k7o0K7M0k0LJ8J0kl8M3Qn1NL2k2n1N5JJ2l3l3O0m7nL0l2K5n4
3203e1L1L0J5o1M7j4k6j6K5N2p4J0K1Qm6k0P4K3n2j1L3J7l0k0P3l6%n6R9m3n4
3234e2P0K1n7RN6Ol3nK4Qrk6P0k6p3L2N4m6j4PJ1jrJ6oJ6j3J9k3k7l4L3L8m9k9
3269d2QJ2Qj4MK1m3LK6J5q7NR5k7l1KJ8j5k5N5k3K8j5NM4jm5J1L0nj8J6L7m8K
3304FN5J2n3K7L2n5J7K1j7j7l1N4kj2l4N7Qk3m1Rk6L7o2M1J7n8QK9oj7k8M3Jk1
3338b9rL1o0L8j0pL3rk6KN7k2k4nJ2JJ5J6kj4rL4J5j3L3qj6l8K6J6j2MJ8ok0L0
$$ plain form
3105 46 13 9 68 20 18 45 80 54 -20 27 93 40 37 48 63 14 -55 35 48 3 -21 37 32 -14 0 27 -13 -23 -17 6 10 -42 -10
3138 -10 -14 -51 -41 -16 33 -70 -44 -14 -26 -36 -62 -15 24 -48 -92 -22 16 -36 -34 43 15 -37 -79 13 4 -41 1 43 15 -45 33
3169 33 10 37 -17 -10 55 28 -32 -5 35 15 18 36 46 44 6 49 57 6 11 43 21 -30 25 26 38 5 -28 32 -15 -20 10 -22 3 -51
3203 -51 -20 10 25 -36 11 -3 -29 -45 -20 32 -42 -32 -11 -3 -49 -69 5 28 -24 -35 -2 15 -15 -35 38 2 2 -54 45 2 -52
3234 -52 18 39 -18 -9 47 53 20 15 39 47 38 12 82 56 -17 15 69 23 9 16 27 26 17 33 27 43 30 49 26 -1 -35 -2 36 -13 -42
3269 -42 -34 -22 -14 -28 -24 -3 -46 -43 -17 -2 -89 -84 11 -16 -47 -45 -27 -42 -67 -12 -35 -7 -22 -17 27 26 -19 -8 22 17 -1 15 52 4 6
3304 6 61 73 20 47 79 24 41 62 45 28 -3 51 49 37 3 60 68 45 4 13 -13 24 -38 3 20 -38 -30 -1 -7 -24 -52 -9 -8 -29
3338 -29 -38 -7 -67 -29 -39 -46 -13 -22 -48 -46 11 -11 -35 -40 -28 -27 -12 4 2 -12 -21 13 28 15 48 40 24 -14 12 28 16 20 38 32 12 42
3374D2%k8qj4L9J5l5nQK4j5j0qNJRj6j1k7QJ2Ok0oJ8l7N7j3l0J9oj1L8j9mK5j6
3411a3k4K2J6j9j4N0n3L3l1L6j1j0J8j6LJ9J4rK4k9oK8Qj3j9L3J3k6Rj9j7L1r
3444A9pK1j8j2J7j1QKj4K9q7M0k6M3J2j8k1L1l2l4L4K4l4KK0J0m5J2Rk2J8k2m
3477e6K0K3oKJk9M7l3PL3lJj2jK0l5N3J7j8kj7MJ5J2l4L4ml8K3NJ1m1J2R2j06
3512cJPkj5J4K9J7o5J4J4j2j3%K4l4K1l6QjK3m1J5nk2M6ok6K7Ok7L7m5K4K3n3
3547e6M7ppp%M1NoKQj0nJ7OJ0j0LJ7J0n6qL8jm2M8okL2j5l5j0J4Ok7j5J7K7j7
3585Fn8QJ0RkJ3jJ3l2K8Jlpj4j5J1J0l7P3l8pKOoJ8j0J4j0M8j7k7%rQ1j0o3K1
3622FL3j1l4J1L7l7K0J6J3m6l2N0J1l8k9L1L3k8l3M2nMl9K1L3m1jL2m3j5K1J6
$$ plain form
3374 42 42 14 6 -8 31 46 11 6 14 38 23 13 5 10 11 20 4 -7 -34 -26 -14 -8 -28 -34 -16 -53 4 -9 -39 -20 -26 -37 1 -18 -22 3 -13
3411 -13 -37 -15 1 -18 -32 18 -35 -2 -33 3 -8 -18 0 -16 -13 6 20 11 35 6 0 28 36 23 4 37 50 24 33 14 -3 28 19
3444 19 12 33 15 3 20 9 17 19 5 34 -53 -13 -39 4 16 -2 -23 8 -24 -58 -24 0 -34 -32 -12 -2 -47 -35 -26 -48 -30 -52 -56
3477 -56 -36 -13 -19 -17 -16 -45 2 -31 -24 9 6 7 -5 -6 14 -21 32 49 31 29 12 16 31 43 9 43 39 1 24 29 40 -1 11 103 -3
3512 -3 -2 5 3 -12 2 31 48 -17 -3 11 -1 -14 -14 10 -24 -3 -39 -31 -32 -9 -50 -35 -40 -62 -16 -22 -48 -21 -15 -42 -5 -50 -26 -3 -56
3547 -56 -9 -16 -23 -30 -30 11 16 10 12 20 10 5 22 28 38 28 31 48 58 2 -6 32 31 -11 37 31 29 61 46 11 1 15 21 -6 -21 -4 23 6
3585 6 -52 -44 -34 -25 -27 -14 -15 -2 -34 -6 -5 -8 -15 -29 -44 -33 -23 -60 13 -25 -32 -30 -24 -30 -12 -22 -8 -18 30 13 -14 -14 -23 58 48 -15 6
3622 6 39 28 -6 5 42 5 25 41 54 8 -24 26 37 -1 -30 1 34 6 -27 15 10 14 -25 -4 29 -12 -13 19 -24 -39 -18 -2
3654bk2n3P9k2J1j4J6K2m0%J5L1l9J8jK1l7KM0k2Jk2L8j1k2K1J3J5n6N1j4K4m6
3687eNJ5Pk3kqO8m3nK4k6m%N5n1K5l4L3l3j1K2J4j8k4L1L3l8onKmoj6Mk1L4L6
3724B5l6j4K7k4J0l5N2oj5Llj0j0mM2k1k7M4j8J9l5M2%k4K6QJ3k3k3O2k2j1pK5
3758C0J9j2l2PL2n8J8L3lk7Rl0L0L1nqj5l8J2J9k7k1K2M9n2oqj0O6q5L9J6k2l5
3792f2J4Oj2K6K6j3rk3K5JK6l5N2k7m1RN0j2kQK2J3o8M6KLj1M1k6j8k1L9J8k3
3826B4k2K5lJ1k7J3MJj6J6j1k0KK2n0O5j6l9J5m3M0j4k8M5llLk6QL1k2K1J9J0
3860C2m9QK5m5K2K3J3j5k0j4P5p0K8j1J5j0J4kk8K9m1J5OmJ7j6K3l2k3J8M8n4
3892b3L2M6m3k4L3k4j6Ol9M5lpRoRj0oJ8J0n8N6Lk1k9L9kK2l9M3k4j2L1j0J2m
$$ plain form
3654 -2 -24 -77 2 -20 -9 -23 -7 15 -25 -25 -10 21 -18 0 -1 20 -17 -15 25 3 4 -18 20 9 -13 8 21 36 -20 31 17 41 -5
3687 -5 0 15 22 -1 -3 -11 57 14 9 33 7 3 3 58 7 32 -2 31 -2 -13 9 23 5 -19 12 45 7 1 -4 -2 -6 -12 -28 -24 -45 -11 25
3724 25 -11 -25 2 -22 -12 -47 5 -1 -16 -13 -16 -26 -36 -40 2 -19 -46 -2 -20 -1 -36 6 6 -18 8 16 29 6 -17 45 23 12 5 30
3758 30 49 37 5 12 44 -14 4 37 34 7 16 -14 16 47 42 34 19 -19 -7 12 -15 -36 -14 35 -17 -23 -31 -41 25 -60 -21 -5 -27 -62
3792 -62 -48 -42 -54 -28 -2 -15 -24 -47 -22 -21 5 -30 22 -5 -46 -37 13 1 -1 7 29 42 -26 20 22 25 14 55 29 11 -10 29 47 24
3826 24 2 27 24 35 8 21 25 26 10 26 15 -5 -3 19 -31 34 18 -21 -6 -49 -9 -23 -51 -6 -9 -12 -9 -35 -27 4 -18 3 22 32
3860 32 -17 -9 16 -29 -7 16 29 14 -6 -20 55 -15 13 2 17 7 21 19 -9 20 -21 -6 0 -4 13 -3 20 -12 -35 -17 31 -23
3892 -23 9 55 12 -12 21 -3 -19 -13 -52 -7 -10 -17 -8 -14 -5 -15 -21 -3 7 -51 5 8 -13 -42 -3 -5 17 -22 21 -3 -15 16 6 18 14
3927A4jmK3n4Mk4N6k0j0M1j5j4NOKl7QRQL8k0K8Kk9k3J4l9%O5pk1J2k6N1k6Jl
3964A4j5K2jnnJl0L5l6mK4j2j1L2k7j7M0k8k3OK3j9L2k4lJ4mMK3nOj3Pj6N2n4
4000a7j4M6j4rKL1qJ8l6J9oMj3J9J0Lj8OR%j5MKl3OK7ml0K1L0l8Qk2lkRJJ4Rn0
4040c4K6j6j5K6kJ2rrOMOpLOm2K7j5O6l8PRK8j8k5oN1o6N2k3j8L7J4l9K0J2j5
4076A5J0k8j3K4kmL5k2rk4J4J5K2l8%K1n3J6L0l2QoJ5K3j0k6K9kqMk5NNk3qJ6
4112b6k8K3MlK6rOJ1k2M2l7M6l0j5J9J2j8NJ8l3K3jK3nl9J4K7j5Ok5L8Np7K7J3
4147Ej3O9o0J6j3NJ9oPo4L2Jkj9K3J1o5M0mJJJ9J1oj0k4PK9k6L0m3lK9lL9n1J0
4184hjK7k9LK1JQpOj1Qk3L3k2k6K8OOk2N3j7p1L1J4L2m3L3Ql2J9k3N3n2OM0j9
$$ plain form
3927 14 13 9 32 -22 -18 -42 14 -6 -16 25 10 -4 1 7 9 -28 -20 -11 -3 35 15 43 45 16 -7 7 -32 -32 33 26 5 17 -9 42 16 17 14
3964 14 -1 21 20 15 10 11 -19 16 -20 -24 0 -12 -23 9 -18 -35 5 -23 -46 -40 -17 -36 -4 -28 -31 -17 -21 -17 6 1 7 -6 1 -15 37 -17
4000 -17 -31 15 1 -8 -6 25 17 35 -1 18 12 16 3 22 32 35 17 23 32 32 17 21 23 -10 -4 23 19 -11 10 40 2 10 -12 -15 -17 -8 -7 7 16 -34
4040 -34 -8 -24 -39 -13 -15 -3 -12 -21 -15 -11 -5 -12 -9 -3 -45 -18 -33 33 -5 2 11 39 21 -4 -10 41 -25 27 4 -14 23 37 -2 18 30 15
4076 15 25 -3 -16 8 6 2 37 15 6 -18 -4 11 33 -5 -5 16 -37 -21 9 -23 -15 -21 -6 17 7 -19 10 8 0 4 -21 -16 -11 -34 -42 -26
4112 -26 -54 -31 -27 -30 -4 -13 -7 4 -18 24 -13 33 3 -12 7 19 1 6 24 -9 14 13 36 31 -8 6 33 18 24 -1 37 42 -35 -8 5
4147 5 -8 61 1 17 4 9 28 22 29 -35 -3 -2 -4 -23 0 11 -54 -14 -18 -17 -16 3 14 8 -2 -26 -19 10 -16 14 -29 -32 -3 -6 33 -18 -8
4184 -8 -9 18 -11 -8 13 14 22 15 21 10 18 -5 28 6 -20 8 14 20 -2 51 34 -37 -6 8 40 -3 30 38 6 25 2 55 3 9 49 30
4220C0nk6J3l3L2K6l8J9J2l6K8n6j7O3k4noK6j6%M9p3M7nl5L7j3j8K6l4L9nl2
4253c0nL6Rl0K1J8k5J4KJ9k9k%M5Rm3L3ql0M3m3J6npJ0k0%NJ5Ll3J1j0M7o1M1
4289A6mn0L4PPj5Kk1M1m1lN0k8qk0K3k2L0k5M6k8k4L7Jk4J3K0J7j1l2L4rm5N1
4323A9J6qk5mK7LpLrQL2l7k4L6k9J3Mro1P7k4k0OJ0J0m1N7n6K9j6J8j4J3m2L8
4358gLk9OJ3J2j0K4k3j6Rj6K1K4j1j5L4l8j4K1L9k0krM6j5n5JO5J1m5J9j6RkJ0
4393B4l1M5k4K6pj1K1p6L2k4L3jonpj2oPJ5pnNnN0o0J2j5J8K8mn5P2m7qK5L1m2
4430a4j6N1n6J0J2M8l3j0l1K9P6o4lJ8k9K6l7nM7k1J3j3POJ6J9m2KJ2Rj8j6K8
4463B1j6Lk6j0O4o8O7m0N0j3J8l4j7Kk4J1L9n8J5K9k3Ql6O7ll7mJ8J0j1kl0M6
$$ plain form
4220 30 25 -1 12 -21 11 37 -1 18 30 -6 22 -34 -51 12 -12 -17 -23 3 -13 -13 36 -37 10 5 -30 7 -6 -24 2 -32 7 2 -30
4253 -30 -35 1 10 -20 1 19 -6 8 10 29 0 -2 -2 43 52 9 42 34 4 47 4 20 15 8 18 -2 -2 3 18 21 -12 -1 -11 36 -25 16
4289 16 12 -38 -4 3 10 -5 -3 -24 17 -24 -27 23 -5 -13 -33 -10 -32 -2 -27 19 -9 -33 4 5 -19 -6 14 31 20 -12 22 13 -32 19
4323 19 35 27 2 -2 25 28 21 24 15 23 55 18 -6 30 1 14 18 9 -52 25 1 -19 -13 -3 7 -34 23 -33 -4 -20 -2 -16 -3 -45 -7
4358 -7 -4 -33 -27 -14 -2 -12 12 -11 -27 -18 -34 -13 11 0 -15 19 -19 -33 -12 27 7 5 -4 42 27 -28 -27 38 49 4 23 7 16 14 24
4393 24 -7 38 14 40 33 22 43 -33 -1 -25 8 7 1 -4 -11 -23 -29 -22 -7 -14 -19 -14 -19 31 -29 -17 -32 -14 14 10 -45 27 -20 -28 -3 28 -14
4430 -14 -30 21 -35 -25 -13 35 2 -8 -39 -10 66 2 -1 17 -12 14 -23 -28 19 -2 11 -2 5 11 27 46 4 6 18 27 9 -7 21
4463 21 5 8 -18 -28 36 -32 35 -5 45 32 50 16 -1 1 -23 -12 27 -31 -16 13 -10 -2 -38 29 26 -11 -15 3 13 2 0 -30 16
4496A6j3j0j1J0qk4K6LjQJ4kk4QJ2j9j1L8LQj9kl7L9j9P3m9j7JN9m8ok7M2m3K3
4532gJ5J0k1LN7j8k9J0lk0pJ5nJ0l9j0O1j7K5m2L1Nl1nnmL0Lk5k4QL7rK6n3M5
4568A7j7j6L7k7OL8m7j2L6k7K7lL9n2L6j7j1J1k5kJK7k7j3K8KOnJ2qLNPk0%J5
4604B4o9M8k7j8J6K9K3m3j2L1qj9QjJ7j8K1QJ%l4K1kJ7k5M8Nm0J3K7l5j0J3K8
4638C7k8L%lJ3j5K3qk3L4k8j2K2k1M4k9L3Mm3L0lj4k0lJ8nJj5j7M3k7j0k1K4Q
4673hRj0k1M2l3j4J2J4RK7l3j1K4j6J5OM2o7PJ6k8MKL4n0K0Rj4L1m7L6mkjJ9O
4709B5k9J2KpJ0kQJ2opK4o8M0j6MKl8L7j6K8KmlK8o8N8j7Lj6J3J4Jn6L7l3O3p7
4746d0L7K8j0J8rOl0oL1k8LJ5rK7k6j1Jj8J9jK4k7J9nj3LRL5m1NJk7L5k3J2k0
$$ plain form
4496 16 3 -7 -18 -8 -16 -40 -14 -11 -12 -4 10 8 -16 -8 4 -15 -26 12 15 23 4 2 -35 4 -15 58 9 -8 -7 52 4 -2 -29 13 -30 -7
4532 -7 8 18 -3 0 57 39 10 20 17 -3 -10 5 0 10 -29 -39 22 5 30 -12 19 24 -7 -12 -17 -21 9 12 -13 -37 -29 8 -1 25 -28 17
4568 17 0 -16 21 -6 0 38 -9 -21 15 -12 15 12 51 -1 35 18 7 18 -7 -9 -8 19 -8 -21 7 9 15 10 22 14 17 22 29 9 9 24
4604 24 -45 3 -24 -42 -26 3 26 -17 -29 2 -6 -25 -17 -18 -1 -19 2 10 11 11 -23 -2 -4 13 -12 36 41 1 14 41 6 -4 9 37
4638 37 9 12 12 9 22 7 30 22 -1 33 5 -7 15 -6 38 9 42 46 3 33 30 16 -4 -7 11 6 7 -8 -25 18 -9 -19 -40 -16 -8
4673 -8 1 -9 -30 12 -21 -35 -23 -9 0 27 -6 -17 7 -9 6 12 54 -13 -6 10 -18 -14 -12 22 -28 -8 1 -13 18 -29 7 3 1 0 19 25
4709 25 -4 8 10 3 13 11 19 31 25 18 42 -26 14 -2 2 4 -34 3 -13 15 17 13 10 38 -30 28 11 14 -2 11 25 26 -30 7 -26 37 -40
4746 -40 -3 25 15 33 24 30 0 -6 25 -3 0 15 6 33 7 -4 -3 -21 -2 -3 21 -6 13 8 -5 -2 7 42 1 6 7 -20 15 -8 4 -16
4782a6J2j0j5R9l7qmj4J8l3L5mj9jJ9mn0L0%j2nPK1nPj3j2J0J3J7j1k2qj0J4K
4818iQ%jk1kK0K8m3J4L7kj9k6OJ4J6j0k4M0j9j2L5j2K6l0NK3m5K4m9KK9J4l2J3
4853bM3k8pLj7K7m5K0k4J5J1j8Oj1J4J9qmLm2J4J3mJ5j0K0l1K9j3K9Lm0K4Kop
4889gJ2K2nJ6m0QJ5L4j8r%npk8PJ1j2L7j7j6JJ1l6K2OJ4rMMk3L8n9Mj1N7j6Ll4
4927b6L6rOj8rM0l6j4MM0m4qJ9K5JKk4RRL6j0Jq9N9K1Nl1NM6o8J7pJ5J4o8N2J5
4964A6k6J5rj8J9LJ0j8j8J2pMkJ1RJ3pj1qM2k4mj7K0kk1Mj4L1QRj1K2P%l4mK7
5002B7pl2j0O8m1l1K3k2M5m5L4oJ9l4OLLLN2j7n9L2lj3j7J8kK7k4nRj0K7MqJk2
5039gJJ4Jl5K9J5k1J1lnK3k2j1Pk0N2J0l4l0j0L1oK4k2J1j0PlJ7mk9K2l1K1K1
$$ plain form
4782 -16 -4 -14 -29 70 33 25 21 7 25 -8 27 23 4 3 22 18 -32 -2 -2 -14 -19 -12 9 4 11 -2 -14 -4 9 26 15 -7 -15 -25 -11 -9
4818 -9 -1 -1 -2 -23 -25 -5 23 -20 -6 31 29 10 -16 -10 4 20 10 -14 26 7 -5 30 18 44 14 19 42 -3 21 -28 -26 3 17 -15 -2
4853 -2 41 13 6 9 -8 19 -26 -6 -30 -15 -4 -22 -16 -27 -13 6 -2 -6 -3 -45 -31 -18 -22 -7 -17 3 -28 1 -12 17 20 -20 4 6 0 -7
4889 -7 5 27 22 38 -2 6 21 55 37 28 28 23 16 -12 -5 6 -6 31 14 -2 -1 10 -26 -4 2 16 7 11 15 -8 30 -29 -25 -36 21 5 8 -26
4927 -26 10 1 7 -11 -20 20 -16 -30 -26 14 -30 -38 -19 6 7 9 -15 -6 3 39 29 30 -59 0 21 26 -5 0 46 -22 -5 -12 3 17 -51 1 16
4964 16 -10 5 -4 -22 -3 0 10 -8 -26 -14 -21 -17 -19 -8 1 14 7 -4 -12 30 6 2 -15 5 3 -18 -14 -28 3 11 20 9 31 38 38 4 0 27
5002 27 20 -12 -22 46 5 -26 -3 -25 20 -25 9 3 22 -12 -6 -3 0 3 55 38 -21 11 8 -5 -22 -4 -6 21 -3 -8 1 -9 18 22 14 15 -7
5039 -7 -6 8 9 -26 3 18 -3 8 5 0 23 1 -10 -3 -23 29 39 5 -25 -35 -4 -10 14 -8 3 -7 0 -3 14 10 -19 3 -28 -7 14
5074A4m8J7PPOj2Nj4K5Mrk1K3M0m8jjM6l2J0j1pJ4k0L9j9j2L1j6Nj1rK9m4O6l5
5110A8k1mj9K7KL6l9k5O4n0MQJ4k8K2l5K4rk5O5n5J8K3k6k1M8j0mj0MOK4k4K0
5144B2k2K7ok7O2m7lPJ0m8L3K9j4j8K1j4rqL2k4J8k9KJ5j9NK0mppoJ8Lj2Pk2K9
5181A4Jk3J4l0M4m0M0nk9L3j8j9KjmO3l7L4j0l9OJpJ1K0Jk4J9j8LJ3j0k7K6RJ8
5217C1j1k5qL1l6j2K6qO0n5l1M7j6j5L5k6MJJ0j2K6m1L2JjJ8qk9lN7k6j8K6k9
5251eK4k0jKJ9l6N0m5J0lJ6Nj7J8pK2l9jOoj6J0J7Lj2k6M3j5l3M2JKj0k4M3l5
5287a8J3J5n5L3l0M7ORlk9J5nPjJ7k3kj1J8J3m2K6nl9JK2L2k4NO%RqrQpjJ1kq
5327iQPk3O%J9jk3MK1l4jL0J1j3j5N5p3K8lK1RJ6ol3NQMK0j2n3M4nj4L0j8k1K1
$$ plain form
5074 14 -34 -17 -10 -3 3 -9 -4 -18 7 11 2 -19 4 44 -4 -5 -6 40 8 18 7 0 14 -6 33 14 2 33 17 22 11 2 31 -13 53 18
5110 18 -3 -7 -26 1 3 39 0 -25 39 -11 -7 1 15 -13 9 -26 -2 -11 -36 29 -26 -8 15 -11 -32 16 6 2 -8 -4 2 26 2 22
5144 22 0 27 21 -6 56 9 6 13 23 -25 8 37 23 5 26 12 3 -5 27 3 21 -8 -6 9 -10 -5 15 11 4 -3 -9 9 12 0 7 -15 14
5181 14 15 -8 6 -24 20 -20 20 15 -14 19 1 -18 -16 -17 -21 42 5 39 29 -10 -4 -3 -10 1 21 22 -2 17 -1 2 15 5 -22 4 13 31
5217 31 20 -5 -13 18 -18 -30 -4 -12 48 -7 -38 9 -7 -22 13 -13 -9 -8 2 -10 16 -25 7 8 7 25 17 -12 -15 42 16 -2 24 -5
5251 -5 19 -1 -2 0 19 -17 33 -12 -2 -5 11 16 -1 17 10 32 -7 -8 -2 -8 -24 -14 3 6 -6 -32 11 -4 -37 5 6 8 -2 -26 17 -18
5287 -18 -5 10 -45 -12 -42 5 11 20 17 -12 3 -2 5 4 21 -2 -4 -15 3 16 -26 0 -5 -44 -43 -21 11 -13 -8 -2 -2 7 -1 -10 -2 -9 -10 1 -1 -9
5327 -9 -1 6 -17 -11 -11 8 7 -16 -12 9 -25 -26 4 15 2 -13 42 -31 -3 -6 15 24 40 34 1 6 14 18 38 26 -27 17 12 -2 28 10 -11 10
5365A0pRJ7j9Oj6kL%M9m1ol2l2N0j4K4l5M4k8J8m1kN2J3k7nlrM4k9k0K2K9J7k0
5401A9Kj9J4OJ4m7J1%rK7j1j7mK3j3lM0k7j1L1Rj8lk8J4jl1L0j7J3NqRJ1m9N2
5437A4j7Lk6K3OjJ7jJ5m8OJ5nj2M4m3L5m2O0j7k6J0oJ3LRk1k0jM9n0J5j8R%K4
5473A6m3M6rqRqk2M0mk6J6Pm2J6j2RK1qJm5L1L0l9J2oL4j1j6oj1J0L9m2kM2m9
5509c0N5n8PM2j6L2j4k0M1j4n5J7j4J9J1j5M5m1L0m8O1qj4Lj2Oqj5OnL3nl6mL2
5544Hj3J0qK0pK7k6J5k8JJ3nj2j7K0MOj4M8l9k1J7k7L0k6M6j8J5Ko2K0LL7pro
5580cj4J4j3J0Jm7N9JOk4OJ0k7J8pM9j1l0oP1k3k6Mk2qj5K6K1J2k9L2m4K8k0J9
5615A8mK7j5J1J5p3L8jj1k3KK0kJPj7L9m9K7j4Oqj9J0L3n9K5J8qL2o3NK2J3L2
$$ plain form
5365 10 3 12 29 10 16 0 -2 1 1 50 9 3 -29 -61 -11 -25 -1 -36 8 -20 -2 -43 -45 7 20 -7 -12 -15 -24 20 -9 -29 -7 22 39 19
5401 19 21 2 16 22 36 -11 0 0 -9 18 7 -10 -14 9 -4 -7 33 6 -5 26 35 17 14 -14 0 -1 -32 -2 -19 -6 -1 -9 0 11 -38 14
5437 14 -3 0 -26 -3 3 2 19 18 33 -15 -9 6 1 -11 33 -10 25 -17 43 26 0 10 4 17 20 29 8 -12 -13 36 -14 1 -17 -8 -8 16
5473 16 -27 19 10 2 11 3 -19 21 17 -9 7 14 -28 -12 -24 -15 6 -2 -1 -46 -15 15 -24 -12 -18 16 5 -11 -17 -28 -18 21 -21 -23 19 -30
5509 -30 25 -33 -26 16 0 32 18 -2 39 25 -30 -13 -27 -8 3 -12 33 -8 22 -26 35 27 13 16 4 10 2 -13 -7 -12 21 16 -20 -24 8
5544 8 -5 5 -3 17 10 37 11 26 -2 -1 12 7 -5 -22 -2 2 8 -6 42 3 -18 -1 -28 2 -24 22 4 19 21 -41 -21 -18 19 12 3 -3
5580 -3 -17 -3 -16 -6 -5 -52 7 8 14 -10 -4 6 -21 -3 -10 39 28 -2 -8 63 40 14 18 -4 -12 -27 -1 20 32 3 35 -9 19 -1 18
5615 18 14 41 26 37 52 -21 17 16 5 -18 -16 4 2 3 10 -7 32 -17 10 -4 2 -6 -25 -15 18 -41 -16 2 -6 26 -37 -32 -10 3 35
5650C5j9l3M9l3RK5k2j1l5N9j2j3k3O2m8j4M7nj5L4m6RJ3k7L8m0L0k7J7l5K9r
5682a1K8lM%k3k2L0j4N3q2M1qRl4J4J1RQm4O3m9L6l8M9j8J2rk6K6m8K6J4rJ8J8
5717C1j3K8m7j9J8j5O8m3k1QKj7J5%OK6l1prJ4l1O7l2ojj0K4NRj2k0jJ4qmj6N0
5754B2p1N0L2j2k6j7J0K9ml6OL4Jn1M1k9PL2k8J3mJ1l1j4J5Q2m5rjl1J0l6L8N
5788gJ2k6J8JK7l8K1J6n1J5J5nK5%j1j5J7nOLk3L0n4M5J4k6K0l9K3k9M4j3k1M8
5822C7l0K1k2JQj3J1Nj0L6l4m1j6L3j3J2%k2kM6Pk3MKj1J3j1j2N2l9lN1rl4jK3
5858A6j1J7j3J3qopK6j5NJ6k8M5n0L7jj3J8n7L7j7loj5QK1J1pJJ6k7k4J5k0L0
5893Dj7K2Mml3L1J5J3o9L7J6k7J0l1L0l0QoO0j7k2K5k%k7N4k0j8J6K7l7Ol2j7
$$ plain form
5650 35 16 -17 32 -1 8 33 11 0 -35 24 12 -1 -24 38 -10 -24 23 18 3 37 -9 0 13 -14 24 -16 14 -13 4 -31 -2 -11
5682 -11 17 14 18 18 -5 -27 3 -11 42 -40 1 -7 2 -32 -18 -7 2 10 -34 29 -20 16 -22 27 9 21 12 -14 12 -36 -10 4 -5 13 31
5717 31 18 46 -1 -20 -2 -17 51 8 -13 -5 -3 -20 -5 -5 1 27 -4 -11 -20 -6 -37 30 -2 -8 -9 -19 5 10 19 7 -13 -14 0 -8 -12 -28 22
5754 22 -49 1 33 21 -5 -22 -12 17 13 -23 -17 17 18 -33 8 -21 -14 18 -10 3 -1 10 -21 -35 -20 62 17 8 7 -24 -14 -50 -12 -7
5788 -7 5 -21 -3 -2 25 -13 8 24 -27 -12 3 -2 23 23 12 -3 14 9 15 18 -5 25 -29 16 30 4 24 -15 8 -21 23 10 -11 37
5822 37 7 28 6 7 15 2 13 18 8 44 10 -31 -47 -14 -27 -15 -15 -37 -39 7 14 -9 -5 -3 -14 -1 -12 -24 28 -11 -14 37 28 -6 -7 16
5858 16 5 22 9 22 14 8 1 27 12 17 33 5 50 0 37 36 23 41 -16 21 4 1 -5 -20 -12 9 20 13 14 30 3 -21 -6 -26 4
5893 4 -13 9 13 9 -24 7 22 35 -34 3 19 -8 2 -29 1 -29 -21 -27 33 16 -6 19 17 17 -10 44 24 6 22 49 12 18 -14 -31
5927c1O9n1l1M9Mj2j1J8j5j7J1J1NJ6l3J5j1L1Kj9L4j3k5k1M7jl5L2oj7MJ1J0
5960B0lLk2%K5oj3mrQRkK1m2oJ5mJ3KJ4%kk7OL4l5j5J4J8j9Pk5PL3k6ll4M5LK9
6000B9j8k4OJ0J0n2RK1J7k2K2L0m8oJ9k2L2k4M6n0k1M4%n0L8NJ1J5k7lj8J8%K
6034ak4M1k5K5k8L1j6j1J0Rk7J8K7k4pk4N0k4J2qOOL4m4Ok3K6j2J2Oo4K7J7J4
6068A5k3RK6j3J8l5J3Ok2j7L4kp5P4j0j8j1L0k3kNK0j7K2rj0K9l7qK5j1j9L5m7
6102d8R2o8J4nj6M2m9K7QNj2QK9j8Nj4mK6j3Nk1J5nK0j9l3N4j1k3PJ3j3j1LK7
6137A7k2kLj0J8j8K0nl0M8K2o8J6RK3o8L7k8K6L6Om6qL8k5L6l0J0k0lJ2KKj3L6
6172B1l0K4k0j5L5j0J6Rm3LKL2k7mJ0j1N1o8K5k2L7m1K8kK1l0JjjL0p0O0J2on9
$$ plain form
5927 -31 38 -13 -44 5 9 -3 -14 4 -11 -28 -17 -6 -1 15 -18 -3 -14 17 19 0 34 21 -4 -25 22 21 -14 18 12 -5 -1 10 20
5960 20 17 20 -2 -2 23 17 4 0 -9 -1 8 6 27 -15 -21 -6 -10 3 5 19 19 17 -10 -4 30 -5 -20 -6 12 -7 0 -25 -18 15 -11 -14 -48 -3 0 29
6000 29 11 -13 -7 3 13 -39 -30 -9 8 -14 8 38 -10 -16 3 -19 13 -11 35 -15 -36 8 8 -42 -4 1 12 27 0 -3 -21 -3 -3 -1
6034 -1 -25 16 -9 16 -12 19 3 -8 2 11 -16 2 29 5 -2 -26 24 0 12 4 10 16 50 6 12 -11 15 3 15 21 -43 -16 1 15
6068 15 -8 1 27 14 32 -3 10 16 -6 -23 11 9 -66 8 -2 -20 -31 -1 -24 -26 -21 -1 -18 4 -5 -15 14 -23 -31 -6 -17 -36 -1 -48
6102 -48 44 -24 -10 -15 -31 11 -38 -11 -3 2 -10 -2 27 9 14 0 -4 22 9 14 -7 8 3 23 4 -29 25 14 -9 -2 11 -2 -13 -10 17
6137 17 -5 -7 -4 -14 4 -14 6 1 -29 19 41 -27 -11 -2 21 -47 -10 -38 -12 24 30 -16 -24 14 -11 25 -5 5 -15 -18 -6 -4 -2 -15 21
6172 21 -9 15 -5 -20 15 5 21 30 -13 -10 -8 24 -3 -7 3 -8 43 -25 0 -22 15 -26 2 0 21 -9 -8 -9 -10 20 -50 10 22 16 -43
6207d3N3Qj9k1N1k1loJ2j4QJ3j6qJ4PQmj3qk1K2J5Lok1J6OjmlJ2k3J7Mk7K9J8
6245C4J6n2j1%j6L3Nj5Oj6KkNj5J2jJ0pL9m2kJ9J7k6O2o1J3l4J2oJ7L5k1pQOk6
6282irkK6Kk1J8J0%nl4M8k7J6l0L3j8PK8m9K0lL0l9J4L2j6j0k3N8l7qqM2j7k9
6317a0L5l3MK7pJ0m9K6J3jOnj2J2mJK0o5M5lK9k7J6k8J2K7n3MPpPJ2kNk0J3M%
6355Il8J6K1lOj7J5om1M6J3k6J4%k7N0l1Rk5J9j9L9%m4L2j6ROJ7o%j1J4Mj2Nj8
6392DJ4l6L0k5oL5l4J7j5Pk5K2J4lj3J1L1J8o9L5L6o6L4l5M2J4k3K5k2k4L5Lm7
6425a6jJ6OK6Lm6J3J3MJ%J0j7lk7K5pMK2Ml3j7jJ1qK6lj6j2K7k6K7Pj2K6p8O3
6462A1j3M4l6k3l5M6K7m2RJL3JmKJ4J4k7k6K9k5M4k6j4j9J9j6rJ4L4l1L7j2Jl6
$$ plain form
6207 -43 10 18 -1 -22 29 8 5 -1 11 -3 5 18 2 -6 8 15 23 19 6 -2 -23 -1 14 17 11 -10 6 12 11 7 4 16 -7 10 14 -13 16 34
6245 34 50 -2 -13 -13 -29 4 9 -6 0 -16 -14 -16 -11 -26 -14 -15 -5 -12 27 -15 -17 2 19 -7 55 -6 7 -27 -15 -21 -4 31 10 3 11 17 -9
6282 -9 -18 -20 6 8 -13 5 15 15 10 -24 24 -3 13 -17 16 -2 5 33 -16 4 1 31 -8 6 38 22 12 -11 47 10 2 -6 36 19 -10
6317 -10 25 -8 -4 23 16 26 -23 3 16 15 21 16 4 16 12 13 33 -32 13 10 39 12 28 0 12 39 -14 -10 -3 -10 -3 9 7 12 -8 5 9 9
6355 9 -29 -13 8 5 11 -6 9 3 -38 8 21 -5 9 9 -18 32 1 10 -15 4 -15 24 24 -20 12 -4 5 11 28 22 22 11 25 29 17 22 4
6392 4 18 -18 12 -13 -19 16 -18 -1 -16 -9 -34 -12 2 -1 -14 -3 28 46 -23 12 48 -18 16 -19 23 37 14 39 17 -7 28 31 -16
6425 -16 -17 -1 5 31 34 -12 1 14 18 19 19 29 12 9 -18 7 0 4 26 30 -3 -20 -21 -10 -18 8 5 -11 -23 4 -22 5 12 0 26 -52 11
6462 11 -2 42 6 -17 -52 -6 21 -21 -12 -11 22 23 19 21 35 49 22 -4 25 0 44 18 4 -15 4 -12 -21 -7 27 -4 33 21 22 -14
6496a4PM0n0N0l1J6J1l1qNQk3j4PK2j1Ljj0L2l8oJ4K0k3K7K3Kol7K7NkLj2kj8
6533a5QM3ml5%K5J3m0j1N0l2L7n6K5%Qk5oM8m9J9j4MrK3ll3QJ7j1M7l9LJ6j1K8
6569B9j9rj9k6M5J6J4k3kmk6K2L8J9p2M3k9J0k2L3J0n7N5j8JQk2j2OJ5m7K4K6
6602Gj4J8j6oOM7p2ML1oj1J0Qj8j1rJ3J3k0JM3k3K7j8j1llK7j2pnK1k5M5j0j6
6638El7N7o0NK3k6K6OK8ll6J9m2N5Mk9oj9KJ5QOk4j4J7kJ3oJ4j3j5J8K6m7J4K9
6674A1rl0M8k3j0JjO6k7k4mRj5L2k7K2mj4J6j8L5l6k2K1J5j8j2K1J1j7M0m2lK2
6708A4j8l6L8j8M8l3k4O1k6Mj2k5J1j1OK3RLrKOl7N1l0k3L4J5J7j4m7O0k8j6J9
6742A4j4K6k5LK1jj9J7l6K5l6K7kQpKLK4l8k4K1joM3Lk7qk9O2l4K0j0j2J8j7j5
$$ plain form
6496 -14 -7 33 -17 33 2 18 29 -2 -10 -5 3 -20 -34 -27 -5 -16 -13 -14 -24 8 -30 -36 -22 -2 -25 2 25 27 21 -16 11 16 14 17 5 3 -15
6533 -15 -7 36 32 -3 -3 22 35 -5 -16 34 2 39 -17 8 8 16 -9 -15 33 -16 3 -11 -7 -16 7 4 -29 -21 -4 -15 32 -7 -4 12 1 29
6569 29 10 1 -18 -44 1 17 31 8 6 2 -24 -2 36 55 -17 26 -3 7 -15 18 28 -29 26 8 9 17 -5 -17 -11 4 -43 -19 7
6602 7 -7 11 -5 -11 -5 42 -30 -26 5 -1 -12 -2 6 -12 -23 -32 -19 -6 -26 -25 18 -5 22 4 -7 -10 -13 14 2 -5 -10 11 -14 31 21 5
6638 5 -32 25 -35 -30 -7 -33 -7 -1 27 24 -12 7 -35 20 24 -5 -11 -30 -28 -13 -5 1 -23 -37 -20 -22 -9 -15 -1 -14 -29 -11 15 -32 -18 11
6674 11 2 -28 20 -3 -13 -12 -13 53 26 2 -2 7 -8 24 -3 19 15 1 17 -1 34 -2 -24 -3 12 -6 -18 3 14 -3 37 -5 -8 14
6708 14 -4 -40 -2 -20 28 -5 -29 32 6 10 -2 -27 -16 -27 -21 2 11 14 5 7 13 -24 27 -3 -26 8 23 40 26 -21 39 11 -5 14
6742 14 0 26 1 4 25 24 5 22 -14 11 -25 2 0 8 1 3 6 30 -8 -32 -11 -12 -18 25 28 1 -7 -36 26 -8 12 2 -10 8 -9 -24
6778b4M8j8qJ3J7k8k5jM0m1K7J8j8mK6j1j8l2M1J3pJ5K2k3om5lM4m7J0M7j5l2
6811b5J5MJ3kk7pM3l5J9o2M8jL0l0JL7j6PROl9NL1L5o1jL2j1k6J5lk6j6J9K6Q
6847A5ml5K7On8P4j5k2KLLK0%rK5l3j3L1n8N5j4k4QM9m1k5L7m2J5JlRj7RM2j6
6883Bj6J1JnmRjl8K5JJ0K8j4j5Pl9QL6k3J4qNK6m1J1J0%j6nJ6J4Pj7nK6L1m6l5
6921c0M2l7J1J4Mj7j2oK6k8K0K5J9k2mj6L4j7rJ0J7m8J8K8K3l9m4K3M5J4l9J1
6953A6k2J6m1N4k6J2l4QJ0Nj3MJ6k4MK6mk2rM4n0KJ%K7J9pJ1kn6M2j3J4j5k1L0
6989BK8m8L2l5JL1j2O5r0J0J9MjJ7k5K1Ol0j3jJj1K7kj7K2Rl5J0L9k5j0j0MN7
7024D0j0l4jK1l7%K2J0nMl6L2j2J7l0M3mj2J8j1j9L0l0J6oj1mL7Mm3j0J7j3k6
$$ plain form
6778 -24 24 6 -2 11 28 0 -25 -26 14 -27 0 18 0 -4 22 11 -7 -39 2 15 8 23 45 22 16 -29 -32 12 -35 -25 22 7 -25
6811 -25 -10 -6 7 5 -22 -29 14 -21 -2 -64 -16 -17 13 -17 -16 21 5 12 21 27 -12 -7 24 59 -2 -3 29 18 -8 7 4 -22 -38 -19 7 15
6847 15 11 -24 3 9 -49 25 10 -12 -10 -7 -4 16 16 7 32 -1 -14 17 -41 14 0 -24 -16 33 -8 -33 4 -38 -23 -22 -25 -16 -33 -24 18 2
6883 2 -14 -3 -2 -7 -11 -2 -3 -41 -16 -15 -5 23 9 -6 1 -38 -30 6 -17 -3 -11 -6 20 -21 -10 0 0 -16 -21 -5 9 16 -1 -6 20 51 5 -30
6921 -30 12 -25 -14 0 4 -13 -25 -31 -5 -33 -13 12 31 9 5 -11 23 6 -3 7 24 -24 -6 22 45 6 -38 -15 30 44 5 16
6953 16 -6 10 -31 23 -3 9 -25 -17 -7 -2 -15 -11 5 -19 -15 11 7 -15 -24 20 -30 -28 -27 -27 0 19 12 23 21 -35 7 -6 8 -7 -28 2
6989 2 30 -18 14 -21 -20 11 -1 64 -26 -16 3 7 6 23 -2 19 25 -5 -18 -19 -18 -29 -2 -4 -21 1 10 -25 -15 24 -1 -11 -21 -17 40
7024 40 30 -4 -5 16 -21 -21 1 11 6 10 -26 6 -6 11 -19 24 20 8 26 15 -4 26 -4 12 6 -5 -9 28 32 -11 -21 -4 -17 -43
7058d3M8%m6MM9m0J1J2j4J5qJ4j7Mj7K1KJ1j7KJ3l7J3L1j4PjmK8m4Kl4M1OOMo
7095BKJ1j4MKK6l5J8k8l9N9rj9L4Nj4J3%kl0KQJ9j8J2ok0L3k9L1k6L3l6qK9Pj3
7132DmJQMnk4J5J5roJKqM1n3%M3K7k8j3l5M1k5pJ4J6j1K6ll5K0j1J9pj7Qk1J6
7170aJ5K0n4J1kj0l2O8qj2%J1%l1M0kj1mj9kM2pJ3l3K3j7j1MK0j3l0ML9Jj4OL0
7207C4n4L5NmkJ0k5kljM2k2ljl2J6J3mj2kJj4Nk8K7mL5Rj4nJJn7N6ok3K2K5l7
7246a8J0k0M1J4l4K1pL9j0jj4J0j8ql6J8Lj4L3j8L1j6j0j0K3j9K2jk9qnj2M9l0
7280b4L6J1Ml5k4L6K8k9J2J5k7kJ0J5l1K0j3Rk0j6M1k7j4M9l5k7M6jk8L7Ok7P
7313Blk4J7j9jL4Ol0L0%Jj7Qll1O0ol6J5l4M9j8pj5J1jJ8jk1L7K1p1K0KPnj8K1
$$ plain form
7058 -43 5 5 -41 -37 12 -28 -17 -5 -19 -4 -12 2 -15 -11 -28 -7 -5 6 -11 -9 4 -33 -20 11 -3 4 3 -1 27 -17 -15 -49 -8 -2 4 8 2
7095 2 4 15 1 5 7 33 -2 16 -12 -51 8 -1 -20 14 19 5 18 18 16 -14 -12 -4 15 -3 9 3 -17 16 -13 18 -8 25 -11 -19 10 17 4
7132 4 0 1 9 13 8 -16 -1 14 5 -1 0 2 -6 35 -18 -18 25 52 24 11 -24 17 -8 -15 -1 15 4 30 27 -8 12 1 20 13 -4 4 -17 -1
7170 -1 14 34 -20 -9 -11 -21 -53 15 7 -5 -5 6 6 -25 15 13 2 -2 -21 -23 19 12 25 -8 15 -2 -13 -9 11 -2 -32 -28 11 12 -2 4 34
7207 34 -20 15 20 16 14 24 -1 -3 -6 -7 35 13 10 9 -23 -7 6 2 -10 -12 -11 -25 -20 -48 -21 -25 10 19 5 0 1 2 -55 1 -5 -28 -6 19 -18
7246 -18 -8 -28 13 27 -7 14 7 46 36 35 21 31 13 5 -31 -13 -10 -24 9 -9 22 6 -4 -14 9 -10 12 11 -18 -26 -31 -43 6 -24
7280 -24 12 23 27 -8 -32 4 32 3 15 30 3 1 11 26 -5 15 2 11 -9 -25 16 -11 -25 24 -11 -38 8 7 -21 16 22 -5 2
7313 2 -1 -25 -8 -27 -28 6 12 -18 12 12 13 -4 4 1 -30 30 24 -12 3 -31 18 0 -7 -22 -11 -12 6 5 -16 21 42 -29 -9 -7 0 -5 -23 -2
7351bJ0Okj9L3k0qL5k6K0j9K7k2j5l2M9j2nj2J4J6kLm6QJ2j3K1K0m0M3j7k7l3
7385e5L6J1J9J6J3m9PLJ6J5j7Lj0J6Kl4J5qnK4plmK2k8L7k0l2K3Okj6K8j0j2%
7421@J2m5PK6m1N5l3nj0L7j8JL5l2M9o3J5m7P6l5K8j6k6J6oL8J7k6l5jL1j1om
7455a7L4j9j0J9J7l3M6j2k5k6M4j4rL4oj8J3l6K4Qj7J6Mk9L1l0Rj0k2K7Nk7J3
7488a6nqK6j8J1l3K6MjL6k4J3J0K0m9J7qLk4lOQlPJ0j2NJ6oN6n7k6J2k8K7J2j6
7525a2j3M1Mj0Lk5k2N3m8K1kK2lj3Mlk4PL1l3K5l0L4NJ3k4J6Qpj7nlj%L6m8mK7
7563CM1n4K1kkK0pk5L3o4LK6lK4l2kL5k5J0J1o1J5K1k1M4%j4j1l5O5j3J7l2rL7
7598A4j8J2m5QN0n0L8rpj6K4OMMj6Oj4j8N0k2j7RJ4Lk9K3j2oKj3j0K5j1j4M9k1
$$ plain form
7351 -2 8 14 12 -7 26 6 -2 33 7 27 8 35 13 -2 -34 15 3 -2 -14 0 16 14 17 -29 -21 -9 -22 -1 19 -21 22 5 -22 -55
7385 -55 -19 -8 11 27 40 -9 -2 1 17 32 15 18 8 24 26 -8 7 -1 -6 18 11 8 4 26 -2 35 15 -17 6 12 10 -6 22 12 0 0
7421 0 12 -33 -26 0 -41 14 -19 -24 -34 3 -15 -14 21 -11 38 -25 -10 -57 19 -16 12 -4 -30 -14 -20 18 35 9 -26 -27 4 -7 -13 -17
7455 -17 17 -2 -12 7 24 -9 37 25 0 -26 18 4 -5 29 23 5 18 -18 6 14 -3 13 17 -12 19 -11 -2 -12 -34 -7 -2 -29 -16
7488 -16 -21 -29 -3 -21 -10 -43 -17 -13 -14 22 -2 11 21 41 -8 9 1 4 -20 -23 -17 -9 -12 -5 5 -7 -2 14 8 64 7 -19 -7 -35 -8 4 -12
7525 -12 -25 16 20 10 13 -12 -34 19 -29 -8 -10 12 9 -4 0 -3 -27 -20 11 -22 3 -27 7 12 25 1 17 25 18 1 -4 -7 -8 -8 28 -20 -24 3
7563 3 44 -10 11 9 7 27 20 -5 28 -36 -33 -7 -10 14 -18 -20 15 -10 0 11 -50 -35 -14 -35 9 9 -5 -16 -51 14 1 18 -14 -23 14
7598 14 -4 8 -37 -29 21 -29 9 0 -7 -23 1 7 11 15 -1 5 -9 -27 23 1 -16 -7 7 10 -19 4 -8 -14 -12 -25 -35 -10 -21 -35 14 -7
7634gK1k4OlqJ2K7p0M7nk7L7j1mPj6j3L8NJ3j6j3LqMK4k1klMk4L6rk0J1l5M8J
7672EL4o3M7L0m6Jo7N5k1J3Lk6N2j8k9K9k3jnj0L5J7l4L7l0L2KMl4J6Mrj5L0J9
$$ plain form
7634 -7 14 -10 -4 -7 -15 -3 24 -46 1 -4 -31 6 -5 -9 -2 -18 -31 7 12 25 9 -4 -1 -9 -5 19 -2 -4 -7 -3 -27 9 0 -20 -9 -44 4 5
7672 5 39 -24 23 53 7 8 -59 -4 -25 -12 -9 -35 17 -1 -30 -1 -24 -25 -30 -40 -5 12 -22 15 -15 17 19 23 -11 5 9 0 -15 15 34
$$ [...]
8191a9
##END NTUPLES=NMR FID
##END=
