##TITLE=1H ikalashn
LR-786-B-C2
24.10.2024
##JCAMPDX= 6.0         $$ Bruker NMR JCAMP-DX V2.0
##DATA TYPE= NMR FID
##DATA CLASS= NTUPLES
##ORIGIN= UXNMR, Bruker Analytische Messtechnik GmbH
##OWNER= root
$$ TOPSPIN		Version 1.3
$$ 2024-10-24 14:29:47.171 +0400  Irina@DPX200
$$ Compression mode = diff/dup
##.OBSERVE FREQUENCY= 200.131300845
##.OBSERVE NUCLEUS= ^1H
##.DELAY= (6, 6)
##.ACQUISITION MODE= SIMULTANEOUS
##.ACQUISITION SCHEME= undefined
##.AVERAGES= 64
##.DIGITISER RES= 18
##SPECTROMETER/DATA SYSTEM= spect
##.PULSE SEQUENCE= zg
##.SOLVENT NAME= CDCl3
##.SHIFT REFERENCE= INTERNAL, CDCl3, 1, 17.49637
##AUDIT TRAIL= $$ (NUMBER, WHEN, WHO, WHERE, WHAT)
$$ ##TITLE= Audit trail, TOPSPIN		Version 1.3
$$ ##JCAMPDX= 5.01
$$ ##ORIGIN= Bruker BioSpin GmbH
$$ ##OWNER= Irina
$$ $$ F:/spectra/data/iren/nmr/1H/4/audita.txt
$$ ##AUDIT TRAIL=  $$ (NUMBER, WHEN, WHO, WHERE, VERSION, WHAT)
(   1,<2024-10-24 14:29:10.437 +0400>,<Irina>,<DPX200>,<TOPSPIN 1.3>,
      <created by zg
	started at 2024-10-24 14:24:57.250 +0400,
	POWCHK disabled, PULCHK disabled
       configuration hash MD5:
       BE 6D 3F 07 2A EA 11 49 91 17 2B D3 AF B3 58 0D
       data hash MD5: 16K
       AA BC 8E E7 29 3A 74 EA CE 3E 8F 91 14 FE 90 5B>)
$$ ##END=
$$ 
$$ $$ hash MD5
$$ $$ 3F 19 04 83 D5 B3 44 47 46 0D 8E 8D 11 F6 19 75
##$RELAX= 
##$RELAX= 
##$RELAX= 
##$RELAX= 
##$RELAX= 
##$RELAX= 
##$RELAX= 
##$RELAX= 
##$RELAX= 
$$ Bruker specific parameters
$$ --------------------------
##$DU= <F:/spectra>
##$EXPNO= 4
##$NAME= <1H>
##$PROCNO= 1
##$TYPE= <nmr>
##$USER= <iren>
##$AMP= (0..31)
100 100 100 100 100 100 100 100 100 100 100 100 100 100 100 100 100 100 
100 100 100 100 100 100 100 100 100 100 100 100 100 100 
##$ANAVPT= -1
##$AQSEQ= 0
##$AQ_mod= 1
##$AUNM= <au_zg>
##$AUTOPOS= <>
##$BF1= 200.13
##$BF2= 200.13
##$BF3= 200.13
##$BF4= 200.13
##$BF5= 200.13
##$BF6= 200.13
##$BF7= 200.13
##$BF8= 200.13
##$BYTORDA= 1
##$CFDGTYP= 0
##$CFRGTYP= 5
##$CHEMSTR= <none>
##$CNST= (0..63)
1 1 145 1 1 1 1 1 1 1 1 1 1 1 1 1 1 1 1 1 1 1 1 1 1 1 1 1 1 1 1 1 1 1 
1 1 1 1 1 1 1 1 1 1 1 1 1 1 1 1 1 1 1 1 1 1 1 1 1 1 1 1 1 1 
##$CPDPRG= <>
##$CPDPRG1= <>
##$CPDPRG2= <>
##$CPDPRG3= <>
##$CPDPRG4= <mlev>
##$CPDPRG5= <mlev>
##$CPDPRG6= <mlev>
##$CPDPRG7= <mlev>
##$CPDPRG8= <mlev>
##$CPDPRGB= <>
##$CPDPRGT= <>
##$D= (0..63)
0 2 0 0 0 0 0 0 0 0.06 0 0.03 0 0 0 0 0.0002 0 0 0 0 0 0 0 0 0 0 0 0 0 
0 0 0 0 0 0 0 0 0 0 0 0 0 0 0 0 0 0 0 0 0 0 0 0 0 0 0 0 0 0 0 0 0 0 
##$DATE= 1729765749
##$DBL= (0..7)
120 120 120 120 120 120 120 120 
##$DBP= (0..7)
150 150 150 150 150 150 150 150 
##$DBP07= 0
##$DBPNAM0= <>
##$DBPNAM1= <>
##$DBPNAM2= <>
##$DBPNAM3= <>
##$DBPNAM4= <>
##$DBPNAM5= <>
##$DBPNAM6= <>
##$DBPNAM7= <>
##$DBPOAL= (0..7)
0.5 0.5 0.5 0.5 0.5 0.5 0.5 0.5 
##$DBPOFFS= (0..7)
0 0 0 0 0 0 0 0 
##$DE= 6
##$DECBNUC= <off>
##$DECIM= 32
##$DECNUC= <off>
##$DECSTAT= 4
##$DIGMOD= 1
##$DIGTYP= 9
##$DL= (0..7)
0 120 120 120 120 120 120 120 
##$DP= (0..7)
150 150 150 150 150 150 150 150 
##$DP07= 0
##$DPNAME0= <>
$$ [...]
##$SW= 21.9926040160658
##$SWIBOX= (0..15)
0 0 2 0 0 0 0 0 0 0 0 0 0 0 0 0 
##$SW_h= 4401.40845070422
##$TD= 16384
##$TD0= 1
##$TE= 300
##$TE2= 300
##$TE3= 300
##$TEG= 300
##$TL= (0..7)
0 120 120 120 120 120 120 120 
##$TP= (0..7)
150 150 150 150 150 150 150 150 
##$TP07= 0
##$TPNAME0= <>
##$TPNAME1= <>
##$TPNAME2= <>
##$TPNAME3= <>
##$TPNAME4= <>
##$TPNAME5= <>
##$TPNAME6= <>
##$TPNAME7= <>
##$TPOAL= (0..7)
0.5 0.5 0.5 0.5 0.5 0.5 0.5 0.5 
##$TPOFFS= (0..7)
0 0 0 0 0 0 0 0 
##$TUNHIN= 0
##$TUNHOUT= 0
##$TUNXOUT= 0
##$USERA1= <user>
##$USERA2= <user>
##$USERA3= <user>
##$USERA4= <user>
##$USERA5= <user>
##$V9= 5
##$VALIST= <valist>
##$VCLIST= <CCCCCCCCCCCCCCC>
##$VD= 0
##$VDLIST= <DDDDDDDDDDDDDDD>
##$VPLIST= <PPPPPPPPPPPPPPP>
##$VTLIST= <TTTTTTTTTTTTTTT>
##$WBST= 1024
##$WBSW= 25
##$XGAIN= (0..3)
0 0 0 0 
##$XL= 0
##$YL= 0
##$YMAX_a= 638328
##$YMIN_a= -967562
##$ZGOPTNS= <>
##$ZL1= 120
##$ZL2= 120
##$ZL3= 120
##$ZL4= 120
##$ABSF1= 10
##$ABSF2= 0
##$ABSG= 5
##$ABSL= 3
##$ALPHA= 0
##$AQORDER= 0
##$ASSFAC= 0
##$ASSFACI= 0
##$ASSFACX= 0
##$ASSWID= 0
##$AUNMP= <proc_1d>
##$AXLEFT= 0
##$AXRIGHT= 0
##$AXTYPE= 0
##$AXUNIT= <>
##$AZFE= 0.1
##$AZFW= 0.1
##$BCFW= 1
##$BC_mod= 2
##$BYTORDP= 1
##$COROFFS= 0
##$CY= 7568.61572265625
##$DATMOD= 1
##$DC= 2
##$DFILT= <>
##$DTYPP= 0
##$F1P= 17.9538593292236
##$F2P= -4.03888763876832
##$FCOR= 0.5
##$FTSIZE= 32768
##$FT_mod= 4
##$GAMMA= 1
##$GB= 1
##$INTBC= 1
##$INTSCL= 1
##$ISEN= 128
##$LB= 0.02
##$LEV0= 0
##$LPBIN= 0
##$MAXI= 945.577
##$MC2= 0
##$MEAN= 0
##$ME_mod= 0
##$MI= -402.1523
##$NCOEF= 0
##$NC_proc= 0
##$NLEV= 6
##$NOISF1= 8.587773
##$NOISF2= 6.764455
##$NSP= 1
##$NTH_PI= 0
##$NZP= 0
##$OFFSET= 17.49637
##$PC= 1
##$PHC0= -45.48676
##$PHC1= 11.6701
##$PH_mod= 0
##$PKNL= yes
##$PPARMOD= 0
##$PPDIAG= 0
##$PPIPTYP= 0
##$PPMPNUM= 100
##$PPRESOL= 1
##$PSCAL= 0
##$PSIGN= 0
##$REVERSE= no
##$SF= 200.13
##$SI= 32768
##$SIGF1= 18.5376
##$SIGF2= -6.396296
##$SINO= 400
##$SIOLD= 32768
##$SREGLST= <1H.CDCl3>
##$SSB= 3
##$STSI= 0
##$STSR= 0
##$SW_p= 4401.40845070422
##$SYMM= 0
##$S_DEV= 0
##$TDeff= 0
##$TDoff= 0
##$TI= <>
##$TILT= no
##$TM1= 0
##$TM2= 0
##$TOPLEV= 0
##$USERP1= <user>
##$USERP2= <user>
##$USERP3= <user>
##$USERP4= <user>
##$USERP5= <user>
##$WDW= 1
##$XDIM= 8192
##$YMAX_p= 0
##$YMIN_p= 0
$$ End of Bruker specific parameters
$$ ---------------------------------
##NTUPLES= NMR FID
##VAR_NAME=  TIME,          FID/REAL,        FID/IMAG
##SYMBOL=    X,             R,               I
##VAR_TYPE=  INDEPENDENT,   DEPENDENT,       DEPENDENT
##VAR_FORM=  AFFN,          ASDF,            ASDF
##VAR_DIM=   8192,          8192,            8192
##UNITS=     SECONDS,       ARBITRARY UNITS, ARBITRARY UNITS
##FACTOR=    0.0002272,     1,               1
##FIRST=     0,             0,               0
##LAST=      1.8609952,     104,             432
##MIN=       0,             -967562,         -967562
##MAX=       1.8609952,     638328,          638328
$$ Real data points
##PAGE= N=1
##DATA TABLE= (X++(R..R)), XYDATA
0 0 0 0 0 0 0 0 0 0 0 0 0 0 0 0 0 64 -64 64 -64 64 -116 128 -128 191 -192 222 -256 320 -329 385 -448 513
32 513 -578 669 -767 841 -961 1084 -1207 1343 -1488 1660 -1842 2037 -2254 2490 -2748 3039
48 3039 -3346 3685 -4059 4472 -4931 5440 -6004 6651 -7378 8215 -9184 10330 -11695
61 -11695 13372 -15484 18223 -21938 27318 -35845 51401 -89281 380721 205552 -376838
72 -376838 337776 638328 166508 -271189 113751 340247 11233 -260479 25349 127752
82 127752 -190366 -345234 -15126 116516 -137967 -236030 42658 97547 -165376 -206899 109410
93 109410 204999 53 -13833 252466 302462 93583 41550 179609 139727 -17128 19143
104 19143 102014 -101930 -342331 -214618 25055 -107252 -390436 -309579 -3898 35522 -104816
115 -104816 -32851 142124 80458 -48306 78717 248186 114335 -82008 27482 208673
125 208673 86523 -113918 -20039 148901 16649 -206652 -128234 73735 6901 -195629
135 -195629 -163719 10110 -14729 -173419 -164601 -27532 -7970 -65951 -8335 96353 82089
146 82089 40448 122659 204015 123669 7877 32961 99284 44335 -52714 -59403 -45714 -107194
158 -107194 -155516 -101512 -44931 -80373 -111948 -46875 23767 7825 -15484 34098 77511 40658
170 40658 8247 54794 100369 66262 20014 32214 53035 28502 1944 10219 14845 -8745
182 -8745 -25372 -26840 -46807 -76536 -73204 -52506 -66437 -93193 -67147 -7763 12816 4872 35606
195 35606 86934 84533 49116 62267 104839 86710 22292 6170 33724 17325 -44605 -65493
207 -65493 -37858 -40180 -81745 -86230 -36154 -5305 -25404 -38373 -8998 16324 7643 520 22003
220 22003 41753 34445 24704 32881 43024 39976 32982 29588 25568 21280 15664 1669 -17454 -29083
234 -29083 -37742 -55147 -69993 -61716 -42109 -39287 -43442 -24321 9671 21380 14745 30081 64426
247 64426 69178 42840 37416 57490 51192 9258 -11984 1806 -2637 -40003 -53220 -25429 -12523
260 -12523 -38954 -51870 -23702 -1693 -17621 -29466 -7408 14664 3971 -7830 12861 35543
272 35543 26878 14202 28285 46232 37578 22891 25657 27369 9556 -10340 -15109 -21266 -38253
285 -38253 -48884 -43888 -41647 -45999 -40542 -21426 -7774 -4411 8067 30685 39598 33266 35442 48127
299 48127 45482 23558 12864 18632 12721 -9512 -18498 -11142 -12636 -28014 -29769 -17805 -16242 -27629
313 -27629 -27693 -14005 -9704 -17460 -14634 1679 8448 3488 9699 28646 35249 26423 27821 41371
327 41371 38950 19884 10477 14132 3991 -19995 -30803 -26399 -31201 -45548 -46367 -30243 -21867 -24491
341 -24491 -16962 3986 16205 14386 17647 31021 35495 26047 21902 26960 23651 9336 3513 7527
355 7527 4210 -7809 -11507 -7066 -10080 -20223 -22978 -18285 -19708 -26349 -25507 -17311 -12683 -12976 -6971
370 -6971 6236 14116 16923 23871 33238 34826 30175 29381 27838 18545 5212 -1130 -6416 -17486 -26820
385 -26820 -28144 -26457 -29861 -30905 -22390 -13233 -10260 -7546 1743 11055 11963 10358 14810 21015 18188
400 18188 13252 15266 18808 15116 8288 8085 9616 4145 -3691 -6647 -7679 -13694 -20481 -22178 -22405
415 -22405 -23550 -23416 -19450 -12439 -6751 -1180 6053 14538 19854 22856 25406 26638 24391 19749 15118
430 15118 9715 2638 -3203 -8416 -13335 -16604 -16882 -16835 -17577 -16824 -12770 -9494 -8892 -6560 -1527 2150
446 2150 2484 3405 7427 11844 11974 10707 13143 17093 15961 11337 9418 10499 6517 -1599 -7303 -9017
462 -9017 -12039 -17731 -20774 -19269 -16104 -15090 -13891 -9544 -1046 4915 6991 8972 14903 18105 16507
477 16507 13977 13269 12488 7611 2469 553 137 -2341 -6838 -8668 -7813 -8407 -10623 -11074 -8377 -7003
493 -7003 -8576 -7031 -3433 -1939 -1949 1286 5339 7197 8018 11173 14468 13096 11097 10479 8880 3803
509 3803 -1195 -3191 -4283 -8489 -13422 -13260 -10290 -11397 -13009 -9301 -2967 -1261 -510 3635 8860 9155
525 9155 6803 7656 9492 8468 5540 4519 5164 3557 976 -415 -1685 -3268 -5376 -5822 -6822 -6472
541 -6472 -5946 -4987 -6349 -7378 -4365 -1399 -2104 -3275 3537 10676 9521 5883 9056 14640 9901 762
557 762 1377 6864 2816 -7286 -8764 -1382 -2755 -13471 -15740 -6003 -430 -7872 -9441 2636 9672
572 9672 2721 -2588 5278 11596 5518 -643 4480 10905 7440 -116 -162 3431 2301 -4221 -5928 -2823
588 -2823 -1369 -3909 -6757 -7070 -5345 -5064 -6897 -8139 -4183 3916 5317 2015 4345 12267 12281 3324
604 3324 963 9276 11210 76 -5819 2688 5978 -6255 -15534 -8033 267 -8003 -15801 -5606
618 -5606 7084 1471 -8404 -2722 9700 6093 -4416 -433 11874 10135 189 1031 9722 8407
632 8407 -1694 -3509 2625 2960 -3281 -5337 -1887 -2649 -7772 -10273 -8360 -6923 -5764 -2801 -240
647 -240 67 2876 6999 6740 3762 5298 9981 7982 2656 4249 8894 5197 -5021 -6965 -1848 -3047
663 -3047 -10215 -9516 -1384 -669 -7144 -7765 -313 1738 -4569 -5382 2760 6103 1562 1466 8411 9360 2837
680 2837 963 6361 7143 2091 599 3965 1827 -5063 -6599 -4113 -5213 -10114 -9856 -4656 -3348 -5725
696 -5725 -3336 3017 3014 -1474 337 7657 8983 4615 5049 9578 7653 872 -1216 2832 2459 -4061
712 -4061 -6109 -1496 236 -3846 -6655 -4477 -2865 -6000 -8025 -4270 455 857 -690 886 3383
727 3383 4137 3509 4253 5591 6124 6530 5065 2950 2799 2901 -409 -5293 -6536 -3653 -3735 -6467 -6845 -2865
745 -2865 -990 -5185 -6488 -265 5013 1536 -1517 3734 9040 5298 -295 2273 7376 4170 -2560
760 -2560 -339 5579 4558 -2771 -4355 146 116 -5874 -7841 -2917 -485 -4823 -6828 -2400 1787 -618
776 -618 -2724 453 4622 4280 2630 4356 6584 6008 2390 339 959 1072 166 -2495 -3155 -1836 -1905
793 -1905 -3701 -4483 -2712 -1337 -2286 -3366 -1147 2112 1760 -673 134 2742 3243 111 498 4395 4890
810 4890 1209 -31 2415 3267 -486 -2483 -856 -156 -2674 -4149 -2837 -701 -2321 -4287 -3143 240
826 240 569 -335 1165 3017 2597 2108 1728 2412 2375 1441 535 514 495 72 -553 -889 -1414 -1161 -1721 -1812 -1326
847 -1326 -585 -227 -741 -1155 -605 374 -293 -321 22 1381 1463 849 1621 2041 1375 918 820 994 -178 -446
867 -446 -456 -1077 -1807 -2064 -1949 -1290 -1132 -1015 211 1008 424 306 1391 2017 883 354 1171 985 139 -457
887 -457 304 752 -704 -1516 -163 46 -485 -1050 -348 264 -109 -1284 -485 481 179 -838 -237 1039 949
906 949 335 640 1442 790 264 594 373 -41 -650 -686 -844 -1179 -1606 -1499 -1042 -835 -701 -541 384 613 917
927 917 1224 1335 1273 1030 1347 1104 340 146 293 -173 -862 -970 -321 -650 -1220 -923 -171 -384 -787 -1111 -322
948 -322 90 -149 -293 735 733 416 490 1295 1659 1114 945 1507 1051 418 108 -344 -366 -1262 -1587 -1167 -1641
969 -1641 -1742 -1676 -1006 -509 -619 125 310 738 902 1268 1578 1872 1038 761 1106 1075 442 279 566 84 -682
990 -682 -288 -585 -580 -1167 -1257 -1083 -1329 -1325 -1234 -792 -428 52 186 887 871 1364 1453 1790 1820 1605 1111 1296 716
1013 716 5 -524 -1048 -1199 -1302 -1352 -1508 -1605 -1084 -1214 -743 -883 -96 -134 540 543 864 1015 918 810 1053 1137
1035 1137 1232 1191 676 716 517 59 -431 -187 -701 -1672 -1656 -1466 -1361 -1762 -1574 -1291 -496 -293 10 788 924
1056 924 1595 1206 1403 1774 1864 1384 1014 698 732 387 -333 -356 -604 -770 -1023 -1164 -1190 -766 -818 -762 -1152 -639
1078 -639 -331 -515 -83 218 724 521 634 1041 1776 1828 1119 730 1195 779 462 -199 -223 -531 -1323 -1449 -1660
1099 -1660 -1052 -931 -1380 -1222 -300 186 160 91 869 1070 898 632 1153 1498 642 439 671 480 531 264 -129
1120 -129 213 422 -690 -1045 -657 -466 -1116 -1253 -1130 -487 -476 -260 -147 290 305 426 449 790 2037 1078
1140 1078 281 698 1006 398 -436 -282 -100 -212 -1034 -1066 -588 111 -1032 -1525 -822 -103 -318 -861 88 614
1160 614 336 -308 -80 937 730 213 65 362 1340 641 -53 733 1001 176 -850 -695 103 -96 -1138
1179 -1138 -1047 -583 -407 -642 -642 -43 806 98 163 357 918 919 564 277 139 854 310 -124 -122 212 -267 -606
1201 -606 -31 -401 5 -486 -619 -7 -194 -247 -410 80 105 -102 -506 -168 142 468 625 274 226 481 668
1222 668 47 126 455 92 -111 -647 -504 130 -208 -145 -621 -12 292 228 65 91 230 96 -333 -202 313
1243 313 289 138 -414 -353 168 124 73 260 187 252 -415 -157 106 422 -131 -268 -104 143 -213 -542 -57 266
1265 266 -23 -298 -115 624 527 -290 -245 282 256 -725 -701 -6 413 -381 -602 141 636 381 -278 175 703
1286 703 178 -415 -167 870 573 -380 -443 -188 309 217 -795 -517 -202 -174 -608 -305 462 628 -459 -484
1306 -484 76 425 -77 -160 341 807 394 -219 32 366 443 383 -579 73 577 -222 -785 -600 144 -618 -1413
1327 -1413 -417 337 -223 -732 -225 741 885 279 14 421 932 361 -13 449 886 297 -275 -399 -227 -52
1347 -52 -341 -610 66 -158 -479 -701 -214 -326 -243 -686 -385 381 433 49 -27 696 605 361 193 849 556 165
1369 165 198 285 -88 -108 -370 -572 -514 -705 -407 -399 -542 -130 -156 -88 -150 212 212 193 240 429 444 423 444 558 765
1394 765 360 234 81 -6 100 -50 -443 -435 -636 -479 -659 -648 -341 -343 -290 -305 -55 210 333 146 646 599 667
1417 667 882 204 565 380 280 -168 -220 -247 -274 -647 -461 67 -425 -669 -695 -14 -68 -171 -10 -369 87 166
1439 166 139 396 443 529 281 430 486 578 334 203 200 -126 38 -677 -703 -575 -480 -703 -645 -442 -399 -467 -7 -15 256
1464 256 179 235 665 404 391 332 670 96 184 219 -140 -46 193 -274 -658 99 -430 -522 -195 -371 75 -628 -595
1487 -595 -34 223 65 -86 -49 305 495 642 236 138 716 334 34 62 -117 31 -364 37 -399 -392 -304 -495
1509 -495 -186 -565 205 12 -348 -206 312 -55 49 409 641 79 314 174 654 111 -6 178 172 161 58
1530 58 -218 224 -76 -168 -369 -274 -120 -302 242 -20 28 77 115 234 -79 314 230 661 335 233 -78 68
1552 68 -333 -212 131 229 -243 -545 -85 345 -250 -388 -385 -89 72 -217 39 -8 82 149 200 186 281 -148 252
1575 252 130 411 -199 207 238 -284 -65 -110 85 -567 -382 -29 44 -185 -214 -69 -266 -31 -604 -218 375
1596 375 178 -30 -165 404 126 -79 -89 -35 -33 -34 -302 -150 8 -219 51 -138 26 -9 -331 -11 281 53
1618 53 174 3 -60 -280 31 60 -399 -161 326 -206 -64 -237 -68 3 -210 -125 -337 -204 279 -138 36 339
1640 339 -11 342 184 150 -158 -121 207 -152 -54 186 -241 -108 -117 -163 98 -265 -12 -540 47 212 -131 169
1662 169 624 335 308 -50 66 567 285 238 -435 444 243 156 -155 -202 7 -194 -15 -387 -402 -96 1 6 170
1685 170 -391 -375 -63 338 332 -28 -172 192 320 131 249 139 383 401 -521 -258 -279 79 233 -268 -195 -70
1707 -70 -355 24 -119 -209 -395 -138 -28 279 -76 300 212 309 271 40 -103 333 -9 -213 252 -49 16 -245
1729 -245 -122 -461 -211 -121 -181 11 -282 -223 -144 27 -33 560 140 -7 131 352 476 414 120 142 -143 243
1751 243 -98 173 121 -11 -562 -442 -109 -132 -360 23 -174 -261 -120 -218 128 207 -225 -30 150 377 309 -241
1773 -241 385 59 293 -71 214 -189 105 -420 -208 41 1 104 -546 -176 141 -254 -17 8 -44 201 -122
1794 -122 -56 188 340 55 245 16 35 265 297 95 -78 -185 274 -152 -210 -38 -121 -260 -7 -43 -65 37
1816 37 -384 145 195 195 290 -29 432 226 340 156 25 435 282 201 181 205 -103 -374 -49 -311 -218 -450 234
1839 234 -153 -14 -31 -227 -121 161 -199 154 122 4 331 196 -53 -96 465 192 -368 261 -100 -358 -163
1860 -163 -259 96 -422 7 12 -29 79 29 -305 286 -14 264 44 277 164 513 -44 -103 29 46 162 -303
1882 -303 117 122 -123 -27 -196 -117 -386 -216 -127 200 -79 -50 -135 94 329 -290 212 201 47 9 -305 155 92
1905 92 24 196 134 280 -23 -219 -226 260 -40 -205 -347 -38 -107 -65 -251 -279 -75 -248 -479 -97 -219 150 243
1928 243 50 -290 -117 185 72 179 131 -108 38 -191 401 187 -18 360 -228 45 13 -90 32 193 -38
1949 -38 369 -80 -5 -8 139 -291 216 -20 53 7 -230 -191 80 370 8 -182 -21 194 -214 -192 -194 298 344 -148
1973 -148 -133 -282 50 56 186 19 153 -166 165 -115 46 144 -252 -241 -105 9 -178 -26 -8 355 114 26
1995 26 -297 285 -55 31 186 -57 364 -322 -46 -125 202 41 -238 -543 -90 -384 -8 266 136 91 -462
2016 -462 220 -277 176 14 264 -172 -11 276 35 -201 29 193 -96 148 -6 -50 -51 33 -39 -38 -66 -129 65
2039 65 425 56 -234 69 609 -125 88 214 111 189 100 -115 56 157 -14 -227 379 -88 -419 -269 -421
2060 -421 -202 -281 -109 -14 -238 172 -108 308 96 -241 52 56 -173 88 31 -134 7 279 304 294 -128 -402
2082 -402 291 -408 71 178 153 -62 -314 -22 351 -106 -155 32 -463 103 -88 489 234 137 234 174 1 203
2104 203 211 -32 70 30 -420 -1 68 -125 -120 -307 203 -198 52 -261 160 166 5 -148 -430 -198 117 52 -12
2127 -12 -25 -53 -155 8 193 119 30 -193 -55 143 46 98 -67 241 -154 104 -191 -107 8 -65 130 -142 221
2150 221 326 -140 117 28 140 56 179 -52 -27 224 -243 279 -97 200 103 52 -11 -27 123 74 -152 -134 -72
2173 -72 161 22 -62 151 57 -139 55 -91 161 -233 51 -83 10 -47 245 282 -36 -72 -53 464 29 229 -216
2196 -216 -187 16 212 -210 -58 -64 -99 -5 29 -1 -314 423 158 -500 -100 111 258 153 -4 -256 290 -64
2218 -64 -56 -53 -178 28 109 -304 27 360 -208 -241 219 75 -228 190 -103 -296 274 67 -116 123 136 -34 88
2241 88 71 449 274 160 323 -653 -120 216 -10 136 -217 -121 56 253 88 395 -255 134 67 17 105 -10
2263 -10 -29 128 135 -66 -141 -178 -1 199 81 432 111 32 113 151 252 -211 -198 -103 -64 -61 -189 -57 155 183 89
2288 89 -17 -93 -66 193 -158 291 95 -45 -161 -512 219 402 -132 230 330 -158 35 83 -201 170 403
2309 403 170 8 311 279 26 -62 305 31 320 200 -368 1 184 47 -13 300 166 51 250 -172 -303
2330 -303 -105 302 98 237 -64 -170 48 -196 21 263 172 88 -119 -30 315 -126 296 92 -29 263 -397
2351 -397 -634 -88 7 103 -304 154 198 152 62 105 20 -161 -23 -66 -34 122 198 -199 314 12 131 -44 -69 -109
2375 -109 45 48 281 -193 -213 -250 75 77 347 5 112 -239 -211 -202 29 175 -202 -328 113 102 106 70 18 -76 146
2400 146 -474 65 -198 194 176 81 25 -45 111 -10 -70 189 48 -92 190 -251 -131 18 164 340 -24 313
2422 313 143 437 -25 -81 -82 -345 -59 53 -276 -374 -98 -262 23 -31 -103 -44 142 -246 273 -159 19 10 -23
2445 -23 -229 305 117 144 299 135 12 -53 -118 -194 -211 -25 -1 58 -295 -53 146 188 21 -137 -179 -382 -3
2468 -3 -158 -282 139 -163 357 286 -173 109 76 -227 36 -181 333 -20 251 -97 -163 -163 -5 -49 37 -311 1
2491 1 -319 -282 -243 -135 -93 130 154 -133 -293 131 -384 135 -313 -207 -4 -179 -16 13 18 221 -126 -280 67
2514 67 -361 173 -258 -581 206 94 -145 -20 0 -22 14 452 -52 209 -73 316 -126 78 -19 12 389 98
2536 98 -246 -52 -33 -32 179 -25 -47 -120 129 -34 -381 214 64 19 155 -38 -147 64 -13 40 344 223 -8
2559 -8 305 -158 -347 -6 -44 184 -172 97 278 -300 -20 310 47 111 89 -48 20 -89 -90 134 66 213 -186
2582 -186 172 47 -146 150 211 63 -379 47 207 -205 244 116 261 -467 -178 -69 -227 -373 317 -13
2602 -13 -292 36 -110 -402 38 228 -126 -33 101 81 43 146 173 260 67 2 -6 292 -62 10 256 -27 23 140
2626 140 -191 246 -341 -215 -112 104 233 -576 -222 -313 -98 146 -90 -209 -107 -192 -127 -337 128 -79 -2
2647 -2 66 -113 133 48 -66 -33 -97 225 190 -145 -319 -423 208 6 95 -75 57 -103 -149 -266 231 34 -157
2670 -157 137 -242 184 2 -163 -112 -50 -12 -203 -27 -107 -39 48 -1 -25 -496 341 238 268 -99 505 -199 -117
2693 -117 28 -438 183 -161 -417 192 56 259 83 2 -274 60 192 -116 -184 22 -272 -8 113 227 53
2714 53 -159 57 242 157 -85 -95 -10 240 312 94 241 204 103 -4 138 -220 -42 346 -247 -126 -342 78
2736 78 -63 169 -203 -84 114 139 297 -179 -7 -108 210 -223 -20 281 -247 281 283 -137 139 -309 -132
2757 -132 -363 -97 290 -143 -140 9 144 167 60 -151 323 -83 260 127 33 376 -533 121 83 -239 77 -59
2779 -59 -259 319 122 270 -71 -165 -181 -322 149 27 -52 160 236 -136 -212 50 102 -98 -44 -48 -143 -246 -222 180
2803 180 115 94 -212 29 46 130 -65 55 -296 1 186 -61 369 -256 -138 243 112 -144 84 89 101 169 91
2826 91 11 -267 -189 -235 -385 449 63 86 -231 76 21 77 -255 121 -129 59 271 114 -25 295 230 153 205
2849 205 200 98 -29 327 -29 -111 -188 -261 -181 12 80 -94 -10 -169 -117 153 -385 -108 150 208 66 -52 -112 -199
2873 -199 -173 -287 -162 324 20 186 260 123 385 266 -415 -52 367 -77 98 20 -126 -209 337 -55 -168
2894 -168 1 -277 228 58 -11 -152 -135 -286 -106 -90 -114 137 -148 -110 268 -80 -315 132 -42 22 -107 139
2916 139 104 -308 -138 147 21 239 101 113 437 -63 126 149 175 1 68 -121 -65 -292 -89 93 109 -202
2938 -202 -91 293 22 -321 -101 -191 -304 -10 5 111 26 100 -60 98 -220 -59 361 -462 237 -371 71
2959 71 126 133 -35 88 276 297 45 -398 108 436 376 -124 -353 -32 -150 227 36 14 150 -194 -192 2 -288
2982 -288 91 -15 118 -115 173 -169 6 5 -144 -377 -34 -16 238 -131 241 414 135 341 227 -123 -43
3003 -43 -136 38 118 -357 -88 -92 -311 58 2 -51 -156 -31 -30 10 9 6 -174 84 76 -107 -53 152 -204 57 218 -10
3029 -10 -397 -174 -24 19 -135 -185 -236 -245 -127 -137 -361 -321 29 -26 134 149 137 -378 16 303 -43 138 -237 175
3053 175 211 -173 155 339 -50 251 -65 160 -236 139 243 -247 -174 -16 -42 -225 -15 2 410 48 -81
3074 -81 365 -273 -291 37 -95 -72 -59 -121 -191 -17 -99 254 319 81 53 -219 -375 159 18 -20 -175 -69 -96 208
3098 208 313 -235 -204 84 420 137 101 362 -155 118 -179 169 -316 -25 322 -60 -375 -236 -99 99 332
3119 332 75 166 207 -225 2 -368 243 269 -117 -67 266 578 221 -68 441 -143 19 200 95 -67 57
3140 57 205 139 -27 204 123 -260 -181 46 240 -151 -4 86 324 -12 97 228 211 -290 -293 204 -265 -56 89
3163 89 -103 197 -155 -48 34 126 72 -106 -263 -77 297 -268 -190 118 -373 141 89 158 65 -52 -105 -16 73 342
3187 342 -197 -52 204 82 191 80 166 -216 138 -182 20 110 -24 -121 -4 186 17 -4 313 -255 101
3208 101 92 -90 124 -58 -30 60 166 -44 -200 -120 -112 200 -130 -316 234 -119 -336 111 12 108 73 141 440 68
3232 68 410 118 226 204 181 75 -128 197 188 -110 -329 255 289 256 100 79 -12 103 -73 -143 -62 137 -21 -198
3256 -198 -48 133 -224 -307 377 -301 41 -28 -272 161 -80 176 167 -154 138 26 119 149 107 -136 -250 -50
3278 -50 -116 221 -405 -66 66 -47 -171 63 41 110 -274 -166 337 -271 87 -61 -92 -164 -496 -42 98 126
3300 126 -91 -212 -239 331 -129 61 46 96 43 59 127 -113 -52 301 -253 -288 37 -301 -64 139 -349 376 -17
3323 -17 -77 132 -315 282 452 229 -26 207 39 451 193 14 352 -102 -137 3 61 -58 -59 349 -83 27
3345 27 114 188 -100 -136 -187 147 262 3 48 -85 194 -103 -247 40 -288 93 -195 -107 94 -348 363 -128
3367 -128 -109 -30 179 -170 525 91 -89 -54 -28 -16 63 459 -4 127 108 262 -71 174 -113 231 341 -30
3389 -30 -29 140 391 36 490 -132 -83 -70 173 -45 -274 -151 101 15 406 56 15 379 1 70 7 163 14
3412 14 -159 13 -10 176 -491 -307 -14 -3 127 203 196 -242 -146 -271 12 245 382 47 -57 -192 259 -16
3434 -16 262 -21 -74 120 130 90 -129 -103 -80 154 -71 61 64 18 236 -417 -158 -26 187 290 166 241 -50
3457 -50 -70 333 21 120 -174 125 203 -158 -21 67 -152 159 172 191 -134 -6 424 -143 -97 58 126 136 152 -251
3481 -251 -301 -106 -203 -210 418 -110 182 -228 -128 136 -33 -278 -299 208 -16 449 31 -157 194 86 -52 -253
3503 -253 153 103 200 -173 58 -12 -183 -106 190 16 -147 8 -5 15 34 235 -417 70 -35 -52 30 -50 -479
3526 -479 -104 81 -368 -486 123 116 -368 -216 -141 -144 62 322 -90 79 -3 -171 -287 285 33 150 258 61
3548 61 162 139 -461 -20 360 191 -189 230 -31 -7 -66 104 -69 15 -111 -44 96 -89 -77 -118 -498 184 201
3571 201 90 19 -327 -160 -364 -222 246 65 -318 224 -298 -107 -62 -68 44 185 -283 -157 -188 195 47 135
3593 135 23 -290 176 128 -30 132 -448 141 109 291 -227 -24 336 64 -241 301 67 -28 -285 -310 -379 145
3615 145 81 -45 65 -100 -246 -131 -36 -129 39 64 90 171 117 -55 -85 -259 -212 163 76 88 -309 -180 393 13
3639 13 -109 -45 -42 -134 -7 -14 -167 -251 101 290 73 125 -45 -85 187 329 175 64 187 113 16 368 170 -319
3663 -319 166 2 306 252 31 127 -19 158 67 108 -1 26 142 116 -61 123 62 307 65 241 -68 217
3685 217 191 -247 85 -53 39 -87 80 78 -14 -253 -422 -132 59 -28 110 213 265 -149 365 -31 102 -185
3707 -185 32 88 379 556 -110 96 -9 124 222 140 -211 -148 92 93 -219 -169 -194 -278 413 -271 31 -168 -40
3730 -40 -290 41 163 27 -132 -4 -52 -210 170 -122 -155 221 223 -151 29 165 283 294 -19 -5 -35 196 -114
3753 -114 218 -197 78 -11 216 -357 -106 -56 57 94 262 17 81 -47 42 -75 9 -60 -135 190 -18 461 -282
3776 -282 -33 -62 -321 -120 -158 -115 69 248 -296 148 340 0 1 -140 410 53 70 80 -86 -102 -230 167 -173
3799 -173 143 -32 45 -60 146 391 -218 -429 6 102 266 -113 51 -184 251 4 -37 -61 -72 -201 556 47
3821 47 -170 72 208 -202 -305 -329 -271 244 -104 325 -446 -248 313 -221 -176 32 74 -28 202 -493 81 -2
3843 -2 143 305 -113 50 249 -249 168 3 314 -33 -18 -69 -336 -40 -233 -73 232 113 -28 -219 -295 -144
3865 -144 235 -116 -103 348 233 432 285 16 10 -47 -8 -60 25 110 267 -195 42 -193 -208 263 92 74 228
3888 228 -463 -48 -59 -386 40 31 -82 -182 -272 80 -209 167 415 36 -110 -192 -82 45 -263 -251 274 -156
3910 -156 191 80 -191 -317 269 -407 164 -319 33 64 -25 53 -257 114 212 127 -16 374 40 -379 -87 -174
3932 -174 -48 -598 149 179 -228 -126 -157 321 -193 177 289 240 -396 -11 -110 58 -362 -77 73 -119 -155 -186
3954 -186 178 -97 138 284 70 108 -67 250 413 -124 -30 150 41 -149 -219 276 52 -319 32 164 -61
3975 -61 -48 15 -15 274 -269 -128 -76 -110 -66 -152 426 305 190 171 133 107 372 -349 20 85 -162 384 -221 -180
3999 -180 -29 -60 -294 -237 -122 -201 -17 183 75 305 -548 152 -3 122 345 385 212 110 324 67 -108
4020 -108 -260 -281 68 -173 46 -288 204 72 -20 119 -198 -20 77 -188 -41 16 -1 0 56 -16 358 -37 -30 231
4044 231 -195 -304 644 -692 18 578 35 -146 72 -249 -135 230 -82 -39 -162 259 -250 -222 -34 72
4064 72 -27 337 6 -116 84 -139 -186 -137 -12 10 -136 227 40 88 -179 144 102 -348 81 202 -144 -90 -167
4087 -167 186 -490 -408 80 137 191 -16 -110 93 278 174 169 -125 -189 -226 -24 -111 81 190 -99 23 -259 -72
4110 -72 -43 34 -3 -258 28 -220 -43 -207 5 138 -31 277 -58 -277 61 40 -312 -20 26 12 -88 -292
4132 -292 27 307 27 -274 -71 178 231 192 161 150 -248 -344 443 310 44 156 -32 -349 188 45 149 -91
4154 -91 219 -23 191 146 219 36 -178 46 94 228 9 337 -24 -309 12 200 -34 -271 16 227 -184
4175 -184 63 -177 385 -256 193 361 70 189 -342 -298 -123 86 290 107 340 -409 -22 -183 186 -4
4195 -4 -203 -46 -167 -150 -48 71 -73 178 -61 162 -121 125 -164 -296 -141 131 -417 -247 -325 130 73 -173
4217 -173 -262 -23 -62 -18 211 392 335 -445 142 -122 -4 270 -81 76 80 -204 -52 -150 51 -237 33 187
4239 187 -130 -329 -32 2 -280 136 24 190 -34 -116 -314 -200 -60 162 156 145 8 33 -104 296 -195 -192 68
4262 68 -46 -292 -25 -265 15 268 75 -106 -257 212 125 137 208 -61 -234 -113 166 192 321 -188 -237 -6
4284 -6 32 -401 -206 324 106 -20 48 -146 -206 -120 109 -32 210 -326 -128 -18 -359 149 -155 -300 116 -28
4306 -28 -171 -248 -208 226 -212 159 -134 33 -305 139 -20 173 124 283 -196 4 315 -225 -140 95 13 -261
4328 -261 57 38 -287 -207 204 -512 -77 -146 -87 -34 -85 344 88 179 23 -213 76 63 -158 -305 182 207 233
4351 233 -359 36 -442 -112 357 -2 -165 -61 203 30 20 86 -270 113 -49 75 52 -462 -42 -308 -50
4372 -50 -194 -99 111 10 311 165 109 28 78 140 -168 128 189 -336 98 113 343 151 -123 -278 113 209 -94
4395 -94 507 74 -1 346 -136 -81 170 -31 277 -213 22 -78 -50 -245 -100 -23 242 35 38 271 -60 253
4417 253 76 86 16 -173 269 45 -272 221 104 100 -140 100 99 -20 -386 -107 319 -296 -255 -156 153 -355 -302
4440 -302 -169 -243 -217 220 169 369 55 289 -11 -207 82 -8 153 305 -203 -163 -147 -389 33 -195 236 130
4462 130 -77 109 162 -42 148 -101 -9 42 40 74 185 -164 95 -237 -85 -118 -290 310 118 -215 21 59 145
4485 145 -153 105 -92 -150 82 286 47 -78 28 41 -156 53 121 205 351 124 254 -296 246 82 -142
4506 -142 -340 -317 262 -113 49 -260 -260 -129 106 -158 -21 31 32 71 -68 42 -196 -32 -1 119 1 -44 172
4529 172 419 156 -12 77 -97 -374 -9 149 244 0 182 41 52 64 51 -219 107 215 -132 37 116 -163
4551 -163 -285 -51 -101 -25 -76 281 -54 183 81 197 89 -30 11 -2 44 93 -154 -236 -14 -109 -32 -74 118 -69
4575 -69 -279 -157 -92 -121 84 52 -9 -140 285 220 134 -376 103 -57 284 430 -102 -64 104 -180 93 65 17
4598 17 -17 -160 -108 330 -308 46 96 -321 -99 150 209 37 167 -22 146 7 -101 -171 65 -263 61 -155
4620 -155 -390 -3 176 299 206 476 -70 -192 -163 -81 -213 84 -141 344 71 -169 214 -94 -49 296 -360
4641 -360 -141 36 102 -113 632 184 -215 -150 -1 113 27 -9 -28 192 50 43 -30 -235 11 96 -199 -101 47
4664 47 -105 -145 -53 -283 -353 106 24 -71 105 66 -74 144 -22 -192 354 -197 289 182 -163 182 -191 151
4686 151 433 75 -176 393 368 -360 -210 50 32 73 -216 -74 316 7 -196 20 494 -91 -63 -198 -135 -123
4708 -123 -117 -333 144 -309 455 167 397 -348 172 269 59 381 8 -189 111 -191 74 -101 94 -158 -170
4729 -170 145 224 17 9 -252 324 -303 -109 -348 197 80 -156 -52 208 -128 366 54 120 -65 -225 -86
4750 -86 -317 257 -40 -17 -73 22 -271 208 -203 14 89 186 220 -376 -230 -33 -177 -13 54 225 -248 -122 249
4773 249 13 8 162 316 -137 7 -144 -143 -14 217 30 62 323 65 -58 -303 -155 -150 -454 169 -30 -10 -97
4796 -97 -313 -229 -201 -207 268 -18 251 261 176 192 -198 418 18 14 85 187 -111 -29 -380 -81 82 267 -2 -73
4820 -73 -34 -90 211 114 271 162 314 -13 190 -3 37 -119 -136 -73 195 -237 145 -33 92 -429 87 -266
4842 -266 -154 17 275 -1 -193 -173 -150 -131 -25 -67 -286 118 -116 64 140 -146 318 -303 236 42 103 -109
4864 -109 -109 -184 -33 78 12 -101 306 28 97 85 27 -199 43 -93 137 -111 155 -242 96 157 -397 207 129
4887 129 241 -334 90 -216 -47 55 -88 46 -129 15 50 -15 186 110 208 96 -185 -404 67 -200 -182 -265
4909 -265 -84 107 361 -89 -271 -186 169 -42 -338 -82 -329 29 141 -80 129 -111 97 -177 438 61
4929 61 -100 -34 -168 182 32 25 -92 -14 -91 58 -149 301 155 -223 73 8 272 157 -3 -180 -384 242
4951 242 -238 -170 67 83 55 141 85 -183 -69 -256 296 157 30 93 76 -102 114 -38 -223 -270 -59 -149 200
4974 200 -42 18 62 118 66 -146 -338 48 -77 -165 169 -147 -7 108 -207 49 -89 147 240 -90 -433 79
4996 79 -94 -187 45 -154 347 13 301 225 -142 68 141 184 77 -102 244 10 -312 -117 -104 91 -42 -91
5018 -91 74 108 -136 -24 174 -80 27 352 -14 -175 163 102 200 52 -185 -20 143 85 76 -231 -316 -197 372
5041 372 242 270 134 -147 142 29 270 315 103 -94 195 -79 15 -191 6 61 -57 222 35 -142 100
5062 100 -360 44 -379 163 -150 -148 126 -4 -102 -311 -34 -105 -56 8 307 -73 -55 -35 88 -4 -128 -581 223
5085 223 -33 -242 -83 -339 50 48 159 -298 258 1 84 -14 -380 -4 -82 299 -97 -224 454 112 160 306
5107 306 498 250 -191 -23 78 315 214 -219 -123 -200 107 -72 -67 -61 -116 98 283 -25 -259 23 100 26 231
5130 231 315 -84 -199 92 170 411 230 76 234 -130 -14 46 225 -175 64 -222 176 -105 100 -21 -314
5151 -314 4 103 222 -158 -144 69 -265 -241 74 -7 56 -35 -52 125 3 175 -172 200 211 -150 -8 320 34
5174 34 7 -216 -320 -106 234 -36 -50 -205 214 115 19 32 -150 -167 -11 -172 171 313 -261 200 1 -414
5196 -414 342 -200 -58 -156 -121 -4 -433 5 -74 -230 104 -130 -196 171 304 -387 -34 -68 136 3 98 94 234
5219 234 -198 -196 140 70 216 214 47 -194 153 -6 -71 -334 -81 -326 -43 -95 73 343 -128 -81 -140 102 168
5242 168 122 -171 -17 -438 -186 -181 126 11 -125 -289 -31 -90 -129 53 44 60 18 -146 -18 32 10 28 -358 289
5266 289 242 -129 -109 -245 161 -192 -205 -30 -79 149 529 -47 -273 -103 -147 -288 92 265 216 -130 49 -100
5288 -100 181 -135 -178 14 265 228 84 -271 180 100 170 -93 372 -141 115 286 261 126 -243 -84 68 -124
5310 -124 -401 -105 345 -207 211 -10 -168 83 285 338 -293 41 -88 -136 134 259 146 109 126 37 -168 148
5332 148 42 -65 -168 -97 -102 149 -322 131 -26 -1 93 16 -363 -162 -184 259 -35 109 -119 -158 100 37 181
5355 181 202 -22 235 -133 -57 -236 184 -69 123 59 -185 -39 -275 -81 69 70 -329 41 -192 396 -44 376
5377 376 -195 -92 63 313 -36 207 -15 -334 -292 -7 -50 -17 145 262 -16 -11 215 -118 -24 120 411 249
5399 249 225 199 -157 252 297 12 -48 -107 223 219 3 271 -98 -133 77 118 -39 -145 2 75 -106 -36 -36 -115 -125
5424 -125 15 -189 273 330 -42 -23 -18 -111 -165 -216 73 -250 198 106 -140 -285 64 188 -124 -136 -133 137 84 107
5448 107 -108 27 179 -249 167 14 -140 -3 57 199 -58 -135 301 32 -345 28 141 109 -145 101 170
5469 170 111 -62 288 -169 -60 -153 194 363 -209 173 -8 89 -190 -7 213 -157 -360 -85 246 -345 154
5490 154 29 -112 -122 289 -323 -383 47 314 -134 -69 -145 63 256 -146 120 -89 -198 166 236 173 -229 7
5512 7 -63 -197 -308 88 268 -77 -11 -301 426 105 -176 2 -191 -104 -13 -147 -116 -163 179 -187 -142 162 -466
5535 -466 -37 182 -293 19 -142 90 7 64 -286 117 -55 -293 83 -317 -142 -9 115 -164 57 166 -465
5556 -465 -170 123 -42 -187 144 -230 -186 83 98 24 -259 -82 -168 -56 -173 257 -232 -51 -59 -171 -47 -173
5578 -173 -104 -140 32 -88 -158 114 -160 169 -45 -198 32 -164 -218 82 211 -25 167 16 -206 158 138 86
5600 86 64 133 41 320 -152 30 274 -163 -248 -39 137 118 -218 -334 -301 -3 -60 -100 58 -49 372 -47 -190
5623 -190 -10 -329 -55 110 -452 357 -116 -140 52 167 292 107 -256 99 66 -57 -126 -204 -261 33 -49 -87
5645 -87 -93 -145 23 9 -82 158 134 73 45 220 31 -144 130 85 20 208 -34 -243 79 403 -136 -227 -26 211
5669 211 -312 -176 -120 -41 -223 -103 90 21 253 85 156 166 -119 -176 -136 -166 177 -112 -354 63 -160 210 -49
5692 -49 136 117 116 134 -444 -23 264 215 -26 189 -69 -31 -52 -63 259 146 94 -57 240 224 355 47 -270 94
5716 94 237 -6 -13 -206 -99 -117 36 133 -163 -13 42 113 -38 -332 216 -39 -42 388 -313 -143 -183 298 264 136
5740 136 -254 178 -187 115 84 89 -64 181 -81 -183 66 62 -81 -5 -109 1 -149 10 -63 91 8 -52 -382
5763 -382 -206 -29 273 170 92 57 -7 -124 -65 -68 192 63 219 222 357 182 -40 -217 -3 -122 -78 107 -219
5786 -219 -141 63 -167 -209 -176 -165 -48 -80 -186 -469 -109 -239 -31 48 24 122 20 -11 381 210 -439 -64 -374
5809 -374 77 88 -86 -200 -19 145 69 -73 176 -130 -94 -135 23 -249 186 -187 12 187 -175 24 -156
5830 -156 325 108 241 132 81 203 -21 184 104 21 452 -4 110 320 120 -298 -17 -178 -6 84 -366
5851 -366 64 19 150 332 -515 -220 114 111 374 350 148 41 -45 -90 99 271 50 -229 283 265 230 343 -96
5874 -96 -149 271 -232 80 50 -191 -122 401 -67 171 1 179 24 -124 -73 -236 39 -253 234 167 -98 -38
5896 -38 334 -39 -56 -176 -83 185 20 170 187 64 251 -118 -369 -66 -69 25 147 147 -203 396 88 31 408
5919 408 280 -296 180 119 182 52 212 -26 273 -133 -224 133 82 -284 104 -236 -153 -123 -361 200 -110 -155
5941 -155 -319 -195 228 -137 38 -136 -81 25 8 -76 236 -70 -22 13 234 -48 -197 20 117 27 -260 219
5963 219 -316 -121 250 -97 147 -19 -156 491 -19 -249 281 -186 -275 -149 -122 105 255 -50 -191 341 -127
5984 -127 -27 -234 -243 -276 198 -206 -265 -115 11 149 243 -252 335 -49 -128 286 211 43 170 215 -180 -204 -19
6007 -19 38 344 67 -356 147 -106 -153 223 -190 -235 109 225 -66 -258 -31 22 252 -55 101 -132 122 100
6029 100 -111 -17 341 178 -211 -203 49 71 113 -73 -127 -339 -253 -126 225 198 -409 -16 -93 174 135 214 -115 -326
6053 -326 -161 101 -238 333 -142 -61 49 -79 454 -83 277 6 -11 99 -38 -140 158 111 171 257 -199 -195
6075 -195 91 -205 274 -425 -265 51 -87 244 102 -15 -156 130 -220 -160 -228 39 263 289 129 69 -71
6096 -71 -220 -80 -289 134 -122 -219 -267 -301 -281 -60 267 221 198 -57 95 -274 73 119 -33 89 -402 -293 362
6119 362 -72 -28 385 -99 -3 254 12 73 168 -187 52 -25 -100 128 48 274 -149 73 -8 43 -99 333 221
6142 221 114 218 121 -253 239 -19 1 97 55 -81 211 284 47 32 48 -73 138 -172 -16 77 180 -167 34
6165 34 -325 -454 140 121 -362 136 20 27 -39 -30 116 14 218 -113 120 146 -39 55 335 218 -195 -21 230
6188 230 -57 -144 74 56 -7 222 -237 64 134 -259 -11 206 -28 42 108 183 161 -350 56 -48 -121 -52 73
6211 73 185 -115 -276 -166 45 -218 316 -153 -173 53 -131 21 13 -493 -173 -365 -75 -102 -112 -286 54 -32
6233 -32 259 -172 19 11 -12 36 393 169 210 -124 -120 199 104 63 -170 82 -17 165 361 40 -93 305 321 13
6257 13 -495 -198 -49 51 217 -3 58 279 -61 -168 -72 -27 264 23 346 225 -239 72 28 -73 -30 134
6279 134 233 226 -16 240 107 -69 -99 225 67 185 -44 233 115 31 18 358 77 75 -245 -157 25 -70 239
6302 239 -208 193 -118 58 -218 -70 -96 -10 49 104 42 -357 185 -303 72 305 -181 339 -476 40 524 -348
6324 -348 -133 -619 -132 -178 188 140 98 8 254 110 1 -66 185 -111 -1 -10 218 -11 -147 -211 391 -89 -379
6347 -379 47 -48 39 -21 248 10 276 -113 44 344 31 34 245 146 63 -340 -112 393 121 110 237 81 105
6370 105 55 -128 -61 -410 -327 -167 -293 -75 523 -137 215 -137 -32 -124 116 48 94 75 -22 79 286 -79 237
6393 237 -181 -262 -131 -163 157 -250 195 161 252 176 134 11 232 326 21 113 376 324 -91 -311 -69 19 -46 85
6417 85 213 251 283 125 -165 -176 323 -13 290 -64 401 -276 -244 542 -21 -337 157 163 59 57 236 -243 -259
6440 -259 -61 154 96 142 394 -179 -98 24 83 -110 -233 -453 59 -197 49 12 338 278 -8 -381 -122 32
6462 32 224 48 -91 -58 -238 -215 -294 -11 418 72 -139 291 50 245 -54 84 -99 -315 151 -169 -116 243
6484 243 141 207 -13 -232 -214 200 -35 101 -324 -240 90 -27 199 -226 30 218 8 143 -387 196 110
6505 110 -161 80 -47 254 -103 166 13 114 -67 -231 -63 -175 125 -333 136 54 49 97 -293 -219 -14 160
6527 160 109 62 -44 15 -235 42 396 6 230 -14 180 162 -17 -78 361 -35 -33 -120 -139 -37 11 -364 -169
6550 -169 165 51 175 225 -95 -390 3 181 -68 -282 -161 258 110 57 41 -246 -403 -553 91 86 -65 25
6572 25 -337 -54 100 143 -50 305 -190 -10 -72 -96 83 218 506 42 -67 34 -101 -14 -23 16 210 189 22
6595 22 -39 -54 218 -75 2 466 264 -87 -349 -162 -240 73 101 39 -153 84 37 368 195 19 -35 134 171
6618 171 140 -2 34 101 137 -317 103 -77 26 -101 166 -328 49 -64 -253 196 -314 149 -235 -12 -173
6639 -173 76 -165 35 -58 -107 -50 -129 66 79 35 5 -134 -210 -134 332 205 6 76 -144 257 -220 14 238
6662 238 -49 82 183 94 86 148 -48 -228 -113 153 -261 -72 426 -269 -57 -89 54 189 87 142 -266 317
6684 317 -39 53 -295 45 -273 -86 -62 -199 -94 110 -94 244 -320 68 292 80 -278 128 289 220 -217
6705 -217 -258 -23 -290 148 -362 131 268 43 -118 -250 76 26 -30 -46 -126 -39 -182 -157 23 -200 -135 -144 206
6728 206 -33 82 -270 83 -309 60 142 -697 -9 -5 -392 239 59 -383 -126 49 223 393 -59 -102 -172 81
6750 81 30 -89 25 193 -46 -333 47 97 163 232 23 162 -69 -357 -54 -489 186 -147 -8 71 73 -79 -247
6773 -247 -372 138 79 -221 49 -364 -288 89 -204 -153 -80 -180 51 3 238 -165 -118 -55 110 66 97 45 44 -18
6797 -18 88 183 15 165 -146 226 92 327 -72 -56 -198 180 -325 -52 5 255 12 -40 202 -263 -228 -8
6819 -8 264 -215 -91 -202 -1 37 -159 -152 158 72 -83 48 60 85 -149 -84 -181 127 233 252 -352 -361 -244 -184 -319
6844 -319 151 372 -17 -43 -96 185 -5 84 -83 115 -66 -99 -197 62 -34 -80 44 86 77 -105 38 -236 208
6867 208 -315 -81 93 -97 -55 226 -63 162 70 -27 -135 -177 -42 -138 114 109 -279 265 -315 -154 428 -235
6889 -235 50 -93 107 -429 95 218 -231 197 62 295 36 148 106 104 -122 -362 -108 25 -460 135 -218
6910 -218 -44 -57 -9 46 -110 -98 -3 -178 129 -114 -350 -198 113 -28 32 -212 -377 -62 151 117 165 -138 36
6933 36 -204 134 -125 -51 -47 51 422 65 155 -154 -155 279 85 -32 388 -181 -25 -19 -251 69 -142 -241 -189 -20
6957 -20 166 -429 -123 -133 27 100 -101 384 161 -10 462 356 -149 -55 -243 75 180 -141 37 -37 259 147
6979 147 -22 -35 91 -33 -4 144 294 3 218 270 170 -10 -203 -183 -143 -22 -310 -137 83 -36 -144 -10
7001 -10 -53 53 269 -132 -193 275 39 71 84 -101 -112 67 58 246 304 131 191 -100 -301 -176 82 108 25 -82
7025 -82 -334 17 -40 93 -176 -367 16 220 -193 -10 -158 33 -191 -294 131 -190 195 -314 -394 183 -223
7046 -223 -226 -101 -53 86 -149 -135 93 112 52 -108 168 -88 -64 -105 -116 -44 46 -43 296 34 -165 181 172 -296 328
7071 328 -138 40 174 73 -201 24 110 145 432 75 118 99 -107 -118 218 216 -21 -126 19 121 -146 -35
7093 -35 -153 -37 -135 -188 13 76 -224 -127 -244 -202 -44 -169 -329 105 -286 309 283 131 -395 121 -182 -89 27
7116 27 -36 -181 54 227 300 164 235 389 170 278 -206 -68 84 -92 -290 193 -192 -49 -557 -35 55 143
7138 143 -263 -281 62 -102 -78 -307 293 325 -52 220 -78 3 98 -56 10 -256 -196 -212 310 -126 41 64 -40
7161 -40 242 -137 49 -177 249 19 -116 -47 -412 -142 44 138 -216 180 -24 -255 -362 13 123 441 230
7182 230 -194 71 56 150 204 -1 487 -40 139 50 253 102 139 -45 115 64 268 -54 -77 -121 149 -211 157
7205 157 132 -154 53 379 -134 82 -171 -168 7 -61 -6 -96 -45 128 -139 -11 203 175 -297 178 -231 -244 -245 215
7229 215 -23 157 216 -77 -65 1 -228 -159 -218 -315 -28 -543 232 -21 -151 269 -138 110 -48 41 111 -17 34
7252 34 -231 -54 105 -352 -144 70 -109 -91 174 -208 -225 179 347 -132 -79 -159 62 210 -178 -33 79 -226
7274 -226 -379 101 -164 -34 257 -172 -48 -98 33 -42 98 140 -437 -139 -155 238 -58 -75 -236 236 -27 -94
7296 -94 -486 182 -161 101 170 -149 -54 146 41 -79 249 -82 164 -168 -90 -135 17 107 -10 133 -185 139
7318 139 85 -126 113 -102 -212 -16 108 -423 -150 -197 209 245 116 149 -110 -197 26 268 26 -110 230 -188
7340 -188 -239 65 191 144 0 -200 25 212 23 -55 193 -189 -116 208 -39 -274 -38 91 2 -324 154 -38
7362 -38 131 160 149 -27 -296 -270 11 301 -64 486 167 43 -408 -156 -112 349 84 238 -144 -8 171 -58
7384 -58 17 -63 97 -171 15 -4 -8 -26 32 -25 328 165 325 -138 163 168 -36 7 -77 -315 -152 -10 25 51 -165
7409 -165 -60 -116 -33 390 -60 14 315 58 -175 -453 70 -145 -28 71 215 51 193 312 -336 199 26
7430 26 168 208 133 415 3 -70 -216 -20 -148 147 -117 -10 166 -165 -23 -341 -27 -183 -84 -44 -155 -68
7452 -68 -205 21 -60 -241 90 -103 121 -175 248 128 27 -34 -3 319 -132 156 27 27 254 -137 419 468
7474 468 -202 92 372 167 -62 -54 -302 -377 106 268 97 13 149 -147 132 39 -34 -193 -52 113 -317 82
7496 82 125 -52 -36 53 87 102 -96 147 -37 -216 -293 -101 200 -29 139 -93 27 23 -300 268 101 109 -405 -23
7520 -23 255 212 37 102 96 275 -103 -58 445 220 192 14 273 145 -148 -15 -149 134 39 -280 -12 71 239
7543 239 157 -146 33 179 109 -265 -231 -261 -102 240 -20 161 -133 212 137 434 -21 384 48 -75 85 -208
7565 -208 -147 547 214 -63 102 -262 -216 242 -192 -304 -40 -251 162 44 101 101 -27 69 253 -193 -248 28
7587 28 -87 -20 45 -153 -186 -179 89 -20 -155 192 -356 79 179 327 -43 152 175 -52 -145 176 -218 -105 -26
7610 -26 -58 -282 -159 49 -21 -76 173 -235 -306 -254 -91 121 24 -8 259 -56 310 -193 86 -286 67 -266 -55
7633 -55 -433 36 134 66 -33 23 -152 -34 197 36 31 273 194 -220 67 -161 -74 -95 103 -64 -75 -339 -383 -569
7657 -569 34 -216 -38 58 172 -249 -330 34 -240 -350 23 -369 116 -38 -73 125 90 169 -162 179 -44 -414
7679 -414 -490 -43 -74 198 -22 122 335 -154 -7 150 30 -97 -40 -23 80 235 128 2 250 65 155 -175
7701 -175 215 232 69 -248 -219 57 -505 -99 -90 212 48 -350 -243 -136 176 130 345 110 -156 191 62 339
7723 339 -8 108 -151 82 -15 -93 140 -58 181 -94 80 274 151 22 -29 57 193 170 29 -250 83 115
7745 115 -58 42 -330 -144 68 44 -3 155 -198 -77 142 241 -71 112 -251 122 -1 -6 231 165 56 119
7767 119 153 139 -55 -320 177 48 108 -131 13 170 -230 -187 134 75 -105 277 -125 -18 116 53 -116 -125 183
7790 183 131 -115 197 92 -60 188 -202 -104 -16 -227 -407 -99 64 -68 -297 -323 -209 64 100 315 -1 157
7812 157 -146 19 -174 191 -213 -108 93 25 117 -383 132 17 4 -67 -218 -132 -133 -217 205 -9 64 -9 -89 191
7836 191 -144 -355 86 43 492 298 46 87 -25 385 70 246 257 -88 42 82 143 52 -102 -75 241 357
7858 357 481 -407 -306 99 132 -286 -257 -49 292 -172 61 119 51 109 160 117 93 61 51 -358 91 164 -111 250
7882 250 211 2 -111 83 -114 49 36 342 -179 -6 -77 66 71 14 -250 -88 14 179 108 -400 90 151 401
7905 401 -113 -202 -281 50 -460 194 -81 -451 -63 74 -300 70 16 192 -98 109 231 -15 -161 5 -208
7926 -208 93 81 -159 177 270 656 -44 -148 -167 -95 40 -179 -305 -151 59 76 -90 203 262 41 -47 54
7948 54 283 -195 248 34 -52 -44 287 124 -8 -45 136 -168 142 -277 46 -40 -104 87 -38 325 -55 124
7970 124 -67 121 -522 -91 94 -63 104 -156 172 -130 -36 264 -356 -63 -70 -3 295 74 -144 -1 -171
7991 -171 22 -380 -245 -32 -15 -220 -186 34 54 74 -68 130 0 -174 49 -560 -29 -13 85 363 -35 370
8013 370 29 -266 -42 -118 116 -21 -246 -82 -10 -56 -273 268 -66 -299 54 274 120 -173 48 -109 -48
8034 -48 143 179 209 -190 -56 -100 96 108 123 -191 -199 276 -177 115 113 195 188 -66 -109 248 216 46 403 25 -95
8059 -95 -251 -134 104 -229 -214 55 -130 -16 -254 -80 -67 39 -196 32 194 137 94 -51 -45 454 -216 105
8081 105 -229 138 -80 61 349 -22 279 272 -229 59 84 147 13 200 260 -11 -6 -177 65 169 182 -105 40
8104 40 -85 -197 175 54 248 34 58 48 -47 352 -7 135 228 62 -121 77 -263 -58 -78 25 -58 34 -368
8127 -368 121 -164 79 81 -505 -524 -3 -11 -313 -81 555 -158 54 30 -157 -89 7 -460 89 -35 -192 319 197
8150 197 -88 -178 59 37 255 -12 168 -24 121 328 179 -242 107 39 117 -77 176 -189 -47 -124 -408 -74
8172 -74 37 -57 -395 202 -84 331 138 -142 -285 273 77 8 -584 -108 86 -9 205 13 104
8191A04
$$ Imaginary data points
##PAGE= N=2
##DATA TABLE= (X++(I..I)), XYDATA
0 0 0 0 0 0 0 0 0 0 0 0 0 0 0 0 0 0 54 -64 64 -64 64 -64 128 -128 128 -183 192 -195 256 -295 320 -384 445
33 445 -494 550 -625 698 -768 863 -960 1073 -1189 1318 -1458 1605 -1776 1961 -2160 2377
49 2377 -2622 2889 -3183 3509 -3877 4281 -4751 5273 -5888 6599 -7443 8461 -9723 11328
63 11328 -13454 16408 -20798 28057 -42091 79379 -383005 -967562 -55586 356112 -96174
74 -96174 -439310 76773 415752 110009 -141233 179181 321130 -3530 -174512 122867
84 122867 198261 -154175 -337067 -112125 -85739 -381556 -436715 -117750 -24396 -253425 -274301
95 -274301 15026 89634 -110410 -130404 88095 132981 10484 52873 174313 51363 -115968
106 -115968 36128 261471 109256 -182696 -108881 162125 120873 -133725 -162848 -40981
116 -40981 -122585 -273825 -175580 -14328 -117556 -260077 -95946 138053 69688 -74798 66306
127 66306 270527 170830 -17215 85790 280202 179030 -56493 -46517 96740 25108 -174457
138 -174457 -181623 -49816 -50662 -142714 -111039 -16010 -35350 -84005 -9621 72850 7814 -70457
150 -70457 7380 121259 95096 19814 48381 104165 71763 32191 78934 114700 45213 -28260
162 -28260 -5079 21735 -43680 -113236 -94986 -66654 -106969 -134494 -73749 -8978 -21616 -40331
174 -40331 9815 72404 80195 73577 99178 117455 96769 71807 61069 35437 -1688 -15020
186 -15020 -14457 -43755 -80509 -68658 -30960 -33757 -63832 -53654 -17522 -24338 -53562 -29705 25741
199 25741 24837 -13913 1758 60682 68861 29187 28195 71772 75065 31022 18341 49049 47510
212 47510 -9808 -52231 -46318 -40430 -68456 -87943 -69716 -47686 -51225 -49571 -22461 8809 22648
225 22648 31953 46857 59959 65260 64786 55478 39541 27923 18785 1510 -14945 -14141 -8568 -21656
239 -21656 -41264 -38412 -23096 -27576 -45474 -38781 -12289 -9843 -29878 -23737 10244 21352 568
252 568 2310 39038 53956 32716 28803 57514 63519 25363 -1282 11161 13277 -23565 -53422
265 -53422 -44352 -33434 -52117 -66704 -44575 -18618 -20938 -25077 1113 30865 31377 24680 36723
278 36723 48358 38216 25328 27007 27074 12436 558 1900 -513 -13749 -20190 -14182 -16023 -27305
292 -27305 -29682 -20476 -20192 -30773 -29389 -12560 -6807 -15130 -8171 16427 28601 23528 27689 45553
306 45553 49406 34799 28081 32499 23177 -1337 -15311 -14960 -22983 -41459 -47029 -36644 -33408 -39414
320 -39414 -31998 -10662 -6 -3089 4732 25075 30840 19910 20020 32395 31726 15910 11542 20828
334 20828 17968 2273 -2883 5704 3071 -14025 -21328 -15014 -16945 -30609 -35234 -26136 -21602 -27100
348 -27100 -23567 -6697 3651 4437 13181 30113 37609 33387 34289 39879 35333 19906 10852 7907
362 7907 -2142 -17556 -25233 -24850 -27504 -33989 -32826 -24155 -18775 -17716 -11272 -462 4225 4209 8962
377 8962 16095 16328 14116 18245 23053 19872 16139 18432 19261 12203 4825 4014 1171 -8306 -18442 -21101
393 -21101 -21717 -28636 -33784 -29555 -20988 -18174 -15776 -4421 8828 14024 16294 23649 32127 30857 26043
408 26043 24135 22365 14786 4763 -1029 -4714 -11057 -17442 -18927 -17710 -18203 -19680 -17404 -13533 -11264
423 -11264 -10019 -6606 -2185 -148 2206 5653 9857 12679 15092 18008 19142 19473 19699 17785 12130
438 12130 6643 2919 -3205 -11177 -16947 -18661 -21068 -24025 -24931 -19678 -14243 -10943 -7535 476 9247
453 9247 12884 13209 16077 20979 20090 14421 12014 11616 9015 3058 -1178 -2044 -2952 -6736 -10834 -11403 -9567
470 -9567 -9359 -12528 -13373 -10283 -7281 -8281 -7633 -3084 1848 3805 5880 10774 15422 16459 14905 13629
486 13629 14228 11883 5739 1653 -575 -3987 -10149 -13193 -13265 -14738 -15996 -14251 -9904 -7329 -4532 104
502 104 4524 6029 6108 8526 10181 9019 7373 8197 9479 6249 2424 2245 3388 840 -3735 -3972 -2946
519 -2946 -5702 -9380 -8626 -6637 -8188 -10862 -8805 -4482 -2421 -1782 2506 6706 9176 9036 9703 10944
535 10944 10082 8408 6510 4483 2316 -664 -3540 -7158 -10141 -9901 -8318 -9887 -10572 -5014 992 -283
551 -283 -4139 143 6760 4571 -1367 2507 10745 9297 1482 2202 10016 8647 -2320 -4399 4114
566 4114 5854 -4768 -9551 -1874 990 -8975 -15123 -7933 -1044 -5824 -9794 -1786 7301 5527 742
581 742 3816 10395 10423 5886 5097 8729 8385 3640 -1335 -3618 -3327 -5149 -8286 -9605 -6521 -1454 -2578
598 -2578 -7283 -5663 1298 1573 -4784 -4314 5968 10073 1761 -1045 8712 13756 2349 -4685 4194
613 4194 11262 2333 -6725 -23 8482 -1401 -14631 -10561 -20 -4822 -15197 -9831 3416 2171
627 2171 -7041 -3385 7912 8964 942 2240 10987 12157 5917 3298 5862 4411 -1785 -4625 -2967
642 -2967 -2809 -4037 -3810 -4292 -6084 -5709 -3684 -4399 -7039 -4342 1465 1436 -924 2192 8674 6566 -138
659 -138 936 8893 9339 2394 2769 8863 6843 -2950 -6294 -1374 -1834 -10276 -12150 -5474 -2416 -7624
675 -7624 -8058 -1201 903 -3413 -2772 5434 8473 4951 4768 8907 8378 2644 1257 4833 3903 -1808
691 -1808 -2562 1451 221 -4682 -5676 -2324 -4141 -9919 -8693 -1686 -733 -5233 -4567 2037 2455 -2459
707 -2459 -868 6953 9033 4907 4556 8887 10065 4203 -136 1368 1189 -3105 -6572 -4337 -1964 -4748
723 -4748 -8000 -6851 -4820 -4443 -3835 -2209 183 1819 3248 3014 3062 3966 5691 4326 1194 2428 6107
740 6107 5818 1152 -284 1688 1449 -4337 -6831 -2509 -124 -4830 -9363 -4488 522 -3822 -7754 -3184
756 -3184 3787 2476 -1162 3006 9932 8892 1837 835 6205 6126 -74 -1923 2489 3458 -3086 -6664
772 -6664 -3016 -419 -4164 -7228 -4396 -492 -1296 -2902 -1252 1462 1002 -847 -613 2160 4184 3278
788 3278 2422 2945 4419 3831 1771 707 1207 1651 -1008 -3323 -2315 -1173 -2922 -6033 -5813 -2482 -1538
805 -1538 -3427 -2286 2500 3592 601 474 3966 4731 1839 749 2936 4170 1165 -1060 515 1516
821 1516 -539 -3370 -2363 -29 -843 -2626 -2299 -314 -891 -2164 -2235 -433 11 -213 552 1329 1839 2458
839 2458 2222 1985 1674 1746 1437 905 334 374 -347 -1673 -2878 -2163 -1890 -2375 -2145 -1458 29 39 -246 363
859 363 1717 903 316 1267 1985 1189 751 296 258 6 -296 103 523 -616 -447 92 -351 -1026 -1218 -485
879 -485 -45 -1218 -1659 -280 500 -503 -450 1095 1793 629 727 2007 1699 726 -212 404 639 -599 -1603
898 -1603 -1315 -834 -1223 -2125 -1266 67 216 -395 335 1059 1085 319 436 1078 634 422 324 458 -350 -665
918 -665 -53 -295 -140 -560 -408 -345 -272 -838 -524 -391 -997 -689 -150 -406 -178 141 1041 1282 839 1154 1952
939 1952 1444 1004 908 533 114 -704 -909 -672 -1100 -1890 -1829 -1274 -768 -1057 -1130 263 1102 673 505 1217 1822
960 1822 646 701 1072 930 724 301 764 383 -231 -402 -150 -565 -722 -860 -1085 -742 -1493 -1137 -1376 -863
980 -863 -693 -378 465 361 758 1085 1749 1768 1508 1642 1866 1469 575 -65 -281 -543 -1046 -1415 -1661 -1562 -1323
1001 -1323 -1688 -1594 -751 -849 -664 -81 -168 206 112 821 1067 1019 1156 1306 1282 704 860 880 845 267 -85 -419
1023 -419 -886 -569 -1438 -1857 -1974 -1785 -1523 -1403 -1339 -783 261 413 604 1026 1575 1772 1556 1446 1592 967
1043 967 493 623 548 -134 -250 -555 -642 -518 -1006 -1356 -1390 -978 -1077 -1196 -918 -422 -223 -219 21 592 960 946
1065 946 1095 1449 1022 1492 1177 930 879 865 -300 -315 -905 -770 -1200 -1621 -1558 -1400 -1061 -837 -963 -380 19
1086 19 130 196 196 1091 1681 1051 856 925 577 610 -169 449 769 192 -308 -473 -182 -204 -824 -1091 -1037 -810 -1532
1109 -1532 -1410 -303 262 -208 -633 141 999 1303 1042 1230 1480 977 1012 569 953 895 141 -387 -598 -574
1129 -574 -513 -1260 -894 -718 -290 -877 -834 97 48 -371 -461 -85 989 692 -135 484 704 1065 522 301 1100
1150 1100 1452 366 -586 -296 134 -464 -974 -813 -447 -811 -1329 -1311 -386 228 -386 -589 567 1090 499
1169 499 228 516 589 179 -236 409 1102 566 -59 -582 -218 293 -464 -519 15 12 -22 -605 -466 281 203 -554
1191 -554 -1254 -22 363 143 192 411 658 292 86 443 979 712 56 -108 13 -5 -235 -622 -102 -243
1211 -243 -610 -623 -506 73 417 149 -290 -238 236 54 1 -26 220 380 13 -126 582 475 228 213 -171 328
1233 328 272 143 -170 -198 -286 -521 -434 -82 11 109 -147 2 261 550 -343 -116 21 123 118 -172 -23 321 260
1256 260 -578 -385 52 305 22 56 155 638 150 -241 -78 516 465 -479 -446 45 343 -505 -644 73 -43
1277 -43 -563 -745 -17 872 384 -569 -357 408 209 -788 -505 379 661 -163 -201 367 1088 431 -600 287
1297 287 383 36 -630 -35 269 380 -771 -1314 -165 284 -216 -1238 -46 493 492 -193 290 893 728 -361
1317 -361 -2 483 782 134 -606 397 468 20 -399 -355 210 289 -1014 -501 -150 -198 -461 -641 44 -44 1
1338 1 -502 123 821 127 -18 165 1078 958 403 319 472 677 -59 -574 275 321 -444 -1014 -745 -403 -321 -741
1360 -741 -330 -90 260 -562 -164 392 674 325 340 320 953 698 393 625 502 36 1 -61 54 -152 -657
1381 -657 -569 -580 -435 -701 -635 -549 -474 -399 -35 -86 89 282 422 542 620 972 700 658 153 481 490 -176 -60 -263
1405 -263 82 -59 -604 -496 -462 -479 -423 -494 -194 -105 -21 -223 303 363 580 299 274 506 619 731 489 478 333
1428 333 307 -171 -394 -136 -133 -225 -840 -640 -174 -406 -404 -249 -208 -39 -371 231 180 432 193 -35 187 557 761
1451 761 240 548 383 214 102 -227 -489 -150 -484 -836 -309 -223 -244 -555 -226 -88 -515 -493 -38 -57 243
1472 243 300 284 377 436 618 418 240 630 134 170 243 -51 -579 -517 -624 -500 -534 -211 -503 -643 -151 80 -144
1495 -144 339 303 -49 -57 513 234 283 159 -66 290 -32 -162 13 -79 -295 -149 -3 -153 -474 -326 -717 -91
1517 -91 79 -340 -449 -269 -286 -17 196 82 288 425 378 283 204 353 221 -23 -26 49 -101 -280 -16 66 151
1540 151 -312 -31 -58 -75 -217 -320 -46 -396 -72 114 264 293 -34 -315 412 190 26 48 505 323 -325
1561 -325 238 -98 -251 -376 -462 -173 -87 -89 -485 127 219 -119 229 126 229 -62 -229 34 129 411 144 363
1583 363 -175 -88 -100 -173 12 93 4 53 244 -114 96 -210 -117 -45 -143 118 -318 213 15 100 80 -238 -50 8
1607 8 -63 -49 362 -104 -1 -314 131 -51 -108 -539 -131 -157 18 52 126 20 80 -117 0 -195 132 130 -229 74
1631 74 -151 -421 78 196 -147 -65 -315 -93 -358 317 -69 -164 -13 249 528 -27 206 520 143 5 76
1652 76 18 130 -48 -398 -430 179 -448 -266 -287 -405 -241 -257 -389 218 -284 -354 118 189 102 269 56 233 -156
1675 -156 201 -133 60 127 -66 156 -142 -172 -268 103 -128 169 -153 -185 -181 -311 -478 -79 -116 380 -152 398
1697 398 -76 283 282 -90 550 342 274 341 -58 -125 -135 -202 -200 -230 -574 -533 65 -285 -314 -109 -41 -10 -170 -35 146
1722 146 252 122 -3 180 164 273 292 280 128 108 149 -55 28 -72 -121 80 -331 -218 -243 -312 -228 -217 117 64
1746 64 451 -114 133 -87 425 614 294 54 215 -108 227 -132 117 172 -112 -208 -160 9 -198 82 -334
1767 -334 -192 -231 0 -116 302 320 238 -32 503 153 311 129 85 -109 42 185 293 26 420 286 -353
1788 -353 -85 -168 -373 -335 -639 -388 -461 4 -184 -307 93 109 145 -45 213 247 443 78 38 484 269 54
1810 54 -226 46 -95 -5 -395 -395 -95 -73 -239 33 -55 -61 -487 -326 -225 166 38 31 157 220 457 111 253 -74
1834 -74 -125 -163 35 -145 413 -144 -145 288 -29 -208 -26 -111 99 -136 -96 -65 -211 496 -74 69 -216 157 201
1857 201 128 375 165 92 16 4 -73 -81 -66 59 -107 146 1 -252 -96 -170 -17 10 -233 127 181 490 -8 422
1881 422 423 215 219 100 -189 53 93 0 153 -115 -190 -74 -89 115 144 -63 -187 -94 -227 -90 96 -76 -161 167
1905 167 -98 -196 383 218 261 -17 -66 255 27 76 -142 -43 335 11 -61 60 -33 42 182 65 135 36 90 -285
1929 -285 36 -136 -185 106 17 -33 -165 254 12 26 -276 110 171 84 209 66 -18 170 249 -66 -123 104 123
1952 123 -63 388 -261 -45 -121 149 392 -25 -107 -186 -397 -140 369 236 49 -277 -144 -229 52 -11 -96 143
1974 143 -17 -502 7 284 339 -53 -219 -326 15 -193 204 -35 -200 109 -53 -192 -82 -14 68 429 -363
1995 -363 234 -128 -105 -336 247 -64 -93 -75 11 120 164 115 -32 -129 212 -137 -260 44 -136 360 4 -213
2017 -213 -78 -70 -27 -174 -67 -25 -156 284 363 -69 -20 24 102 346 -66 -359 316 200 -99 19 151 24 -72
2040 -72 -78 -47 -121 11 53 -81 -204 -95 -275 8 95 315 -89 -24 149 48 -631 46 -103 -78 143 -172 -72
2063 -72 -428 229 -71 -52 12 -85 86 -203 -105 -215 -248 203 -16 543 -58 106 50 -83 126 145 -1 -31 -256
2086 -256 21 -191 -327 -176 -148 34 -65 -147 -62 36 -192 165 -169 -116 57 81 63 298 126 233 180 126 57 -67
2110 -67 -390 139 185 -206 144 49 87 -503 -182 181 -14 -153 -56 112 110 154 -227 26 109 393 68 -78 -3
2133 -3 -180 92 22 470 -252 42 -105 -440 -178 -102 59 -508 -187 310 214 -456 -257 212 85 439 379 117
2155 117 -39 -110 175 141 174 43 174 168 179 24 -331 -59 -243 -135 37 -49 7 -121 219 40 15 -50 -265
2178 -265 331 -149 -125 -9 -280 334 119 136 75 -156 -179 154 108 -123 -94 129 -304 -210 243 396 86 -168
2200 -168 -155 -446 -79 83 -290 -166 57 381 215 -102 -52 295 -206 -12 -181 -29 -200 179 -98 -99 -16 271
2222 271 66 22 -12 317 153 -242 354 35 294 187 -125 73 -106 -46 284 128 -102 -10 -352 21 -142
2243 -142 24 178 7 -250 350 3 -111 66 -43 -52 -82 102 320 -14 -260 -25 32 -78 -214 -180 -151 85
2265 85 170 -372 -321 345 304 -67 89 101 -38 -47 247 -254 -145 112 150 -66 -55 56 -147 -234 225 -141 -259
2288 -259 58 83 -351 -58 13 -13 -6 186 62 -127 -469 338 -260 77 119 9 -33 -45 78 -36 -150 -278 411
2311 411 -217 47 97 71 236 235 -8 -314 12 460 -206 27 40 -89 227 -5 -186 -83 -149 71 236 -333
2333 -333 -148 186 -43 -55 -202 -99 -278 27 232 -8 100 114 5 90 55 226 177 -53 -109 -111 118 312 153
2356 153 -11 59 4 -32 -144 -155 -112 -324 -313 165 93 -366 -9 62 -466 160 -79 6 221 311 56 10 285 236
2380 236 -55 -31 -11 -34 -6 -151 31 17 -25 179 253 -152 -186 30 -180 217 -57 57 -43 138 -301 27 106
2403 106 426 454 -1 -198 -248 52 2 245 -78 -194 -49 107 27 -110 -173 -144 130 207 107 171 -40 72 98
2426 98 -108 61 120 78 -303 130 19 -43 -243 42 3 -253 -45 194 37 -279 188 55 -252 -21 -19 -101 -112
2449 -112 69 -174 44 16 -152 425 168 -407 163 19 43 22 24 -184 -303 191 -126 135 72 102 -391 139
2471 139 123 -188 -408 -50 -316 110 96 -393 -352 -20 29 178 1 -120 305 248 -251 -393 -31 -473 -76 135
2493 135 -55 21 -97 -163 64 -33 78 -197 75 -32 -47 151 -171 147 -27 79 -68 -2 -30 220 84 136
2515 136 -5 -72 47 -121 -71 72 158 105 334 -96 -193 -322 56 274 101 -109 84 373 -100 -68 133 62
2537 62 204 24 190 5 -499 16 -15 -74 9 217 -9 146 -102 -64 42 -107 -157 143 40 98 -22 -254
2559 -254 -38 274 179 54 357 -40 118 336 -125 118 186 -92 453 -100 16 362 -95 129 182 -317 -25
2580 -25 112 192 -29 -196 84 -103 -31 82 -146 10 -58 -115 173 53 87 -199 -85 -158 -214 205 -27 -3 -226
2603 -226 -224 -142 10 -245 126 240 -92 -156 339 295 15 35 -250 -2 192 -211 -173 -121 64 54 158 -386 84
2626 84 -6 -104 -59 82 -328 -16 -43 -76 -74 -107 -43 -73 49 6 207 25 27 14 -242 -166 -11 16 287 -149 -46 160
2652 160 183 -28 4 -117 244 -272 -58 41 106 -387 -68 9 -307 -88 -245 -112 -133 64 91 127 140 165 -186
2675 -186 -379 -17 -37 -61 490 30 -39 155 5 -92 67 -480 14 -266 139 -181 -116 -171 516 -16 193 274
2697 274 26 111 3 288 106 -141 179 277 -333 -61 21 -179 187 57 -154 -177 -70 53 -29 32 131 -82
2719 -82 91 -141 77 163 -353 427 -84 4 406 -243 86 -229 26 -181 -147 -324 158 52 69 -284 123 -9
2741 -9 -149 215 -226 -69 -213 12 -30 69 148 -80 35 -216 -76 132 -71 -138 -137 -110 50 -546 335 -110 9
2764 9 79 -312 -47 -202 52 -379 -158 85 -313 4 -27 175 116 92 205 -229 -78 215 22 375 297 58
2786 58 -237 -153 128 189 -295 221 -222 111 1 254 -387 30 192 157 -317 -28 -38 -35 -240 -48 32 28 126 -82
2810 -82 -123 -46 -222 -58 -292 -271 -292 -129 203 199 -60 -353 -102 -37 101 46 21 82 193 42 -157 52 363 16
2834 16 -99 -223 129 20 572 -120 81 80 -193 -146 -14 76 -54 -93 -152 -336 225 -46 23 -173 135 242 -144
2857 -144 277 36 299 202 48 -60 378 144 130 218 344 95 -51 -312 -86 -1 396 180 -77 31 -159
2878 -159 -99 148 -180 175 -181 -205 -204 -302 23 132 -77 55 165 238 -239 21 324 -190 143 442 -178 -304
2900 -304 -179 180 -94 -206 -196 239 -248 93 94 133 -8 -346 150 -85 -63 -252 -403 142 -77 38 -49 -169
2922 -169 -146 121 -203 233 109 -193 183 180 -53 -254 -286 -27 236 291 -63 -210 -56 9 -230 195 328 378
2944 378 -310 210 -91 -203 111 -111 44 -67 -150 -40 228 109 229 6 -115 -56 -442 289 -154 -383 -150
2965 -150 136 197 7 42 -156 65 -218 170 -381 155 -209 -260 59 -354 71 15 -153 21 337 64 183
2986 183 105 78 -28 -43 92 220 -90 -542 88 203 193 219 -199 -87 -52 -2 -252 334 71 20 342 -218 -172
3009 -172 70 75 -66 54 -56 -268 -159 -389 -405 93 197 45 -96 -60 -390 -218 191 -180 231 495 -92
3030 -92 -47 -26 -127 -200 3 -53 -22 -282 -80 -107 203 -154 99 -519 -111 -26 -213 -223 216 -84 32 -4 -133
3053 -133 -22 76 246 -3 69 2 -144 113 36 238 -174 -84 -86 117 211 -164 -22 -123 -83 116 -160 -63 -43 -13
3077 -13 209 -576 -10 -151 265 -277 108 201 85 -381 73 168 -234 -21 -104 71 46 62 -110 -64 18 24 -253
3100 -253 -12 -304 -167 33 -54 303 -17 176 -134 65 74 -175 164 -193 -46 -57 221 -74 -215 -80 48
3121 48 44 237 110 64 -8 15 146 29 525 -303 -202 51 5 52 0 -85 151 346 -251 42 428 -79 306
3144 306 208 -65 304 268 -281 472 34 105 -268 277 -156 62 -118 51 -236 -244 339 59 -372 -150 36 187
3166 187 -117 92 150 49 73 -72 16 68 35 -301 -259 -174 88 -108 -68 122 65 -168 39 15 28 -59 141 -350
3190 -350 134 25 -39 423 -48 472 8 249 48 183 77 193 344 -218 -146 -243 29 -182 -176 71 255 103
3212 103 -46 0 -257 12 30 -73 52 -245 -223 -270 -364 245 284 225 -231 135 -497 234 -13 369 -43 13 284
3235 284 210 -129 136 288 -23 273 7 -251 -153 70 -89 -18 -120 -17 150 8 232 -115 225 -137 -407
3256 -407 -31 -109 168 364 -156 -42 216 6 63 -205 31 -103 178 272 -212 88 -13 -150 -48 -39 -230 -305
3278 -305 239 7 -147 -28 -79 195 7 -23 67 -65 -42 -19 -229 144 -128 -153 58 75 135 -184 15 -164 -300
3301 -300 331 123 21 -13 -76 44 187 -205 94 -180 26 198 75 -164 7 137 7 144 13 -177 -38
3322 -38 -48 -32 134 116 104 -37 -51 -71 -82 -112 224 -160 -152 -4 174 28 -247 -158 109 -391 -394 -142 167 63 89
3347 89 53 -120 576 -7 -109 128 167 35 1 386 331 -71 -92 42 443 153 -18 -139 -206 50 -384 285
3369 285 149 -106 119 -135 652 -209 -48 86 276 -23 -204 4 -391 149 -107 284 -5 64 -234 175
3389 175 246 143 -137 -20 326 -95 219 177 -83 591 135 -233 -16 -160 -4 -44 -157 -82 -99 -334 -151 146
3411 146 217 220 174 320 -216 54 -215 -192 34 -208 68 -233 132 -92 -289 26 107 -444 178 -266 -38 -162
3433 -162 -357 133 120 11 69 -95 22 -17 164 -75 292 -327 40 -57 57 0 175 -45 -58 246 50 148
3455 148 18 211 -220 -12 29 -109 28 -17 -101 -124 289 94 128 264 -99 192 -83 166 74 150 37 -28 -252
3478 -252 -41 -330 -7 -281 -339 175 99 -215 -286 66 -197 70 108 350 -1 -140 233 -38 314 131 242
3499 242 -24 170 -288 158 -184 -550 61 47 202 178 96 -45 -41 -50 -226 -112 140 -253 -279 -84 72 -100 227
3522 227 230 -23 -167 -271 437 223 -44 -344 -166 216 -99 295 -78 17 193 -56 -85 33 178 -342 -11
3543 -11 -139 114 160 62 171 -76 -14 106 -249 89 34 -220 205 -87 -26 172 163 68 12 225 163 83 -93 -323
3567 -323 -110 -118 134 -134 -12 -188 217 83 -74 214 121 -195 -257 131 78 -583 -246 -381 -16 -52 48 -113
3589 -113 57 -233 -221 114 -6 -85 -333 -39 156 235 -208 29 86 -144 79 119 183 576 -305 27 9 64 -26
3612 -26 -77 121 45 106 -190 -37 -36 -7 -258 58 -15 517 74 5 86 610 -87 232 -117 486 15 121 -254
3635 -254 -6 14 -83 23 174 87 52 -521 -31 -126 -375 -93 35 177 30 54 -126 235 307 209 306 156 131
3658 131 -3 -56 309 -63 178 -78 40 3 104 290 58 -98 52 -66 252 -105 -9 140 27 76 -32
3679 -32 58 12 87 -8 -6 279 217 367 264 108 -6 -9 -32 -137 222 72 -173 -102 53 18 -243 -251 -42 326 -13
3704 -13 -170 217 400 -136 -22 12 -163 134 144 78 48 -152 98 384 -69 188 -73 -36 113 7 -295 18
3726 18 460 -44 92 254 -299 -106 -320 18 -220 178 12 31 -50 69 -176 -168 86 93 65 34 15 79 76 -147
3750 -147 98 -242 45 -39 135 42 306 274 262 267 -103 -438 -42 76 303 -122 -79 32 2 89 164 12 -6 4
3774 4 236 200 -6 75 169 69 -190 -30 -126 68 -292 193 -26 -178 -76 -259 -36 15 -175 -174 106 128 279
3797 279 10 -275 -18 -219 -58 -53 -152 48 124 155 -142 6 -339 -240 -371 -90 -162 -28 72 -376 -488 -122
3819 -122 87 158 90 584 -58 26 -98 -101 -2 -42 -31 -22 122 -145 -114 57 -63 191 -201 -95 -182 159 -322 -148
3843 -148 -139 -38 -79 1 -122 -90 -172 137 254 190 -144 377 47 235 -225 59 316 142 -104 -207 242 78
3865 78 422 199 155 -63 89 33 180 -32 -102 211 -267 120 48 -75 -154 -135 100 235 72 98 181 -48 -59
3888 -59 -225 101 -156 -19 268 157 -72 25 -171 -287 -168 -171 307 357 81 9 19 -274 -82 100 291 -276
3910 -276 13 -263 108 196 68 5 -60 -103 -20 -56 53 130 8 128 40 243 37 174 139 -137 313 250 103
3933 103 92 2 -102 34 184 363 23 42 -78 91 86 -16 281 -101 37 220 -2 380 -154 -214 -259 326
3955 326 180 222 14 142 126 272 -257 -19 581 178 -120 116 -60 -17 -18 -133 -221 -141 -90 97 -130 62 42
3978 42 -95 173 -40 51 245 -142 -75 -37 -60 -128 -123 68 -310 -166 -14 240 138 43 -125 146 -317 -224 260
4001 260 -41 -95 179 -388 122 -39 82 249 83 -97 -242 233 79 38 585 -127 50 261 -35 59 66 24
4023 24 115 -24 150 46 -43 -66 158 307 161 183 74 104 -149 -44 -177 -33 -1 206 116 -56 24 -128 -201
4046 -201 190 77 -152 131 -222 71 -48 86 127 85 -254 638 21 -7 210 -147 -95 117 -151 -178 161 333
4068 333 215 -159 200 -462 181 -59 85 -57 19 60 -245 -75 312 -430 -336 -32 -71 -264 197 176 18 39
4090 39 -180 -107 -273 433 167 86 -63 101 -192 -259 102 205 -159 194 62 -54 -63 137 65 25 -52 51 273
4113 273 95 -226 333 381 39 53 26 -172 -313 84 -38 -80 241 -78 -656 -168 -80 177 -181 -66 128 -7
4135 -7 473 -27 174 -100 -171 128 3 -144 43 82 124 -128 82 146 178 210 -39 -222 -129 -69 456 -201 -7
4158 -7 -13 170 61 277 -202 -201 52 219 -98 307 75 236 64 172 237 -229 270 72 -40 -150 -50 -95 -122
4181 -122 -415 428 130 9 208 -148 122 -105 -221 -298 320 -80 150 3 -20 -78 -188 -270 -285 -67 -18 -92
4203 -92 -225 142 -403 38 -197 60 -65 -318 77 402 -158 -55 -154 208 305 8 206 53 -25 137 -148
4224 -148 -266 -216 7 139 25 102 100 -9 -166 391 235 -191 -336 -251 71 140 -162 -158 -41 -128 -282 -175 -332
4247 -332 416 142 -358 84 101 25 173 109 -70 191 -130 102 113 29 114 129 146 -333 160 334 187 -49 -353
4270 -353 -391 -120 151 -29 -136 -223 -64 -199 -47 -292 -159 237 -250 -231 250 113 29 -278 -79 -129 -256 120
4292 120 65 413 116 395 100 157 -24 -240 -240 -82 -21 387 -118 -98 -102 -181 -1 -23 -106 -111 30 166 -44 108
4316 108 -79 276 159 29 79 22 75 119 -102 -95 -30 -311 -101 -149 59 139 -184 -212 26 -110 229 183 133 368
4340 368 104 -124 -24 183 132 207 -41 101 131 -543 59 -32 23 -53 167 -189 286 -293 -101 -70 124 61 284
4363 284 -133 -115 -105 -26 626 -216 201 -91 -298 136 218 -91 366 359 200 -314 -196 37 57 67 145 -40 248
4386 248 226 -25 124 -82 -156 -259 88 47 -256 -26 32 115 -177 -178 -147 282 129 -112 -37 -53 106 -107 -112 -251
4410 -251 437 87 -53 -180 69 -47 143 -41 -436 -336 -55 -115 -3 60 51 234 -13 197 -34 192 108 229
4432 229 -251 -195 264 -6 24 -331 -211 88 296 -196 -316 -67 -83 314 -84 -79 -87 -70 -223 -93 -39 216 94
4455 94 192 -26 217 -249 -64 -46 -18 -62 -10 -173 -174 92 -230 -10 34 145 53 278 -278 -103 -171 -14 109 176
4479 176 321 209 24 91 -192 332 -328 -143 171 11 -155 112 -156 -298 182 -286 -123 -95 -233 -246 -178
4500 -178 108 -117 -29 -366 -492 -60 -55 10 248 -393 102 88 -124 -68 -222 -131 9 377 -258 47 280 346 -372
4523 -372 274 300 -21 20 -153 -213 -134 -104 243 131 113 141 110 -117 -292 -120 126 -183 208 -25 -302 332 121
4546 121 86 -158 -14 -46 166 -20 240 -219 -177 -447 -89 131 -414 160 -280 -31 -15 -35 233 -64 -242 -3
4568 -3 33 -133 -187 -40 28 97 185 169 94 119 -77 -68 -174 313 39 343 -66 -275 39 -39 101 517 -77 -221
4592 -221 -49 112 -248 111 -258 268 76 -86 64 -23 -164 180 -222 -327 65 40 159 -90 65 -270 275
4613 275 399 -68 155 28 -12 -104 -49 34 338 144 151 393 16 194 395 294 -104 -449 387 59 63 -15 -378
4636 -378 146 189 49 -109 -168 144 261 130 204 73 -53 148 407 94 -238 63 -22 188 -422 -107 -241
4657 -241 171 109 -259 -211 190 -10 -119 107 154 335 -381 -125 -239 150 -300 393 -45 -138 -37 163 149 -220
4679 -220 -47 -50 103 145 -46 109 -5 112 265 152 304 -129 -117 -271 323 -29 156 1 76 176 212 108
4701 108 -295 311 166 -51 -196 -280 -44 -180 -114 85 -20 103 311 -118 104 -128 76 253 -174 -153 -154 144
4723 144 257 219 308 94 41 -46 -141 -9 -1 95 -141 -248 51 65 132 -156 -159 79 19 53 40 29 324 -262 -405
4748 -405 91 21 177 -39 -71 -87 21 243 8 148 -32 -93 -184 31 -239 -74 2 272 -230 -84 -89 -113 -315
4771 -315 233 69 170 231 114 138 -153 -326 -330 245 -162 236 105 -112 32 116 14 -216 13 -182 477 155
4793 155 -395 -483 315 34 -143 -215 189 227 -145 -2 181 -30 -118 506 109 -75 11 -84 310 346 -27 -143
4815 -143 311 -15 269 -136 -27 220 212 -521 18 66 -60 -20 298 -36 163 255 211 -272 -431 -32 -28 255 -89
4838 -89 -284 197 -99 115 234 139 142 -248 -53 -308 5 -103 114 232 231 -116 264 -214 10 -19 -123 -86 74
4861 74 -89 485 208 169 195 101 602 390 318 -21 89 -114 10 110 -255 79 266 -13 -192 -122 444 -545
4883 -545 288 13 329 -21 26 32 39 -305 131 167 -206 106 -277 203 187 113 -224 63 -358 229 308 10 -238
4906 -238 -154 30 -427 279 208 -78 49 211 10 -353 -21 24 -363 535 93 183 -76 99 8 207 -253 -74
4928 -74 -173 -27 178 -101 108 8 54 319 -165 -132 -189 90 -236 -13 33 8 -51 16 2 -166 209 -82 -320
4951 -320 113 -114 44 97 156 263 -233 489 179 -78 -218 100 114 -42 247 -147 251 123 73 142 -140 -274
4973 -274 124 70 241 260 182 96 20 -85 -4 -43 57 -88 -115 -66 96 -57 -38 -19 22 163 -32 -186 260 -26
4997 -26 67 196 -37 45 -314 -167 178 508 -8 -34 115 279 -215 -315 12 -411 200 49 193 -142 -454
5018 -454 203 49 -220 -164 -182 -133 164 47 -12 217 122 -110 -354 93 293 -127 -70 -46 15 -141 257 -27 8
5041 8 66 -53 -161 107 -225 -185 -179 -436 254 -200 -182 -377 -20 141 11 -23 -58 176 -178 75 -317 173 -129
5064 -129 157 -3 -45 -100 146 -200 -53 -185 -93 209 -30 57 184 -339 145 44 -208 -84 -218 -193 -128 66
5086 66 219 141 -360 -136 128 -6 225 -12 -172 82 -29 214 -99 73 174 -5 -295 55 76 128 5
5107 5 -139 79 242 48 -14 -89 -20 384 -33 199 81 7 23 153 103 57 -135 458 144 186 145 -63 96 -190
5131 -190 270 9 84 -25 58 -241 294 384 -194 -139 -431 -257 165 42 145 -263 -286 -243 -179 -306 -83 -1 263
5154 263 -96 133 153 -118 -78 -162 -38 -60 -179 -56 285 -10 141 244 19 -209 58 148 -9 -36 47 -410
5176 -410 -97 22 142 -164 -102 126 -270 -37 -41 -208 12 133 -121 -137 85 127 145 297 -170 -246 100 -172
5198 -172 -64 -111 129 146 -17 -103 78 240 44 -98 -174 266 185 -252 -38 182 -133 -294 277 50 -190 157
5220 157 -113 -119 32 110 57 599 157 98 -77 50 102 133 216 -99 -128 -167 -212 -310 -97 -253 -109 -216 -2 -16
5244 -16 105 283 -345 69 -100 -252 -147 104 336 -112 -66 -289 360 0 9 104 -29 20 24 -54 -265 41 275
5267 275 -48 32 -78 137 198 -50 216 386 15 -107 202 -93 -93 140 54 292 -256 461 159 195 -92 138
5289 138 103 236 273 43 -75 -326 192 -105 -59 -54 -19 -77 -235 163 -281 95 -174 -43 476 9 -48 -75 42
5312 42 -233 414 6 292 84 -208 121 -197 -2 221 -23 -168 -27 220 -166 88 -15 -118 224 105
5332 105 463 176 -53 148 -246 83 -57 -72 -173 -250 -57 70 149 83 -46 -200 -100 69 165 -179 -122 49
5354 49 238 40 120 138 150 -173 -218 -56 26 6 -324 -121 100 345 -75 -322 14 295 204 383 263 228 -123
5377 -123 -170 -26 416 -54 192 -189 543 -142 -189 126 -394 519 -136 -239 -120 112 -188 -5 -330 -177 -7
5398 -7 -50 -170 60 36 141 -121 -406 -47 -146 143 352 191 24 -68 127 230 227 48 11 36 49 148 255 89
5422 89 -175 136 100 6 -242 -91 -56 190 149 26 201 -113 127 222 157 -280 -53 -352 487 -400 37 147
5444 147 -45 85 -107 -8 94 -219 413 231 89 124 -254 -29 143 133 53 141 1 131 126 488 44 55 -40
5467 -40 -33 -153 -16 81 64 181 -205 -279 -98 -233 -268 63 -147 -127 -44 -104 390 -50 -50 153 165 16 3 -100 -75
5492 -75 299 165 60 300 101 118 -13 -192 237 -263 -22 140 23 158 -53 -107 158 -94 -334 -303 2
5513 2 -41 29 45 -51 -252 -294 78 51 -142 283 56 -119 -28 193 192 -73 -101 -9 236 -16 25 344 59 -307 -98
5538 -98 153 245 249 -207 -160 178 -221 48 -146 -165 288 -131 -324 -109 332 237 -54 157 -150 69 -17 -237 -218
5561 -218 182 33 17 55 108 132 134 67 -271 67 82 46 118 -44 202 -54 -151 -143 -100 -243 -343 0 157 23 -89
5586 -89 -51 32 5 -305 -19 -36 -203 -107 141 116 -186 20 71 8 -195 114 -204 173 139 -38 53 -48 53 139
5610 139 34 -88 -51 156 87 -183 -2 168 -209 -125 201 -292 -11 419 -222 -227 104 221 110 84 -12 -261
5632 -261 -234 -124 -170 7 -18 182 -300 13 -342 153 -127 -117 -301 -194 -119 -106 387 349 -415 205 144 -24 48
5655 48 -13 363 314 -53 -77 -168 62 260 -159 -4 131 -62 165 109 160 154 -155 -74 45 98 -6 165 -171 -47
5679 -47 -149 203 185 199 -187 -144 -244 56 182 234 96 -221 -130 118 4 -339 -164 -252 61 277 -74 -196
5701 -196 55 239 -122 -222 14 -296 191 43 -89 21 41 189 74 -213 -13 307 9 -22 97 120 -82
5722 -82 -67 151 -145 22 16 141 -173 69 -300 -187 110 61 -131 -113 116 -37 -238 -191 26 -14 -170 -191 350
5745 350 -1 -145 282 41 178 -434 -78 -95 418 160 -105 230 -82 275 152 -84 20 -218 -156 -189 -78
5766 -78 203 10 188 -401 -6 166 -203 46 126 7 217 -108 221 -21 121 -78 -60 493 -337 -60 -208
5787 -208 96 -86 269 -1 -52 130 114 68 -33 117 -117 2 17 -116 -382 -57 -27 41 237 -251 -163 39
5809 39 -5 351 111 -9 179 38 -101 237 -159 64 -284 158 32 -134 268 34 109 -185 183 -30 -62
5830 -62 541 292 14 231 -229 39 42 339 -62 -43 -20 -48 211 -215 -193 543 318 131 -395 81 -209 24
5852 24 -36 -156 225 262 -235 -243 -135 277 10 -26 97 164 -84 35 -98 49 -250 11 -5 -435 63 -62 -161
5875 -161 211 -254 -165 344 -252 -107 27 -138 -30 -51 70 147 234 -434 -170 -146 -134 194 27 155 11 -149
5897 -149 102 -246 70 414 -233 216 318 194 -116 136 -33 -437 85 5 197 42 -104 -125 -51 299 -75
5918 -75 47 78 103 -13 8 94 142 -419 -6 53 302 92 333 -107 -260 357 23 -46 247 262 -201 137 214
5941 214 -220 80 -51 -80 44 -139 177 96 -285 -233 -145 -89 -189 -359 503 156 -54 -343 -64 -82 -107 -375
5963 -375 109 -81 29 -4 -5 172 29 -149 142 -314 105 -55 -17 69 -1 -98 -255 13 -311 -106 130 39 -145
5986 -145 15 31 145 -117 177 -62 -80 152 340 -67 40 76 -241 208 259 -198 -80 96 -204 231 255 88
6008 88 23 139 -55 7 223 -9 44 -44 -331 201 157 -188 418 -373 53 -111 -7 -140 163 -66 -300 43
6030 43 409 241 26 104 81 313 -189 169 290 -63 -15 259 88 111 172 -123 120 -153 24 314 314 -89 -99
6053 -99 -290 -416 132 20 194 125 370 99 -92 498 138 -8 67 124 -557 -159 2 357 -237 226 -29
6074 -29 -7 5 -315 47 -165 229 56 187 -293 114 466 -41 -231 -207 -137 -493 11 471 14 -212 -470 -33
6096 -33 -73 -198 -157 272 123 167 176 -431 6 -376 85 174 -112 -80 -157 -80 -44 -224 235 114 -208 -36 14 269
6120 269 268 56 101 59 31 1 -161 -239 -119 484 22 -141 -157 98 15 126 91 -268 166 493 -85 196 351
6143 351 -342 76 275 92 -3 161 -374 172 35 283 -227 60 -166 40 -138 190 165 281 242 102 -57
6164 -57 -109 68 -107 10 -125 138 127 -76 2 -33 29 -11 262 146 54 -132 -241 23 -243 190 -75 -95 167
6187 167 122 -35 -160 -189 278 -66 235 198 -11 148 -17 -36 269 -71 -118 -316 92 -1 157 113 238 -232
6209 -232 -156 -504 61 123 537 170 178 -334 -5 199 -65 -161 -164 -3 -172 133 40 -156 169 152 -92 111 -195
6232 -195 -60 340 -106 -95 -62 -16 124 -399 -273 -15 298 116 -85 150 148 210 177 -101 309 274 91 98 -239
6255 -239 148 38 -25 -320 -187 -50 79 169 -156 -44 -108 206 -68 -10 -154 -27 95 -5 -73 140 223 28
6277 28 -75 155 172 -580 -6 -149 -231 -68 -87 108 60 212 89 320 -81 -267 130 -171 235 -92 -134 -74
6299 -74 60 -67 115 -86 -273 -338 219 -241 -133 -13 75 88 -253 80 -11 -228 79 131 -106 28 -19 -1 -15
6322 -15 -156 -7 -38 74 171 4 41 112 -64 168 206 -154 110 143 286 -135 300 -121 210 -67 -11 -219 -57
6345 -57 6 -49 53 85 72 140 -1 -17 83 148 -207 -38 -517 -209 190 250 82 348 -24 12 224 89 -76
6368 -76 -122 119 189 -152 243 133 -487 114 -289 -79 112 -144 -52 -225 418 -183 287 -7 -339 33 -26 -17
6390 -17 -16 -126 -117 -236 -217 -90 105 241 198 72 -2 113 135 -222 452 -293 167 -59 69 218 344 -12 8
6413 8 -55 296 322 -175 174 163 196 -37 164 -253 -18 -137 173 -114 -151 34 172 141 181 260 88 -213 180
6436 180 2 63 -112 35 -206 324 -69 -134 63 -105 82 19 42 67 -34 76 -188 -83 141 30 105 134
6458 134 -331 -50 -112 -201 -332 147 -310 127 214 181 62 -207 183 329 96 74 15 45 9 13 101 187 30 28 224
6483 224 -102 398 79 -210 -21 -84 -213 302 148 -48 -24 76 34 248 62 10 -51 -93 56 69 -218 -347
6505 -347 -180 36 196 -25 257 -49 209 -53 -269 51 103 -305 -97 -14 194 118 -101 56 -264 135 -69
6526 -69 146 -165 108 81 48 64 17 -169 -283 50 70 121 66 83 -9 95 -113 -150 -86 136 -75 -103 254 72
6550 72 31 -35 -14 88 -250 209 -197 25 419 322 0 -79 15 -2 37 -304 160 -231 -260 -123 -28 -337 24 334
6574 334 75 -416 -2 0 -183 -121 4 -168 193 99 291 -259 104 -276 423 -156 -75 -210 -239 -25 -19 62 -181
6597 -181 -147 86 157 221 33 -163 -37 296 74 58 -250 -144 43 90 105 149 -87 165 -163 -98 111 107 178 -191
6621 -191 -89 -397 113 159 -34 -39 -92 32 -139 6 -88 -155 323 23 33 -167 -210 47 -117 404 226 144 -61
6644 -61 43 -303 139 -226 -289 197 -16 172 65 34 82 -27 -95 -366 55 -129 54 67 -346 -125 330 -180
6666 -180 -198 229 148 14 111 -13 225 144 68 -280 86 77 -136 204 -69 37 -261 88 2 7 160 266 37
6689 37 -185 278 348 -365 -327 -126 -464 75 -150 36 -415 -168 401 48 -265 23 179 182 116 -64 339 -112
6711 -112 139 217 220 38 -116 -255 320 -29 44 104 -278 267 -231 -280 -133 -228 143 -247 -193 160 -321 -126 1
6734 1 -22 -156 -276 -343 -215 173 -61 234 49 231 266 166 181 73 -16 -78 -40 -238 188 -300 4 70 -280
6757 -280 -136 -47 -24 116 8 -586 27 124 -59 -20 521 -284 -9 -213 370 -462 -159 3 498 175 268 137
6779 137 -38 119 -467 30 -390 200 1 -123 98 80 216 79 -190 302 -317 -34 191 -454 213 48
6799 48 -108 138 -381 41 145 160 -183 -201 -301 55 -73 25 190 147 -207 -246 110 86 -70 -225 2 255
6821 255 257 152 -26 317 -209 -173 -221 14 140 -109 -59 -190 -135 238 132 178 339 282 -185 64 136 -365 -128
6844 -128 -400 148 43 142 73 -80 175 -154 -12 251 249 126 150 143 -100 -190 168 -59 69 -209 -106 184 205
6867 205 22 -227 -176 -126 55 95 334 95 40 154 67 -267 95 40 131 182 -6 56 155 -401 92 420 -50
6890 -50 295 39 336 215 2 50 -83 157 752 -173 -313 -38 341 6 -302 -431 189 120 -66 18 -83
6911 -83 584 66 -129 80 -121 230 -249 181 88 49 -123 40 368 93 -85 -138 12 -41 70 -47 207 -197
6933 -197 -44 390 389 205 17 42 288 215 -59 140 -51 -83 -163 -92 234 195 163 -333 246 318 -189 9 -20 168
6957 168 -42 199 -58 135 127 -97 -190 65 -100 -335 -2 160 -95 -109 87 0 201 8 -47 60 -73 -66 -147
6980 -147 -83 -312 -129 -35 7 -172 465 -6 31 139 -236 -13 18 195 34 126 -102 -118 -3 -270 -196 0 -260
7003 -260 -357 178 211 383 14 -155 17 -271 21 262 189 -48 -156 48 124 183 -147 -157 -72 -146 95 -158 -82
7026 -82 145 228 -224 68 401 -120 79 1 -174 156 34 -64 4 -241 -197 -318 -206 -245 100 139 -150 -79 -53
7049 -53 -280 88 140 221 -93 -90 -52 -78 -293 -393 -387 -46 165 -173 59 -281 174 21 -156 22 269 58 -352
7072 -352 -125 -356 -120 -50 -242 56 -227 -138 38 -44 -177 -15 314 90 -11 92 -131 44 -270 -178 -346
7093 -346 36 -376 -101 167 153 90 224 -3 0 -24 -93 592 308 17 186 -74 -16 144 -116 -400 201 -311
7115 -311 190 143 -63 393 451 -228 -69 -62 -100 92 24 -191 326 -150 51 132 -30 -205 0 66 292 -115 -12
7138 -12 60 67 -384 -111 -304 276 27 141 64 -220 -15 -251 81 -166 -140 -235 -90 -16 -50 -87 -341 -47 182
7161 182 -72 67 -201 -31 33 221 30 -33 -154 25 98 -36 -210 67 233 95 121 -166 -533 27 363
7182 363 -187 173 32 -12 43 -48 445 342 196 -63 -69 39 292 -332 -242 31 51 58 -104 377 160 -34 -34 87
7206 87 61 -374 22 -102 33 -257 67 26 -149 -72 -337 -328 61 240 -394 191 -65 148 207 97 -22 -156
7228 -156 -21 -156 -26 84 -187 -174 95 -134 -56 154 75 -70 -192 211 -77 -131 -3 -278 -68 -95 61 130
7250 130 -276 218 93 330 533 276 -13 -373 -122 90 -364 23 53 -255 -313 -130 -89 -30 -236 301 120
7271 120 -227 6 373 -148 -113 94 -210 87 -66 101 -159 -183 -75 -192 -315 226 199 -61 -25 50 198 104
7293 104 -102 240 166 -308 3 113 238 -30 124 -132 191 -211 157 -97 -6 -244 -317 -168 -132 -197 -417 423
7315 423 -297 15 140 -14 21 -105 91 -52 -146 249 -50 104 -62 -51 -12 -153 -236 -103 -164 141 -173 -126
7337 -126 -123 -6 41 113 147 193 378 442 39 -6 89 7 -43 246 -62 -46 -182 -54 45 -69 -12 117 -46 13 93
7362 93 213 -321 195 305 -20 252 79 -63 -18 236 364 -107 266 -83 139 -11 -56 73 -208 2 116
7383 116 177 56 -75 -59 172 -133 99 -162 65 294 198 -16 -69 351 209 157 100 -44 -298 -118 -78 -109 51
7406 51 101 108 240 -135 92 154 124 -364 70 88 -129 -378 -31 -50 -333 82 35 43 204 423 -188 201 77 170
7430 170 121 -31 -46 -294 -107 -105 294 -304 115 -124 21 -99 545 63 -152 -136 -255 0 -246 -221 -26 -53
7452 -53 -205 -13 233 172 13 -265 45 -67 -323 -291 26 341 -414 33 -58 -129 326 -36 219 327 -135 135
7474 135 380 404 -84 212 -151 8 -303 120 277 90 384 246 179 235 134 230 -37 0 78 -13 -227 -93
7496 -93 231 -94 -135 -168 -105 156 -159 -24 34 28 -7 -41 -11 -189 -127 -51 231 -416 85 75 -392 -217 233 163 -313
7521 -313 60 23 -112 -497 38 75 232 70 102 -53 -14 -197 122 -3 205 344 -62 -82 -136 242 -166 -202
7543 -202 116 -33 152 -138 -336 -102 -206 -58 -51 -79 -70 12 258 184 -157 -176 -199 33 180 -126 -235 -26 39
7566 39 -242 155 -130 -5 -257 121 130 137 83 -236 -56 30 -144 -266 -137 111 -114 105 -20 364 9 167
7588 167 62 -1 61 -344 148 89 367 -189 127 -196 86 273 -176 -140 -106 94 48 105 391 -134 100 -106
7610 -106 -148 -108 -311 111 -181 -140 -97 151 -130 -72 44 -187 -27 -29 -188 -176 234 -402 212 18 -60 -6 -26 -177
7634 -177 -187 119 41 -164 -266 101 61 -278 165 11 -121 -144 124 159 -22 -261 121 283 160 -85 -241 -91
7656 -91 279 174 -425 216 -94 -124 -49 112 -203 -38 -207 -69 -66 251 143 109 128 217 -87 99 -276 -209 -132
7679 -132 222 403 65 -147 227 -147 90 19 -209 274 8 318 120 13 -134 208 -30 188 100 138 -144
7700 -144 -28 -64 91 -116 -171 209 211 100 -26 19 155 -363 250 140 -136 186 -159 48 -111 -190 82 -17
7722 -17 321 -169 -59 106 -72 107 10 -292 -323 -38 -141 27 108 -167 59 -127 -231 1 -26 433 -123 -95
7744 -95 46 18 -159 75 86 -17 59 86 127 13 -18 -211 82 168 -7 -82 88 62 85 5 -316 -119 -307 14
7768 14 262 132 -213 29 -21 -29 -224 -14 164 -89 167 -17 2 -23 268 220 -202 -383 -61 295 107 70 -103
7791 -103 -108 44 -14 -93 350 45 36 239 151 -6 -35 59 250 -122 -69 23 -92 -36 -266 124 -56 -42 -137 -163 58
7816 58 39 -99 -243 68 171 102 138 -243 -17 271 -218 30 -263 -27 204 89 -98 215 208 256 -298 132
7838 132 155 105 -77 223 146 426 40 264 40 285 -40 -275 -283 -160 -54 45 163 -201 -25 332 86 82 339
7861 339 49 -323 274 337 -99 18 107 32 298 -82 -304 -279 214 37 -53 -256 -426 74 -61 6 -88 95
7883 95 -137 17 -51 -111 337 -360 202 -15 127 5 48 216 112 -99 62 377 -112 138 -501 -34 -57 -3
7905 -3 -57 -214 251 297 -160 178 367 -360 303 93 256 -113 87 157 -250 76 208 46 9 22 -289 -312 -339
7928 -339 -96 -157 -204 28 -32 -299 230 -131 -81 -122 -351 49 73 -41 -37 146 50 -115 294 102 31 -115 210
7951 210 -183 107 195 131 370 -371 -25 185 449 135 -91 325 -14 118 -274 212 235 -118 -26 -137 -324
7972 -324 -158 136 4 -55 -74 -6 -238 -180 -230 -27 -67 -323 -218 86 -105 82 -226 -82 262 25 -274 -141
7994 -141 -317 63 94 -373 153 -13 -60 233 -69 132 -333 92 5 -369 -55 -4 -119 -116 223 -78 -99 -520
8016 -520 -224 -86 63 119 -83 -412 400 186 82 249 -75 -62 -125 253 65 -230 39 -7 -83 -114 126 -19
8038 -19 195 189 -73 60 -299 -15 240 -279 106 51 -159 47 96 -511 -88 -85 9 -240 -228 -77 233 19 46
8061 46 64 -152 177 157 -134 35 232 -243 126 275 -105 189 -74 -20 365 -301 -140 186 -237 -158 30 -478
8083 -478 -97 -80 -271 -106 -250 -181 -79 -235 71 447 -131 -26 -178 -114 138 196 74 50 -112 180 -33 -182
8105 -182 -3 -155 33 -305 -70 32 177 47 -343 -539 -40 -307 170 -140 -123 148 -130 -1 204 -160
8125 -160 201 105 -212 -219 3 94 -151 142 -37 98 145 -358 -113 71 -343 -13 -4 -105 13 -179 -175 174 225
8148 225 288 -27 -279 -310 -308 205 165 -56 -305 -248 -274 -78 -225 -29 -137 -141 181 19 -383 14 137 54 94 2
8172 2 79 -222 59 103 42 482 -34 -192 67 32 40 -12 52 61 -155 -16 -268 -216 432
8191D32
##END NTUPLES=NMR FID
##END=
