##TITLE=1H ikalashn
LR-770-R2-K1D
17.10.2024
##JCAMPDX= 6.0         $$ Bruker NMR JCAMP-DX V2.0
##DATA TYPE= NMR FID
##DATA CLASS= NTUPLES
##ORIGIN= UXNMR, Bruker Analytische Messtechnik GmbH
##OWNER= root
$$ TOPSPIN		Version 1.3
$$ 2024-10-17 16:18:59.093 +0400  Irina@DPX200
$$ Compression mode = diff/dup
##.OBSERVE FREQUENCY= 200.131392401
##.OBSERVE NUCLEUS= ^1H
##.DELAY= (6, 6)
##.ACQUISITION MODE= SIMULTANEOUS
##.ACQUISITION SCHEME= undefined
##.AVERAGES= 32
##.DIGITISER RES= 18
##SPECTROMETER/DATA SYSTEM= spect
##.PULSE SEQUENCE= zg
##.SOLVENT NAME= DMSO
##.SHIFT REFERENCE= INTERNAL, DMSO, 1, 17.95386
##AUDIT TRAIL= $$ (NUMBER, WHEN, WHO, WHERE, WHAT)
$$ ##TITLE= Audit trail, TOPSPIN		Version 1.3
$$ ##JCAMPDX= 5.01
$$ ##ORIGIN= Bruker BioSpin GmbH
$$ ##OWNER= Irina
$$ $$ F:/spectra/data/iren/nmr/1H/4/audita.txt
$$ ##AUDIT TRAIL=  $$ (NUMBER, WHEN, WHO, WHERE, VERSION, WHAT)
(   1,<2024-10-17 16:18:25.125 +0400>,<Irina>,<DPX200>,<TOPSPIN 1.3>,
      <created by zg
	started at 2024-10-17 16:16:14.921 +0400,
	POWCHK disabled, PULCHK disabled
       terminated by command 'halt'
       configuration hash MD5:
       BE 6D 3F 07 2A EA 11 49 91 17 2B D3 AF B3 58 0D
       data hash MD5: 16K
       A0 C2 B8 81 1B CF 8E 53 CA FC E7 80 74 BC B2 9D>)
$$ ##END=
$$ 
$$ $$ hash MD5
$$ $$ 9C 45 DF 3A E1 B8 F5 4C 99 80 3D 52 1A 95 BE E4
##$RELAX= 
##$RELAX= 
##$RELAX= 
##$RELAX= 
##$RELAX= 
##$RELAX= 
##$RELAX= 
##$RELAX= 
##$RELAX= 
$$ Bruker specific parameters
$$ --------------------------
##$DU= <F:/spectra>
##$EXPNO= 4
##$NAME= <1H>
##$PROCNO= 1
##$TYPE= <nmr>
##$USER= <iren>
##$AMP= (0..31)
100 100 100 100 100 100 100 100 100 100 100 100 100 100 100 100 100 100 
100 100 100 100 100 100 100 100 100 100 100 100 100 100 
##$ANAVPT= -1
##$AQSEQ= 0
##$AQ_mod= 1
##$AUNM= <au_zg>
##$AUTOPOS= <>
##$BF1= 200.13
##$BF2= 200.13
##$BF3= 200.13
##$BF4= 200.13
##$BF5= 200.13
##$BF6= 200.13
##$BF7= 200.13
##$BF8= 200.13
##$BYTORDA= 1
##$CFDGTYP= 0
##$CFRGTYP= 5
##$CHEMSTR= <none>
##$CNST= (0..63)
1 1 145 1 1 1 1 1 1 1 1 1 1 1 1 1 1 1 1 1 1 1 1 1 1 1 1 1 1 1 1 1 1 1 
1 1 1 1 1 1 1 1 1 1 1 1 1 1 1 1 1 1 1 1 1 1 1 1 1 1 1 1 1 1 
##$CPDPRG= <>
##$CPDPRG1= <>
##$CPDPRG2= <>
##$CPDPRG3= <>
##$CPDPRG4= <mlev>
##$CPDPRG5= <mlev>
##$CPDPRG6= <mlev>
##$CPDPRG7= <mlev>
##$CPDPRG8= <mlev>
##$CPDPRGB= <>
##$CPDPRGT= <>
##$D= (0..63)
0 2 0 0 0 0 0 0 0 0.06 0 0.03 0 0 0 0 0.0002 0 0 0 0 0 0 0 0 0 0 0 0 0 
0 0 0 0 0 0 0 0 0 0 0 0 0 0 0 0 0 0 0 0 0 0 0 0 0 0 0 0 0 0 0 0 0 0 
##$DATE= 1729167502
##$DBL= (0..7)
120 120 120 120 120 120 120 120 
##$DBP= (0..7)
150 150 150 150 150 150 150 150 
##$DBP07= 0
##$DBPNAM0= <>
##$DBPNAM1= <>
##$DBPNAM2= <>
##$DBPNAM3= <>
##$DBPNAM4= <>
##$DBPNAM5= <>
##$DBPNAM6= <>
##$DBPNAM7= <>
##$DBPOAL= (0..7)
0.5 0.5 0.5 0.5 0.5 0.5 0.5 0.5 
##$DBPOFFS= (0..7)
0 0 0 0 0 0 0 0 
##$DE= 6
##$DECBNUC= <off>
##$DECIM= 32
##$DECNUC= <off>
##$DECSTAT= 4
##$DIGMOD= 1
##$DIGTYP= 9
##$DL= (0..7)
0 120 120 120 120 120 120 120 
##$DP= (0..7)
$$ [...]
##$SW= 21.9925939549014
##$SWIBOX= (0..15)
0 0 2 0 0 0 0 0 0 0 0 0 0 0 0 0 
##$SW_h= 4401.40845070422
##$TD= 16384
##$TD0= 1
##$TE= 300
##$TE2= 300
##$TE3= 300
##$TEG= 300
##$TL= (0..7)
0 120 120 120 120 120 120 120 
##$TP= (0..7)
150 150 150 150 150 150 150 150 
##$TP07= 0
##$TPNAME0= <>
##$TPNAME1= <>
##$TPNAME2= <>
##$TPNAME3= <>
##$TPNAME4= <>
##$TPNAME5= <>
##$TPNAME6= <>
##$TPNAME7= <>
##$TPOAL= (0..7)
0.5 0.5 0.5 0.5 0.5 0.5 0.5 0.5 
##$TPOFFS= (0..7)
0 0 0 0 0 0 0 0 
##$TUNHIN= 0
##$TUNHOUT= 0
##$TUNXOUT= 0
##$USERA1= <user>
##$USERA2= <user>
##$USERA3= <user>
##$USERA4= <user>
##$USERA5= <user>
##$V9= 5
##$VALIST= <valist>
##$VCLIST= <CCCCCCCCCCCCCCC>
##$VD= 0
##$VDLIST= <DDDDDDDDDDDDDDD>
##$VPLIST= <PPPPPPPPPPPPPPP>
##$VTLIST= <TTTTTTTTTTTTTTT>
##$WBST= 1024
##$WBSW= 25
##$XGAIN= (0..3)
0 0 0 0 
##$XL= 0
##$YL= 0
##$YMAX_a= 1687972
##$YMIN_a= -2098247
##$ZGOPTNS= <>
##$ZL1= 120
##$ZL2= 120
##$ZL3= 120
##$ZL4= 120
##$ABSF1= 10
##$ABSF2= 0
##$ABSG= 5
##$ABSL= 3
##$ALPHA= 0
##$AQORDER= 0
##$ASSFAC= 0
##$ASSFACI= 0
##$ASSFACX= 0
##$ASSWID= 0
##$AUNMP= <proc_1d>
##$AXLEFT= 0
##$AXRIGHT= 0
##$AXTYPE= 0
##$AXUNIT= <>
##$AZFE= 0.1
##$AZFW= 0.1
##$BCFW= 1
##$BC_mod= 2
##$BYTORDP= 1
##$COROFFS= 0
##$CY= 7568.61572265625
##$DATMOD= 1
##$DC= 2
##$DFILT= <>
##$DTYPP= 0
##$F1P= 17.9538593292236
##$F2P= -4.03888763876832
##$FCOR= 0.5
##$FTSIZE= 32768
##$FT_mod= 4
##$GAMMA= 1
##$GB= 1
##$INTBC= 1
##$INTSCL= 1
##$ISEN= 128
##$LB= 0.05
##$LEV0= 0
##$LPBIN= 0
##$MAXI= 945.577
##$MC2= 0
##$MEAN= 0
##$ME_mod= 0
##$MI= -402.1523
##$NCOEF= 0
##$NC_proc= 0
##$NLEV= 6
##$NOISF1= 8.587773
##$NOISF2= 6.764455
##$NSP= 1
##$NTH_PI= 0
##$NZP= 0
##$OFFSET= 17.95386
##$PC= 1
##$PHC0= 313.7489
##$PHC1= 8.641859
##$PH_mod= 0
##$PKNL= yes
##$PPARMOD= 0
##$PPDIAG= 0
##$PPIPTYP= 0
##$PPMPNUM= 100
##$PPRESOL= 1
##$PSCAL= 0
##$PSIGN= 0
##$REVERSE= no
##$SF= 200.13
##$SI= 32768
##$SIGF1= 18.5376
##$SIGF2= -6.396296
##$SINO= 400
##$SIOLD= 32768
##$SREGLST= <1H.CDCl3>
##$SSB= 3
##$STSI= 0
##$STSR= 0
##$SW_p= 4401.40845070423
##$SYMM= 0
##$S_DEV= 0
##$TDeff= 0
##$TDoff= 0
##$TI= <>
##$TILT= no
##$TM1= 0
##$TM2= 0
##$TOPLEV= 0
##$USERP1= <user>
##$USERP2= <user>
##$USERP3= <user>
##$USERP4= <user>
##$USERP5= <user>
##$WDW= 1
##$XDIM= 8192
##$YMAX_p= 0
##$YMIN_p= 0
$$ End of Bruker specific parameters
$$ ---------------------------------
##NTUPLES= NMR FID
##VAR_NAME=  TIME,          FID/REAL,        FID/IMAG
##SYMBOL=    X,             R,               I
##VAR_TYPE=  INDEPENDENT,   DEPENDENT,       DEPENDENT
##VAR_FORM=  AFFN,          ASDF,            ASDF
##VAR_DIM=   8192,          8192,            8192
##UNITS=     SECONDS,       ARBITRARY UNITS, ARBITRARY UNITS
##FACTOR=    0.0002272,     1,               1
##FIRST=     0,             0,               0
##LAST=      1.8609952,     -80,             41
##MIN=       0,             -2098247,        -2098247
##MAX=       1.8609952,     1687972,         1687972
$$ Real data points
##PAGE= N=1
##DATA TABLE= (X++(R..R)), XYDATA
0 0 0 0 0 0 0 0 0 0 0 0 -32 32 -32 32 -32 64 -64 96 -96 128 -160 192 -224 256 -289 352 -416 480 -544 634
30 634 -705 801 -928 1039 -1184 1334 -1485 1669 -1872 2081 -2326 2583 -2859 3179 -3509 3874
46 3874 -4282 4716 -5197 5733 -6308 6955 -7669 8450 -9345 10345 -11476 12784 -14293
59 -14293 16071 -18212 20814 -24098 28368 -34168 42573 -55873 80234 -139523 593794 152873
71 152873 -1574296 -1530736 -671706 765499 1687972 1449390 -188490 -1601586 -1698064 -568498
81 -568498 751424 1652956 1353171 -134651 -1604347 -1561140 -273514 1049983 1570761
90 1570761 1124565 -242376 -1567765 -1603620 -289536 1048174 1462995 887802 -332482
99 -332482 -1481642 -1461212 -138411 1238689 1511593 760980 -412476 -1380155 -1371571 -144883
109 -144883 1217876 1438090 521629 -627505 -1336670 -1184969 -62804 1222677 1458582
118 1458582 507983 -663585 -1256209 -1024342 8718 1197926 1407163 362890 -878145
127 -878145 -1302381 -849896 116956 1096680 1294748 369264 -843508 -1252107 -712490 252824
137 252824 1102543 1225389 300473 -942441 -1318801 -621702 381070 1030458 1021622 224181
147 224181 -874359 -1252785 -549204 500067 1079072 944161 156281 -862371 -1233845
156 -1233845 -523439 568286 1072880 779209 1616 -843460 -1137176 -470848 616850
165 616850 1116386 727502 -86237 -811254 -1019786 -416789 608942 1105539 658136 -218630
175 -218630 -861864 -940731 -341557 613849 1093165 621146 -294377 -862197 -804567 -221067
185 -221067 595536 1026699 591678 -338693 -916554 -776701 -140487 605949 965397 535581
195 535581 -382690 -931725 -690251 -1274 634641 873001 474197 -368599 -922533 -683286
205 -683286 49356 661326 806414 386470 -397915 -913879 -644188 138903 722355 747373
215 747373 288506 -399319 -846002 -602855 159176 737781 703392 195349 -438462 -809011
225 -809011 -562900 185567 769388 688618 113641 -480975 -743143 -474375 211885 755826
235 755826 654393 46990 -526170 -705319 -409555 221010 731887 637902 10388 -571830
245 -571830 -679887 -316492 276067 708301 590019 -30674 -598816 -654316 -245120 304462
255 304462 658980 535523 -47710 -608518 -648849 -188815 365995 649608 476418 -85317
265 -85317 -609613 -622977 -133087 408538 615874 396684 -120998 -589197 -596903 -107861 441534
276 441534 616181 346137 -163562 -578332 -557623 -67791 473274 605149 278802 -220023
286 -220023 -561175 -503236 -40143 472542 591129 242528 -257638 -552791 -454679 -1525
296 -1525 483136 580706 202990 -307567 -554248 -397801 45532 474697 542272 167412 -330625
307 -330625 -546309 -352208 87107 474160 515898 141325 -353386 -550098 -313774 138487
317 138487 478278 469143 94872 -367863 -533904 -274866 175471 476819 430955 62951
327 62951 -370759 -520248 -249123 209924 487985 395369 12855 -387291 -496838 -211027
337 -211027 238183 485166 356815 -27132 -388728 -465146 -180068 254317 484889 332892
347 332892 -64849 -405191 -442600 -141327 276545 476862 298191 -103316 -412153 -408337
357 -408337 -100106 288590 460047 271767 -126124 -418681 -388125 -66078 307000 447725
367 447725 238944 -157281 -425062 -360274 -24814 323224 425414 202883 -175853 -417689
377 -417689 -335469 2310 334456 410623 172465 -199407 -417886 -311614 34751 349792
387 349792 392058 134466 -222128 -405804 -278269 60599 351843 372468 107244 -238607
397 -238607 -399508 -254033 85211 358991 355705 75920 -260805 -391215 -219455 114887
407 114887 358223 329187 48259 -270793 -378762 -193516 135509 357297 308389 23735
417 23735 -283735 -371544 -166777 163552 359384 280524 -6825 -290185 -353003 -139907 180804
428 180804 354639 255616 -31116 -294223 -338598 -119295 198316 356878 233411 -61920
438 -61920 -302770 -316973 -89969 212157 348823 208540 -86458 -304942 -294647 -66746
448 -66746 219283 341696 191923 -108471 -314296 -276137 -35958 232314 329770 168065
458 168065 -129492 -316922 -253433 -7088 238032 311388 147595 -140511 -318503 -239767
468 -239767 18336 251525 297725 122274 -156002 -317486 -221358 45786 261922 277062
478 277062 93113 -164953 -307099 -205795 61793 270951 264998 67586 -178117 -299194
488 -299194 -188229 80573 281050 251137 36433 -193050 -283288 -163728 92428 280342
498 280342 239067 14900 -205758 -271677 -141671 104368 280743 229378 -6849 -223519
508 -223519 -261346 -111954 119987 272373 212041 -23294 -232374 -250660 -87265 132693
518 132693 263286 197312 -34652 -241639 -246834 -63342 153220 256062 173479 -50298 -243685
529 -243685 -236445 -41926 168601 245801 149933 -60889 -239591 -229210 -29124 184562 244303
540 244303 126750 -79883 -237164 -214904 -12879 196788 238810 101820 -97545 -228862
550 -228862 -196294 -3077 200757 236848 85586 -116399 -227351 -177377 12054 205039
560 205039 231866 68127 -135870 -224693 -153354 28910 201418 220893 56734 -147574 -224523
571 -224523 -135087 45901 200637 209746 45162 -159671 -226627 -116180 68307 200013 190654
582 190654 30457 -163661 -222671 -101588 85178 199457 173619 17567 -165574 -220230
592 -220230 -91392 103045 204830 155497 -2830 -167715 -209836 -78391 115325 206059
602 206059 138334 -21011 -167172 -197369 -69256 122117 209999 127690 -40949 -172636 -183295
613 -183295 -53810 128799 208505 115301 -59432 -176363 -166250 -37489 129717 202473 107926
624 107926 -71147 -183033 -155143 -19516 135230 195422 97177 -83470 -188474 -142284 1228
635 1228 139748 182034 84444 -88207 -189156 -134764 16500 146805 172305 70526 -94984
646 -94984 -189410 -126793 32599 155378 160829 52386 -100475 -183170 -117848 42842 160838
657 160838 152158 36271 -106264 -176581 -108501 51305 166533 145800 19703 -115011 -168904
668 -168904 -95706 59351 168541 138332 4174 -123022 -159105 -81215 64335 166139 132988
679 132988 -5921 -131840 -154650 -66568 73686 164235 124176 -18107 -139684 -147197 -49173
690 -49173 81054 156459 114107 -23539 -143025 -144753 -37256 91813 153757 102231 -33306
701 -33306 -146004 -138860 -23376 101712 147697 87703 -40325 -143683 -133251 -15022 109901
712 109901 145822 74595 -50887 -142264 -124727 -5766 115922 142588 62166 -60631 -140214
723 -140214 -115157 2899 120226 139369 50219 -71066 -137583 -103160 11149 120780 134899
734 134899 42191 -79296 -137554 -93449 21723 123737 129104 31038 -87956 -134665 -80619
745 -80619 30901 121607 121329 24590 -92169 -134471 -72844 41300 124120 113810 13770 -98087
757 -98087 -130978 -61499 50582 122248 103758 6210 -99426 -127923 -54812 58783 124210
768 124210 95465 -4467 -102420 -122353 -45755 65515 123469 86813 -13521 -104094 -116578
779 -116578 -37792 71375 123142 78564 -23554 -106047 -108876 -28891 74665 120557 72033
790 72033 -30985 -108741 -103483 -19402 80171 117971 63351 -39178 -109488 -95420 -10274 82493
802 82493 113166 56774 -43988 -110358 -90861 -2018 87697 109883 47595 -51097 -109638 -83035
814 -83035 6470 89569 104229 39698 -55399 -108124 -77238 13147 92882 100496 30902 -61530
826 -61530 -106358 -69279 20569 94312 95216 22955 -66139 -104031 -61920 27150 95346 89847 15119
839 15119 -70399 -101263 -54440 33228 95609 84683 8221 -74449 -98987 -46898 40317 95697
851 95697 77723 454 -76990 -94755 -39430 45221 94526 71855 -5534 -79230 -92181 -32681
863 -32681 51350 94434 64754 -13389 -81047 -86788 -25276 55451 92462 58003 -19504 -81723
875 -81723 -82261 -19112 59274 91437 51949 -26317 -83127 -76801 -12048 62531 89123 45576 -32141
888 -32141 -83520 -70904 -5285 64657 85814 39887 -36918 -84122 -65935 1400 67093 82475
900 82475 34044 -41748 -84197 -60200 8445 69232 77773 27340 -44920 -82818 -55457 13946
912 13946 71014 73925 21300 -48412 -81680 -50552 19795 73185 69515 14095 -51712 -78886
924 -78886 -44817 24464 73889 65212 8000 -54497 -76127 -39715 28403 74637 61677 1711
936 1711 -57860 -73257 -33424 32694 74141 57096 -3946 -60119 -69892 -27467 35857 72825
948 72825 53024 -8438 -62430 -67397 -21487 40138 71886 48274 -13567 -64174 -63987 -15247 43456
961 43456 69346 42937 -17254 -64626 -61068 -10452 46768 68015 37750 -21599 -65153 -57703
973 -57703 -5094 50051 66030 31948 -25894 -64526 -53495 -728 51995 63919 26968 -29569
985 -29569 -63929 -49657 3441 54152 62184 21928 -33846 -63495 -44705 8398 55243 59090
997 59090 17104 -37047 -62393 -40176 12384 55744 56417 13027 -40019 -61850 -35842 17061
1009 17061 56843 52846 8136 -42668 -60170 -31360 20979 56799 49210 4019 -44139 -58534
1021 -58534 -27531 24472 57451 45870 -477 -46314 -56430 -22903 28076 57237 41972 -5169
1033 -5169 -47684 -53442 -18726 30362 56509 38706 -8845 -48947 -51249 -14481 33190 55821
1045 55821 35147 -12881 -50542 -48207 -9727 35548 53843 31243 -15911 -50709 -45805 -5795
1057 -5795 37714 52346 27669 -18560 -51476 -43598 -1468 40509 50410 22754 -21734 -50759
1069 -50759 -40431 1986 42168 48646 18828 -24242 -49952 -37768 4726 43813 47526 14497
1081 14497 -27671 -49015 -33885 8068 44718 45504 10499 -30478 -47469 -29857 10252 44585
1093 44585 44006 7667 -33352 -47141 -25831 13882 44562 41662 4511 -36036 -46343 -21262
1105 -21262 17309 43354 38235 2416 -37096 -45849 -18260 20741 43218 35115 -397 -38068
1117 -38068 -45097 -15127 24739 43060 30596 -3667 -37571 -43398 -12929 27285 43301 27071
1129 27071 -7203 -37251 -41276 -11121 29332 44177 23783 -11505 -37595 -37819 -8369 30327
1141 30327 43904 21082 -15304 -37716 -34153 -5987 30173 43411 19670 -18632 -39066 -30875
1153 -30875 -1966 30769 41931 17676 -21478 -40097 -27155 2330 30258 38924 16445 -22127
1165 -22127 -41206 -25779 6369 31481 36209 13622 -23244 -41683 -23862 10768 32826 32333
1177 32333 10276 -22783 -40735 -23366 13231 35172 29752 6152 -23039 -39015 -22258 15055
1189 15055 37220 28046 1483 -24246 -35896 -20091 15825 38267 26839 -2913 -26120 -32424
1201 -32424 -17315 15349 38280 27203 -5599 -29370 -30573 -13077 16554 37114 26027 -8216
1213 -8216 -31709 -28435 -8436 16836 34289 25274 -8308 -33715 -28943 -4233 19716 32326 22416
1226 22416 -9150 -34690 -28278 -393 22278 29335 19028 -8929 -33994 -28910 1322 25810
1238 25810 28407 14536 -10283 -32345 -28155 2531 28406 27984 10234 -12200 -30046 -26559 2862
1251 2862 30233 28472 6048 -15498 -27389 -23470 2394 30250 29882 4060 -19443 -26845 -19404
1264 -19404 3882 29403 29600 2199 -22711 -26107 -14708 5136 26661 29371 3511 -25088 -28214
1277 -28214 -11246 9322 25529 26211 2506 -25903 -28849 -8462 12580 23572 22769 2854 -24782
1290 -24782 -30576 -7718 16905 24732 18538 271 -23606 -29627 -7267 19306 25538 15012 -2265
1303 -2265 -21859 -28320 -7777 21087 27526 12139 -6588 -20809 -24929 -7790 20556 29187 11571
1316 11571 -10497 -21500 -21560 -5741 20155 29509 10600 -13883 -22277 -17459 -3701 17849 28698
1329 28698 12054 -15657 -25271 -15503 610 17852 26329 11205 -16467 -26543 -13426 4323
1341 4323 17117 23015 11183 -15248 -28483 -14151 8358 19500 19561 8201 -14474 -27762 -14240
1354 -14240 10525 21238 16996 5177 -13361 -26321 -15133 11512 23999 15727 774 -13680
1366 -13680 -23178 -14620 11001 25689 16040 -2724 -15471 -20461 -12583 10347 26281 16282 -5488
1379 -5488 -17418 -17870 -9781 9163 25028 17543 -6476 -20628 -17181 -5743 10082 22832 16886
1392 16886 -6925 -22143 -16435 -2403 10719 20218 16079 -5822 -23581 -17889 476 13723 18383
1405 18383 13156 -5650 -23023 -18167 2204 15953 17001 10031 -5488 -21546 -18864 2532 18630
1418 18630 17139 6628 -6882 -19437 -18049 2204 20031 17753 3634 -9071 -17637 -16022 1871
1431 1871 20151 18790 1755 -11751 -16321 -13278 1530 19406 19767 1479 -14559 -16522 -9987
1444 -9987 3136 17875 18968 1315 -16283 -17007 -7337 4748 16067 17962 1932 -16987 -18585
1457 -18585 -5348 7652 15384 15332 1559 -16678 -19085 -4380 10197 15140 12652 975 -15467
1470 -15467 -19320 -4687 12220 16101 10287 -1006 -14409 -18406 -4753 13414 17292 8292 -3526
1483 -3526 -13471 -16449 -4674 13347 18159 7422 -5801 -13738 -14373 -4132 12886 18790 7218
1496 7218 -8119 -14623 -12105 -2327 12150 18150 7058 -9406 -15358 -10468 -425 11387 16969
1509 16969 7338 -9963 -16889 -9628 2067 11723 14997 6473 -9829 -17249 -9093 4151 12251 13198
1523 13198 5398 -9207 -17286 -9372 5615 13664 11939 3519 -9201 -16431 -9039 6708 14646 10808
1537 10808 1235 -9320 -14978 -8577 6491 15384 10634 -615 -9952 -13818 -7774 6726 15733 10594
1551 10594 -2274 -11208 -12464 -5894 6712 15163 10280 -3157 -12236 -11930 -4181 6885 14501 10079
1565 10079 -3606 -13201 -11540 -2363 7807 13539 8966 -3951 -13636 -11192 -1003 8578 12463 8054
1579 8054 -4169 -13639 -11246 -93 9902 12089 6454 -4543 -13248 -10821 841 10667 11683 4835
1593 4835 -5269 -12531 -10088 1021 11237 11726 3802 -6210 -12173 -9380 1637 11591 11664 2630
1607 2630 -7492 -11693 -7867 2355 11350 11164 1888 -8206 -11656 -7032 2992 11344 10779 1378
1621 1378 -8839 -11684 -5785 4112 11059 9756 694 -9063 -11355 -4955 4826 10981 9067 55 -9420
1636 -9420 -11275 -4256 5733 11228 8198 -1155 -9568 -10772 -3304 6383 11152 7342 -1794 -9571 -10023
1651 -10023 -2770 6661 11192 6984 -2631 -9961 -9684 -1745 7325 10799 6055 -3535 -10266 -8866 -1016
1666 -1016 7476 10279 5436 -3827 -10348 -8594 -152 7895 10069 4689 -4630 -10390 -7900 768 8506
1681 8506 9440 3519 -4859 -9807 -7514 1121 8857 9253 2813 -5421 -9735 -7118 1764 9342 9066 1657
1697 1657 -6256 -9384 -6057 2091 9279 8824 1152 -6737 -9080 -5358 2490 9078 8672 653 -7603
1712 -7603 -9079 -4181 3399 8705 7945 150 -7911 -8876 -3128 4007 8465 7410 168 -8173 -9139 -2689
1728 -2689 5107 8430 6347 -455 -8103 -9121 -1955 5921 8233 5210 -994 -7552 -8839 -2076 6526
1743 6526 8699 4484 -2014 -7413 -8063 -1777 7079 9152 3654 -3221 -7269 -7023 -1389 6631 9069
1758 9069 3451 -3932 -7290 -6104 -1043 6389 9095 3379 -4984 -7883 -5250 241 6188 8520 3059
1773 3059 -5363 -8280 -4496 949 5848 7743 3234 -5176 -8972 -4289 2334 6410 6631 2494 -5272
1788 -5272 -8918 -4174 3327 6488 5747 1744 -4666 -8609 -4508 3768 7499 5167 572 -4692 -7986
1803 -7986 -4522 4084 8190 4888 -793 -4895 -6790 -3988 3560 8454 5071 -1565 -5377 -6258 -3492
1818 -3492 3379 8441 5393 -2484 -6505 -5398 -2084 3288 7694 5290 -2520 -6850 -5052 -1002 3288
1833 3288 6803 5255 -2346 -7752 -5395 343 4319 6083 4438 -2091 -7740 -5625 887 4898 5400
1848 5400 3513 -1750 -7317 -6044 1117 5884 5422 2331 -2107 -6647 -5865 1169 6509 5255 1284
1863 1284 -2651 -5813 -5437 799 6783 5637 534 -3477 -5246 -4727 570 6882 6240 -72 -4685 -4957
1879 -4957 -3395 715 6120 6110 70 -5281 -5071 -2498 1061 5420 6267 245 -6100 -5788 -1401 2258
1895 2258 4913 5142 464 -5640 -6052 -1156 3087 4584 4496 580 -5463 -6637 -1010 4176 4938 3135
1911 3135 -161 -4859 -6233 -1168 4669 5354 2503 -784 -4340 -5806 -1538 4818 5944 2053 -1864
1926 -1864 -4127 -5001 -1477 4488 6195 2017 -2880 -4271 -3903 -949 4113 5976 1948 -3295 -4747
1941 -4747 -3276 -609 3933 6192 2199 -3867 -5441 -2523 674 3668 5160 2181 -3628 -5548 -2541
1956 -2541 1228 3688 4663 2301 -3514 -6193 -2590 2452 4196 3597 1441 -2888 -5716 -2844 2513
1971 2513 4634 3142 911 -2779 -5446 -3157 2798 5285 2936 -346 -2920 -4584 -2997 2353 5609
1986 5609 3137 -1062 -3355 -3933 -2208 2248 5482 3224 -1517 -3795 -3351 -1738 2019 5175 3500
2001 3500 -1762 -4558 -3236 -513 2210 4514 3409 -1471 -4746 -3337 -220 2575 4294 3167 -1503
2016 -1503 -5093 -3567 603 3002 3576 2276 -1346 -4565 -3668 697 3523 3551 1859 -1410 -4622 -3608
2032 -3608 728 3974 3349 853 -1687 -3900 -3440 573 4358 3622 552 -2250 -3776 -2952 596 4188
2048 4188 3691 136 -2679 -3396 -2457 605 4072 3949 91 -3372 -3438 -1663 1054 3748 3588 184 -3596
2065 -3596 -3599 -1258 1326 3541 3450 212 -3641 -3844 -994 1944 3238 2864 157 -3578 -3858 -773 2272
2082 2272 3379 2456 -236 -3459 -3729 -735 2751 3281 1895 -644 -3079 -3610 -839 2796 3691 1532
2098 1532 -1150 -3105 -3071 -561 2901 3758 1374 -1353 -2940 -2859 -566 2743 3866 1426 -1765 -3276
2114 -3276 -2377 -36 2774 3513 1191 -2110 -3284 -1962 219 2533 3353 1367 -2151 -3378 -1932 560
2130 560 2798 2981 906 -2115 -3590 -1840 1140 2674 2568 738 -2056 -3256 -1709 1174 2963 2504
2146 2504 536 -2120 -3457 -1700 1547 3163 2330 -33 -2275 -2947 -1441 1381 2985 2160 -169 -2249
2162 -2249 -2942 -1276 1528 3164 2085 -579 -2631 -2675 -1053 1705 3168 1999 -633 -2550 -2417 -648
2178 -648 1582 2997 1882 -864 -2798 -2415 -378 1915 2935 1485 -1044 -2776 -2171 -120 1836 2477
2194 2477 1426 -970 -2753 -2390 -165 2132 2814 1245 -1320 -2797 -2124 308 2241 2466 766 -1426
2210 -1426 -2495 -1866 346 2179 2498 746 -1326 -2668 -1791 458 2517 2394 513 -1713 -2404 -1434
2226 -1434 644 2387 2039 425 -1621 -2322 -1542 719 2517 2137 222 -1941 -2577 -1174 1134 2362
2242 2362 1808 -43 -1941 -2138 -860 948 2295 1876 41 -1908 -2371 -832 1376 2388 1764 -495
2258 -495 -2197 -2036 -393 1403 2145 1415 -414 -2044 -1985 -525 1322 2265 1274 -497 -2261 -1876 -60
2275 -60 1796 2348 949 -787 -2063 -1658 -218 1487 1942 1000 -781 -2010 -1945 2 1823 2231 816
2292 816 -1249 -2131 -1443 281 1822 1737 575 -1022 -1920 -1452 73 1692 2141 626 -1246 -2044 -1430
2309 -1430 602 1987 1771 332 -1532 -1892 -885 666 1729 1679 508 -1369 -2083 -1152 762 1893
2325 1893 1807 130 -1668 -1904 -671 867 1782 1343 6 -1418 -1615 -922 802 1775 1414 -166 -1529
2342 -1529 -1989 -721 1118 1985 1222 -482 -1601 -1577 -361 935 1576 993 -171 -1524 -1677 -462 1195
2359 1195 1980 1180 -667 -1842 -1303 -79 1358 1707 697 -718 -1527 -1229 -50 1234 1745 937 -751
2376 -751 -1838 -1466 236 1420 1750 670 -837 -1656 -1064 266 1322 1470 516 -746 -1625 -1413 256
2393 256 1466 1367 478 -1066 -1708 -893 578 1628 1340 63 -1066 -1337 -886 266 1473 1412 203 -1071
2411 -1071 -1616 -873 642 1691 1415 -158 -1392 -1426 -561 733 1370 1076 -32 -1114 -1240 -690 744
2428 744 1509 1354 -127 -1388 -1576 -200 908 1410 835 -228 -1334 -1319 -271 886 1227 916 -152
2445 -152 -1440 -1630 -301 1150 1433 759 -534 -1247 -1234 -116 1203 1321 480 -494 -1161 -1132 -234 991
2463 991 1512 619 -587 -1346 -1009 59 1250 1427 478 -866 -1187 -785 -9 866 1189 575 -708 -1317
2481 -1317 -843 176 1114 1382 474 -961 -1440 -577 533 1059 935 412 -760 -1205 -657 413 1226 1111
2499 1111 198 -966 -1542 -815 712 1208 800 -62 -901 -1136 -599 588 1240 843 -12 -843 -1071 -649 555
2518 555 1465 901 -259 -991 -1005 -306 622 1321 736 -426 -828 -884 -350 575 1227 940 -436 -1116 -906 -76
2538 -76 559 1252 731 -428 -1158 -841 171 736 760 637 -287 -1226 -1087 41 817 911 496 -381 -1333 -956
2558 -956 215 1057 688 261 -276 -1037 -875 104 1079 979 121 -523 -948 -883 175 1355 1156 -132 -721
2577 -721 -777 -602 129 1032 977 41 -612 -908 -474 174 983 1156 49 -968 -928 -273 318 856 926 -23 -995
2598 -995 -1037 -268 364 706 734 146 -978 -1085 -184 503 738 618 89 -959 -895 -178 755 707 470 134 -727
2619 -727 -1048 -160 768 968 315 -231 -665 -1025 -233 903 931 295 -252 -668 -750 -291 617 1159 373 -426
2639 -426 -719 -547 -208 721 1111 367 -756 -846 -406 -97 588 910 366 -565 -853 -368 103 509 821 371
2659 371 -653 -1002 -370 336 423 624 419 -461 -993 -490 317 597 476 179 -317 -953 -483 441 857 528
2679 528 98 -435 -852 -617 481 944 500 -121 -357 -675 -557 321 1016 577 -203 -532 -567 -316 299 1045
2699 1045 490 -207 -664 -504 -230 181 749 729 -348 -919 -421 -156 348 661 725 -161 -806 -522 125 275
2719 275 641 583 -60 -801 -713 -38 564 460 287 -94 -748 -747 221 648 499 255 -156 -603 -782 98 836
2740 836 630 106 -302 -634 -604 111 825 601 66 -371 -464 -395 -252 644 610 -70 -490 -581 -293 -53 665 625
2762 625 28 -606 -500 -252 52 559 575 143 -568 -666 -166 159 522 582 -3 -657 -573 -11 443 424 474 66
2784 66 -632 -704 -144 324 389 300 -63 -465 -640 -307 547 652 235 -4 -534 -584 -203 492 498 190 -205 -304 -542
2807 -542 -284 329 748 323 -285 -532 -510 -108 377 636 140 -377 -456 -475 -256 279 478 459 -227 -642 -346
2828 -346 -7 298 633 232 -401 -624 -377 195 244 372 241 -247 -444 -281 139 399 488 278 -168 -674 -416
2849 -416 271 568 434 109 -235 -433 -223 215 492 340 -52 -281 -317 -371 48 571 417 7 -398 -523 -302
2870 -302 146 565 314 -113 -422 -371 -228 87 495 516 22 -423 -510 -144 341 509 392 -27 -401 -309 -13
2891 -13 333 399 201 -90 -474 -378 89 259 447 289 -155 -433 -375 123 356 355 110 -93 -454 -232 -114 380
2913 380 422 155 -123 -449 -295 13 266 372 176 -245 -383 -360 70 380 262 189 -112 -320 -331 -96 319
2934 319 458 226 -148 -390 -257 196 458 369 123 -217 -287 -207 -12 353 305 -42 -220 -408 -257 160 493
2955 493 348 -5 -281 -336 -203 72 312 369 21 -452 -382 -215 133 249 229 3 -243 -354 -211 140 266
2976 266 289 -123 -360 -300 -64 224 449 296 -55 -425 -277 -17 266 314 365 -166 -335 -328 68 325 194 267
2998 267 -96 -209 -302 -105 383 303 129 -145 -205 -450 -93 351 376 75 -238 -292 -338 4 270 371 -67 -215
3020 -215 -142 -261 -31 230 487 182 -377 -271 -179 129 290 320 -38 -413 -294 -150 -2 96 431 173 -247
3041 -247 -428 -161 110 243 357 -24 -104 -331 -40 214 266 152 151 -259 -415 -182 217 366 128 -82 -236
3062 -236 -313 -205 373 352 156 -74 -251 -307 -141 263 322 229 -95 -199 -274 -298 145 357 140 -265 -316 -135 -51
3085 -51 163 323 71 -252 -211 -125 -61 -23 241 192 -60 -371 -207 94 91 265 261 -114 -264 -21 167 217 149 146 -85
3110 -85 -379 -230 112 306 77 49 8 -317 -302 19 299 172 -37 -27 -221 -271 69 365 216 -168 -50 -181
3132 -181 -260 -104 368 187 -165 -300 -156 -52 -88 244 140 -76 -330 -130 -16 -130 262 232 60 -315 -202
3153 -202 71 -62 107 264 3 -368 -166 110 104 89 277 110 -246 -219 -143 174 103 204 113 -235 -348 -42
3175 -42 166 67 49 -19 -94 -277 -115 319 273 59 -120 -179 -306 -77 178 179 30 -197 -105 16 -163 143 209 -6
3199 -6 -199 -51 -82 -155 23 251 154 -116 -121 -195 -23 45 219 88 -95 -316 -19 223 -42 227 207 -107 -267
3222 -267 -140 76 83 76 203 -207 -401 -18 306 73 58 102 38 -271 -160 127 127 -11 151 -71 -211 -204 91 294
3246 294 74 -118 8 -191 -80 41 358 168 -172 -6 -21 -61 0 327 158 -39 -245 -186 121 -57 153
3267 153 90 -158 -116 -7 160 -37 41 152 19 -217 -237 32 63 37 259 -34 -298 -17 85 193 -3 149
3289 149 120 -117 -166 -16 164 108 -15 5 -135 -246 -42 199 200 5 18 -109 -242 -21 245 267 -32 -11 18
3312 18 -120 43 261 215 156 -204 -90 -69 -55 51 244 -38 -71 -149 -68 22 77 147 73 -146 -206 -37 160 87 141
3337 141 53 -82 -140 -130 117 144 50 93 -27 -156 -34 151 148 232 -3 -77 -246 -126 146 164 86 -47 -89 -157 39
3362 39 120 135 64 70 61 -82 -72 61 170 106 -95 -151 -11 -49 88 215 51 10 -234 -114 49 56 52 92 -54 -126
3388 -126 -164 -101 43 194 28 -175 -110 -146 17 1 51 23 53 -161 -143 -45 217 81 153 5 -107 -91 -7 243
3412 243 95 22 -13 -77 -82 56 103 127 90 -48 -150 -111 -53 238 60 -148 30 -47 -154 -46 162 89 -75 -177
3436 -177 -106 -67 19 136 82 34 -180 -66 -157 63 120 154 19 -169 -78 15 62 103 69 49 -62 -184 0 77 197
3461 197 161 -57 -90 -82 -23 116 73 60 -33 -119 -141 -60 140 100 77 -8 -40 -18 -35 61 141 -28 -38 -138 -29 7 51
3488 51 218 77 -51 -132 -95 -116 22 45 43 35 -177 -78 -29 170 116 114 15 -102 -118 -48 129 72 117 -43 -55 -8 22
3515 22 159 154 -38 0 -68 -179 -63 99 39 77 -24 -65 5 87 105 16 28 -116 -237 -135 111 24 92 -97 -212
3540 -212 -59 -170 42 33 69 -103 -94 -145 -103 117 131 44 15 -43 -118 56 32 282 44 64 -51 -65 -20 82 183
3565 183 133 -9 -76 -176 27 139 167 40 9 -119 7 -10 22 156 91 -86 -122 -50 45 100 42 9 -194 -318
3589 -318 -37 -99 65 171 -49 -3 -11 -60 -152 -18 138 2 -1 -107 -63 -70 37 169 128 95 -4 -61 -42 100 102 -59
3615 -59 28 -179 -114 76 79 169 2 -48 -165 -130 148 102 -58 43 34 -172 -10 29 60 40 -23 -174 -131 -96 117 236
3641 236 -36 -70 -151 -62 38 -47 10 62 -123 -227 76 -166 -38 41 58 -13 -220 -132 -13 60 2 100 -5 -153
3665 -153 -157 71 179 142 95 16 -24 -67 -99 125 92 90 1 -144 19 -29 85 50 28 -28 -41 -157 -92 16 133 61
3691 61 -69 -109 -48 -79 134 67 -25 -141 -37 -76 23 43 -9 51 -41 18 -6 -1 36 92 141 -14 -150 76 -40 31 82
3718 82 -28 -51 -92 -44 112 106 55 -72 42 -64 -5 67 125 116 -12 -40 -94 4 -100 -41 0 18 -22 -72 -76 239 158 41
3746 41 -98 -42 -107 -173 75 56 97 -35 -168 -14 54 71 85 -83 146 2 -25 6 42 -36 128 64 -87 -104 -43
3771 -43 -6 -72 116 -115 -146 62 -51 83 140 -2 -21 18 -59 31 20 143 -75 -60 28 -60 18 40 -15 -46 -71 -120
3797 -120 41 87 -31 39 98 -69 0 -60 25 -74 88 -23 -45 9 -18 -34 174 73 -61 39 -57 12 17 99 96 94 -35
3824 -35 29 24 -5 31 -14 63 48 125 -59 56 143 64 165 -147 -20 -117 16 141 32 19 -101 -60 135 9 45
3849 45 58 60 -122 -151 56 -91 12 -17 -186 -61 -84 34 2 163 8 -192 -30 -144 14 66 38 104 110 -96
3873 -96 27 26 -53 74 128 -57 -63 -1 158 111 -104 50 40 -19 -130 8 40 52 129 -19 -59 71 -10 11 211 -57
3899 -57 -239 10 -96 146 75 67 -21 -59 -23 -106 -58 25 108 49 -127 48 -41 63 143 -29 107 -56 -52 33 63 119
3925 119 35 145 -82 -129 -25 111 117 44 79 56 77 70 118 -10 -41 -18 -1 -43 80 -27 74 22 -56 -61 -135 -60 92
3952 92 60 -2 -102 172 -44 -45 -28 128 -9 -77 -166 18 -10 135 67 12 -54 -21 -46 -15 90 131 -11 -34 -65 4
3978 4 58 91 29 64 -52 -103 6 8 121 21 27 -47 -44 -5 62 51 -27 31 80 -77 -24 -57 -15 -75 96 57 -83 -40 -59
4007 -59 -33 95 60 -28 -53 -28 83 102 -52 52 -99 -30 -142 69 28 91 37 -124 21 91 -98 99 34 3 -28
4032 -28 -50 33 -64 24 63 39 -23 -43 35 28 225 -19 -82 54 69 -86 28 124 71 -1 -76 -80 86 -15 -83 31 -66
4059 -66 -152 -103 48 52 -18 -50 -3 14 -63 7 -16 83 27 26 103 -6 -18 216 177 -17 68 -17 -21 -57 107 -53 76 53
4087 53 14 -8 -150 115 11 -42 -92 108 8 52 -1 -19 3 -84 -62 44 165 30 91 35 -57 -97 29 -87 -4
4112 -4 80 24 70 16 -45 131 28 22 38 -43 -24 20 -21 52 82 68 29 25 64 79 87 14 9 -23 62 84 26 -44 140 109 33
4143 33 126 38 80 59 -43 -114 -89 -10 46 24 53 51 30 -106 14 89 18 107 -57 76 -149 78 80 -4 83 -109 49
4170 49 41 -12 -66 55 3 -27 -21 76 -7 34 -67 64 59 21 -47 44 64 89 -5 -14 -62 137 -17 78 17 17 57 -59 -49 89
4200 89 53 -6 141 56 98 -98 72 92 70 95 71 -90 -74 -44 -59 81 54 115 25 -108 134 64 18 158 -16 -61
4226 -61 62 -67 -52 76 41 28 -37 -34 -19 29 78 -123 -19 -56 -124 7 44 92 148 -19 38 -48 -43 35 76 1 9 5 -100
4255 -100 -51 36 -8 8 -129 -193 -113 69 104 -17 -87 -78 -104 -113 136 26 81 -30 54 -105 28 12 138 24 -99
4280 -99 -83 -32 -55 -47 82 48 -29 -10 -133 -44 57 48 86 -52 -110 120 73 -30 84 -1 45 65 -11 -51 48 95 209
4307 209 -70 -203 52 -75 60 -40 33 -145 -154 -85 -96 123 -94 108 2 10 -53 72 -10 -51 -84 -47 95 -89
4331 -89 -2 71 -43 24 48 33 58 -2 63 127 7 155 -1 105 -12 -66 22 -10 -93 -20 33 57 86 153 -105 0
4357 0 -65 -70 42 53 91 40 -23 -168 119 114 -66 -119 26 16 -18 -38 -18 47 1 43 -11 -109 -34 16 132 15 67 7
4385 7 61 81 174 141 0 -15 27 -12 -61 71 69 36 79 36 -43 42 45 83 -17 -78 -22 20 47 47 40 -25 -23 64 90 -87 -182
4416 -182 33 76 52 7 37 -97 25 -68 29 30 -57 -32 -89 -38 38 -24 -85 30 137 -61 90 22 -31 -14 -93 168
4442 168 65 85 12 2 -35 139 -73 68 123 50 13 27 -58 13 3 23 -50 46 -83 101 4 -65 67 86 -60 113
4468 113 73 -5 -24 79 182 -10 -137 -40 14 -59 -57 -43 79 -82 99 82 -28 58 62 -73 -56 -23 154 144 88 42
4494 42 9 -13 -63 201 6 -98 112 67 -9 -27 46 73 95 47 -50 93 -139 62 121 108 -24 61 110 12 -7 72
4520 72 111 38 -7 -4 21 -93 22 57 -63 -151 -17 -5 -18 3 -4 -17 -124 124 85 -77 -30 -15 96 -51 -38 -6 86
4547 86 -34 16 55 -88 -93 18 52 -110 -29 113 92 -17 -22 44 -35 106 -19 -41 -15 -31 84 48 68 -49 96 -22
4573 -22 -12 43 31 49 -2 -61 -66 -125 73 123 -52 -35 24 5 -12 -106 -12 23 -26 -34 122 -24 -19 239 100 -27 -11 70
4601 70 53 47 12 24 -82 41 16 26 -17 77 96 175 -165 39 76 103 -89 62 -29 -23 -9 12 136 25 33 8 4 47
4629 47 -17 32 49 85 -70 56 47 -12 5 8 63 -99 94 -8 -143 55 130 7 -24 -23 -62 10 90 62 90 -86 -35
4656 -35 137 137 141 -14 142 80 157 5 -44 -27 83 1 36 -165 77 24 20 111 -85 -48 -44 -11 95 -15 -32 28 49
4683 49 -27 22 24 139 -58 -60 -44 -24 149 54 23 104 107 70 -8 -9 80 123 127 -175 -163 -42 -6 41 4 -16 -23 83 21 -6
4713 -6 101 14 51 7 70 70 -5 85 18 -20 30 -9 137 15 113 -46 -52 -88 5 -53 -83 -50 -85 147 -9 -120 -3 13
4741 13 -66 87 2 -32 31 49 13 48 -52 29 -74 -52 -17 45 44 110 132 10 40 126 119 72 -27 -60 27 -41 39 93 -68
4770 -68 39 -31 -3 24 38 108 105 33 97 -76 48 -11 -9 2 -20 140 43 17 2 -148 58 -7 124 73 -122 100 50
4797 50 1 -33 -100 -19 38 93 -87 48 -45 17 -98 58 -27 -23 67 32 19 15 55 37 -8 -16 34 70 11 -62 -78 -3 11 -21
4827 -21 58 -88 -147 145 41 -107 -38 -86 -79 -102 102 72 -194 12 35 8 -24 36 -98 17 47 30 25 20 -29 -12 32
4854 32 -60 -70 41 15 39 20 105 17 -30 -60 -17 67 44 146 141 -44 70 46 54 22 -38 -127 -60 22 2 -50 -82 10 114
4883 114 -12 -63 -31 -44 -31 77 29 -35 -77 -85 -67 -61 5 -73 7 68 0 68 59 -158 2 -27 -14 41 76 30 49 -3 5 34
4913 34 107 -55 20 119 199 -25 108 175 -21 41 -47 -36 -4 77 36 -26 -72 -30 -41 -112 36 -79 -106 30 5 69 -47
4940 -47 -17 149 -111 -56 17 -142 -114 7 116 -57 6 127 20 -64 -15 -12 74 -3 -53 127 86 22 27 14 87 -91
4966 -91 -46 0 -40 -18 6 73 20 63 -46 -106 -1 8 27 -113 -43 -26 29 20 -28 -28 34 -141 -15 2 29 54 -91 -80 14
4995 14 -40 22 -5 -11 -6 -53 56 -118 203 52 -4 -14 -42 31 16 -44 128 -2 -79 37 -10 -52 133 -80 115 -29
5021 -29 -14 -63 -39 33 -53 55 81 8 29 -14 14 126 102 -105 -18 -7 -57 100 35 -11 100 -3 -33 8 -117 -83 27
5048 27 -28 -85 -165 120 -36 26 122 -2 23 -13 -6 132 -81 -70 47 1 -127 -43 15 80 60 38 -31 93 1 41 149
5075 149 57 126 -37 77 -46 16 64 26 -34 62 -69 -48 17 58 97 0 17 -31 34 -49 66 18 48 -150 -61 -105 46
5102 46 0 45 -39 -97 29 -36 -32 -112 -51 -21 -18 -35 9 -43 -82 -19 84 -67 -131 -20 153 -48 26 104 -4 -90 115
5129 115 65 165 91 19 -13 -50 93 -14 66 58 -21 -25 27 -3 23 -55 -26 -94 30 129 74 -49 -61 -32 -48 -33 52 -142
5157 -142 3 16 -73 91 116 114 99 -160 -57 -55 87 51 133 -108 178 158 85 21 101 71 27 -12 -8 72 -3 68 62 -12
5185 -12 -43 -43 10 82 5 168 56 -5 12 -79 -19 -53 -86 11 21 -82 -10 115 -71 -34 11 -5 70 -93 -51 -37 33 -116
5213 -116 -27 -117 56 35 10 44 -33 81 130 -22 20 89 -50 179 45 41 1 45 -65 -49 76 -7 -9 52 14 79 73
5240 73 -11 18 -10 -38 -31 -2 -58 -17 5 66 -1 88 -19 59 30 -32 -21 -3 -61 -102 14 27 -21 14 54 -62 40 10 43
5269 43 -43 -20 -78 57 55 163 35 130 -95 -4 84 10 3 72 34 29 -46 38 -1 37 -52 -77 -49 -48 26 -48 -7 11 -77 7
5299 7 -19 -134 -2 65 -149 -8 12 -1 -80 -25 25 35 -14 109 -10 9 23 -3 155 31 -24 -55 114 -6 34 -51
5325 -51 39 83 89 95 24 70 -99 13 -7 -41 21 82 115 -32 119 27 66 27 -121 -32 -40 -130 -40 -27 -19 43 222 -38 -36
5354 -36 53 -95 46 -23 110 -32 -131 -64 -44 -70 7 -15 -21 -82 84 -14 -61 -7 70 -134 147 71 1 50 15 54 -19
5381 -19 262 90 -33 139 97 -106 68 12 -57 55 49 166 28 -46 11 19 -98 29 114 -10 -45 -65 -34 32 -29
5406 -29 -18 -7 -1 -130 -62 9 66 44 23 -70 52 78 29 -23 -67 49 19 78 -3 42 -31 93 10 -26 62 14 156 -30
5434 -30 -1 43 107 -1 -38 11 -31 60 67 89 -34 20 157 -55 80 8 -111 100 98 -5 11 -15 -12 -12 -54 31 42 71
5462 71 -18 82 -52 -86 -63 60 22 -105 25 29 48 43 5 81 93 13 -1 -31 55 102 89 -9 -31 21 51 104 -68 76
5490 76 6 15 -53 2 87 57 35 3 128 -31 33 -35 81 -33 28 18 17 -38 -17 157 16 -17 -73 -68 125 -61 -132 13
5518 13 -20 -65 65 13 -18 -1 -36 -4 162 -51 37 -25 -41 140 -13 70 59 -46 73 91 49 -114 -18 4 81 75 18
5545 18 -2 -62 128 47 92 -12 -45 -66 6 11 -23 -40 5 -44 -35 -108 43 56 -82 0 2 2 66 -117 111 36 22 0 -26
5574 -26 110 43 31 64 143 -59 80 36 80 23 -107 -114 76 80 -7 69 -23 19 -29 119 -86 67 57 74 -103 9
5600 9 -4 81 120 53 42 -76 0 38 52 93 94 -10 26 45 -156 38 -24 25 16 -114 97 48 87 -81 -45 -51 -64 -64 26
5629 26 -47 74 64 35 -28 -126 2 46 -11 -10 84 11 88 17 -48 67 -46 30 122 109 -4 57 92 13 -57 114 -33
5656 -33 38 119 46 -45 30 -113 -25 -45 13 -57 -41 0 60 -57 -42 -8 7 -55 -153 -25 -106 49 -46 33 8 82 -57 97
5684 97 61 -46 54 80 -32 19 -81 44 35 9 51 -75 128 17 98 -24 -101 -73 -29 38 -104 -128 -59 41 60
5709 60 103 48 56 -116 50 -46 -85 -71 9 13 -155 -9 14 -33 -20 -32 26 -130 43 42 -101 -129 0 123 31 -10 -46
5736 -46 34 15 61 -120 -87 62 117 6 62 -81 48 100 31 23 -103 -12 -20 122 -29 12 -144 155 -1 -38 -60 -41
5762 -41 -76 -74 -28 149 4 -7 -24 40 74 164 -49 94 127 -10 85 8 47 39 63 62 -65 -15 -65 3 73 70 54 77 152
5791 152 -18 26 99 -5 27 78 34 -30 53 -38 209 37 -38 -51 78 -12 76 51 50 -59 131 41 73 100 58 -77
5817 -77 -37 98 36 -58 14 -27 12 118 14 15 -27 9 -23 -24 -2 45 133 77 -204 151 -71 17 -55 -20 39 118 22 -15
5845 -15 -24 -21 10 -73 14 -65 136 21 -97 71 -85 34 29 178 60 -18 49 -86 135 -101 -16 -108 41 29 23 3
5871 3 -3 -32 163 7 -82 51 59 124 -127 -128 17 41 -56 -42 85 189 -58 72 -24 -3 -18 21 -5 18 -4 51 -18 33
5899 33 39 -48 -52 44 136 98 146 -78 -13 -93 84 -42 -21 211 81 95 -98 47 35 -21 40 -21 -15 85 61 -40 -93
5926 -93 -28 26 -48 59 51 -4 -17 64 -177 -73 -10 -5 -54 9 -47 -93 87 -17 75 54 56 34 95 109 109 -15 27 123 -23
5955 -23 64 47 -41 50 -34 39 3 -57 43 -14 -27 10 73 -10 -62 -26 -34 -66 -127 36 -21 67 175 -77 -139 -16 -90 -17
5983 -17 -3 -60 -35 -2 30 -29 -29 31 173 128 3 107 -62 -118 -25 -25 171 -24 -49 156 6 -92 -6 -19 74 -11 -21
6010 -21 45 99 -54 144 -5 98 64 62 115 27 -40 -51 101 71 14 20 -70 71 -38 56 -65 -93 20 35 -108 55
6036 55 100 -79 110 -88 -13 -41 62 90 -54 -5 31 189 114 2 -34 -7 -16 -60 -33 34 98 -14 110 -7 -20 -25
6062 -25 91 158 46 4 69 24 -82 28 -49 33 -31 22 34 -44 -62 71 48 5 -96 118 -10 -69 106 -8 -107
6087 -107 -52 54 -100 -61 22 15 29 17 20 -27 6 72 -7 -71 -103 24 151 173 95 182 -75 -3 87 94 17 47 -92 2
6115 2 97 133 62 47 30 3 -138 40 14 67 73 -27 68 -92 -1 -73 34 28 29 -36 -94 -14 43 -55 -104 103 19 -52 -120
6144 -120 12 98 -127 16 62 151 29 45 18 48 57 106 94 38 -3 84 143 53 -26 -7 86 51 157 56 -126 43
6170 43 -13 -18 26 -13 -121 -59 -60 67 -50 13 -175 -102 136 -13 -3 -24 25 -105 -102 -91 24 19 -96 -28 30 -55 -79 -20
6198 -20 31 -31 -61 -83 53 110 30 -44 69 -34 15 88 72 73 3 -6 -20 3 -75 18 40 -29 45 46 36 -22 20 -69 -42 -1
6228 -1 80 -48 65 14 -36 -26 -67 -42 -109 -31 -47 -7 12 1 -15 -193 -7 -64 2 -48 22 5 4 -138 24 28 97 66 -8
6257 -8 50 -100 -87 -39 -97 57 77 24 62 21 50 -5 104 18 3 124 59 83 -6 142 27 113 45 -180 16 -56 29
6284 29 -35 39 -114 49 -21 70 -54 -50 -21 49 -142 -104 30 83 -58 -9 -20 8 -78 -17 5 2 -29 -30 67 -114 15 32
6312 32 -56 125 79 -35 -39 21 67 21 50 25 31 60 -71 -57 -52 7 12 85 28 -55 9 24 27 24 3 11 -145 -116 0 -64 -85
6343 -85 -53 -86 -31 99 -39 79 -13 29 -32 -133 71 9 29 -20 51 64 38 -22 126 125 127 -54 72 128 90 -56 24
6370 24 -72 -110 -78 92 9 54 55 46 17 -83 30 -87 -19 157 76 158 -74 10 30 -83 -59 13 57 48 28 -57 -2 105
6398 105 -176 -72 44 77 -49 14 67 24 85 -179 -77 -18 -48 -59 39 44 78 15 3 -109 -44 -16 127 39 -26 -10
6424 -10 165 -30 3 195 -35 74 -14 10 -35 119 80 83 -51 84 -77 -56 0 -39 54 -87 2 -89 -92 -94 -7 17 -21
6451 -21 -11 -37 -55 49 -37 -1 9 125 -24 -71 5 10 16 11 58 74 78 102 -4 -145 -10 5 39 100 -73 -103 149 -25
6479 -25 -34 12 38 48 27 -26 4 -28 -11 55 -56 31 47 9 15 -36 -61 -55 -72 76 -80 -66 -50 46 -35 -6 12 -138 118
6508 118 69 113 6 4 21 -85 39 92 -35 -33 7 -72 76 -23 -16 45 25 -1 -1 -68 73 65 -62 83 112 20 42 12
6536 12 99 140 151 95 20 38 -73 4 151 78 23 -51 30 -12 1 -27 -50 88 -92 -40 77 31 31 5 -74 -81 -46 -7 -66
6565 -66 4 23 29 34 48 -33 79 16 7 38 97 -8 27 120 -31 -49 43 173 -85 -51 -21 107 -26 -18 -3 108 -24 80
6593 80 -75 -35 -33 -94 11 58 -36 9 -68 -88 53 24 -28 -46 -55 -95 -62 -82 -43 46 54 84 -1 92 -12 4 144 -16 71
6622 71 -57 82 23 -66 30 66 70 67 5 12 8 -21 -10 57 -90 -15 67 69 76 -2 -97 -88 -95 -26 -108 -16 0 -21 4 -92 36 15
6654 15 -12 0 -113 168 -93 -58 20 -14 62 169 72 36 92 -70 -43 -51 113 -9 29 36 -102 91 11 160 44 -9
6680 -9 10 58 6 67 -70 -93 34 113 98 -41 -104 46 -6 -17 -20 -49 31 31 61 -36 -87 -60 -129 30 -74 62 -76 32
6708 32 -102 54 -83 32 27 25 44 -81 136 71 -31 -24 0 -50 121 30 -29 -27 102 -16 68 -97 31 1 92 94 72
6735 72 78 117 168 17 10 -113 55 29 43 -78 36 -84 130 86 -7 52 -53 -16 18 -3 -233 31 39 -36 123 -16
6761 -16 44 11 19 -60 -115 37 121 -39 44 47 -5 42 -18 6 97 95 133 32 5 -77 50 71 144 63 -40 23 202 -36
6789 -36 110 -6 33 65 25 -41 82 149 -14 -46 -145 -176 69 -36 17 57 25 -33 35 -60 -70 10 52 26 -50 99 -49
6816 -49 38 90 10 88 -50 -61 17 -53 14 -14 39 8 -1 18 -27 -1 79 53 18 -46 -48 45 52 -57 -9 53 82 -47 -47 78
6846 78 16 9 46 -83 106 -1 16 11 -8 -40 -90 6 -50 -138 -50 -50 -10 -75 -25 26 151 -46 3 -23 -13 95 -60 82
6874 82 44 57 85 -86 -100 60 -9 -40 61 7 -118 74 117 136 -64 12 -22 36 13 4 -32 6 -78 59 -28 26 26 -122
6902 -122 -64 13 41 -38 49 10 47 9 -8 -48 -48 105 -109 -77 39 -33 -58 -71 -9 50 -9 51 57 40 -33 -16 7 -71 107
6931 107 48 23 26 32 -26 -10 46 20 93 -111 -17 85 10 -39 -26 -1 13 94 -13 -90 -64 32 71 -34 -56 -1 58 53 -41
6960 -41 176 -53 52 50 -14 15 -82 31 27 13 -35 -58 -40 -84 -50 36 141 19 -46 164 18 16 8 -62 25 36 -25 -98
6988 -98 -81 -90 -65 -16 -48 73 -54 81 23 73 108 41 -30 53 18 63 -50 32 -14 34 34 122 52 13 24 -9 1 -68 10
7017 10 -13 20 50 -16 -105 -69 -76 -47 -41 -35 49 5 -8 -20 -66 208 56 17 94 -61 -77 -11 120 -22 -26 22 28 -8 86 -117
7047 -117 8 54 -199 1 110 5 -146 3 12 -3 104 -64 24 -7 -27 -57 -116 -73 78 129 77 119 27 13 -11
7072 -11 -13 25 -14 79 14 -69 132 31 8 8 74 28 -40 -26 72 51 40 158 30 -8 92 6 -17 68 57 141 -56 52
7100 52 112 8 -15 -24 -6 21 -8 73 35 -13 -48 -78 -48 40 -223 52 26 -67 -164 16 -10 -31 33 12 110 -9 -41 -8
7128 -8 -8 -131 -117 -18 -9 34 29 -36 19 2 97 41 -62 108 55 7 134 -63 -100 -108 190 106 141 69 -88 50 19 21 6
7157 6 -92 -5 71 -7 128 24 -31 -9 114 8 -19 -10 12 6 -193 23 42 -29 -85 16 81 -39 -55 52 52 194 90
7184 90 -48 1 -59 -11 100 100 58 82 54 88 62 -107 11 114 82 16 3 -38 70 -20 127 76 29 -35 -64 -39 -17
7211 -17 70 4 -34 20 -79 -76 -74 15 48 -45 -61 3 38 -118 -165 -129 -85 53 -104 57 -28 56 78 112 -50 -18 -21 -8 12
7240 12 44 62 -89 -12 125 -13 -89 51 -67 -70 119 -51 -19 8 42 -14 83 -6 133 22 45 -150 86 69 -57
7265 -57 46 -26 192 24 6 60 15 35 -155 -12 -59 106 -3 -48 40 -34 16 -81 -68 -25 -38 74 22 -10 7 6 -38
7292 -38 25 15 -30 127 45 38 -49 41 55 103 37 129 9 139 -127 13 -45 -22 46 77 151 174 -24 11 82 -33 -109
7319 -109 -98 34 121 -65 -116 -15 -38 -80 117 140 90 17 -64 49 -84 -51 -23 -74 -54 141 -55 84 47 29 62
7344 62 114 -36 -23 -47 177 -9 -15 -13 169 -5 37 23 31 52 133 49 -27 45 37 201 91 110 91 12 11 33 -49 36 28 -41
7374 -41 -58 39 -87 -72 -85 -36 -35 -25 -13 -42 119 -70 19 -24 -84 -30 -28 47 92 -52 17 26 127 65 18 -32 38 -120 131
7403 131 130 -19 29 -4 35 -18 95 52 -24 28 -24 -20 13 75 -2 12 61 -16 1 -200 104 -3 -115 -148 -128 -16 -5
7430 -5 -45 43 -12 65 37 -109 -62 -274 111 -34 18 -45 -47 -33 33 106 43 42 52 -11 57 97 56 54 -19 39 -66 59 111
7459 111 84 -11 -9 80 -2 95 40 -97 -22 -11 -2 84 72 -27 -1 9 28 -38 -134 134 -132 -126 -35 1 -48 56 48 -64 73
7488 73 122 142 -45 38 18 10 -75 66 2 -54 -60 -14 40 21 -34 -38 74 -85 -78 -44 80 120 -63 65 15 121 31 -65
7516 -65 -132 93 -22 47 -16 -2 -27 50 3 30 109 9 -60 -8 24 30 -65 -33 15 -44 -16 -28 9 53 111 89 70 42 -30
7545 -30 -137 -30 12 79 79 86 13 -47 -23 48 34 34 128 -91 -43 -112 30 -47 -32 59 -54 -18 20 57 -22 2 85 47 33
7574 33 -31 41 -2 -82 -11 39 -36 -86 -83 12 77 9 78 -93 45 -30 -22 -14 -11 -5 -53 -34 -23 -60 -69 151 -38 -74 -16 121 119
7605 119 113 8 10 -58 45 -4 -51 -102 -94 7 -57 50 119 76 25 35 67 7 -87 -47 -56 7 -19 133 -66 53 0 -38
7633 -38 -54 -32 -106 -61 -38 -37 74 -50 -55 -43 7 128 -11 -93 -38 28 -14 -132 75 91 42 56 127 -36 57 201 107
7660 107 -26 33 113 -22 98 45 -9 19 -3 14 67 -13 -10 -34 39 61 27 42 30 6 44 29 146 27 53 -29 -71 33
7688 33 65 -21 -84 -101 35 -2 44 -2 -128 16 -87 12 0 29 -45 -110 -28 -10 -141 56 -104 82 104 -61 98
7713 98 12 79 42 29 118 138 33 -33 63 95 -37 -30 248 130 1 3 124 -16 96 80 170 -7 16 -12 -6 104 -56
7740 -56 -146 -21 4 -21 -81 -54 0 -112 26 -16 27 -22 -83 -86 -10 -43 17 -1 -152 70 165 -37 142 -13 -61 -23 -79
7767 -79 85 -12 -18 21 44 -35 20 -44 42 126 32 -21 -19 36 16 -142 34 -15 125 79 71 5 62 -2 28 -63 87 -29 119
7796 119 6 -96 18 26 68 51 -61 -58 22 -15 -10 34 55 -107 132 72 115 50 -10 -71 -18 68 80 87 137 -33 -37 106
7824 106 -29 20 16 96 -71 28 115 -82 -139 117 73 10 24 -46 186 128 -65 -100 -20 -13 -24 -39 -18 84 -121 -177 -91
7851 -91 57 -128 -34 -48 119 -85 -9 -18 -63 180 69 53 22 -16 -54 40 61 90 -12 -46 -61 -4 80 54 75 0 97
7878 97 72 145 31 -9 15 -60 34 10 21 4 -1 -56 47 104 -71 57 -12 82 -51 -96 22 -93 -13 -2 -83 12 -21
7905 -21 -73 -62 69 -67 58 141 -14 -3 81 -59 13 27 8 41 -53 98 -52 24 -37 159 99 -104 115 36 129
7930 129 36 34 -17 -136 4 80 35 -14 -27 35 144 -24 2 49 0 -91 -36 -67 46 74 -108 -51 -35 68 -43 163
7956 163 -72 35 -20 48 -56 57 178 -26 -36 22 -17 59 2 -73 47 -19 -66 51 -40 -12 -69 11 146 -33 -11
7981 -11 -49 -75 7 7 122 36 -40 -82 27 -4 77 100 30 33 -53 64 -29 90 -91 14 -57 -92 -24 59 -121 33 -50
8008 -50 -9 85 -50 -84 -27 126 33 12 -128 -53 53 3 -111 26 -13 1 32 4 46 16 -9 163 -68 55 -39 62
8034 62 155 29 112 94 50 -53 -111 -17 -47 37 79 -21 -71 -48 -94 -76 -39 22 170 25 74 -74 -37 -84 34 -87
8060 -87 -6 -68 -66 -16 58 2 5 -25 105 -12 88 44 -53 7 125 -48 -49 127 20 -45 -140 5 -49 -8 2 -59 -1 26
8088 26 -21 -109 5 86 58 -32 -26 81 67 176 -24 104 35 55 -4 -83 -23 13 -54 -125 -67 2 23 -61 -44 49 62 -23
8116 -23 61 30 48 104 -93 -19 -11 74 107 84 82 121 78 100 29 -33 50 53 -3 -78 46 -62 0 48 -38 47 -14 -6 -115 -48
8146 -48 -93 -93 -64 -68 83 -8 -69 42 -49 57 -69 28 23 21 21 98 -21 -15 0 14 -123 29 -84 -7 -20 48 84 -30 46
8175 46 49 46 2 54 40 38 63 -45 77 -47 6 -63 65 5 108 -80
8191h0
$$ Imaginary data points
##PAGE= N=2
##DATA TABLE= (X++(I..I)), XYDATA
0 0 0 0 0 0 0 0 0 0 0 0 0 -32 32 -32 32 -49 64 -64 96 -96 128 -160 184 -224 249 -288 329 -384 448 -512 576
31 576 -671 739 -835 961 -1072 1203 -1351 1504 -1681 1874 -2069 2303 -2548 2808 -3117 3432
47 3432 -3776 4175 -4592 5052 -5577 6142 -6783 7506 -8308 9235 -10303 11545 -13027
60 -13027 14808 -17014 19826 -23542 28705 -36413 49114 -73889 140535 -708318 -2098247
71 -2098247 -964972 517861 1611264 1576321 535609 -1127411 -1828359 -963382 628702
80 628702 1516481 1374906 260235 -1223194 -1921447 -943401 768611 1664968 1245337 118564
90 118564 -1107266 -1617037 -781911 833575 1678492 1136782 -121548 -1216469 -1574026
99 -1574026 -755783 780160 1643937 1048085 -261988 -1209174 -1331487 -531043 848849
108 848849 1659707 1038174 -388799 -1313676 -1237921 -393390 777716 1463838 909409 -457441
118 -457441 -1347472 -1140913 -212272 862605 1445872 905248 -473063 -1391557 -1065541 -18707
128 -18707 895239 1223070 694288 -503994 -1367512 -1055233 47655 965671 1189446 630804
138 630804 -488793 -1316392 -986710 191348 1072797 1073147 401781 -555533 -1229720 -949036
148 -949036 167877 1076086 1043081 301389 -588260 -1131068 -836607 237571 1139254 1033925
158 1033925 167694 -687178 -1060617 -732079 223959 1071865 981490 81382 -761745 -995119
168 -995119 -584212 282371 1045284 970365 62267 -812484 -974586 -472991 333552 973747
178 973747 876917 -5774 -872642 -958809 -350269 414957 911788 795409 4949 -836029
188 -836029 -939704 -286906 492746 889352 691358 -66176 -855621 -932027 -223626 568061
198 568061 853236 567879 -107205 -780585 -862404 -192921 611044 865682 495637 -183441
208 -183441 -776235 -821249 -164088 639887 856521 398731 -274667 -739031 -713066 -113356
218 -113356 637095 851463 365424 -331281 -734156 -642027 -72703 621410 825172 318033
228 318033 -407724 -751594 -556374 10221 613384 777288 287532 -430148 -744428 -487220
238 -487220 76017 596002 716019 252366 -454150 -766142 -452792 152066 612597 652701
248 652701 195704 -459742 -740665 -398379 217784 617535 582795 139846 -454341 -721094
258 -721094 -385054 251697 639801 537899 68262 -469996 -681188 -334786 296230 653841
268 653841 488341 -1008 -473748 -627073 -298245 299160 648987 460926 -56902 -500490
278 -500490 -590375 -244602 324673 648472 431508 -110883 -521565 -538574 -178522 333640
288 333640 613912 396596 -141947 -538894 -512874 -127665 353456 593171 366331 -171148
298 -171148 -555248 -482537 -61073 384289 556096 312088 -194701 -550704 -456937 -21463
308 -21463 401688 527331 269307 -212592 -545930 -435484 21248 435765 507862 212358
318 212358 -244338 -529435 -398111 53515 445648 479441 163952 -265783 -509776 -366891
328 -366891 77157 460184 469650 122889 -299826 -497201 -322067 110897 462275 440999
338 440999 78577 -324913 -476998 -279215 133679 455528 420836 52867 -345452 -468793
348 -468793 -240199 168140 455505 390659 15316 -365575 -452695 -197378 196979 443100
358 443100 355129 -10322 -369700 -437269 -167320 223536 442337 326248 -42853 -381989
368 -381989 -420797 -131415 251021 433673 286862 -75814 -381307 -393996 -101976 265763
378 265763 425932 260529 -101822 -386486 -374076 -71927 285337 418587 227401 -135096
388 -135096 -389641 -344145 -37001 295403 400615 198912 -154000 -387154 -321749 -10127
398 -10127 307257 388772 171568 -178679 -390216 -297202 23921 320032 367419 137050 -196160
409 -196160 -380306 -271055 47967 326007 350681 110222 -212073 -375652 -250338 72628
419 72628 337156 334135 76170 -231881 -362814 -219546 94853 337725 314578 49777 -244293
430 -244293 -350301 -195067 111530 339403 300711 23886 -264029 -341541 -162974 135430
440 135430 335564 277755 -684 -274066 -326983 -134096 151965 327192 257801 -17862
450 -17862 -283763 -320868 -108721 175540 323824 231948 -41098 -289363 -306589 -81206 194919
461 194919 314221 203391 -58907 -286768 -294089 -64082 211340 312394 178959 -82787
471 -82787 -288268 -277163 -41630 227337 306893 149955 -106859 -282573 -253473 -24963 232126
482 232126 301280 131084 -127885 -283173 -232972 -4723 239537 295218 110064 -151950
492 -151950 -283174 -205087 19703 239039 279982 93445 -165456 -282526 -184457 41381
502 41381 240462 266592 78221 -179550 -285670 -163916 69276 243941 244214 56914 -186189
513 -186189 -280053 -146320 89627 245299 223910 38921 -189299 -275832 -134600 110000
523 110000 253971 205027 12411 -195399 -262974 -117528 124734 256175 185534 -11116
533 -11116 -197059 -246932 -104521 132170 260196 175181 -34576 -207136 -231715 -83848 141647
544 141647 258471 160651 -56876 -214155 -212443 -61523 144734 249936 151202 -70210 -223286
555 -223286 -201061 -38865 153727 241708 137718 -84337 -231061 -188268 -13107 162764
565 162764 226085 119972 -91323 -231351 -179350 5575 172687 214872 102241 -99575
575 -99575 -231801 -171721 24431 186493 203063 77646 -109148 -223748 -159339 37054 193840
586 193840 193452 57296 -117412 -215422 -148593 46250 202391 188802 35492 -132435 -206558
597 -206558 -129827 56804 203850 180456 17436 -143946 -196226 -111202 63665 201300 175487
608 175487 5576 -157731 -192450 -90982 76995 197563 164492 -7410 -167425 -186456
618 -186456 -69970 89427 189075 150772 -14208 -171583 -184536 -55461 103810 185861 135286
629 135286 -25289 -174843 -180095 -39857 119147 181039 115234 -36613 -171038 -171898 -30623
640 -30623 128600 179870 100101 -49607 -169980 -163181 -20335 138454 179164 83394 -65401
651 -65401 -167006 -148704 -10308 141784 176190 71032 -78560 -165608 -135082 -195 143579
662 143579 173073 61003 -91547 -166616 -120607 13332 144806 166151 50487 -102156 -166350
673 -166350 -105576 26914 143014 155999 42829 -107635 -167539 -95831 41153 145888 146012
684 146012 31315 -114481 -166256 -83316 55920 146135 131411 19792 -114294 -161904 -77079
695 -77079 65611 150496 122153 5938 -119086 -156407 -66770 76174 152245 109971 -8491
706 -8491 -120256 -146752 -58111 80721 153526 103006 -21453 -125298 -138083 -46136 86211
717 86211 151784 94515 -32753 -129373 -129204 -34012 90977 148501 86402 -43015 -133354 -120287
729 -120287 -20603 94959 141920 77996 -49155 -135472 -114526 -9503 101261 137625 67629
740 67629 -58113 -136860 -105893 3560 105395 129062 56965 -61623 -135015 -100829 11584
751 11584 111310 125506 45893 -69881 -133773 -91819 22183 114738 117591 34086 -74314 -129013
763 -129013 -84550 27923 117772 113989 23899 -81692 -126031 -74661 35792 118597 107393
774 107393 14170 -86716 -121510 -65301 42233 118876 101867 5214 -92606 -117640 -54499
785 -54499 49011 116637 94651 -1499 -95830 -114917 -46387 56473 116535 87127 -10286 -99333
797 -99333 -109792 -36369 62547 113333 78578 -16355 -99851 -106016 -29974 68350 113344 71161
809 71161 -25115 -101981 -99724 -20567 73242 109743 62375 -31675 -101418 -93916 -13837 76704
821 76704 107892 55474 -38948 -102869 -87166 -5149 80407 103997 47462 -44873 -102380 -80791
833 -80791 2379 82990 99974 39939 -50627 -101616 -74017 9745 85240 95317 32642 -55272
845 -55272 -100740 -68056 17193 88008 90466 23992 -60242 -98198 -60584 23492 88827 85323
857 85323 17195 -63487 -95868 -54678 29324 90612 80744 9033 -67993 -92762 -46642 35085
869 35085 90085 74785 2079 -70841 -89045 -39902 39687 89695 70125 -4308 -74372 -85997
881 -85997 -32297 44913 88404 63875 -10544 -76468 -82081 -24919 49396 86222 57794 -15529
893 -15529 -77833 -78621 -18524 53898 84666 51537 -21023 -78569 -74843 -12199 58298 82477 44300
906 44300 -26455 -77915 -69785 -6686 60992 80394 38314 -31334 -77794 -65139 -1512 64056
918 64056 78501 31890 -37073 -77061 -59008 4434 65365 75103 26238 -41389 -76201 -53545
930 -53545 9339 66315 72210 21248 -45761 -75943 -47932 15430 67256 68253 15573 -48993 -74480
943 -74480 -42287 20461 67360 63568 10822 -51251 -73251 -37514 25669 68252 59207 5117
955 5117 -53895 -71113 -32216 30501 68351 54073 -298 -54947 -68155 -27786 33882 68331
967 68331 50054 -5574 -56838 -65286 -22922 37624 68200 45370 -11242 -58218 -61302 -17459
979 -17459 40406 66863 41069 -15554 -59448 -57898 -12592 42727 65710 37153 -20069 -60845
991 -60845 -54471 -6933 45502 63333 32219 -23813 -60857 -50632 -2296 47275 60991 27854
1003 27854 -27020 -60969 -47529 2340 49818 58787 22994 -30529 -60628 -43368 6916 51389
1015 51389 55939 18042 -33403 -59275 -39600 10385 52435 53827 13726 -36435 -58529 -35519
1027 -35519 14612 53457 50871 8973 -39285 -56841 -30826 18177 53374 47817 5364 -41202
1039 -41202 -55777 -26978 21745 53641 44550 1350 -43362 -54266 -22786 25553 53297 40585
1051 40585 -2676 -44376 -52012 -19216 28214 52997 37169 -6409 -45158 -50133 -15565 31339
1063 31339 53138 33247 -10793 -46035 -46768 -11699 33210 52248 29851 -14528 -46450 -43796
1075 -43796 -8355 34747 51481 27018 -18257 -47665 -40626 -4005 36269 49842 23760 -21265
1087 -21265 -48200 -37095 273 36935 47326 20981 -23149 -48828 -35010 4562 38924 44923
1099 44923 17437 -25266 -48762 -32396 8650 40355 41552 13239 -26307 -47531 -30427 11481
1111 11481 42060 39454 9122 -28026 -46185 -28074 14126 43774 37399 4353 -30061 -43585
1123 -43585 -24780 15657 44192 35732 389 -32232 -41263 -21333 16998 44294 34822 -2945
1135 -2945 -35101 -39644 -16726 18896 43004 32720 -5397 -37086 -37698 -12317 20538 40887 30718
1148 30718 -6556 -38598 -37562 -8410 23725 39443 27437 -8444 -39397 -36441 -4529 26730
1160 26730 37129 23170 -9440 -38556 -36118 -2630 29778 36826 19025 -11815 -37574 -34606
1172 -34606 -701 32509 36494 14333 -14742 -35533 -31805 -74 33377 36895 11250 -18316
1184 -18316 -34340 -28298 1153 33686 37199 8898 -22277 -33853 -23878 3417 32649 36387 7528
1197 7528 -25315 -34143 -19594 6102 30657 34486 7324 -27108 -35768 -16559 10356 30397 31288
1210 31288 5545 -28046 -36250 -13719 14495 29614 27116 4557 -26804 -36763 -13529 17978
1222 17978 31246 23654 1143 -26565 -35354 -12050 20807 32172 19989 -2406 -24949 -33062
1234 -33062 -12281 21608 34295 18143 -6871 -25382 -29584 -10562 21734 35088 16830 -11020
1246 -11020 -26296 -25853 -8179 20972 35070 16477 -14284 -28332 -22196 -4488 19724 33282
1258 33282 16871 -15684 -30913 -20705 -157 20478 30631 15512 -16626 -32558 -18874 4542
1270 4542 20749 26531 14332 -14867 -33541 -20380 7795 24108 24030 10319 -15252 -32266 -19590
1283 -19590 10198 26188 21259 6469 -14147 -29780 -20300 10322 29332 21388 1695 -16291
1295 -16291 -26837 -18085 10181 30084 21195 -1874 -18326 -24111 -15594 9494 30205 22165 -4532
1308 -4532 -21622 -21997 -11674 9272 28227 22570 -4985 -24413 -21786 -7446 10858 26232 21446
1321 21446 -5668 -26561 -21504 -3257 12701 23054 19738 -4099 -27233 -23436 -876 16599
1333 16599 22068 16017 -4931 -26249 -23475 974 19216 20312 12117 -4777 -24012 -24183 340
1346 340 22263 21716 8009 -7914 -22042 -22046 181 23205 22619 5296 -10631 -19980 -19498 -543
1360 -543 23082 24312 3620 -14525 -19578 -15383 432 21428 24746 3671 -17398 -20664 -12070
1373 -12070 2532 19843 23485 3873 -19138 -21564 -8702 5502 17926 21327 4851 -19272
1385 -19272 -23784 -7695 9358 17956 18092 3628 -18486 -24018 -6755 12172 17971 14818 2677
1398 2677 -16772 -24131 -7570 14407 20106 12093 -765 -15924 -22297 -7582 15233 21308 10251
1411 10251 -3855 -15074 -19847 -7811 14860 23006 9901 -7214 -15748 -16888 -6409 13789 23298
1424 23298 10187 -9832 -17434 -14173 -3875 12801 22262 10555 -10992 -19188 -12380 -861 12266
1437 12266 20281 10976 -10888 -21194 -12047 2555 13097 17649 9629 -10350 -21489 -11906 5265
1450 5265 14397 15228 7780 -9431 -21348 -12791 6741 16658 13998 4632 -9463 -19832 -12713 7166
1464 7166 18244 13120 1795 -9724 -17858 -12165 6632 19270 13481 -686 -11344 -16114 -10611
1477 -10611 6299 19445 13866 -2475 -13388 -14406 -8095 6220 18425 14061 -3148 -14987 -13783
1490 -13783 -5502 6680 17159 14044 -3290 -16670 -14015 -2894 8234 15578 12436 -3186 -16954
1503 -16954 -14348 -1152 9802 14202 10896 -2898 -16597 -14996 -241 11874 13970 8431 -3720
1516 -3720 -15651 -14662 233 13360 13882 6047 -4840 -14385 -13821 -38 14014 14540 4426 -6542
1530 -6542 -13679 -12402 273 14285 14895 3077 -8492 -13058 -10289 902 13419 14893 2879
1543 2879 -9865 -13402 -8594 1927 13052 14477 2596 -11178 -13958 -6850 3660 12384 13216 2198
1557 2198 -11262 -14232 -5780 5106 12111 11666 1727 -11233 -14575 -5527 6668 12579 10285 519
1571 519 -11051 -14197 -4689 7784 12694 8856 -505 -10639 -13350 -4785 8310 13289 7986 -2193
1585 -2193 -11004 -12379 -3895 8878 13514 7120 -3605 -10975 -11128 -2923 8625 13404 6818 -4512
1599 -4512 -11568 -10332 -1819 8876 13064 6419 -5468 -12010 -9344 -383 9060 12190 5552 -5829
1613 -5829 -12172 -8781 607 9248 11545 4780 -6136 -12289 -8473 1865 10030 10813 3473 -6681
1627 -6681 -11982 -7725 2553 10237 10208 2623 -6974 -11702 -7108 3088 10777 9953 1649 -7823 -11375
1642 -11375 -6201 3938 10811 9211 603 -8200 -10713 -5223 4345 10749 8888 104 -8553 -10653
1656 -10653 -4356 5281 10723 8156 -724 -9024 -10237 -3470 5811 10344 7259 -1368 -8990 -9889 -2991
1671 -2991 6333 10417 6604 -2203 -9171 -9490 -2194 6984 10367 5652 -3146 -9179 -8572 -1647 7059
1686 7059 10414 5068 -3811 -9372 -7924 -981 7297 10185 4574 -4732 -9505 -7052 200 7230 9614
1701 9614 4077 -5110 -9754 -6610 963 7409 9228 3794 -5296 -10151 -6205 2040 7932 8388 2927
1716 2927 -5416 -9902 -5814 2874 8154 7331 2149 -5463 -9619 -5833 3305 8940 7120 852 -5806
1731 -5806 -9098 -5339 3841 9280 6830 -189 -6058 -8088 -4731 3482 9408 6757 -1124 -6785 -7758
1746 -7758 -3858 3658 9392 6843 -1891 -7745 -7092 -2532 3900 8560 6528 -1903 -8084 -6958 -1471
1761 -1471 4351 8064 6250 -1947 -8754 -7126 -288 5188 7347 5080 -2074 -8421 -7102 218 5938
1776 5938 6866 4176 -1972 -8061 -7478 328 6933 7068 2905 -2658 -7464 -7031 507 7418 6971 1624
1792 1624 -3283 -6614 -6420 144 7545 7429 1272 -4412 -6687 -5383 405 7378 7735 747 -5370 -6334
1808 -6334 -3985 951 6822 7663 902 -6254 -6881 -3129 1576 6240 7173 1096 -6584 -7501 -2215 2759
1824 2759 5861 6099 1021 -6247 -7571 -2000 3616 5636 5081 807 -5921 -7998 -2170 4593 6240
1839 6240 3978 -132 -5364 -7394 -2131 5132 6609 3343 -872 -4916 -6810 -2503 5195 7329 3047
1854 3047 -2042 -5035 -5645 -2104 4898 7632 2898 -3188 -5333 -4689 -1590 4288 7437 3162 -3770
1869 -3770 -5939 -4054 -599 4023 7145 3354 -4095 -6884 -3405 776 4004 5883 3200 -3800 -6973
1884 -6973 -3534 1477 4184 5195 2933 -3347 -7404 -3912 2622 5253 4165 1675 -3051 -6860 -3986
1899 -3986 2804 5589 3896 905 -2846 -6176 -4174 2761 6549 4038 -535 -3567 -5167 -3595 2295
1914 2295 6529 4203 -991 -3949 -4438 -3194 1912 6517 4608 -1479 -4831 -4178 -1936 2066 5920
1929 5920 4809 -1497 -5550 -4249 -990 2417 5110 4230 -1493 -5780 -4247 -155 2792 4685 4030
1944 4030 -1232 -6029 -4684 670 3893 4150 2780 -1050 -5348 -4800 479 4220 4129 2230 -1179 -5099
1960 -5099 -4999 524 5035 4508 1046 -1932 -4331 -4239 236 5007 4764 717 -2374 -4141 -3780 131
1976 131 4855 5152 244 -3435 -3796 -2818 279 4422 5060 571 -3829 -4275 -2050 749 3956 4658 681
1993 681 -4236 -4517 -1462 1517 3726 4242 796 -4149 -4904 -1098 2405 3685 3343 704 -3887 -4919
2009 -4919 -1254 2722 3970 2941 181 -3653 -4940 -1254 3347 4257 2179 -587 -3189 -4342 -1340
2024 -1340 3239 4582 1889 -1121 -3465 -4029 -1204 3403 4688 1689 -1924 -3312 -3123 -984 2894
2039 2894 4621 1962 -2300 -3821 -2757 -407 2909 4385 1811 -2509 -3956 -2421 114 2723 3976
2054 3976 1900 -2416 -4312 -2281 890 2872 3568 1652 -2339 -4447 -2256 1378 3140 2990 1275
2069 1275 -2208 -4369 -2434 1661 3547 2645 643 -2186 -3922 -2341 1481 3849 2771 73 -2483
2084 -2483 -3474 -2137 1630 4085 2744 -399 -2653 -3223 -1876 1492 3886 2866 -625 -3172 -3086 -1310
2100 -1310 1676 3761 2648 -927 -3071 -2974 -845 1774 3567 2641 -846 -3558 -2973 -465 2025 3419
2116 3419 2278 -993 -3500 -2891 -96 2221 3071 1923 -988 -3335 -2916 95 2540 3195 1514 -1173
2132 -1173 -3254 -2856 219 2800 2941 1003 -1397 -3102 -2444 69 2897 2871 866 -1623 -2998 -2318
2148 -2318 313 3080 3062 481 -2048 -2867 -1857 713 2787 2765 449 -2006 -2930 -1707 642 2724
2164 2724 2805 444 -2342 -3046 -1403 1105 2821 2449 70 -2386 -2746 -1163 1295 2585 2237 199
2180 199 -2417 -2902 -1174 1662 2834 2012 -313 -2536 -2700 -911 1675 2540 1744 -347 -2164 -2466 -854
2197 -854 1554 2769 1721 -619 -2496 -2553 -519 1858 2709 1386 -830 -2383 -2078 -269 1857 2633
2213 2633 1319 -843 -2525 -2094 -234 2019 2779 1201 -1276 -2569 -1839 306 2089 2353 957 -1320
2229 -1320 -2297 -1935 252 1967 2423 1074 -1381 -2717 -1606 584 2252 2229 519 -1738 -2355 -1296
2245 -1296 666 2072 2097 453 -1484 -2357 -1405 702 2266 2142 197 -1846 -2518 -1063 1089 2186
2261 2186 1676 22 -1687 -2204 -1041 869 2163 1879 32 -1921 -2314 -718 1220 2388 1616 -367
2277 -367 -1945 -2004 -508 1208 2131 1488 -425 -1869 -1900 -725 1337 2346 1501 -590 -2149 -1844 -356
2294 -356 1441 1956 991 -740 -1859 -1657 -355 1296 1942 1113 -807 -2011 -1761 30 1690 2054 742
2311 742 -1106 -2000 -1460 258 1467 1580 682 -709 -1896 -1550 218 1693 1959 606 -1237 -2156 -1346
2328 -1346 571 1755 1626 237 -1180 -1815 -1129 441 1515 1739 414 -1272 -1913 -1138 627 1935
2344 1935 1594 61 -1554 -1766 -771 712 1713 1235 -124 -1331 -1546 -826 618 1808 1429 -73 -1701
2361 -1701 -1717 -608 1089 1745 1177 -401 -1531 -1509 -407 922 1496 1158 -79 -1577 -1714 -444 1309
2378 1309 1753 886 -521 -1567 -1342 -103 1269 1578 752 -582 -1280 -1348 -207 1056 1797 877 -694
2395 -694 -1846 -1329 -50 1350 1562 530 -1015 -1540 -974 125 1083 1395 482 -852 -1572 -1273 76
2412 76 1422 1576 506 -1138 -1797 -851 479 1333 1308 164 -828 -1327 -879 359 1372 1277 250 -1112
2430 -1112 -1675 -1024 601 1483 1122 85 -1025 -1391 -558 491 1295 1017 24 -966 -1343 -836 708 1626
2448 1626 1177 -272 -1225 -1246 -508 852 1385 924 -330 -1097 -1036 -482 523 1519 1187 -326 -1430 -1297
2466 -1297 -124 907 1470 873 -357 -1410 -1073 91 796 1212 719 -265 -1221 -1185 -108 1103 1312 707
2484 707 -486 -1395 -1135 78 1288 1054 316 -529 -1096 -988 102 1182 1244 391 -591 -1259 -1079 221
2502 221 1233 1240 189 -678 -1162 -654 147 1131 1242 273 -819 -996 -693 120 1037 1187 116 -1062 -1156
2521 -1156 -426 510 1125 1074 33 -1082 -1083 -523 500 761 902 181 -1119 -1139 -403 694 1125 883 160
2540 160 -992 -1243 -228 684 930 535 -22 -651 -1246 -429 736 1202 579 -136 -832 -1102 -395 832 1278
2559 1278 326 -454 -731 -787 -344 511 1228 608 -639 -767 -824 -259 819 1317 537 -739 -1027 -479 87
2578 87 597 1101 557 -649 -992 -601 146 534 1050 501 -609 -1248 -497 336 697 747 391 -450 -1125 -538
2598 -538 323 797 692 350 -431 -1140 -731 373 1002 623 74 -481 -1008 -607 546 1136 572 -130 -355
2617 -355 -857 -668 321 1135 693 -304 -720 -754 -438 319 1012 733 -437 -723 -598 -257 304 943 833 -218
2637 -218 -904 -734 -80 431 828 887 -209 -1061 -768 95 530 691 557 -212 -917 -800 72 749 598 547
2657 547 -161 -893 -784 131 767 643 247 -191 -732 -726 32 811 839 -18 -370 -681 -841 -4 839 675 -100
2678 -100 -528 -585 -498 -42 800 793 40 -605 -681 -372 -52 703 901 129 -696 -717 -353 150 556 827 172 -848
2700 -848 -675 -159 268 540 718 212 -650 -982 -309 370 552 490 202 -568 -943 -128 567 522 224 20 -320
2721 -320 -888 -175 604 689 310 -8 -572 -829 -378 512 847 293 -236 -475 -603 -217 542 870 401 -252
2741 -252 -460 -467 -277 335 901 290 -531 -651 -365 -80 464 664 403 -346 -763 -248 39 422 699 365 -351
2762 -351 -740 -381 258 361 440 378 -263 -640 -362 112 398 513 241 -185 -910 -570 205 645 494 45 -278
2783 -278 -635 -365 185 667 448 10 -377 -513 -486 200 710 537 -147 -468 -436 -326 123 720 507 4 -454
2804 -454 -409 -337 234 632 448 33 -704 -495 -99 325 492 553 13 -622 -421 44 166 380 325 -14 -370
2825 -370 -626 -66 481 472 388 -71 -517 -554 23 379 488 93 -123 -465 -510 71 356 409 272 -167 -530 -435
2847 -435 19 578 556 194 -236 -437 -333 -16 493 618 105 -390 -481 -365 12 429 596 286 -285 -427 -293
2868 -293 62 485 450 72 -324 -398 -251 122 294 553 173 -292 -515 -217 154 396 374 149 -350 -434 -124
2889 -124 144 499 362 -32 -222 -325 -350 234 408 300 109 -393 -506 -195 380 472 345 -39 -292 -345 -223
2910 -223 210 517 283 -35 -393 -364 -166 202 364 302 -127 -518 -395 -36 291 404 93 -244 -351 -358 61
2931 61 325 317 334 -143 -340 -514 -60 310 363 237 -170 -429 -359 29 326 307 127 -172 -400 -198 7 414
2953 414 371 205 -276 -344 -206 -11 453 359 69 -152 -368 -311 63 182 389 207 -172 -390 -265 87 282
2974 282 314 17 -414 -466 -155 182 241 280 79 -218 -453 -186 233 252 163 84 -184 -450 -227 158 452 197
2996 197 -148 -183 -214 -135 217 357 170 -97 -185 -246 -122 63 538 234 -245 -293 -229 8 224 404 194 -142
3018 -142 -328 68 -63 169 318 272 -40 -476 -278 74 35 284 222 -183 -477 -123 130 294 150 136 16
3039 16 -433 -313 19 255 235 70 -20 -309 -335 90 404 206 41 -51 -349 -259 -27 390 147 18 -193 -133
3061 -133 -127 -26 428 262 -162 -144 -151 -98 -79 222 260 13 -262 -190 -203 -107 266 470 4 -386 -293 15 93 278
3085 278 259 -36 -321 -335 29 122 163 151 122 -175 -349 -88 215 94 150 76 -156 -364 -95 415 224 -42 35
3108 35 -170 -302 -147 212 321 68 -124 -15 -192 -153 241 349 24 -100 -152 -148 -169 178 424 -1 -245 -82
3130 -82 -257 -77 207 283 188 -147 -336 -53 -52 102 330 153 -111 -229 -166 84 99 31 158 -172 -472 -82 43
3153 43 154 40 118 -104 -401 -166 271 240 81 -3 -35 -167 -205 55 292 79 -16 82 -60 -166 128 381 118
3176 118 -82 -189 19 -237 -42 366 87 -118 -211 -114 -181 20 330 186 -210 -404 -141 58 -28 189 289
3197 289 -127 -373 -42 120 39 206 130 -19 -279 -208 34 207 81 191 25 -415 -188 117 258 86 102
3218 102 6 -216 -337 -27 163 164 88 41 -312 -326 63 325 160 -96 -1 -39 -186 -3 219 152 -71 -88 -2 -117
3242 -117 -208 243 199 -109 -209 -89 -56 -22 106 299 85 -204 -268 -101 -24 41 222 135 -142 -208 -32 146 124
3265 124 263 182 -99 -297 -1 181 171 143 44 -48 -309 10 216 264 22 1 -136 -375 -196 252 243 118 -48
3288 -48 25 -319 -122 170 199 -73 24 -184 -76 40 167 325 146 -179 -155 -128 -18 63 168 101 -155 -276 -106
3311 -106 -3 68 223 66 -168 -232 -1 -38 96 217 55 -121 -106 -27 112 14 59 114 182 -352 -104 -27 162
3334 162 130 -61 -20 -251 12 234 190 91 6 117 -127 -83 -59 192 207 -22 -106 -72 -37 -16 109 174 -192 -20
3358 -20 -86 -9 -42 135 263 42 -56 -121 -218 120 177 235 50 -97 -234 -34 -13 95 170 -45 -121 -143 -64 -7 48
3383 48 71 51 -108 -91 1 130 64 49 -76 -170 -196 1 128 88 2 41 -52 -235 -58 111 102 9 -42 -174 -111 -50
3409 -50 120 168 108 -102 -115 -44 -86 28 183 -42 3 -75 -7 -88 42 200 48 -136 -148 -80 -4 90 86 -12 -88 -81 -103
3436 -103 -30 35 186 108 -25 -52 -75 111 27 67 34 -34 -153 -53 37 66 53 29 -29 -264 -176 4 160 129 -83
3461 -83 -82 -261 -89 16 156 106 -19 -158 -250 -82 -57 136 29 10 -114 -99 -196 -1 186 30 -102 -40 -32 35
3485 35 13 146 -30 24 -140 -105 -4 12 140 55 -26 -89 -28 -14 -11 80 -35 7 -20 -24 33 127 175 50 -6 -145 -177
3512 -177 106 41 133 70 -120 -49 -231 4 133 44 123 -35 -169 -57 58 169 171 0 110 -108 -91 140 58
3535 58 32 123 -175 -1 32 34 106 25 51 -104 -113 -104 37 114 107 0 -7 -179 -127 -20 -36 90 44 -86 -162 35 23 -3
3563 -3 101 6 -65 -93 -238 17 69 107 -65 -92 -50 -44 133 13 47 28 93 -142 75 -64 65 25 78 -27 -11 -108
3589 -108 -9 39 102 -107 -142 -93 30 33 -3 38 123 -105 -211 91 19 58 117 -169 41 -162 -70 143 8 0 55 -148
3615 -148 45 -120 69 5 112 131 -108 -34 -83 103 41 6 -72 -9 -114 31 87 82 59 -30 -25 -67 42 54 59 5 -166
3642 -166 -149 -62 36 168 -14 -35 -109 -49 -30 35 70 95 -67 -87 -6 7 -35 151 15 11 14 -231 8 -10 11 -68 -32
3669 -32 -16 -99 4 -5 133 102 47 60 -182 -102 -5 183 142 -62 -37 2 94 73 27 136 49 14 -113 61 -36 63 96
3696 96 -72 -113 -5 77 -31 19 179 -18 -110 -102 -12 -8 70 -1 -98 -201 -79 14 137 91 154 -144 -148 -72 -24 167 117
3723 117 -3 -196 -21 -98 -38 94 100 -107 -33 -52 -132 -50 18 5 -122 -78 -18 -48 -39 43 58 -6 -111 -69 47 56 177
3750 177 28 31 -79 -83 -90 -43 48 98 -101 -86 -37 -73 41 41 -89 -21 -220 -69 50 146 60 11 14 -141 -81 -55 162
3777 162 25 72 -148 -11 -36 53 10 112 70 6 66 -87 -124 104 134 32 13 3 -69 32 28 -9 147 -73 -65 -113
3803 -113 8 -4 138 28 -18 -133 -34 -38 -31 78 9 -81 1 -134 -68 84 90 89 -68 -140 -25 20 -54 125 21 -2
3829 -2 -99 -55 43 -48 57 -1 -41 -33 -99 -31 32 129 -43 -52 -82 73 36 139 -46 -137 -81 -83 -31 -148 60 168 -23 -73
3857 -73 -112 75 -54 102 -24 85 -158 -29 3 -98 32 49 11 -43 9 -15 61 4 -35 139 -134 -119 -19 178
3881 178 138 96 27 -7 21 -135 82 -45 63 59 -95 -3 -38 47 113 -47 -34 -59 -107 -27 78 107 111 -96 -81 -96 42
3908 42 -98 -67 62 -109 -10 -56 2 36 74 -94 -73 58 -7 78 -15 -46 51 -90 42 -45 -51 89 31 -66 -70 -106 -59
3935 -59 8 -6 16 -9 65 -19 -90 -47 82 131 -51 -32 -46 -58 8 185 82 -82 -96 33 -43 56 -14 37 -96 -17 30
3962 30 78 10 106 176 52 -142 -66 -8 -125 -98 -63 3 -26 -126 37 -68 56 42 -146 -61 -117 53 97 59 -2 193
3988 193 -127 -99 96 121 -28 30 35 -35 -85 60 -130 20 84 -81 -67 -9 -62 125 29 -133 -51 -1 -47 46 67 71
4014 71 -29 -54 10 17 -27 53 58 -71 47 -183 -60 -91 -3 58 27 -86 -9 -39 19 -33 88 -52 -133 -141 5 38 -42
4041 -42 22 23 -200 58 -54 108 25 -59 -87 -5 -10 -89 31 20 90 -66 -142 -2 -163 83 157 -139 6 -14 69 -25
4067 -25 46 -32 53 -93 70 -6 26 66 104 -79 -90 -156 93 -3 122 17 14 -39 -13 -113 -114 107 37 63 34 -23 -68
4094 -68 125 -60 72 29 58 -89 -134 64 25 20 18 -107 -134 -81 -27 87 35 -83 -45 -126 -8 -11 -68 10 23 -29 -60
4121 -60 -164 -70 24 29 17 -127 31 64 -81 -55 1 -56 -33 -42 -9 18 -7 -14 -77 79 -39 37 -108 -69 56 150 10
4148 10 -70 104 48 18 48 3 -62 -39 -66 27 36 -40 8 -46 -99 -47 8 4 -52 -109 -2 -23 -136 19 -139 36 100 68
4176 68 46 1 -57 57 -81 80 -67 13 -21 89 96 72 29 -25 -142 -2 18 -177 -93 61 -121 -72 33 139 -30
4201 -30 -32 -38 62 -73 2 63 -104 -10 1 6 64 51 108 69 83 -46 1 -22 -36 -40 -46 -78 -80 -67 26 -113 35 55 -111 13
4231 13 -58 51 73 110 43 -62 -78 -11 -10 -14 116 -83 -171 -29 -23 -65 132 129 25 27 -23 -103 -47 44 74 -28 -73 -101 21
4260 21 -36 9 72 -36 -43 90 45 -42 -142 77 0 -13 -56 -57 -34 23 -8 -133 -134 56 46 13 46 129 -19 -23 -46 12 -75
4289 -75 129 137 84 -77 -106 29 -28 14 77 58 -19 -18 -53 27 103 58 31 -85 -59 12 77 22 44 49 -22 -8 -64 11 26 -115
4319 -115 11 13 16 -119 71 71 -23 29 -4 -105 -71 29 -25 -10 -58 -21 -30 66 -38 94 16 -47 -28 -54 -25 62 3 15
4347 15 -116 -198 -42 77 24 76 -23 73 -2 13 43 -183 109 164 16 -141 3 81 127 -67 -89 -21 82 -155 42
4372 42 50 -13 -22 43 -56 -149 5 2 55 -74 -89 -30 -1 -41 -1 132 103 -3 -132 7 -61 -45 -15 -13 -63 5 -13 -56 41
4401 41 32 86 -78 64 -17 -128 -76 34 48 -39 -95 72 63 -38 -196 63 -36 -129 -73 61 98 71 29 -54 -83 95
4427 95 57 -66 11 -77 -35 -164 -47 31 48 -94 -88 -9 -26 27 62 50 -59 -3 -56 61 -78 -50 -25 7 -130 -7
4453 -7 48 -38 20 150 53 -79 -98 -62 65 62 27 -47 -73 -152 17 -10 25 65 -34 -13 -72 72 -32 -35 -8 93 -42 -36
4481 -36 -26 -109 -25 -64 -79 -20 -93 -28 24 -29 -24 -24 25 -115 -86 -17 49 -48 -93 -44 86 -34 -58 79 43 -61 109 98
4509 98 -39 -111 113 61 -47 -12 8 62 41 100 36 41 -18 -14 -48 -20 11 95 -36 64 13 7 34 -64 140 19 -132 -124
4537 -124 179 90 -15 -80 -11 -33 -60 -101 206 -16 -166 51 -101 -91 -71 -34 -135 -27 -21 124 -56 -43 -27 -34 7
4562 7 66 45 -7 10 13 126 -63 -111 83 -48 -19 -23 106 -20 39 -20 50 -119 90 15 -80 -138 -82 -34 14 78 -28
4589 -28 -54 -105 -2 -134 -115 17 131 86 -111 -165 82 40 -72 -38 -83 -36 -45 105 -38 -136 -90 -38 33 -20 -95 97
4615 97 203 -51 -53 -78 -28 13 79 -19 -88 -108 60 14 -32 -87 39 84 -30 -81 -93 4 29 -52 -70 -137 115 99 10 -219
4643 -219 43 96 57 148 -71 59 21 100 -59 -120 -59 -36 8 57 7 -28 26 -1 -57 58 130 31 -14 -89 7 -15 -34
4670 -34 55 54 -188 55 -10 148 87 -37 -27 -73 174 27 -88 69 104 76 -93 -16 154 85 -9 -9 21 -69 76 64
4696 64 -57 15 102 35 46 160 -43 -25 -140 -8 31 -92 -30 -25 25 -21 20 34 -39 -6 -48 -63 156 38 -83 -39
4722 -39 -106 -38 30 95 48 -35 96 -18 -30 -21 -12 1 -19 42 26 -25 -59 -1 69 -39 89 85 -45 60 -36 44 -30 -59 -29
4751 -29 -62 -44 -43 22 -17 -30 -62 141 -10 45 -18 -127 9 -75 49 125 -12 122 91 102 -104 -23 -38 82 -14 -59
4777 -59 -30 75 155 59 24 81 7 -5 -17 36 -11 24 16 -3 48 -87 -57 -15 -8 21 -93 -124 -28 -68 33 48 -4 26 62
4806 62 -63 -63 17 -1 23 33 -49 -14 -29 -56 40 -13 20 21 -48 -100 29 5 105 19 -2 49 -16 117 -44 -98 1 43 8
4835 8 -77 -7 1 65 12 81 -152 63 55 -39 98 -36 -107 26 -117 100 95 -92 -122 -54 64 83 -34 115 -17 -4
4861 -4 -48 -150 -53 59 -16 57 4 -88 -132 -9 31 -119 -12 104 -88 -26 9 -40 124 -20 30 -22 9 -40 68 -25
4887 -25 -19 79 50 -39 -150 -104 -105 -88 1 171 -9 -28 46 136 -195 -85 16 17 78 6 89 -1 -98 -24 81 100 93 -127
4915 -127 -8 -47 184 -57 -114 41 0 -6 -84 74 -89 32 115 -10 -23 36 -21 -67 -4 -78 96 46 6 -18 -118
4940 -118 13 -59 -84 73 -85 -74 4 28 82 -30 -87 -42 -11 23 -26 -130 6 -72 -52 -115 138 1 54 -60 -126
4965 -126 104 -33 -51 20 -18 24 -85 -184 103 31 6 16 2 7 -46 -16 -76 121 -84 81 16 72 95 -34 34 35 -2
4992 -2 31 -132 49 102 89 -70 -60 -31 24 50 -43 -13 -42 32 -33 2 88 -74 23 30 10 106 -28 87 41 31 -16 -70
5020 -70 16 41 -74 -74 6 38 -32 -41 -132 -58 38 10 22 -20 -118 -44 -12 16 43 -23 46 54 6 -43 17 -51 69 142 -113 47
5050 47 45 -18 10 35 -34 -8 62 -66 79 -85 -33 58 -65 -64 -46 -80 -23 66 -193 -69 -65 -142 8 -48 8 103 112 -47
5078 -47 -58 -88 56 4 -76 -77 75 -63 -47 -75 1 -70 -89 -74 28 33 43 61 -15 -31 93 -53 94 30 -31 -22 22 -45
5106 -45 -7 11 -141 -23 17 -106 92 127 55 -57 2 159 -82 37 47 17 -125 25 -35 89 156 -22 122 -41
5130 -41 -25 -8 -9 46 -21 21 6 -160 4 25 -64 27 -5 -91 25 -18 66 -56 42 125 83 -38 -11 -72 -6 0 -137 -90
5158 -90 -116 -11 -90 55 52 107 104 -111 -23 -25 64 -38 32 -6 -101 23 -95 -50 12 -99 -76 -130 -3 36 38 40 -61 -19
5186 -19 23 85 -53 1 0 30 185 18 55 -10 51 -15 -43 50 43 15 84 -22 -47 63 -118 40 -63 191 -96 180
5212 180 61 -120 -26 85 -114 26 -12 40 -122 35 -63 -102 11 11 -118 -132 71 51 83 22 17 -26 -15 -9 77 -51
5238 -51 -133 82 174 69 -147 -6 -64 70 -58 -42 -111 33 -43 64 2 -26 16 -1 32 -96 -4 -9 8 -57 33 -28
5264 -28 31 123 3 54 12 -43 141 140 -18 -63 -125 -19 53 -69 -28 14 50 -17 -29 -8 -32 103 19 1 48 -1 -117
5291 -117 59 25 27 15 17 16 -67 80 -43 137 -64 -21 41 23 -62 123 55 33 78 -54 25 63 -75 -15 -64 205 -76
5318 -76 -5 135 22 56 7 35 -78 77 35 -19 -28 72 -27 -128 -21 49 -49 -13 2 88 41 4 15 -19 65 -26 31
5345 31 71 97 129 17 26 -67 122 -13 78 -138 -2 -10 -25 -53 -41 15 -32 58 42 -28 36 9 -21 82 18 -127 -24
5372 -24 62 -99 47 -18 138 104 143 19 -56 20 5 -34 13 -39 -66 -30 5 -65 -53 -38 -58 -53 -135 -75 -45 -129 -53 -4 -55
5401 -55 22 -7 -56 42 -116 -107 -87 -47 87 -38 -8 1 69 -94 -47 -81 35 58 -20 27 -62 19 -10 47 -61 -71 -161 10
5429 10 65 82 82 -132 22 56 73 55 -41 -14 -29 74 -9 -34 26 -128 -23 96 -15 -31 47 43 -91 88 -35 -163
5455 -163 -8 36 -118 14 -29 -12 141 -51 -6 -31 37 50 140 81 -75 -41 -69 126 -75 21 13 162 -39 5 -52
5480 -52 -90 108 -103 -72 -17 -125 21 25 20 7 150 53 30 -15 -9 -81 -30 -9 -36 42 -80 5 -37 -38 -48 8 -128 -71 9
5509 9 -117 12 46 -76 85 71 95 61 -45 -64 -79 -117 55 -69 36 -84 -48 40 -171 -28 76 10 -50 25 -78
5534 -78 2 -205 132 -70 40 -167 54 -7 -10 -2 22 -14 -49 -98 -48 107 -5 40 -154 -5 41 -45 -24 32 -119 -32
5560 -32 16 166 -58 56 -59 -15 -35 -81 -54 -107 -98 44 43 -79 72 -3 -58 6 45 -118 33 136 -49 -33 -102 21
5586 21 103 -13 -12 -134 -72 -20 68 -51 -89 -78 -38 -26 -17 -137 53 -77 -108 25 -25 29 15 -48 -38 77 43 90 19
5613 19 -2 -43 38 99 13 39 -40 9 87 -74 -177 -24 41 -21 94 -67 -61 50 80 4 63 66 1 -18 6 -52 -58 -26 45
5642 45 -7 -141 10 -75 8 -3 -135 -100 -37 19 -15 14 -32 -19 -71 28 -50 -82 -29 -44 76 42 -11 37 123 -33 -37 -99
5670 -99 -44 97 53 -9 -162 -99 5 -98 23 -73 74 2 -54 3 -178 -37 69 99 -66 -77 -48 -68 1 37 -37
5695 -37 29 -66 14 -74 -5 51 -56 24 99 120 -5 -67 92 -8 -35 -48 13 55 52 -186 -41 46 24 -8 24 4 -85 29
5723 29 9 -67 -13 37 131 15 2 -39 -112 -26 -192 -23 -66 -111 -108 13 -104 21 -39 133 72 46 31 33 -62 -41 -49 -4
5751 -4 15 -16 -49 -93 -78 -25 21 -26 94 -73 -124 -128 -96 -56 -17 -61 0 -103 52 -27 100 47 -29 -14 51 -53 85 -20
5779 -20 70 -21 8 -107 -81 -150 12 53 -15 -11 27 110 -67 52 18 -73 -129 6 -133 -7 -75 -121 -34 -59 -3 -37 24
5806 24 72 -3 35 -70 -117 -137 164 -61 23 51 39 -157 -8 89 -45 5 -40 -6 -44 -112 175 -56 19 -21 63 65 -66
5833 -66 -97 44 40 36 -54 7 -1 -5 -30 92 -130 -38 77 -23 13 -89 -32 9 28 11 38 -40 -64 12 -18 -35 -4 90 9
5862 9 38 52 3 -15 38 122 -68 -108 -71 83 186 66 19 24 -47 -15 91 87 -61 -19 -52 -61 -44 128 96 95 25 -45 46
5891 46 37 -50 -18 -64 -28 38 -96 -60 -22 16 -40 -31 0 -67 -24 0 39 -33 -1 -65 -23 -17 -50 -59 96 -49 -2 1 111 44 44
5922 44 74 100 -6 7 -46 4 -16 -65 -70 30 -2 4 -101 -34 67 79 42 -19 129 -23 30 -114 88 -89 17 -31
5948 -31 71 8 -32 25 -6 -82 -2 99 -139 27 -33 -37 -46 -151 148 -76 -25 77 37 -64 -74 9 103 56 -48 -64
5974 -64 10 193 111 57 18 -124 -41 65 -11 39 -53 1 -28 116 -20 15 -28 27 -7 82 -13 74 -120 44 -21 30 87
6001 87 -15 121 -15 -9 -96 3 68 -22 -131 57 3 98 -13 -18 6 0 5 176 23 57 48 68 45 -116 66 82 -60
6028 -60 -113 4 84 -36 -34 -3 -107 184 80 51 -52 69 -24 22 -85 46 84 -77 82 23 -41 -92 -78 -33 38
6053 38 -31 60 -36 74 -21 -67 -27 -11 -53 20 84 -7 -121 43 52 -19 -10 -20 -90 103 42 137 105 -49 1 -75 -42 29 5
6082 5 39 -9 -18 -6 7 -38 -81 -107 -7 -16 20 10 76 27 -4 -116 -162 30 -78 -28 -78 61 39 -47 -32 -20 -35 -84 36
6111 36 -105 -19 8 -38 -97 29 -122 -95 -7 53 -149 -104 -23 45 -199 114 -43 94 49 43 -33 1 187 54 76 -63
6137 -63 19 68 -36 60 49 13 -34 48 -14 -38 23 -37 -86 118 -8 -39 -17 -46 -10 -6 37 -114 51 -4 177 122 99 5
6165 5 51 47 56 -44 -50 -3 109 -97 56 48 -45 -33 26 11 29 71 106 43 40 137 -25 87 83 -71 65 56 -46 -202 19
6194 19 54 5 -25 -1 -20 -30 2 47 -114 71 -114 -101 63 2 101 -5 -34 -103 -45 -40 -18 -47 66 -97 2 -79 53
6221 53 -63 -71 -28 -86 -26 -42 1 -181 83 -4 -43 41 17 42 -24 112 -69 -44 -34 54 -34 22 -106 91 -2 -73 -86
6248 -86 118 113 110 53 7 5 -54 66 113 54 30 -26 -38 24 23 -142 0 -72 51 -22 45 -4 -46 -9 -78 57 61 111 7
6277 7 -24 -2 -12 -57 101 -8 -68 -90 -140 -14 16 -16 25 158 14 39 64 96 78 -62 2 -135 37 -128 7 -51
6303 -51 -19 -17 -26 49 91 10 -9 61 85 -18 -75 87 113 -60 -36 40 -164 -66 -18 -58 -2 90 -49 136 38 2 -39 0
6331 0 -20 -14 -48 -1 -26 -18 4 100 -114 45 -44 32 82 58 -1 -170 40 74 43 -128 -18 -116 1 96 13 -2 110 21
6359 21 -85 60 111 -4 -3 -49 -64 -30 61 38 -78 1 -64 83 -11 43 -29 -56 -65 31 78 -18 -58 -9 -44 98 133 -75
6387 -75 -40 -19 -3 84 30 1 -120 5 28 -42 -9 -99 6 21 -125 54 -127 -118 106 -110 8 -94 -74 10 78 -29
6413 -29 44 -54 60 39 -89 67 -50 12 42 -33 -47 84 44 -35 -133 -170 -20 63 -8 76 -78 -22 111 17 35 -16
6439 -16 -1 -68 43 29 21 26 -72 103 -101 54 -19 27 -64 23 10 -27 64 65 29 -78 181 58 17 52 -26 74 42 -90
6467 -90 76 80 59 22 -53 -50 -38 52 19 -29 23 -113 -131 50 55 -6 48 -44 116 9 -16 -12 54 93 -4 51 -73 13 58
6496 58 116 146 48 7 -34 114 26 -109 -31 53 65 -48 -17 169 104 131 -17 -127 -100 -7 73 -95 -72 -109 25 38
6522 38 66 67 69 0 -104 -41 -3 57 -31 70 -10 -38 69 92 -68 -2 -80 79 19 66 -138 -9 55 -11 103 -9 -37
6549 -37 -82 37 31 -9 -73 -97 -19 -50 -168 38 -73 -9 29 -35 90 40 17 75 -99 -58 58 -21 17 -30 69 -146 -115
6576 -115 65 102 62 -19 -111 172 105 2 -6 60 56 11 56 -42 63 -29 3 131 60 24 -14 128 122 -89 115 -29 -22
6603 -22 27 75 27 -43 -10 -77 -22 21 132 10 -3 -27 -27 -103 -51 29 -14 -74 106 -23 -35 -50 -110 118 6 28 -151
6630 -151 52 7 -57 11 33 42 75 -27 31 1 -72 -38 -35 17 66 9 -83 -66 61 94 -38 6 19 -2 -12 63 -51 156
6658 156 -66 10 -25 -174 12 55 -8 43 18 83 11 -10 36 79 103 108 35 -93 28 25 -44 -40 -56 45 98 89 100 -5
6686 -5 19 -55 85 39 38 -46 -27 -38 -50 -93 -81 20 61 57 -31 -30 89 -121 -65 -17 -81 -47 28 22 16 49 44 -39 -16 29 -21 -61
6718 -61 -69 37 -35 -49 -96 -119 48 -72 -109 108 -52 -33 -56 -26 -25 -82 -12 -12 0 -65 -71 -65 -14 -55 41 48 -34 2 70 -31
6748 -31 11 -53 -145 97 49 48 -86 -49 -6 19 1 -29 -35 5 50 -30 21 23 24 -54 -9 54 87 -6 -11 73 44 -2 12 2 -20 -29
6780 -29 -30 -20 -42 -33 -179 13 -19 -37 -39 -118 -31 -66 13 51 35 32 -93 -197 -106 -23 69 -84 -40 17 11 -54 12 -146 44
6809 44 10 138 4 -6 -51 6 74 32 8 -8 -16 27 -4 -131 -10 27 63 27 -95 -95 -72 -17 68 -16 -13 -61 -37 -81 121
6838 121 50 -53 107 44 -72 3 -66 2 -180 -48 7 19 -118 -21 -24 -121 -30 27 58 126 59 88 -19 0 17 66 -28
6865 -28 -83 -11 32 49 79 -49 50 51 60 -22 19 155 42 109 -115 34 -52 -22 77 -95 22 10 24 -53 -39 -6 -102 103
6893 103 -114 -195 -134 24 18 -15 3 10 67 -70 -42 -19 17 20 -20 60 -7 -47 -59 29 -7 -6 -63 187 59 34 -1 35 132
6922 132 79 -37 127 17 67 -28 -3 -41 -12 36 -89 63 -52 75 -38 -61 -53 -60 -109 -105 76 -74 74 -32 0
6947 0 -60 40 -97 -20 -82 -111 -45 -55 19 55 73 -19 1 12 3 -41 -25 31 20 -42 44 -30 7 -22 -37 20 -170 51 -48
6976 -48 -82 31 -101 38 9 156 29 38 -85 -55 58 59 5 -49 122 46 -77 -5 -4 -226 46 4 91 10 -1 -109
7002 -109 -29 -110 -11 60 34 41 64 33 67 74 61 -76 -2 18 28 -33 -34 95 35 -11 67 22 -5 124 25 151 122 39 59
7031 59 -72 9 -57 14 -40 53 13 65 1 -106 -65 -5 -48 -31 -83 68 -12 -112 106 11 -161 -81 -45 -52 -101 58 -42
7058 -42 39 -119 76 92 -76 69 -41 24 78 42 43 -8 -20 17 80 33 -19 116 29 128 64 -58 -25 -15 -72 110 31
7085 31 62 12 -93 75 -2 -99 -15 -56 43 3 -56 36 -32 -28 -94 -22 86 26 41 60 -1 3 127 -92 -69 -179 12 106
7113 106 101 66 21 -94 -126 31 36 2 -3 -54 -137 100 -1 -53 -27 39 49 34 -7 -80 75 11 76 -137 -12 46 -71
7140 -71 -1 24 23 76 60 -71 26 0 1 -75 -10 41 -93 -23 20 6 -82 -27 26 -61 4 -29 -9 26 -106 -81 -38 -16 -23 -19 0
7171 0 33 71 92 8 47 -5 19 10 105 -38 63 -53 69 71 -128 19 -16 -115 -113 30 50 102 -32 -96 -72 -17 44 8
7199 8 -104 -169 -26 22 47 -33 4 -65 19 10 -69 51 25 -10 -39 -53 -39 -30 9 -19 10 -57 23 0 30 -23 -14 32 -55 -6 -83
7230 -83 55 72 145 -27 2 -72 39 -24 11 107 -82 -44 108 45 -44 27 83 -71 14 -123 -131 -122 -35 -74 -65 -19 -60 128
7258 128 -12 -7 -83 -120 25 77 -16 38 -34 29 13 -67 5 19 19 68 -108 18 64 23 13 -111 -20 -68 -54 154 -79
7285 -79 171 -24 115 28 5 32 164 10 -75 74 47 6 46 -103 -83 74 29 98 47 -42 48 109 5 -93 -10 -40
7311 -40 -18 -69 -32 -85 20 -52 -51 -2 18 53 -33 -38 -59 86 -83 57 -16 43 20 -7 65 38 -53 -8 6 154 92 -11
7339 -11 -71 146 57 12 -103 69 146 21 -55 144 -25 -105 -8 47 -26 16 21 -34 -32 -11 52 -123 -4 -39 -58 67 -2
7366 -2 -31 43 -77 -123 24 19 24 96 -47 -49 -40 19 29 -38 -145 34 40 59 -18 -104 -1 8 32 57 103 -53 -31 -36 -60 92
7396 92 -99 8 2 0 3 -69 -9 -41 -68 -66 3 -25 -116 -69 52 85 71 22 29 76 -61 -45 59 -124 20 -41 101 102 -15
7425 -15 64 4 7 -32 45 -33 49 19 34 -65 58 -6 -47 62 52 46 -36 102 48 -80 -90 19 109 133 -33 -41 23 -1 178
7454 178 35 -66 53 55 80 22 -151 143 -56 18 -2 -56 31 -41 -169 1 24 -128 82 67 16 -76 14 -26 -50
7479 -50 -15 93 -22 -19 -59 48 59 -94 4 -27 -72 -9 43 -49 41 18 -30 75 42 179 3 65 -96 -50 105 4
7505 4 -111 -74 -168 4 -29 75 37 -112 -64 23 -63 10 -96 127 -20 -127 -94 -21 -28 69 10 -8 -75 34 -8 22 41
7532 41 55 -5 78 -34 -15 28 34 48 80 106 124 0 53 40 -118 9 -108 17 58 25 109 -21 -26 65 61 -61 -100 -128
7560 -128 94 22 80 21 -27 34 15 -75 -34 34 35 -118 -114 -44 19 -27 -49 -5 78 33 -62 121 -2 99 6 -118 8
7587 8 144 99 172 82 -42 93 6 30 -1 16 16 -37 42 109 109 99 69 93 -18 2 -14 -44 -121 -44 -49 -20 31 66 54 39
7617 39 -49 -70 -102 -2 -51 -29 -61 -24 -72 -27 -24 -77 46 43 38 33 -96 -72 -41 17 32 59 75 -10 9 -60 -27 -24 -27 57 28 115
7649 115 52 39 46 46 68 10 -14 -67 25 -56 -70 -52 -24 19 -13 -64 28 -16 46 -39 -21 109 -29 2 -40 51 -54 34 35 22
7679 22 -90 -17 47 110 29 -84 -47 -140 158 -101 35 -44 -42 92 13 33 -38 72 72 -25 -75 -101 93 53 126 103 -62
7706 -62 -6 -27 -14 -48 -21 -98 -14 -26 -39 -86 -28 73 8 -54 -18 88 -80 65 27 -27 -60 -61 -67 -35 -92 -154 -141 -38 -91
7735 -91 27 -34 -45 44 11 76 -46 53 -13 27 22 -11 -93 -72 12 120 141 -9 -20 128 14 -1 85 -1 110 32 76
7762 76 174 7 -1 -70 -122 -37 -37 32 22 -39 -20 -23 29 -35 -81 -99 -124 -43 95 30 13 29 -4 -55 -21 -72 -7 -5 30 -37 23
7793 23 148 -30 -87 -33 59 -59 86 -10 27 42 37 51 25 21 106 71 125 17 34 -46 -20 -31 -74 11 -92 111 66 139
7821 139 -13 15 -36 3 90 112 -32 38 -36 42 30 -146 57 29 -42 0 28 68 9 26 -5 -47 -15 33 76 -9 -3 -90
7849 -90 143 91 84 -7 -93 105 -39 -29 32 -36 -3 41 15 15 37 -127 -35 65 -53 126 -59 11 50 67 -55 38 157
7876 157 -88 -27 -36 -34 86 4 17 85 3 5 59 34 -52 13 16 -41 110 -5 -62 -53 -80 108 70 103 5 29 0 44 55 36
7906 36 -15 63 34 107 33 65 106 42 -60 99 33 -9 79 53 1 61 24 104 -73 -147 140 -17 18 -56 73 40 -50
7933 -50 -62 -71 -2 -49 101 -17 -44 24 22 42 -53 30 -48 50 -7 -24 29 29 -100 -3 84 47 72 46 32 98 -11 57 -127
7962 -127 77 50 109 -41 13 63 22 52 -43 14 3 -53 21 22 -45 -19 40 -34 8 -126 31 -24 -87 24 13 29 -76
7989 -76 -7 -1 11 63 26 -25 -15 -29 -154 -56 -7 -117 47 -95 40 35 26 100 2 -16 74 56 166 -120 -51 74 48 125
8017 125 -87 -92 -21 -8 48 -83 -63 -79 7 -15 -65 53 -25 -61 -98 -22 -141 -87 40 -90 0 35 42 -89 -15 31 12
8044 12 -73 1 23 -11 -27 73 -48 46 -16 -47 10 -113 39 132 22 71 -9 -60 45 44 36 104 32 57 -30 29 37 -14 -67
8073 -67 160 106 -80 0 27 42 25 -1 -41 22 65 57 -36 12 74 60 31 9 9 -4 39 -41 -32 -20 -20 67 -30 -107 -41 111 -72
8104 -72 4 -51 -16 10 99 -61 62 42 24 -18 50 -14 38 -193 91 8 3 4 -66 15 -78 23 -121 74 27 -8 202
8131 202 60 -73 113 -59 -12 92 -26 49 -69 -79 -211 -25 59 -151 7 -53 -42 20 40 101 -109 -17 -4 27
8155 27 2 66 106 32 27 -20 -30 -46 -28 19 19 -84 77 97 -13 10 -59 -19 7 42 -31 24 -26 6 90 163 95 -16 89
8184 89 -7 -38 -67 33 52 2 41
8191D1
##END NTUPLES=NMR FID
##END=
