##TITLE=1H ikalashn
LR-770-R2-K1
17.10.2024
##JCAMPDX= 6.0         $$ Bruker NMR JCAMP-DX V2.0
##DATA TYPE= NMR FID
##DATA CLASS= NTUPLES
##ORIGIN= UXNMR, Bruker Analytische Messtechnik GmbH
##OWNER= root
$$ TOPSPIN		Version 1.3
$$ 2024-10-17 15:49:46.687 +0400  Irina@DPX200
$$ Compression mode = diff/dup
##.OBSERVE FREQUENCY= 200.131392401
##.OBSERVE NUCLEUS= ^1H
##.DELAY= (6, 6)
##.ACQUISITION MODE= SIMULTANEOUS
##.ACQUISITION SCHEME= undefined
##.AVERAGES= 16
##.DIGITISER RES= 18
##SPECTROMETER/DATA SYSTEM= spect
##.PULSE SEQUENCE= zg
##.SOLVENT NAME= D2O
##.SHIFT REFERENCE= INTERNAL, D2O, 1, 17.95386
##AUDIT TRAIL= $$ (NUMBER, WHEN, WHO, WHERE, WHAT)
$$ ##TITLE= Audit trail, TOPSPIN		Version 1.3
$$ ##JCAMPDX= 5.01
$$ ##ORIGIN= Bruker BioSpin GmbH
$$ ##OWNER= Irina
$$ $$ F:/spectra/data/iren/nmr/1H/4/audita.txt
$$ ##AUDIT TRAIL=  $$ (NUMBER, WHEN, WHO, WHERE, VERSION, WHAT)
(   1,<2024-10-17 15:49:25.468 +0400>,<Irina>,<DPX200>,<TOPSPIN 1.3>,
      <created by zg
	started at 2024-10-17 15:48:17.796 +0400,
	POWCHK disabled, PULCHK disabled
       configuration hash MD5:
       BE 6D 3F 07 2A EA 11 49 91 17 2B D3 AF B3 58 0D
       data hash MD5: 16K
       EA ED 26 ED C1 E5 AA 2E 54 A0 A2 89 CE 5E 84 7D>)
$$ ##END=
$$ 
$$ $$ hash MD5
$$ $$ 49 9A D4 ED E9 9B 52 DA 94 FC F4 CB 69 A6 E5 78
##$RELAX= 
##$RELAX= 
##$RELAX= 
##$RELAX= 
##$RELAX= 
##$RELAX= 
##$RELAX= 
##$RELAX= 
##$RELAX= 
$$ Bruker specific parameters
$$ --------------------------
##$DU= <F:/spectra>
##$EXPNO= 4
##$NAME= <1H>
##$PROCNO= 1
##$TYPE= <nmr>
##$USER= <iren>
##$AMP= (0..31)
100 100 100 100 100 100 100 100 100 100 100 100 100 100 100 100 100 100 
100 100 100 100 100 100 100 100 100 100 100 100 100 100 
##$ANAVPT= -1
##$AQSEQ= 0
##$AQ_mod= 1
##$AUNM= <au_zg>
##$AUTOPOS= <>
##$BF1= 200.13
##$BF2= 200.13
##$BF3= 200.13
##$BF4= 200.13
##$BF5= 200.13
##$BF6= 200.13
##$BF7= 200.13
##$BF8= 200.13
##$BYTORDA= 1
##$CFDGTYP= 0
##$CFRGTYP= 5
##$CHEMSTR= <none>
##$CNST= (0..63)
1 1 145 1 1 1 1 1 1 1 1 1 1 1 1 1 1 1 1 1 1 1 1 1 1 1 1 1 1 1 1 1 1 1 
1 1 1 1 1 1 1 1 1 1 1 1 1 1 1 1 1 1 1 1 1 1 1 1 1 1 1 1 1 1 
##$CPDPRG= <>
##$CPDPRG1= <>
##$CPDPRG2= <>
##$CPDPRG3= <>
##$CPDPRG4= <mlev>
##$CPDPRG5= <mlev>
##$CPDPRG6= <mlev>
##$CPDPRG7= <mlev>
##$CPDPRG8= <mlev>
##$CPDPRGB= <>
##$CPDPRGT= <>
##$D= (0..63)
0 2 0 0 0 0 0 0 0 0.06 0 0.03 0 0 0 0 0.0002 0 0 0 0 0 0 0 0 0 0 0 0 0 
0 0 0 0 0 0 0 0 0 0 0 0 0 0 0 0 0 0 0 0 0 0 0 0 0 0 0 0 0 0 0 0 0 0 
##$DATE= 1729165762
##$DBL= (0..7)
120 120 120 120 120 120 120 120 
##$DBP= (0..7)
150 150 150 150 150 150 150 150 
##$DBP07= 0
##$DBPNAM0= <>
##$DBPNAM1= <>
##$DBPNAM2= <>
##$DBPNAM3= <>
##$DBPNAM4= <>
##$DBPNAM5= <>
##$DBPNAM6= <>
##$DBPNAM7= <>
##$DBPOAL= (0..7)
0.5 0.5 0.5 0.5 0.5 0.5 0.5 0.5 
##$DBPOFFS= (0..7)
0 0 0 0 0 0 0 0 
##$DE= 6
##$DECBNUC= <off>
##$DECIM= 32
##$DECNUC= <off>
##$DECSTAT= 4
##$DIGMOD= 1
##$DIGTYP= 9
##$DL= (0..7)
0 120 120 120 120 120 120 120 
##$DP= (0..7)
150 150 150 150 150 150 150 150 
##$DP07= 0
##$DPNAME0= <>
$$ [...]
##$SW= 21.9925939549014
##$SWIBOX= (0..15)
0 0 2 0 0 0 0 0 0 0 0 0 0 0 0 0 
##$SW_h= 4401.40845070422
##$TD= 16384
##$TD0= 1
##$TE= 300
##$TE2= 300
##$TE3= 300
##$TEG= 300
##$TL= (0..7)
0 120 120 120 120 120 120 120 
##$TP= (0..7)
150 150 150 150 150 150 150 150 
##$TP07= 0
##$TPNAME0= <>
##$TPNAME1= <>
##$TPNAME2= <>
##$TPNAME3= <>
##$TPNAME4= <>
##$TPNAME5= <>
##$TPNAME6= <>
##$TPNAME7= <>
##$TPOAL= (0..7)
0.5 0.5 0.5 0.5 0.5 0.5 0.5 0.5 
##$TPOFFS= (0..7)
0 0 0 0 0 0 0 0 
##$TUNHIN= 0
##$TUNHOUT= 0
##$TUNXOUT= 0
##$USERA1= <user>
##$USERA2= <user>
##$USERA3= <user>
##$USERA4= <user>
##$USERA5= <user>
##$V9= 5
##$VALIST= <valist>
##$VCLIST= <CCCCCCCCCCCCCCC>
##$VD= 0
##$VDLIST= <DDDDDDDDDDDDDDD>
##$VPLIST= <PPPPPPPPPPPPPPP>
##$VTLIST= <TTTTTTTTTTTTTTT>
##$WBST= 1024
##$WBSW= 25
##$XGAIN= (0..3)
0 0 0 0 
##$XL= 0
##$YL= 0
##$YMAX_a= 209105
##$YMIN_a= -226517
##$ZGOPTNS= <>
##$ZL1= 120
##$ZL2= 120
##$ZL3= 120
##$ZL4= 120
##$ABSF1= 10
##$ABSF2= 0
##$ABSG= 5
##$ABSL= 3
##$ALPHA= 0
##$AQORDER= 0
##$ASSFAC= 0
##$ASSFACI= 0
##$ASSFACX= 0
##$ASSWID= 0
##$AUNMP= <proc_1d>
##$AXLEFT= 0
##$AXRIGHT= 0
##$AXTYPE= 0
##$AXUNIT= <>
##$AZFE= 0.1
##$AZFW= 0.1
##$BCFW= 1
##$BC_mod= 2
##$BYTORDP= 1
##$COROFFS= 0
##$CY= 7568.61572265625
##$DATMOD= 1
##$DC= 2
##$DFILT= <>
##$DTYPP= 0
##$F1P= 17.9538593292236
##$F2P= -4.03888763876832
##$FCOR= 0.5
##$FTSIZE= 32768
##$FT_mod= 4
##$GAMMA= 1
##$GB= 1
##$INTBC= 1
##$INTSCL= 1
##$ISEN= 128
##$LB= 0.01
##$LEV0= 0
##$LPBIN= 0
##$MAXI= 945.577
##$MC2= 0
##$MEAN= 0
##$ME_mod= 0
##$MI= -402.1523
##$NCOEF= 0
##$NC_proc= 0
##$NLEV= 6
##$NOISF1= 8.587773
##$NOISF2= 6.764455
##$NSP= 1
##$NTH_PI= 0
##$NZP= 0
##$OFFSET= 17.95386
##$PC= 1
##$PHC0= -55.25373
##$PHC1= 20.04146
##$PH_mod= 0
##$PKNL= yes
##$PPARMOD= 0
##$PPDIAG= 0
##$PPIPTYP= 0
##$PPMPNUM= 100
##$PPRESOL= 1
##$PSCAL= 0
##$PSIGN= 0
##$REVERSE= no
##$SF= 200.13
##$SI= 32768
##$SIGF1= 18.5376
##$SIGF2= -6.396296
##$SINO= 400
##$SIOLD= 32768
##$SREGLST= <1H.CDCl3>
##$SSB= 3
##$STSI= 0
##$STSR= 0
##$SW_p= 4401.40845070423
##$SYMM= 0
##$S_DEV= 0
##$TDeff= 0
##$TDoff= 0
##$TI= <>
##$TILT= no
##$TM1= 0
##$TM2= 0
##$TOPLEV= 0
##$USERP1= <user>
##$USERP2= <user>
##$USERP3= <user>
##$USERP4= <user>
##$USERP5= <user>
##$WDW= 1
##$XDIM= 8192
##$YMAX_p= 0
##$YMIN_p= 0
$$ End of Bruker specific parameters
$$ ---------------------------------
##NTUPLES= NMR FID
##VAR_NAME=  TIME,          FID/REAL,        FID/IMAG
##SYMBOL=    X,             R,               I
##VAR_TYPE=  INDEPENDENT,   DEPENDENT,       DEPENDENT
##VAR_FORM=  AFFN,          ASDF,            ASDF
##VAR_DIM=   8192,          8192,            8192
##UNITS=     SECONDS,       ARBITRARY UNITS, ARBITRARY UNITS
##FACTOR=    0.0002272,     1,               1
##FIRST=     0,             0,               0
##LAST=      1.8609952,     -230,            -99
##MIN=       0,             -226517,         -226517
##MAX=       1.8609952,     209105,          209105
$$ Real data points
##PAGE= N=1
##DATA TABLE= (X++(R..R)), XYDATA
$$ [...]
2313a185N03J096Q91k58j73m18o15j074m8O44L00M14J105N51r31o96k12r00p66
2332a772P03J020O07M99M86n07j171p42K02k74j12J022J059p7j84K21o94j365
2350a079m68R26K7J43J410Q05p27p37o3q28j127O02J235N6K29J018J43j407q79
2369g21L10n09q45J324J195n0L6O69n91j931l46R19m92J69J540R73p75m56K49
2388F68o40j686J78J288J02j05J508N61j531q41M55p28j087J172J456k38QJ027
2406A567m56j755o98P77m55k66J524J365o82p29O58o15j711j45J421j98k15J686
2424A073Q42j464p01L34p71j484J169J556l17P7J122K07k077o30P54n99p90J578
2442a21J482n75m51R77n22k049l13J226l84j61J697J381j418q31M28n10j860N28
$$ y = [-1185, -682, 414, 1305, 1047, 874, 456, -159, -1233, -1281, -637, -337, 77, 1182, 1733, 802, 106, -106, -1006, -1772, -1069, -49, 558, 1057, 1543, 1036, -135, -877, -675, -949, -1061, -39, 1020, 943, 759, 980, 286, -1079, -1547, -621, -594, -451, 959, 1764, 1037, 300, 237, -591, -1718, -1116, 119, 175, 404, 1422, 1565, 158, -721, -411, -920, -1765, -441, 754, 704, 740, 1409, 818, -1113, -1459, -540, -1032, -863, 677, 1650, 875, 419, 668, 28, -1658, -1480, -192, -90, -195, 1313, 1874, 343, -498, -43, -771, -1858, -686, 770, 532, 540, 1567, 1111, -644, -1342, -565, -1020, -1286, 238, 1603, 921, 192, 850, 235, -1476, -1621, -200, -398, -613, 1073, 1915, 451, -250, 84, -687, -2171, -1002, 554, 237, 314, 1436, 1643, -434, -1064, -310, -909, -1699, -121, 1361, 786, 335, 1312, 790, -1259, -1572, -346, -730, -891, 806, 2187, 769, -62, 366, -144, -2004, -1476]
2460a476J479J98l33J519N85j967q07O15n77j018J071J798l01n40J321n07k085
2477a025m15J171m47n43J684J556j291n06P18q59j879L97J457k29j04J745N96
2494B026j656r81P29p59j577J305J790l04l18J216J3k031o41R12m89r23J816J440
2512A568p95n13R09q50j826N0J239p9l34J453J173j568o67P30p41j621P20J682
2530E30l18k14J405L62j977q26P99n06j090J488J725m99n47R44k26k205l56J305
2548b06l23m77J784J246j207o47M33n89j830L64J730J1n65J749L44j599r00O49
2566c3o60j082J042J750l37l50J155m96j833m07P50j65n74J303J667q56o24N55
2584H05q56j636K31J251M0j37J527O66j403p12L97q20j207Q54J573m7j35J064
$$ y = [-1476, 3, 201, -132, 1387, 1972, 5, -802, -187, -764, -1782, -711, 1087, 786, 246, 1567, 1060, -1025, -1440, -269, -716, -1259, 425, 1981, 690, 184, 902, 43, -1836, -1439, 18, -211, -315, 1430, 2026, 370, -611, 118, -641, -2218, -913, 877, 573, 255, 1471, 1484, -547, -1188, -276, -765, -1688, 128, 1568, 773, 260, 1169, 319, -1507, -1457, -218, -297, -631, 822, 1995, 427, -240, 490, -251, -1872, -1152, 530, 212, -2, 1403, 1765, -212, -1038, -239, -745, -1835, -347, 1378, 879, 332, 1276, 1050, -1155, -1511, -206, -529, -1006, 778, 2024, 817, 170, 603, 14, -1816, -1452, 278, 289, -276, 1473, 1817, 218, -682, -33, -693, -1775, -733, 1017, 680, 330, 1485, 989, -844, -1251, -501, -666, -1240, 63, 1730, 874, 250, 805, -51, -1687, -1456, -205, -165, -302, 1225, 1891, 488, -224, 173, -647, -1854, -1000, 573, 526, 391, 1455]
2602A455n9j693p83O05n65l92J395J415l96m51M57n54j796l08J231q2o5J399Q23
2621A636q22p53K12o86j373M92J375K31j79J287J22j211j158M69p05n75Q93J843
2639A098k49k74N26l66j632m90O59J21p4J322Q55n39l92M1p67j287J72R34L40
2658bK56R18M04j293p76K83o10o22N11J457J93J6N77l10j282p98J40mj94J320
2678A84R27P1l31r7p55r08m48Q14J62L52P54P07p82p08No57q04L66J263K26M85
2699H26M52k8j309o95J2j53j31R00Q97K11j24R9q49j228m7J99L56K17J078P72
2719A455m09n52m17p13r03M52Q52M06M55M73o6n63p68m69l85l8P14P75N31J36
2739I66l6l98r85m50r1R6M74Q89Q00j68l73m40p42n81j68N43P31M15L01M48n29
$$ y = [1455, 1396, -297, -1080, -475, -1040, -1432, -37, 1378, 982, 531, 988, 434, -1362, -1670, -439, -521, -586, 813, 1636, 814, 61, 273, -413, -1786, -1294, 81, 312, 133, 1420, 1542, 331, -827, -358, -1063, -1638, -745, 1098, 849, 575, 1101, 735, -897, -1387, -728, -607, -681, 641, 1496, 957, 565, 606, -161, -1448, -1276, -342, -2, 254, 1172, 1576, 283, -493, -210, -820, -1442, -931, 526, 719, 735, 1312, 1002, -280, -1078, -938, -942, -1136, 184, 1111, 1182, 851, 754, -1, -909, -1357, -543, -381, -29, 725, 1432, 650, -58, -53, -710, -1514, -1148, 115, 341, 826, 1278, 1250, -59, -754, -742, -895, -1026, -126, 771, 982, 858, 957, 108, -1120, -1167, -968, -612, -395, 683, 1455, 1046, 494, 77, -636, -1539, -1087, -235, 171, 626, 1099, 1033, 470, -298, -767, -1152, -1190, -476, 299, 830, 966, 930, 532, -453, -903, -994, -898, -424, 465, 1265, 1097, 724, 284, -458, -1039, -1207, -664, 67, 482, 783, 1231, 702]
2760G02n07o66o42p5L45P31P65L30J19o91n84o72k93O4M97Q27O25P3r0m07o12
2781a61o48l57J60L90J119L64J18qn02r18m84k92J38P00R08M93j0k43n16n75n56
2802h80k39L04P11N66L47K50k24p80o88k87j05L16N93Q52K55J07n41n75p33j96
2822i47m4O31N76N53L13q8l83q78l95m53L14L04O86O44L84l35n26o60p16k84N11
2843g93N69O84L97M09m70n76p28o14L5J83O80N22O69O1k24o15q08m30M3K99O81
2864b6N48P06k39j77r18p93k13J39M92O76M74N60k36l83o96o56k52J25L08O94
2884A33O96J52l2n28q18o24j28J05N89Q55N63K31l45p70m51n19k50K14P21O83
2904D77M52J97l09n92q01m60j40M53P40N41M06ml27o21o59n01M27K27O90M01M94
$$ y = [702, 195, -471, -1113, -1188, -843, -112, 653, 983, 1102, 411, -173, -845, -1138, -1074, -577, 250, 875, 948, 858, 451, -161, -809, -1166, -1006, -616, 503, 867, 985, 977, 475, -443, -927, -1219, -1081, -381, 527, 1020, 1010, 767, 251, -324, -880, -1119, -815, -104, 462, 809, 1059, 835, 55, -633, -920, -1025, -709, -116, 736, 991, 1098, 557, -18, -751, -947, -991, -360, 216, 769, 1082, 994, 611, -267, -662, -1115, -801, -497, 189, 833, 1217, 882, 356, -304, -1020, -1304, -793, -224, 460, 857, 1266, 796, 220, -508, -1122, -1087, -904, -224, 298, 967, 1028, 804, 189, -619, -1049, -1006, -707, -26, 522, 1228, 989, 812, -106, -899, -1112, -973, -481, 195, 669, 1229, 993, 610, -86, -742, -994, -869, -561, 133, 829, 981, 949, 421, -397, -1021, -1149, -1044, -455, 400, 963, 1194, 849, 79, -372, -891, -1141, -927, -206, 477, 929, 1126, 817, 225, -576, -1036, -1176, -723, 17, 558, 964, 960, 633, 12, -647, -1148, -721, -494, 196, 597, 1091]
2925A091j41n28p06l31n23J3N58P41N90M25r9o13r38m34k40k2P61P43P11j23l58
2946E77l79o01o09rK31N72O78L95K73k93q66l46n14l88M55J073L17K41K86m02
2966F91q19o72K28l50K35Q76N86L10k01j53o43r92k09N02L37K34J030M20n67o87
2986A56k24o23n41K76Q83L83J50O23Q7j056p28q2m52m7R38Q55K84P3j94l17j284
3007h40l73M81J75J96R04Q53n06n67q3o73p13L7P60M05L05O72K48p84j115K50
3027c68o10n48J024J177J36k66L98k98j291k67M91k69r2J051J028m92k23m2o07
3046f8j212j21J039K51j19J256N34j085p62M6n21r24Q27J246L16k06N95l1j426
3065c65o81N78r5l97Q10J331k59k71J28m19j599j69Q54K74m1J243P72j101o60
$$ y = [1091, 950, 422, -284, -615, -1138, -1125, -567, 174, 764, 1189, 1090, 477, -461, -895, -1135, -1157, -396, 347, 1058, 935, 577, 198, -403, -1012, -1021, -790, -218, 460, 855, 1128, 835, -31, -377, -891, -1279, -824, 249, 566, 807, 1093, 691, -128, -800, -572, -922, -687, 189, 775, 1085, 884, 731, 88, -904, -1113, -611, -274, -40, 990, 1410, 843, 156, -68, -691, -1232, -956, -73, 310, 460, 1083, 1170, 114, -614, -696, -1148, -1195, -257, 598, 882, 955, 761, 444, -840, -1213, -732, -557, -361, 543, 1396, 890, 323, 240, -433, -1146, -1109, -349, 56, 361, 1033, 1281, 497, -618, -368, -978, -1526, -502, 675, 811, 545, 943, 645, -646, -913, -422, -691, -783, 268, 1296, 804, 581, 539, -68, -1280, -1401, -362, -111, -230, 1026, 1560, 475, -287, -241, -762, -1686, -859, 387, 703, 497, 1092, 1061, -365, -1046, -468, -563, -960, -150, 1181, 922, 651, 779, 360, -1239, -1408, -554, -280, -321, 922, 1694, 593, -67]
3084f7J81m15j072K26J212J28j12R79L76j528p33L65j23q65J078J482r9m19K29
3103H23j16j670l29Q16k36P4J038J058q35n55M03n66j263J08J306M9j37J129K78
3122A375j272o86L26k42q70Q22J512j06p08J057k99j592n82O90P2n52J137J186
3140A268n31n30L69m94j374K25Q38K85k42J125P81j384q38L17k82j074N69J560
3158E88k22j13Q89N3j470p56O50j56p54J267J374k90m64J01k17j509j25J070j50
3177b34k78J291Q62j174p03M11l43j280L08J264L39k68Q77K55j190q20M54n31
3195g60o71J143J303j88m35O03l2j693p89J132P5l29R42R88o94n28N63n32j548
3214a450J30J240K89m36J088N19j094r95N97n40o73P23J503j95n34R97k27j594
$$ y = [-67, 114, -301, -1373, -1147, 65, 193, 81, 1060, 1436, -92, -825, -460, -583, -1448, -370, 1112, 1013, 594, 823, 707, -963, -1292, -476, -712, -638, 400, 1458, 623, 68, 471, -95, -1358, -1250, 56, 105, -32, 1097, 1375, 103, -583, -257, -499, -1369, -547, 965, 859, 151, 1208, 909, -683, -1265, -575, -503, -1055, 82, 1268, 737, 207, 576, 82, -1292, -1067, -229, 56, -186, 939, 1720, 336, -502, -185, -467, -1541, -972, 588, 366, 253, 1142, 1195, -275, -1031, -381, -537, -1291, -24, 1350, 1060, 596, 697, 480, -1029, -1154, -84, -234, -512, 779, 1641, 467, -236, 175, -168, -1448, -1140, 124, 463, 195, 1072, 1327, 137, -683, -229, -760, -1431, -288, 1015, 827, 392, 995, 963, -730, -1519, -387, -312, -641, 301, 1289, 595, 67, 630, 98, -1450, -1320, -80, 209, -227, 861, 1380, 286, -709, -112, -652, -1325, -602, 901, 706, 172, 1169, 942, -652]
3232f52m08O72j41m65J206J055n29m51M84p18j216L4J202j03j79J210M48j112
3250C37r84N67m8j262M47J376j25k43R93o9j394n56N15j28n91R46J365m33m01
3269C12M68m18j204l62Q16N4M5R02P27p83n49L60o50q55J74J024R1P2Q03m4p97
3290A86q03K02j12l96P22R63Q3o02O77j15j497m25O85j47M0Q45Q98m01p21K45
3310C27k88j431L77Q85J44K16O34K74r11o96J05q7o26N69J018m5O4L48k86r39
3330c48n94L21K00l07Q81Q34j32m76P3m35r90n2P83m0J65P76N45p71n98J64n78
3351e79m58L27P80L15L02L72l48p88n50R6k27qQ42O83N4m66J92k53r16j20L81
3372c69j0K25O05O74m83l12j51o59n22K23O45M16LM57L0n99n83Q1l99p3L41J088
$$ y = [-652, -1060, -388, -529, -994, 212, 1267, 738, 287, 771, 53, -1163, -1129, 73, -30, -209, 1001, 1449, 337, -647, -80, -128, -1390, -943, 433, 308, 65, 1058, 989, -405, -961, -446, -574, -1165, -219, 1146, 713, 312, 780, 362, -842, -1204, -388, -334, -289, 613, 1340, 557, 8, 368, -282, -1137, -963, 61, 152, 224, 1027, 983, 186, -617, -415, -527, -923, -201, 762, 845, 243, 920, 805, -692, -1117, -432, -579, -539, 306, 1204, 803, 82, 327, 39, -1392, -1015, -130, 14, 230, 864, 1138, 227, -469, -364, -451, -1077, -508, 510, 465, 529, 877, 591, -348, -942, -621, -421, -728, 153, 987, 855, 379, 452, 17, -973, -1025, -242, -282, -117, 659, 1204, 433, -165, -1, -579, -1037, -710, 70, 385, 687, 1059, 711, -77, -627, -531, -758, -766, 76, 759, 813, 347, 539, 286, -630, -750, -369, -379, -154, 451, 1125, 642, 330, 179, -480, -1002, -779, -134, 282, 285, 742, 772, 173, -410, -329, -728, -801, -460, 628]
3394F28K5j16K10m32p22l22M7J05K53O37P02k99l13j97m56m49l3M61L91K15M97
3415H32J25o82l62j97m32j51M10P30L95k3Rj55p69l43N0j39L39N94N08J14l33
3436E20m66j21n72k53M65K11L49M42K49m87k39q9m36m28K94O06L98J82J15j28
3456F12m79o21j65N5P2L57P53L1j05j22l23n12k70J45Q3L82O04K81k5m34m24l14
3478d19l49R0L37N25L52J83l7m82m50k21k48J89L69N28K71o0j00k42n24k57j43
3499f88J28N70K97K97J34l30l12m87l23q4L56M24L14L81j06j32k82m38l83n5K75
3520d44M71M96O7n5l46k08n99j8PJ98O18K74K10j58k16m10l35k08J35J64O37M24
3542G04Q4k59l27n63j91k8K65L48K44K45J68k43l96o55J87k09J02K75N10L26q4
$$ y = [628, 653, 537, 747, 315, -407, -729, -682, -577, -324, 313, 1015, 716, 403, 206, -250, -699, -732, -271, 120, 335, 832, 957, 275, -87, -284, -716, -867, -457, 273, 668, 645, 654, 499, -270, -613, -563, -702, -363, 231, 739, 853, 520, 54, -67, -639, -892, -427, -216, 133, 575, 824, 337, 98, 9, -427, -855, -561, 45, 443, 625, 740, 612, 133, -488, -653, -598, -526, -169, 584, 615, 510, 388, 65, -447, -717, -572, -489, -107, 497, 778, 753, 319, -105, -419, -768, -678, -341, 184, 536, 719, 682, 200, -250, -471, -719, -530, -161, 367, 638, 578, 478, 236, -288, -545, -688, -560, 10, 307, 604, 738, 408, 96, -391, -714, -798, -442, -18, 296, 677, 571, 439, 157, -281, -664, -719, -444, 27, 523, 590, 535, 189, -19, -618, -636, -629, -431, 187, 461, 671, 513, 297, -113, -448, -656, -521, -357, 280, 704, 788, 529, 202, -361, -552, -580, -315, 33, 277, 522, 690, 447, 51, -604, -417, -626, -524, -249, 261, 587, 503]
3563E03j44m51j95k38j58L99K39N11K72j95l32k86l58l20Q9L49M52K23K98R7l80
3584C75m24l04l03N7L24K97O08J7l43l6l61l40j34J21L67M04K29J11k94l16l35
3605b80k51k34L96L61L35K77J25l95n32j69k34j73L24L79M26K25p9j05m55n51
3625f10j08M2L45N23L23K21l12k17l25k27l13J77L60J96M31R4j06l74l44k70q8
3646e82N2N64L38J10J70j88k91m42j75k48J10O73K65J37J32r1l28q10n8L16J2
3667c34K70M75K19m9l20j86m72l38J43M03K35K36J62K16n48k34j05j78k83M34
3687b54L69L58j4P3k22n04l90J32Q7K66L07L18j41n1j31l12n39J93J71L27K00
3708B43K69L6k34k14l66K8m66K46O57R5L2K24p8n43m35J43k1M7K36O27n9j75%
$$ y = [503, 359, -92, -287, -525, -683, -284, -45, 466, 738, 543, 211, -75, -433, -753, -664, -315, 137, 360, 658, 755, 375, -49, -353, -656, -599, -275, 22, 630, 647, 304, 268, -93, -433, -567, -446, -79, 325, 554, 665, 371, 55, -280, -531, -765, -369, -8, 327, 604, 729, 334, -198, -367, -601, -774, -450, -71, 355, 580, 501, 396, -59, -610, -718, -676, -331, 192, 515, 736, 424, 207, -118, -345, -658, -481, -121, 75, 506, 600, 494, 120, -224, -494, -582, -530, 34, 372, 482, 652, 464, 173, -269, -444, -692, -582, 91, 356, 493, 625, 534, 206, -604, -662, -346, -334, -64, 411, 630, 581, 261, 75, -397, -735, -592, -189, 46, 282, 444, 660, 112, -122, -227, -405, -688, -254, 115, 473, 459, 532, 310, -194, -584, -452, -365, -99, 208, 526, 385, 334, 203, -109, -648, -455, -284, 43, 243, 512, 548, 314, 100, -266, -238, -704, -458, 199, 294, 326, 550, 472, -71, -506, -363, -384, -337, -101, 526, 467, 292, 292]
3731B92l06l78j53K16Q1L09J86M12k68m98l5k15j89J15N81J12p2K00J15m60k33
3752a88p8p6j60L04O49J33l38M5K6o81j75K57R4M7L39M39k42k02j6o19j37O8M84
3775b7R0J40K15L49o45k72q2j07j74J27N47K13P6K21l10n54k58R1J32j22M78L49
3797D77k5m44P0o0m53j26M47P1J54L01J67l79k43k5j76j73J21N52J32r6K62j52
3819D02n22j86MK00m04N25L83N6l88K43j30n48k66M20K3n3N39L27l22k27o6l50
3841c40k99J11P72k06J81J66Q6m52l39l9J05k10K66N05O2N1k6j92m60l97O65L8
3863D8j35J97L47j13l81J82k15m41j25M78J74O5L00K2m34k97L48l87j47K36N15
3884B37J14j85K09m7l76l91J70N0n3L57M61l13l02K05o2n87K32L37j53J16L40
$$ y = [292, -14, -392, -545, -329, -248, 61, 247, 659, 391, -107, -142, -357, -546, -431, 150, 262, 190, 390, 505, 45, -188, -266, -342, -502, -198, 451, 584, 246, 291, 317, -364, -539, -282, -188, -141, 198, 637, 395, 193, 177, -442, -579, -511, -27, 63, 203, 418, 767, 122, -150, -232, -339, -513, -386, 161, 374, 450, 671, 361, -193, -451, -360, -228, -350, 128, 477, 452, 8, 78, 18, -435, -561, -114, -43, 111, 412, 579, 200, -43, -68, -244, -417, -296, 256, 388, 292, 554, 402, -120, -306, -302, -102, -506, 19, 402, 458, 70, 313, 183, -365, -631, -211, -188, -241, 298, 625, 303, 76, 10, -340, -639, -528, 244, 38, 219, 385, 471, 19, -320, -359, -254, -464, -198, 307, 369, 420, 394, 202, -258, -655, 10, 48, -87, 110, 457, 344, -37, 145, -70, -511, -636, -158, 16, 81, 381, 403, -31, -328, 20, -367, -514, -278, 237, 351, 166, 375, 328, -48, -439, -269, -219, -272, 85, 546, 233, -69, 136, 74, -513, -281, 56, -97, 19, 359]
3905C59J00k25l40L90l19k79k6O30k88K83J45k3m45l29J54J07j81J94L12N4j67
3926A06ok6l97j13K17J85o4J55N71l67n9k38j17k96L6M75K2K2L46J1k29m02J24
3949d4j88j14K17L07L5n3K0N3m20j66J88J44j95K67L21R0l80J27l13k63o5K83
3971a49K7J8K62J80k57j33p6O1l16N1O47k32O5K77k49m75J23q4p1L3J36L40J84
3994C62m51M05k10m53j84L13K05j48M40J06j46k95rmj99lK42K08N0m1Rj5l50r5
4018b63L7j47K45L00m9J25J0k48k16j80J35J77r3K23K83j98j4j54r3l10J64P7
4040a89J43K33J43j12l39J86k36P1k41J69L57M5j3M1j4k47l6j62m3P8J81O7K93
4063C75j14l39J05k06k55L40l1L3L68p8P0l27j53K34k23J61oK05J96k46K30l18
$$ y = [359, 459, 234, -106, 284, -35, -314, -340, 290, 2, 285, 430, 407, -38, -367, -213, -106, -287, -93, 219, 273, 106, 100, 74, -323, -436, -219, -34, -98, 57, 628, 261, 202, -36, -153, -449, -413, 62, 84, 106, 452, 463, 234, -168, -44, -232, -346, -129, 178, 213, 160, 180, 233, -187, -353, -165, -21, -216, 51, 372, 462, 82, 209, -104, -367, -432, -149, -122, -104, 158, 338, 81, -52, -128, -67, -383, -332, 315, 83, 148, 425, 176, -299, -176, -260, -331, -298, -162, 178, 362, -89, 316, 106, -347, -531, -218, -13, -161, 279, 385, 239, -56, -65, -69, -268, -271, -29, 179, 229, 188, 197, 182, -168, -263, -226, -373, -128, 172, 123, 248, 258, 10, -206, -386, -251, -74, -167, 56, 339, 141, 127, -27, -120, -430, -266, -189, -46, 187, 330, 218, -121, 65, -171, -100, -341, -172, 185, 230, 217, 258, 244, -3, -39, -201, -244, -166, 15, 82, 375, 261, -78, 27, -179, -434, -94, -125, -92, 276, 198, 268, -59, -212, 22, -201, -40, -46, 159, 355, 109, 339, 21]
4085B1p6j88j7N3L7K98J3m5K01j55k22k50J50J41m5J91J92k3r3j93k2k04J01J25
4109a0J54M7j9OL6k52j84q4N0J14M8K54k07M15j92k78J44k70J8L7J55J32j0Pj49
4134c8O7r0k07J87P1r4R2L32k36j12J4l11l7J40J36J03J57Q1L6k66Pk17k9jJ23
4159i2m5L65J13p8r5k16j90j66J90K46Q8J23k1q8j55j36j03R3J8K59k33L62m3
4182A96Kj06j81q9J0l5P6K24J30j38q8oj2l00QJ51K50qM6%j73J55j62j87q6K16
4208a07R5N5J3K01j56j31k64J00J21j43K44J18QO8K6k81j71m0k1K91r2M5J28q3
4232B4K9K8j95k27R8K64R7N9R6j28j13j39n2j59L45j15J26J24J53k73l4j46p0
4255b08J70l8J8M7L49Qk26j14k63J54k18K45M3K05K95j46j58j73m4j73j04J89
$$ y = [21, -55, -243, -260, -207, -170, 128, 141, 96, 297, 142, -80, -330, -180, -39, -84, 107, 299, 276, 183, -10, -32, -236, -135, -10, 144, 191, 172, 178, 214, -38, -222, -306, -256, -142, -94, 160, -47, 368, 176, -102, 42, -228, -210, -173, -18, 114, 104, 111, -38, 29, -61, -268, -81, -10, -104, -12, 320, 84, -28, -14, -325, -362, -222, -86, 17, 174, 255, 291, 25, 32, -185, -214, -215, -92, -137, 228, 341, 263, 168, -48, -238, -404, -214, 32, 120, 243, 222, 134, -21, -157, -260, -167, -149, 110, -123, 239, 196, 198, 92, -89, -178, -168, -203, -127, 97, 227, 89, 1, -5, -17, -317, -309, -158, 92, 84, 130, 130, -43, 112, -50, -237, -323, -107, -12, 43, 56, 257, 101, -30, -294, -194, -73, -216, 28, 146, 154, 222, 248, -33, -204, -244, -265, 26, -66, -21, 107, 24, 53, 81, -114, -341, -243, 21, 118, 177, 273, 145, 32, -107, -159, -318, 27, -88, 38, 162, 315, 42, 8, -138, -208, -38, -76, -58, -11, 338, 346, 120, 6, -257, -103, -321, -76, -33, 172, 467, 321, 163, -10, -54, -227, -331, -142]
4277a42P0K91L2Mj73j16m1j92J38J23L1K37J41k42j45o1j41j19L48m7Q1K66j34
4300B09R0l67J17l28n3J53K48O3o5N1J38k22k90k9K0j5K40K35r7J25k64q8j4k17
4324c60M8K79M9J18J94k74j1q3k73M3j47K79J80J28J0L7j16j21o2j52o7J42K53
4347I4Q0J21j60j23r3j54o5MK68J02K31ok66r0Mp8l03K77K59O7r3J64j51Q6l13
4372a38o5K0rK49P3J93j84J91m06L8k60P3Q3K43j54K48n1R5k04k38pp6J65K05
4396H4J00J36j33j95mj15k03J17QL73O9J33k05k94L4j85o1K41K69j81K88K5j36
4419A65j03k73l5Mo5J23L55R0k00J20j69r9k13p1J02K79R1J03Q2ok24j32k50P8
4443b48R9J47K41Q1K0l68JM3k18j27M4M12L6qJ90m04m4j20J00j29Q8L26M9J22
$$ y = [-142, -72, 219, 251, 255, 82, -34, -75, -267, -129, -6, 25, 262, 403, 161, 16, -45, -186, -305, 43, -4, 77, 343, 209, 299, -68, 49, -279, -332, -179, 69, 132, 67, 118, 256, 34, -256, -285, -265, -280, -40, 195, 98, 223, -41, -129, -143, -360, -312, -33, 16, 134, 328, 54, 43, -40, -313, -270, -417, -138, 42, 170, 180, 217, 101, -20, -82, -234, -301, -159, 94, 174, 295, 135, 12, -81, -235, -300, -296, -28, 74, 305, 299, 33, -57, -53, -131, -434, -157, 102, 169, 76, 240, 89, 175, -138, -203, -183, -192, 57, 130, 323, 139, 330, -76, -38, -298, -225, -142, 101, -53, 195, 144, 239, 35, -203, -210, -286, -121, 84, 184, 320, 187, -8, -12, -127, -330, -213, -205, 168, 237, 370, 165, -129, -95, -280, -341, -100, 169, -12, 276, 301, 165, 62, -211, -246, -242, -307, -184, 171, 261, 61, 181, 12, -87, -300, -371, -269, 10, 101, 204, 286, 280, 56, -76, -326, -248, -149, -2, 239, 320, 340, -28, -27, 16, -202, -329, -285, 127, 163, 155, 345, -59, -103, -223, -123, -252, -164, 162, 211, 333]
4467C33k43k7qm84K21Q3J16K48J5j56J47j62j31j38j22M5K29J01L10o0j82r0k01
4490a56k64P8J20J94L43j5J5j52l21j74n3K19nK11J43J02p6k8l08o7r5L9J25R
4514a16K18R7J56l48k01r0Kj36K34J88J62J14pj90j91j94%n4J96J46L79k09Mo6
4538I4l24j14k8L72P6J6L61j57j68m3l72r1m1L61K94j79P0J62j16j49j98J2k80
4561d42J95J46M75o6j62J87l13l80q1L32J23K5J70K1k16o1J73m58m8N9K51K62
4583A92J64J44l31j82p9j93K2Q4K79K56j33J72O3m61l05p0R1R9J22J87K34M2j43
4606B54k75j04k05L6L12k69N24K21k69Ol36j80o4KK04N7K90q6O7j21j25l95J98
4629b58kJ60K64J87J9k12o9k02m22L44J78k03L69K25jj99j85n1k03n3L18j5J37
$$ y = [333, 90, 63, 55, -429, -208, -125, -9, 239, 254, 98, 245, 83, -48, -186, -308, -263, -34, 67, 377, 317, 135, 45, -156, -420, -342, -222, -28, 315, 300, 315, 163, -158, -332, -385, -166, -171, 40, 183, 285, 209, 181, -127, -194, -289, -250, -125, -116, 102, 199, 355, 7, -194, -284, -282, -418, -184, 4, 166, 280, 273, 83, -108, -302, -302, -356, -160, -14, 365, 156, 160, 94, -230, -344, -372, 0, 76, 92, 453, 296, 128, 85, -287, -378, -419, -58, 236, 57, 127, 289, 173, 24, -174, -162, -442, -247, -101, 374, 308, 146, 333, 20, -360, -441, -109, 14, 39, 209, 230, 14, -47, 126, -332, -380, -321, -70, 192, 356, 500, 169, -13, -92, -285, -263, -179, 100, 356, 223, 395, 458, -3, -308, -378, -287, -188, -66, 121, 355, 397, 254, -21, -125, -330, -294, 18, -251, 273, 494, 225, 231, -105, -285, -349, -347, -143, -86, 204, 118, 185, 64, -61, -456, -258, -260, -100, 164, 351, 370, 158, 89, -113, -535, -191, -13, -216, 153, 378, 377, 178, -7, -58, -261, -314, 4, -11, 126]
4652A26J66J21j13l30k15j72P5j4M18J45n1l3J16k48k74L5oJ37J56K98J93r2j79
4675B59k32j41k85J28K56J24J01J63m2k35m51J9j20K67J61L23O2j39M3k16k86
4696b41j00K5J07J09K94J90j68J64k91l09j40j09J2N05J49J71M9jl29k40j59N3
4718b59K25J94n2J44K9l38j27l00J66K20k0J99K32n5K23l36j13k77J5q2K63L6
4740a3K62K33k94k11j37J07m91L09K49K87O4L8j76j55k64j23jP6K23L51M5K3j58
4763B44l22j92j22R5J88L53K68k26K05l73l15j40M6J35K5K31J90K8j27j32l17
4784b58p7JP5J65K50P9K53j26k97j26k66j1P1K17L07P4m7p9j87k46k00R5R3L02
4808F2J77J3QPk84k36j67K7J96K56L05p0L8j78k17k79j90L4L47K55m8L37L5k04
$$ y = [126, 292, 413, 300, -30, -245, -417, -342, -356, 62, 207, 156, 123, 239, -9, -283, -248, -254, -117, 39, 337, 530, 438, 259, 27, -114, -399, -271, -15, 109, 210, 373, 331, 96, -355, -336, -456, -189, -28, 295, 357, 218, 261, 45, -241, -341, -316, -209, -100, 194, 384, 216, 380, 89, -220, -360, -469, -457, 48, 197, 368, 417, 416, 87, -153, -312, -259, -34, 160, 108, 252, 281, -57, -184, -484, -318, -98, -118, 81, 313, 258, 481, 145, 32, -245, -230, -312, -49, -13, 249, 482, 188, -23, -160, -53, -544, -235, 14, 301, 365, 403, 227, 72, -192, -315, -316, -240, -17, 334, 379, 402, 244, -78, -270, -392, -297, -109, 244, 512, 286, 491, 118, -197, -337, -291, -156, -131, 100, 290, 318, 191, 59, -258, -335, -334, -259, -94, 156, 235, 488, 362, 65, -61, -327, -338, -267, -50, 257, 331, 284, 205, 18, -228, -428, -333, -240, 62, 239, 252, 260, 267, -17, -253, -420, -393, -197, 59, 364, 294, 332, 154, -63, -342, -532, -498, -151, 104, 56, 393, 428, 224]
4832B24l09r7j75p7K40L24L11Mr0j50l60k52M8m6K54K99J47J05k48j10j56j08
4854b22k71L52J89P0P5J56n8l98M1l64J89K82n5L11j31J06q7j89k51o5M8K01L21
4877B50J21K31j52k20j59m20J28p0J75K63L42p9k41j37k19l9j52J86K50K31N1
4898C40Mj08k21p6m63J97R7jN16K49k54Q8l20l78l4K3K26M7K79K46l9l74j11l78
4922d45M3m6L36J74Q8K57j14k64j79k89QJ30P8M55l8J03M9k47j64l20Q2O1J13
4945a29K70L39n5r9l15k34r1j49M46j80L42K54J1k97j12j98j07k51L16K11K77
4966B49L1N8j07m10o1n8j09J85M68J01R2j17j35k53k09k38K10J35K16M22J6j49
4988C37k00l11m4j16K04J16K18L51j03j76j84j42k51j38R6L33K39L9K44m8n46
$$ y = [224, -85, -182, -357, -434, -194, 130, 441, 445, 355, 205, -155, -407, -359, -405, -151, 148, 295, 400, 152, 42, -114, -222, -493, -141, 48, 118, 193, 349, 291, -107, -66, -430, -241, 41, -14, 297, 166, 272, 185, -4, -255, -320, -272, -71, 250, 371, 602, 450, 230, 71, -349, -221, -291, -116, 147, 489, 410, 169, 32, -187, -226, -378, -192, 58, 289, 340, 344, 236, 15, -61, -524, -327, -230, -231, 285, 534, 280, 368, 48, -330, -364, -341, -115, -68, 211, 457, 418, 44, -67, -445, -402, -448, -112, 62, 150, 407, 293, 29, -150, -439, -431, -301, -223, 232, 194, 297, 346, 99, -65, -385, -303, -242, -129, 141, 480, 425, 326, 11, -223, -314, -463, -17, -197, 145, 399, 410, 113, 1, -197, -304, -555, -239, -28, 249, 280, 338, 231, -179, -240, -298, -407, -222, 246, 347, 439, 322, 187, -66, -275, -513, -303, -168, 48, 470, 486, 337, 137, -174, -218, -334, -130, -14, 204, 555, 452, 276, 92, -50, -301, -439, -343, -10, 229, 268, 512, 464, -82]
5009h2k47J21j33R2K08K87K06r7q1k42l29j60M9N20L1P5J98j28kn16l4j64N2K47
5033a29L63l7J10L4k72j20l79l7K37J69J31K93J60k09r7m19j32O0K1M0L56K98
5055D41j13J5l29q2l19J12L7L27J27K29j13q7m29j13n8j39M20%M07J56k5l8n23
5078i7j09k55n2K87K21M24k7k0k41k84k62L7J76Q8L18J62N9j44k74j67k77K8J53
5101b56L51R0j4K39k02k28j03k76O1j10M42L56j18K03l50P8m43j47J06J76J59
5122A4K22K72j2l46l50j10J6J9J47J47J73K54j04m33L8k21m5Q6R6K91L54j37N1
5145D22j18m39l38P5K3J97M18K95r7j31k4n49j39k0J95K95Q4J31J32k59k42q0
5167a69k14J2K43K30K0J49R1j03l81j40m8m8J04J95L48M7J18k67k62l27J43P6
$$ y = [-82, -329, -208, -341, -249, -41, 246, 452, 355, 274, 32, -297, -457, -408, 112, 143, 218, 416, 288, 286, -230, -264, -428, -376, -129, 234, 197, 307, 341, 69, -51, -430, -467, -230, -61, 70, 363, 523, 314, 217, -202, -334, -274, -253, -213, 143, 441, 328, 343, 14, -68, -387, -275, -238, 89, 216, 445, 332, 245, -184, -297, -355, -494, -74, -74, 333, 489, 464, 426, -97, -206, -461, -513, -226, -5, 419, 392, 372, 131, -153, -415, -378, -202, -114, 204, 366, 425, 281, 7, -160, -437, -409, -256, 95, 185, 171, 410, 208, -20, -123, -399, -338, -448, -6, 350, 232, 435, 85, 163, -280, -427, -321, -145, 14, 236, 508, 496, 150, -200, -310, -294, -275, -128, 19, 192, 446, 342, -91, -53, -274, -319, -233, -137, 154, 508, 371, 422, 304, -135, -473, -398, -375, -178, 240, 535, 438, 307, 283, -266, -405, -425, -230, 65, 149, 280, 412, 153, -89, -169, -383, -371, -128, 102, 122, 271, 362, 259, -122, -262, -310, -358, -254, -59, 289, 336, 454, 187, -75, -402, -259, -183]
5189a83J33L38j9J28k01j04j38k58j68M28N7L46M4J6n4k36j89k28j93K10M47l1
5211A45J25N5k42L4l86k40J23j7L02K39J22J78k74q7o03r9K48K17K84L98j05L0
5233D47m07n3k60k46J72K63J47K68K5L1n13O3k79N8m6L46K79j69K57k14K6k88
5255i3m11J79K19J04R9K69j48R1k89k51j68j08J49L09K04J87J47p7m09k64n0M
5277c07J10J15K83PP6j78k07k68R1k14K73K72K01R7k6j76j47k20j56K5J30M56
5299B37J41L9k1k36j36o60L06J43J67L23J02l1j19k06k93r3L3j31L74J66K53j3
5321C45L8l60k54O2k66L46J35J44J45j51J41n02P0k70M0K40J87L75q4J50l17l87
5343a73j26J5r1J68L06J90MJ5k24k19j04K4QK35K19J58ol11R5m39j49l6J67K60
$$ y = [-183, -50, 288, 269, 397, 196, 92, -46, -304, -472, -44, 13, 359, 403, 419, 365, 129, -60, -288, -481, -271, 176, 145, 270, 325, 83, 117, -269, -509, -386, -403, -101, 138, 260, 438, 164, 77, -526, -625, -377, -160, 124, 522, 417, 447, 40, -13, -273, -519, -347, -84, 63, 331, 356, 387, -126, -63, -342, -284, -330, 16, 295, 126, 383, 169, 195, -93, -504, -325, -106, -2, 97, 366, 218, 309, 20, -231, -399, -507, -358, -49, 155, 342, 489, 412, 3, -261, -311, -307, -197, -82, 201, 208, 284, 106, -101, -369, -278, -492, -219, 53, 254, 351, 325, 149, 2, -218, -374, -349, -219, 237, 378, 417, 396, 160, 24, -636, -330, -187, -20, 303, 405, 374, 255, 49, -244, -337, -304, -435, -61, 105, 358, 345, 383, 23, -231, -169, -435, -89, 46, 190, 335, 184, 325, -177, -107, -377, -337, -97, 90, 465, 381, 531, 214, -173, -299, -284, -375, -207, 99, 289, 293, 308, 84, -135, -239, -215, -207, 28, 247, 405, 399, 88, 183, -256, -405, -441, -274, -14]
5367a4J52L08J3k52l54m3k31R7K15j01N14K6m9k9k51k86j06NJ82K27K35j36J91
5390C13j81l71j63l3L38P2J35L4P2M7j02j47l68q7L55LJ83J66J20k6l24j97r4
5413b55J37k99M92K07J44m0J2m37j01k20L8O7M19M3J16Q0j41l01j08k80L2J17
5435b78K06M45j29Q8j18j70k51j08O8j84M53K92n9N9l21l1l12m8J06L26O5K81
5457C80P1J8n16j9m11N8J00K48K17J5K67k09q3l10r2Q9Q5m4K47J74K8m6j67j74
5481g4m48J54J11L64QL08l1j33l85j31O3j51L10J80M0oK64k10m34j54n0K1L20
5504f4J81J72J63j84j51j64l11j85L40J96K1M41j36j36m72R2n4k77K40L36R7J95
5526C40j2l9k84l23q9k2J38L82J07J65J05k26k24j94k15M4J44J51L40J02j06m6
$$ y = [-14, 138, 446, 459, 207, -147, -190, -421, -324, -109, -210, 304, 330, 281, 252, 1, -285, -391, -386, -204, 23, 258, 122, 313, 132, -239, -402, -435, -97, -25, 110, 144, 216, 263, 161, 14, -354, -441, -86, -83, 100, 266, 386, 360, 36, -161, -255, -118, -417, 75, 282, 426, 386, 398, -39, -140, -360, -322, -255, 164, 207, 323, 403, 262, -39, -147, -427, -395, -278, -72, 373, 244, 332, 214, 44, -207, -315, -247, -431, 22, 314, 255, 314, -7, -38, -350, -398, -292, 34, 99, 380, 451, 469, -47, -66, -477, -419, -319, -71, 146, 161, 428, 219, 136, -174, -266, -177, -92, -136, 111, 285, 313, 267, 100, -74, -522, -368, -257, 107, 115, 423, 392, 259, -126, -257, -194, -345, -35, 145, 185, 179, 443, 233, -201, -355, -405, -384, -64, 117, 289, 452, 268, 117, -47, -358, -543, -203, -7, 14, 455, 319, 183, -289, -197, -251, -528, -288, 48, 145, 340, 328, 289, 5, -318, -407, -429, -291, 91, 198, 363, 468, 242, 18, -176, -391, -347, -203, -52, 288, 390, 284, 238]
5548B38k06l30j06k3K79J84L49k4qk62k79n6o5J50K3L31J76n6j78Ol09j29o9K07
5572a57J20K08K21n7k53j47Ql91N4J50K00J59K19J07l55j81j55l6M9J06J53J19
5594A41K50P6l04j91j45j11j29J39M60P0L8j5j19k06l32m2J04L83L8J32J45o7
5616C15l89Oj16k23J34L86J2J99L5l15j64q4L6j69jK73L62qK35k33k95m28J07
5639c25l0Q9K20K92K24l94Q2k67j15k91K03J99K16q7L66j36j00l19j48p4J68R6
5661a31M10R8L1n6l56j53j35j62L29J34J93L02m11N0k21J30m98J4J62L74KK78
5683C84J8k28l44j60k8n1J28L69J60k4Q3m6l35j72j44K1M29o6K08M2R7j12j84
5706D5l88j68J97L71J26J32O6k13j65k60j37M6N6L38N8K44J73j67l01j95O7j06
$$ y = [238, 32, -298, -404, -427, -148, 36, 385, 361, 353, 91, -188, -244, -309, -159, -136, 195, 371, 315, 137, 143, -166, -295, -364, -157, -37, 171, 392, 335, 82, -65, -57, -448, -394, -244, -44, 115, 334, 441, 86, -95, -250, -286, -237, -131, 22, 141, 391, 467, 163, -28, -173, -284, -413, -274, 186, 256, 294, 279, 160, -46, -378, -420, -316, 67, 105, 237, 382, 315, -74, -68, -184, -407, -273, 113, 125, 324, 359, 44, -120, -204, -168, -337, -338, -65, 297, 289, 524, 291, -4, -432, -325, -355, -266, -46, 246, 470, 76, 158, -109, -224, -515, -312, -113, 103, 16, 382, 246, 146, -173, -321, -395, -227, -131, 279, 377, 408, 352, -4, -157, -292, -454, -125, 9, 202, 504, 93, 143, -78, 52, -446, -432, -270, 104, 106, 384, 402, 174, -170, -330, -358, -409, -281, 88, 248, 224, 307, 261, -74, -246, -390, -369, 60, -6, 202, 244, 341, 229, 45, -343, -511, -314, 57, 183, 315, 381, 168, 3, -257, -394, -348, -292, 46, 104, 348, 521, 354, 53, -142, -75, -181]
5728a81r3O6M66J28J9k7l78l36k69M78j10J52K88K25j94K0l72j88j57N6K52K23
5750F8K05K10r5j92k71k16r4NJ50K51K90J25j55j81j27l04Q3r1J99R6K58J56o6
5773C04k19j06j31k62P4L73J62K57J2j02l31l28M9j02j0M12Q6K47n4M8m24l30
5795c75pJ6J94O8M88Q3M7n26m0k43k27K23L45j59K61K65K6m66j20K7m12O1M76
5818EJ58J60K9k7k66j06l27K7k6L18L23k2J80p8k81l02j22N1J95R1J31K40j3k80
5842E8k36k3j96J9O9K19L49m4O3k50j89r5p6J46o5L54J36O8n2k45Qn51J53N1J66
5867a63K85L02j78P1l12j50o3k19K57K9K65J72P9r0m4l74k31k1j43M53L63PJ06
5890D01l46j19k29r7J10J12J97K51J64l9k44k71K3k20j19J82K23J74J66J56m66
$$ y = [-181, -274, -208, 258, 386, 405, 378, 0, -336, -605, -127, -237, -85, 203, 428, 234, 254, -118, -306, -463, -407, -155, 68, 273, 483, 388, 196, -75, -291, -385, -380, -230, 21, 311, 436, 281, 100, -27, -331, -248, -339, -140, -44, 214, 370, 304, 85, -21, -152, -414, -340, 33, 195, 452, 464, 362, 31, -297, -248, -350, -360, 52, 138, 385, 331, 379, -45, -375, -382, -366, -172, -104, 384, 467, 514, -12, -52, -295, -522, -299, 46, -113, 148, 413, 439, -27, -147, -120, -532, -471, 5, 163, 323, 352, 325, 59, -47, -374, -347, -373, -55, 268, 246, 426, 348, 67, -235, -357, -306, -111, -20, 111, 351, 338, 58, -178, -201, -397, -378, -309, -90, 259, 215, 278, 28, -161, -256, -332, -186, -251, 103, 239, 307, 255, 10, 18, -533, -380, -329, -163, 122, 424, 246, 317, 5, -145, -208, -427, -170, -141, 124, 296, 375, 285, 241, -133, -364, -385, -528, -75, 288, 295, 401, 55, -64, -293, -390, -280, -168, 29, 280, 444, 405, 161, -110, -87, -307, -426, -244, -21, 153, 319, 475, 9]
5911Ij07k22k84K96K64K22P7K50l09k3k51q7j96mL05J35K53K5k3l02l49O7k03
5934d57Q2L37K05J27p4J68n68j4j64Q5jL60K07j0O1k02j42j71j50p2K57P3K28
5957A65J13j70Q5j64l00j49M9K17P2M30O9k76j2l29J17m54J21K68K87J38J6K8
5979C21k38k53j49J65j89K91J27K09J15j87k17k40l47M12l0P6K83O7K1o0j98j18
6001a39j11Q0L9J17M72j11J4k95l08J61j36k8R8K42J32k9K47k75m61L0k29K14
6023b76J06J67J64K25q8l52o5k59l0J35J38K18M94j64m8l43j97j20r4J39L20L2
6045A02K94n1M3l47k50r4m9P7K37J55J78jj18l00j59j22P1K32L13J72k69J07k5
6068A96n13QNm4L72j6K39J99j11j80k32k39p0J80K23J10J37%R8l55k74J1R3m0
$$ y = [9, -98, -320, -604, -308, -44, 178, 255, 505, 196, 173, -78, -165, -361, -365, -60, 75, 328, 353, 330, 28, -321, -254, -457, -375, -38, 167, 294, 220, 388, -180, -194, -358, -273, -274, 86, 293, 283, 344, 142, 0, -171, -321, -393, -136, -63, 165, 278, 108, 193, 29, -271, -420, -371, -154, -82, 348, 417, 141, 129, -200, -83, -537, -416, -148, 139, 277, 293, 321, 83, -170, -319, -154, -343, -52, 75, 284, 399, 212, -5, -245, -592, -180, -210, -134, 149, 216, 237, 177, -21, -139, -250, -170, -131, -14, 458, 347, 361, 66, -242, -81, -217, -245, -147, 95, 227, 198, 445, 170, -291, -261, -490, -276, -170, -3, 161, 386, 298, -54, -119, -378, -408, -273, -135, 83, 577, 413, 365, 22, -175, -295, -389, -250, 70, 102, 396, 345, 388, 41, -209, -303, -352, -275, -38, 117, 295, 294, 176, -124, -283, -405, -334, -102, 211, 383, 114, 221, 196, -317, -309, -304, -348, 24, 8, 247, 446, 335, 155, -77, -316, -386, -206, 17, 127, 264, 264, 362, 7, -267, -256, -163, -203]
6092b03K77p9K96K13k86k07j99k20qL42O6J60L20j12j03j52l51J31l73L42K47
6113A01P4K31j54j95j29j19k94P4K62L11J06j15K88l94r9k40j09L71j0K53J54
6134C67ok62rl51K7j24N8J74K31J64l6j90k0j24j52q0J06K43M13j97J9l9k28l21
6158c37k8O1J43K42K20J11k07j8l50rk25L5L01O6K97J5J83k98n12j63J3K71J41
6181d8P2L47L9j85l10j15q6o9K99n4L03J81p8k9j70l93J31q9P1O5J93Q6oR4k55
6206fl70M9lK17K66J80j33L42l43k31k02j9n8J92J06K44R2j66Ml27q9m2J90j60
6230b67L85J67J93o9l04k65k49m6J79J96J87J36J39k50j54j69j39j13L22K06J61
6251B46pK8j05k29l51Q7L9N4J73K51J1j56R4k39j57n8P1J96K61N2J1J31k30l83
$$ y = [-203, 74, -5, 291, 504, 218, 11, -188, -408, -416, -74, -8, 152, 472, 360, 257, 105, -246, -115, -488, -146, 101, 175, 406, 252, 57, -72, -191, -485, -411, -149, 162, 268, 153, 441, 47, -52, -292, -401, -30, -40, 213, 367, 361, 99, 90, -261, -234, -358, -300, -126, 105, 269, 233, 43, 23, -101, -253, -333, -227, 16, 429, 232, 251, 212, -16, -337, -365, -304, -161, 81, 301, 412, 205, 187, -163, -172, -397, -362, -61, 5, 302, 317, 500, 202, -310, -473, -460, -189, -48, 24, 371, 410, 225, -85, -200, -286, -355, -56, -110, 193, 374, 296, 267, 97, -296, -165, -254, -183, -118, 75, 161, 155, 249, -6, -376, -327, -330, -113, 153, 333, 200, 542, 199, -32, -234, -253, -311, -119, -13, 231, 323, 157, 161, -166, -255, -297, -107, -267, 118, 285, 478, 409, 105, -160, -409, -455, -276, -80, 107, 243, 382, 132, -22, -191, -330, -443, -121, 85, 246, 239, 267, 162, -67, -418, -331, -292, -238, -65, 186, 197, 41, 135, -104, -261, -319, -248, -52, 209, 261, 272, 403, 173, -210]
6275b10l3o0k15M10K09J98O3m1l05j33k48l7J44L73K47l3j41L9j54j95m11K24
6297c09L4L29K09J79k6k23k17l06N5q6K71L6K12P5r2j15R6k69o5n4pK91J71l5
6321A54J12j84l8l69L2J07O0K17J40J39k48j0j72l32J99o3K80Q1n6L00j28k49
6343b8k14L5j62J19J67K37Q8l3J05k90k63n6m4K54N4M59o6j03j08j19r6k78K02
6366a40M3J31K27Q3p7l52k36m1J24P5K88j44L44J28l24j02j59j79K02L0Q8J81
6388A90K4R0j15o8j82l16R4JK75K03P2R3k02j38j31j84n6M6J91L20K2P9l18l7
6412d7l03P1k8J48J68P7K41p5ol60k63M3J99J5J37K59n2N4j17k51p1j40J47J93
6436C9P7J36J50j71k0l19j39j54J46J49J86K30O9l3m49jk33n2L90J12R2mk8Q5
$$ y = [-210, -243, -303, -518, -108, 101, 299, 362, 321, 16, -117, -365, -402, -258, 115, 362, 329, 188, 227, 73, -122, -533, -309, -275, 54, 263, 442, 416, 193, -24, -330, -275, -361, -90, -54, 158, 233, 141, 26, 122, -147, -212, -266, -273, 18, 189, 154, 266, 82, 44, -325, -293, -186, -126, 91, 231, 370, 122, 112, -60, -392, -193, -256, 24, 105, 49, 349, 221, -28, -242, -207, -369, -250, -83, 154, 242, 209, 314, 24, -239, -295, -339, -85, -31, 428, 362, 259, 151, 32, -64, -342, -140, -97, 34, 261, 344, 267, -85, -321, -362, -238, -163, 125, -19, 325, 453, 129, 27, -132, -311, -109, -79, 9, 190, 214, 304, 189, 121, -61, -377, -283, -282, -7, 196, 268, 361, 159, 21, -110, -294, -350, -304, -113, 207, 229, 308, -10, -47, -350, -279, -307, -159, 9, 86, 327, 252, 246, -114, -377, -334, -135, -120, 17, 276, 224, 278, 161, -90, -161, -301, -154, 39, 116, 252, 402, 231, 211, -108, -247, -401, -255, -106, 80, 310, 379, 346, -103, -104, -337, -389, 1, 113, 205, 201, 173, 258]
6460B58l01r9j97J2Q1J80L02j81K43j58k45q1k08J58J69J67J57J22O9l75j71k56
6482c54Q9j8J30K09Q3K8qj44k54k0j7N9J32K99P8l0j33k67n2m8p3K76J1K58P9
6507C13k3q2j82j91j74J83J55J49ok1L04k76j32k77N7j1J88P4J24Q8j41j36L9
6530B2l46J07R6%J43%L84j47j53j93j15j30L77L6R8J52l7k6l02m3j85NN4K44R7
6555A38%L9n2j78o3q9J5j83L41K14J69j43p4j99J12l17J2J59K85J9M2j7j77q4
6579c1k73P8J1J43J70N3K75l01j54m2o3j06K42m0K01m8J70q8k45L3m4k73K06P0
6603e6K55P0j27k33M9pk36O5p2L51K01k34R4nj94o1k29K80k01M19J21j50K25l51
6627b6K7k75Q6J3J91J71qO2j45J16k69j41n8RJ62K96j74J48l5k54ln0j37j0L70
$$ y = [258, -43, -142, -339, -327, -246, -66, 236, 55, 298, 140, -105, -186, -394, -236, -67, 100, 257, 379, 448, 73, -98, -354, -265, -283, -153, 56, 139, 167, 159, 15, -239, -259, -276, -217, -85, 214, 292, 262, 129, -138, -190, -238, -311, -35, -24, 234, 313, 290, 208, 26, -165, -339, -156, -1, 148, 142, 121, 425, 149, 17, -260, -203, -214, -26, 48, 172, 260, 119, -17, 22, -324, -217, -121, -121, 22, 22, 406, 259, 106, -87, -202, -332, 45, 81, 179, 331, 294, 268, -34, -77, -262, -257, -203, 41, 138, 138, 177, 125, -53, -116, -205, -190, -373, -32, 182, 351, 208, 134, -65, 47, -270, -258, -99, 186, 205, 247, 230, 53, -31, -304, -226, -215, -72, 98, 151, 426, 125, -29, -71, -134, -240, 2, -38, 163, 115, 285, 197, -48, -15, -59, -332, -126, -56, 199, 269, 142, -91, -42, -49, -285, -220, -292, 59, 260, 26, 120, 115, -79, -140, -369, -89, -290, 129, 250, 100, 325, -26, 1, -274, -188, -175, 16, 187, 179, 241, 96, 212, -57, -198, -256, -247, -85, 211, 37, 185, 150, -104, -107, -157, -294, -304, 66]
6652F6j04J22K55k36K7l04nQ0K0K45J8J16J33k41j59k06K3r1j3M61j06L6J57j34
6676A60l27J26l25J23J32J24Q3J55l9j92j36j20Qo6K63N5J83k34K04k64q0K7j45
6699b85K23K3J50P3J10k19j27Q7k88oJ57J23J43N4k2q0j86Mk16J49J3K57j14J86
6723B09J84k68q9j72n8QK7K15M2J47r1o5j34k93M1K8J82K17p5R4R0k58j47k05
6747c71K07j26L16J06K3P0J76m69j65P2j26Q9K44N3J3J62j41j45j19N8j46P2j64
6770c11M92J12j18r5j01j15k27L01o3J73L1j6J90j46k92J4M6pJ15l3K70j30P8
6793A68j47k22j57K70j00O7K32n0J55p1m1j32k49KR5J19M3J96M8m1k17o3l8j75
6817c08L49p6J83N4J50m32n1l7n9%J08JM45j51j3k50J14j00j41L0o1L93Q5r1J04
$$ y = [66, -38, 84, 339, 103, 130, -174, -179, -99, -79, 166, 184, 300, 433, 192, 33, -173, -150, -241, -254, 207, 101, 137, 294, 160, -167, -41, -366, -243, -111, 13, 96, 251, 212, 20, -116, -236, -228, -294, -31, 24, 207, -27, 177, -87, -167, -140, -285, -62, -39, 111, 184, 294, 75, -52, 35, -253, -259, -102, 21, 164, 218, 196, 116, -70, -66, -282, -133, -120, 137, 23, 209, 393, 125, 36, -136, -194, -186, -159, 56, 98, 245, 154, 89, -45, -338, -297, -269, -87, 130, 55, 149, 239, -19, -166, -371, -164, -290, 26, 132, 155, 225, 401, -68, -233, -161, -287, -198, 46, 99, 112, 274, 133, -12, -131, -73, -219, -147, -311, 181, 293, 175, 80, -21, -136, -363, -62, -125, 48, 79, 63, 253, 107, -185, -171, -125, -132, -17, -50, 220, 90, 168, 21, -201, -358, -88, -188, -121, 111, 61, 216, 145, 104, -28, -277, -275, -180, -61, -18, 178, 226, 185, -32, -95, -133, -308, 41, -35, 148, 202, 352, -80, -131, -168, -227, -227, -119, -118, 327, 176, 163, -87, 27, -73, -214, -184, -245, 148, 233, 142, 246]
6842B46o3k54j05M4R3L2m2L14j70K47l22k45J77q7m9K62l4K05q9j68p7o0N3J89
6866I7k32Q9O4L7K37k13j09k51L09k00oJ07K87k32L00j67j91q6Pj11L15j1J10
6889A50J09p0l17l9Q8on9J93n8L5J60j10p3m7k5or6O0J3K44j21Q0l1j4k62jJ08
6916i5J36p4K59o8j03nj42j4N6m7p4K54N6L0j7j98J67l42R8q6K78J89k4q1l3j86
6942f6m3P0j42M4J45K70n3j12J33k48O4k61J23J4K29J7K7q4p7j07r8o4K01R9j84
6967a03J83N5O6l29J25k01L3P0l6K54K19k19k16K08l22K9J4J16JL32p2k05K26
6990B28j64N4j71k9M3K01j47J42J1j41J64j79j06K8J16j28J87R5j31K2k00k2j4
7013a41N6l0L03q3O0k1j83K2J8r6K00j32M0L01j02j29N3l58J93p2J42n9P3O2j33
$$ y = [246, 183, -71, -176, -132, -39, -7, -49, 265, 95, 342, 20, -225, -48, -135, -184, 78, 44, 249, 160, -8, -85, -145, -92, 97, -135, -46, 18, 55, 292, 79, -30, -281, 28, -172, -178, -71, 216, -16, 284, 117, -74, -160, -153, -264, 51, 40, 150, 259, 189, -128, -167, -79, -85, -144, 49, -9, 26, 186, 76, 3, -44, -69, -75, -171, -111, -98, 146, 25, 105, 74, 60, -202, -203, -95, 41, -33, 226, 158, 55, 50, -92, -106, -50, -97, -171, 83, 139, 169, 152, -46, 121, -221, -123, -209, 69, 258, 234, 153, 120, -66, -109, -39, -181, -137, 8, 278, 225, 113, 246, -2, 62, -199, -76, -62, 167, 184, 211, 127, 50, -57, -155, -219, -18, 81, -103, 80, 135, 201, -128, -3, -204, -171, -101, -137, 117, 336, 117, -99, 109, -213, -184, -170, -54, -53, 279, 207, 2, 228, 64, 118, -53, -82, -39, 162, 15, 157, 168, 27, 191, 12, -94, -66, 50, -78, 109, 204, 73, 95, -105, -127, -141, -85, -115, 188, 105, 165, 144, -39, -17, 1, -95, 105, -27, 13, 314, 212, 83, 136, -222, -29, -101, 41, -18, 55, 117, -16]
7038a6J68L2k90M4j97J01J74p5J34j62J08m6j26O4p5N9K42j92P8L5K16l02j65
7061a91J02r5J67L6N4r2J66j24P0k29P2n9lJ03J21L9j4N6l32k1K5j03J67K50M6
7086B11J5j51j25J27l10L0K14n1J34o1N2m0O0j80j05P9j6R3K26j51J7n0R2j71
7110f1K56m94K28L5L6K23P9j20l10K00qj66M1J5J50M7j64Q0j04j26N8p4M2K21
7134H4k0R4J28j32j18p6n6O2l0K07n4L9q1j02o5m5J41j28J06L5J3J43j15q9p4
7159a33q6JJ24N3O3L0j08M2Q6k17j12J96j84K82K0J52j21m9r0l9j54J28r5J13
7183i8M6J95K18k91o4j87J52L1j95J74L18k00J40k83N9q2K8k0k01L47m0nj14l
7207g5p2n7P3K53m7o2J51J37k32j3o7k9M3j78K42j1l3P5k6J4j37j05L8J1Q9J84
$$ y = [-16, 152, 184, -106, -62, -259, -158, 16, -59, 75, -87, 21, -25, -151, -87, -162, -103, 139, -53, 25, 60, 276, -26, -191, -89, -184, -17, 19, 73, -19, 147, 23, 93, -136, -64, -123, -126, -23, 98, 137, 123, 179, -153, -174, -149, -252, -85, 165, 211, 226, 75, -50, 77, -233, -203, 11, -40, 94, 33, 85, 45, 105, -75, -180, -101, -117, -24, 202, 51, 68, 18, 110, -61, 195, -299, -71, -36, 0, 223, 302, 182, -128, 72, 64, -102, -61, -46, 104, 151, -13, 67, -37, -163, -105, -179, -137, 84, 64, 158, 286, 154, 36, -40, -96, -34, -64, 143, 89, 128, 47, -55, -120, -165, -24, -152, -46, -11, 2, 145, 30, -59, -133, -219, -218, -94, -41, 22, 52, -56, -14, 72, -145, -257, -61, -245, 37, 57, 209, 88, 39, -51, -90, -244, -116, -211, -98, -52, 143, 361, 70, 6, -181, -29, 2, -193, -19, 299, 99, 239, -44, 15, -67, -39, -59, -260, 87, 47, 42, -72, -75, -147, -204, -131, 122, 75, 13, 164, 301, 69, 56, -11, -40, 3, -175, 67, 56, 23, 98, 72, 86, -51, -156, -118, -107, -18, 166]
7233A66r9N4Pok48O0K6r8RJ20J83Lj65n8k9j5Q4k0j3J09J03q2j03n9J64j68L9
7260c6J01N0mJ4j00rj0k10J67j44J94N5MN8R5j40k7j7Ko5j56L06J6q8J00j36k74
7287b54Q7MO5n9J91J02r9o9Pj37o8m9L30j0J35r2m0k6N4k96R1p4J74R9o0l8K03
7314A71j35j56J36l17J81Q2J69J1Oq8j24O3r1M6j10J3K76j42L4N4oj15q5J16j28
7339a39N2N6J72L1j49O5r7j6n9Q1j22J52J27M1l73J07j56J59J50k03K35m8l5Q4
7363A15J37l89J55r4M5j42J41Q9R9O5Mj86k2j82L8J42P8M7Kk6k3k26j31K73k44
7388b35J50rO1J79k17J83j59K8K9k3M1n5K38j69oJ29k37J22p3k18J71J70N5J08
7412B63j55k48j4O4J24k44kL34L9k01J36j12j99K65k01J19L9J31L3k12K82l45
$$ y = [166, 67, 121, 128, 122, -126, -66, -40, -138, -129, -9, 174, 177, 12, -46, -75, -90, -6, -26, -39, 70, 173, 91, -12, -71, 93, -75, -36, 65, 115, 111, 125, 25, 16, 6, -204, -37, -181, 13, 68, 72, 130, 225, 85, 58, 41, 43, -22, -178, 128, 144, 56, 156, 20, -254, -167, -163, -98, -157, 34, 136, 37, -32, -25, -162, -230, -279, 51, 41, 176, 84, 44, 18, 72, -224, -133, -207, -33, 66, 6, -32, 171, 36, -120, 16, -301, -120, -38, 131, 142, 148, 60, -64, -1, -92, -46, -156, -143, 133, -9, 25, 79, 73, -42, -127, -11, -139, -87, -31, 141, 172, 23, 88, -9, -25, -84, -3, -125, 27, 154, 195, -178, -71, -227, -68, 82, -121, 114, 66, 31, 115, 252, -137, 18, -76, -31, -173, -32, 57, 156, 221, 225, 39, 17, -165, -127, 15, 93, 140, 142, 116, 93, -133, -264, 9, -235, -85, -94, -33, 146, -71, 112, -47, -19, 10, -13, 28, -27, 211, 42, 36, 165, -72, 50, -23, -241, -70, 100, 155, 263, 108, -140, -154, -90, 34, -210, -212, 122, 161, -40, 96, -16, -215, 50, -151, -32, 7, 138, 171, -41, 241, -104]
7434a04j36R7j41J00K25l6K62j10k03l1j06PN1j10K07L1K27J6k98J88O3l44K74
7457A29p2M4J03o3l5N0m02J70p0m6J84K62j21M9j25l5k07k8J46j25K07K64m23
7480a44J26J76m1l10j9m7K84J04j20K88p7j91L1p1p3P3j59L89j65R9P7j25J35
7503B40l72J84m20K58R3M0Q1J85k01j99l5j23J70J3k7L70l21K11p4n5j16j36J37
7526i7Q0J40o2L04j69K7j78j82j05K25J50K0O7L2j43j02j27L2j28J90j3R9J27
7549A87j06l5j56m4k6L6M9O3R2k3K74k84j12j23P6k8p5L78k43L73k04j3Kj07m9
7574i8J04j09J44O5J62j31J9j52j14j47K52j03J60K3p2J54j51L6j62q1R4J02Q3
7597G8n8Q5j5k40J36m9k12J05J17K19O6j12p0J15l11M2L4o4K17J00O5j6k62P4
$$ y = [-104, -240, -143, -284, -184, 41, 5, 267, 157, -46, -77, -183, -176, -125, -235, -28, 3, 230, 246, -52, 136, 199, -145, 129, 57, 101, 204, 141, 106, 156, -246, -76, -146, -192, -8, 254, 133, 182, 57, 22, -185, -213, -67, -192, 15, 279, -144, -18, 158, 117, -193, -212, -259, 25, 129, 9, 297, 220, 29, 60, -11, -84, -11, -170, 219, 54, 153, 230, 105, 240, -132, 52, -368, -110, -17, 23, 104, 289, 88, -111, -146, -269, -99, -86, -113, 257, -64, 147, 73, 18, -98, -234, -97, -17, 123, 61, 365, 196, 223, 45, -137, -242, -17, 133, 153, 220, 252, 109, 7, -120, -88, -216, -26, -39, 60, 187, 81, 46, -110, -154, -180, -144, -95, -32, 60, 37, 311, 27, -85, -208, -132, -160, -235, 143, -100, 273, 69, 56, 58, -49, -98, 6, -103, 41, 106, 268, 137, 156, 4, -110, -257, -5, -108, 52, 75, 3, 157, 6, 42, -120, -201, -107, -5, 78, 20, 105, 90, -150, -14, -63, -275, -170, -53, 166, 232, 120, 50, 165, -146, -104, -70, -134, 83, 183, 248, 232, -30, 44]
7621D4Q1k05j95K03M7J90KJ14l24J6k19RK30M3L6O4K53k79j75J97k09j11RJ53
7645b6Q4J28J84j91k63L0j32o7J34J26L3K9j00j2J15j60l5k06K71r8L24Q0m4j85
7669A9n2q5r6N0R9L9J69O3j29P8j98o8q0M1J24N2R7N4rp3o8k81O4J70J30n1N7
7696A16P6j93lnk48J10l0P8M12N3j64j97J56l91K22k36L04o0Q3R1K4k13n8j75
7720b48J54K4j9L00k9M5k60L9K8q2j83M7K59l8J60P8k07o2j5k37J05P1K20j74
7744b4K80l6M8m07n7j11O3J21J23K73j93K38j66k96M4j62J12M5K99N6r4O7r2o6
7768F5l90J01O1J97J63m5J50k24j7j97L8k46P8K67m4K10Pk7j75L4k37K6J29J3
7792f3R1K36j26L4j17n8k11K0N7o0M07j03K22k30j69q5M1k4j09K12K38k73J63
$$ y = [44, 125, -80, -275, -72, -25, 165, 167, 281, -43, -27, -246, -237, -7, 36, 72, 136, 389, 110, -65, 132, -77, -188, -179, -26, 58, 186, 370, 179, -84, -54, -186, -253, -119, 7, 40, 69, -31, -43, 72, -88, -123, -329, -58, -156, 168, 248, 204, 19, -33, -118, -214, -164, -65, -26, 143, 206, 77, 155, -43, -111, -191, -150, -26, 26, 123, 177, 168, 95, 27, -254, -190, -20, 110, 59, 116, 192, -1, -4, -9, -257, -147, -177, -99, 313, 366, 202, 5, 161, -230, -8, -244, 60, 0, 83, 174, 198, -15, -73, -248, -94, -70, -89, 211, 182, 227, -33, 6, 34, -48, -231, -184, 75, 37, 197, 275, 68, 6, -9, -246, -141, -70, 150, -24, 256, 220, 268, -139, -196, -307, -244, -123, 0, 273, 80, 318, 152, -144, -100, -262, -150, -105, 194, 250, 156, 223, 131, 65, -325, -224, -163, 34, 197, 152, 302, 78, 61, -136, -98, -344, -266, 1, -43, 167, 174, 147, -28, 6, -231, -205, -76, -63, 28, 264, 138, 172, 55, -3, -214, -194, -137, -197, 210, 107, 329, 99, -70, -155, -114, -138, -247, -35, 203, -70, 93]
7815I3r2q0k97J19K43k48K41J18j5q1J83k12k68L9K5O7K31m7O6J36k60k3q0j47
7839b89K22Q4L4K08N9j28k03L4l72K26n1j53M60J75o3j35o0k28J3j04N4K39O9
7862I1J09j37K0p8l39R5J04j93K58L73j25J1k03q7rk64K41RJ81J84r6J83k30j17
7886a9j82J5j00K65p6L13nr1j05j89Lj38J38J17J61P1j5R8m00K4oq2J61p8K28
7911A08nJ08k24M5j93j34J83M5J1J88j51L15j76k06k55J83m9P4K02J15q4j59J40
7934H1j4j29j43K13P8k6J34J25j21j15k78m3n3J92O4J2K16M4k63N2M3k70q9J79
7958a11J9M34j85J64k76N8j25j93j31K4L30J22O0j17n5%l47P5K6P2L24N9R1k38
7982H0j3j73q9Q4j71L73O0k7J23j08l16L5pn1P5oK77J77n2j13j20m9k51M0J47
$$ y = [93, 1, -79, -376, -257, -14, -262, -21, 97, 82, 1, 184, -28, -296, -257, -232, -165, 66, 19, 85, 221, -39, -62, -142, -289, -67, 17, 51, 259, 318, 190, -13, 21, -351, -125, -176, -329, 131, 306, 243, 108, 48, -180, -167, -271, -217, 22, 91, 200, 63, 83, 5, -334, -239, -135, -328, -70, 303, 178, 189, -14, -101, -110, -374, -133, -124, 57, 241, 145, 328, 98, -19, -201, -186, -286, -21, -97, 216, 211, 120, 15, -174, -171, -309, -171, -54, 107, 178, 163, 261, -139, -115, -121, -203, -42, -120, 108, 103, 211, -13, 32, -161, -295, -112, -67, -56, 132, -19, 296, 120, -86, -341, -158, -207, -133, 69, 184, 100, -59, 81, 67, -62, -205, 8, 86, 60, 194, 319, 198, 83, -195, -238, -291, -99, -35, -23, 193, 237, -26, 26, 69, -201, -290, -111, -92, 342, 157, 321, 45, 103, -22, -215, -346, -322, 8, 130, 190, 73, 18, 18, -329, -254, -228, -156, 168, 227, 318, 80, 67, -106, -195, -111, -282, 91, 151, 124, 247, 139, -177, -142, -149, -200, -125, -131, 146, 323, 271, 158, 38, -11, -262, -222, -75]
8007g5J99k22L32Q0k89N1p6k08J99L5nJ06J02k4p9m34J05o7J26J00N1J59P3j3
8031B26k10P8k27p7k08K69Q6K09K12k60J62n44K3o3Q0J49K01R0j5J16k58n1k42
8054b54J00J24L6J78M1p8k0j76K17l48q1J04K19J90L7j97K6o9l76Q3m2L46j06
8077d6K22Mk9j6k32n5r1LJ13K75l0J14q5j50r3k92J06K53P3RJ75j64L4m3n5P4
8103G4k49k18M26J25J47l11L47m19j44J0k2J53r5L15j0K2m2r8N0l16P6NK05K08
8127B39m3m3p2r2j38o9j78M89L3O4m8J18q6m6j59j55m2R7K60m1J22k1l07q7j49
8152c54K42Q8l7J58J41%o3q8r8j44q9Q1J10K32J43j95J09l63N4j39p5M03m9M0
8176A07K10j71k4j49j47J7m9K91N6j1j7J23j78j34j54
$$ y = [-75, 124, -98, 234, 314, 25, 76, 0, -208, -9, 26, 21, 127, 229, 205, 126, -308, -203, -270, -144, -44, 7, 166, 239, 226, 16, 94, -133, -210, -418, -149, -63, 146, 358, 98, 260, -284, -261, -324, -244, -95, 106, 196, 181, 297, 39, -12, -254, -154, -30, 6, 184, 225, 147, 127, -49, 168, -180, -261, -157, 62, 252, 289, 92, 118, 49, -327, -244, -286, 60, -46, 176, 180, 151, 135, -97, -152, -243, -240, -127, 148, 118, 232, 147, -3, -96, -388, -282, -29, 44, 53, 228, 64, 98, 55, 0, 74, -175, -393, 33, 158, 305, -6, 341, -78, -222, -212, -234, -81, -176, 139, 129, 151, 109, 11, 61, -255, -179, -174, 31, 239, 196, 153, 81, -11, -149, -218, -396, 93, 126, 190, 142, 260, 174, 128, -31, -186, -228, -131, 129, 88, 210, 189, -118, -205, -354, -112, -24, -61, 97, 238, 238, 175, 87, -11, -155, -244, -163, -53, 179, 322, 127, 236, -127, -73, -212, -287, 116, 67, 107, 317, 146, 122, -27, -174, -157, -206, 85, 141, 130, 113, 236, 58, -76, -230]
8191b30
$$ Imaginary data points
##PAGE= N=2
##DATA TABLE= (X++(I..I)), XYDATA
0@%%%%%%%%%%%%%%%jJ7l2L2l2L3l4M9o5O6q2R8j14J31j48J67j84K14k46K78l11
36a64L47l93M40m90N44o01O67p41Q22r08J004j106J216j338J475j626J791j976
54a037K183k416K682k988L344l763M263m877N653o664Q046j0047J3220j9018L2888
69B1469j20920j27066K84458o979j59917J26403J87690j71360j35809J42835J2641
80E3445k07873N5106K09934q6077j48812J91634J41748k16806j29057J65829N35
91B9606j88090P2475K16509n7066j11138J17832K3076k14873k4402J95386k6942
102C2373j59031J18548J73544j27212j25396J34732L8028j84289j8957J55209
112C7549k6077q5157J39397R8173j71241r2245J32078r657j63616O6544J92434
$$ y = [0, 0, 0, 0, 0, 0, 0, 0, 0, 0, 0, 0, 0, 0, 0, 0, -1, 16, -16, 16, -16, 17, -17, 32, -33, 33, -49, 49, -65, 66, -82, 85, -99, 115, -131, 147, -164, 183, -210, 230, -260, 284, -317, 350, -391, 431, -477, 527, -579, 637, -701, 774, -852, 939, -1037, 1146, -1270, 1412, -1576, 1768, -1995, 2268, -2609, 3044, -3620, 4426, -5621, 7599, -11419, 21469, -99451, -226517, 57941, 50962, -108955, 17448, 205138, 33778, -102031, 40804, 53445, -154428, -99322, 110612, 24535, -124277, 67357, 209105, -7701, -136758, 29071, 29606, -158484, -86009, 130500, 73434, -37704, 80128, 103204, -111669, -136071, 59315, 32373, -126658, -8110, 165434, 38222, -87174, 47558, 85586, -98703, -117660, 37549, 11472, -73685, 65712, 163885, -7356, -99601, 32477, 22820, -140796, -74252, 118182]
123A18182n2720j23639R3835O3592j44592m5523J25220k4219j20600R2277J38666
134A20479r1376q1908J19415J7300j80835k6628J52457P17q6868Q9924R1746j15740
146H683p8697R3273j992j21574M4014J35001n1580q9551J01144P2154j25108o4381
158g8614R1776o954r8811N9139J21615m4993o5330P0593O085j30466j3492J17545
170B8093n561p9192O5882Q6318p7662o6355P1402J1068j00537L792R2532j8459
182A1321m9029P9584N3988r8272n7860O5031m590p7782M4377J03120k8699o1473
194b0284M7782K0016q6966k0010P4631q794o1094N0881P4265m7297m5481N3035
206C0684J744r0553q125P7776J073l4649N3789M2111o9745m6615M4825j064n7301
$$ y = [118182, 65462, -58177, 35658, 99250, -45342, -90865, 34355, 10136, -110464, -18187, 120479, 29103, -52805, 66610, 83910, -96925, -123553, 28904, 29621, -57247, 32677, 124423, 8683, -70014, 23259, 21267, -100307, -56293, 78708, 27128, -62423, 38721, 110875, -14233, -78614, 13162, 6208, -92603, -33464, 88151, 43158, -22172, 48421, 54506, -75960, -89452, 28093, 22532, -56660, 9222, 95540, 17878, -48477, 22925, 33993, -66544, -62752, 29780, 11321, -37708, 41876, 95864, -2408, -60268, 4763, 173, -77609, -33232, 69888, 41189, -20284, 27498, 47514, -39452, -59462, 15169, 6375, -54719, -3838, 70427, 23130, -22351, 30684, 32428, -58125, -66250, 11526, 12599, -22050, 31739, 73850, 4105, -42510, 2315, 1251, -56050]
219e6050K7382P1947k1039m1398M4379K5685o4329k8807M3183p214m3584L8681
231a1164O4146k2541l4089K8584m737o6369p020N8265M845k6659L4983L3860m2812
244I292l3203L0052l48m6119Q402M7775n381j9063L6230K0392m9067l0736K2635
257i139l669k7097L0342M9671j2092k6815J5460j222m3637p566L5450J247j9216
270a8283K5554L0077k1226k0938J5396p086l8638N47L5904O104n875K5429J1630
283C8595l6153k5710J1889j156j5655J9420L2524n416j4808J2326J436k9207j1896
296b3811J4989j399q959K1675K7286p225j4792J736j1779k7670j13K5381J0107
309E426J43J5107O517k1262j7263M175k879j1585Q514K0389L513j970J0425R6
$$ y = [-56050, -28668, 43279, 22240, -19158, 25221, 50906, -13423, -42230, 953, -6261, -49845, -11164, 52982, 30441, -3648, 24936, 20199, -46170, -53190, 5075, 9920, -16739, 18244, 52104, 9292, -23911, 6141, 5793, -40326, -31924, 15851, 10470, -8593, 27637, 48029, -1038, -31774, -9139, -12808, -39905, -9563, 40108, 28016, 1201, 16661, 15439, -28198, -35764, -314, 933, -18283, 7271, 37348, 16122, -4816, 10580, 3494, -35144, -34597, 1307, 7411, 1536, 26965, 38595, 2442, -23268, -11379, -12535, -28190, -8770, 23754, 18338, 3530, 15856, 17292, -11915, -23811, -8822, -10221, -19180, 2495, 29781, 22556, 7764, 9500, -2279, -29949, -30062, -4681, 5426, 5569, 20676, 27193, 5931, -11332, -7157, -10036, -21621, -13107, 7282, 10795, 8825, 19250, 19346]
323A9346k1605j5983J743l74M72J8847K1235j255j0954m796j0331j6823j557J3831
337h204P630K939J0492O915q008j0327l986p619j0640L024J4466J0982O628O768
351B1060l310j6382j5186m274P23N150J3208J3538K765m632m695p662j0542n299
365a5538K128M544O877J0673Q606J50p253j0789j1465p645J507J0563J3236R449
379A5043L377m256j0053j1130p025j176M155P094Q421P412L030k610o758r260
393c736r232m574L169J0256J1025Q381L089n460j2430j1097n161L20N595J0868
407A013R484L399j299l986p879r481n168N58M070P400J0740P680j139o880r469
422i57j0209o804K738R850R905P391L928k866r285r384m962k619J300P260R319
$$ y = [19346, -2259, -18242, -16499, -16873, -16401, 2446, 23681, 22426, 11472, 6676, -3655, -20478, -22035, -8204, -574, 2365, 12857, 19772, 11764, 1437, -2549, -10168, -20808, -17784, -3318, 7664, 14292, 21060, 17750, 1368, -13818, -18092, -17369, -12219, 989, 14527, 17292, 12660, 7965, 303, -10239, -15538, -13410, -8866, -1989, 8684, 17290, 17440, 10187, -602, -12067, -19712, -18205, -7642, 5594, 15043, 18420, 14164, 4111, -7019, -14044, -15220, -11065, -3971, 4450, 11862, 14892, 12282, 5524, -3736, -12968, -17542, -14373, -4117, 6908, 15289, 18378, 12918, 488, -10609, -15770, -15450, -9855, 1013, 10497, 13896, 12597, 8611, 732, -8749, -13917, -13359, -9289, -1889, 8851, 16531, 15392, 8512, -957, -11166, -17970, -15232, -5382, 4523, 11914, 15842, 12976, 3691, -5693, -10655, -13274, -11974, -4714, 4605]
437D605O050K739o88o766j0920p973k358L024Q011J1256P790O69n455q611r423
452h050o232N14N862P629P686N119K41m459p586p964n674n15M875Q155R107O087
468A4795q19o579r092q451m928K106Q201Q562O116L671j561p917q531m873k810
483a2110oO846J0400N365J587n11n827j1376p676O47L182M762J0692Q887j888
498A2974o159m712p088q900n8Q473N677L568P910L414q069r230k911m710n459
513a5280O241J2866N051J27L791k766j3898q414K711Q65n65J0574J2383j721n912
528F053L78n268j3779k688R358L504Q00J1275Q086r298j0035M45n228j0541N126
543a1812J5081L034j572Q096J361j5730r395M943j814o140J1151J5794k607o017
$$ y = [4605, 10655, 13394, 12706, 5940, -4980, -12953, -15311, -12287, -4276, 6980, 14770, 15439, 9984, 1373, -8050, -14282, -13768, -7906, -277, 7409, 12528, 12769, 8310, 724, -7240, -12914, -13429, -8554, -399, 8708, 14795, 13976, 7397, -1695, -10146, -15074, -12968, -4767, 3795, 9911, 13582, 12021, 4104, -4427, -9300, -12110, -12116, -5270, 5130, 10495, 12082, 11571, 5744, -5632, -13308, -12661, -9479, -4717, 5975, 14862, 12974, 6815, 2103, -4985, -13885, -13943, -5470, 207, 3775, 11685, 15099, 7030, -2200, -5111, -9821, -15280, -9039, 3827, 8878, 9005, 12796, 10030, -3868, -12282, -9571, -8706, -9271, 1303, 13686, 11965, 6053, 6431, 1163, -12616, -15304, -5946, -2442, -1642, 9633, 17719, 8421, -1614, -1169, -6397, -16938, -11812, 3269, 6303, 4731, 12827, 14188, -1542, -10937, -5994, -7808, -13948, -2797, 12997, 10390, 4373]
557D373N480l137j8093m673J1261J127l354J3827J2326j0403j0551M852m466j6147
571a7578L176J7208Q84l852J2415O063j7573j0803P463l011j1612J0541J9353
584A2674l551p809R742N35k0932o530J2969o18q269J4528J6948j0528j1280Q760
598F639l061k0742J61J9425n2p204J4932J0795j8216j2223J0105l005j6502Q521
612a0427K1670l819r248J3740M468k2905r671J4785j414j2584J4371K0297r959
625I304j1805J1243j700k3132j280K0308j588j0767J6511J4786j7540j3011J2354
638C683k259k0613N762K2187l597r078J6421O807k3825j0421J5466k778j6155
651a8400J3589K3204r384j3000J3394J772k4204l855J9226k690j2553J7151J7692
$$ y = [4373, 9853, 6716, -11377, -16050, -4789, -3662, -7016, 6811, 19137, 8734, -1817, 3035, -1431, -17578, -14402, 2806, 3690, -162, 12253, 18316, 743, -10060, -2597, -5608, -17220, -6679, 12674, 9123, 1314, 11056, 11591, -9341, -15871, -2902, -3520, -11789, 2739, 19687, 9159, -2121, 6639, 3578, -17164, -17003, 2422, 2370, -4834, 10098, 20893, 2677, -9546, 559, -2446, -18948, -10427, 11243, 7424, -1824, 11916, 16384, -6521, -16192, -1407, -2821, -15405, -1034, 19263, 9304, -2501, 8742, 7042, -16090, -17370, 2938, 1350, -9417, 7094, 21880, 4340, -8671, 3683, 1424, -19189, -13427, 8760, 5163, -3915, 12506, 19313, -4512, -14933, 533, -2245, -18400, -4811, 18393, 9009, -3991, 9403, 11175, -13029, -16884, 2342, -348, -12901, 4250, 21942]
664B1942j6559j3142J4749j821k4946L005K4642k407j1721J6449J0256k2509j1376
677a3438J5791k859j8959J2130K4190r963j3526J7322N839k6120q198J9430j807
690a68j5198J5876K0451j4039j3015J4295j740k5497K291K4728l463j4428J6995
703G088J4696k0952j2993J5396j034k0122P716K2518p200j1111J7796O209k5910
716g903q818J8931j913j6982J3903K2532j1553j4024J3110J092k2845n30K0544
729E544m099j3062J7137J5957j9108j2304J5541j050k2848M492K3393l786j0982
742e175J5291P567k2980q829J6851k703j6950J2948K1847j1525j3751J5379M749
755A2719k3370m697J8624k753j2995J5104J6986j5429j1225J3800j851k2962L911
$$ y = [21942, 5383, -7759, 6990, 5169, -19777, -16772, 7870, 5463, -6258, 10191, 20447, -2062, -13438, 2353, -506, -19465, -7335, 16855, 6892, -6634, 10688, 16527, -9593, -17791, 1639, -168, -15366, 510, 20961, 6922, -6093, 8202, 6462, -19035, -16744, 7984, 4521, -9907, 7088, 21784, 832, -12161, 3235, 2201, -17921, -10205, 12313, 5113, -5998, 11798, 18007, -7903, -16721, 2210, 297, -16685, -2782, 19750, 8197, -5827, 7283, 8375, -14470, -15000, 5544, 1445, -11617, 5520, 21477, 2369, -9935, 5606, 4556, -18292, -13800, 9593, 5807, -5175, 10116, 17683, -5297, -14126, 2725, 22, -16928, -3980, 17867, 6342, -7409, 7970, 12719, -10651, -15348, 3276, 523, -12472, 2632, 19618, 4189, -7036, 6764, 4913, -18049, -14138]
768a4138K3131l510j2526J4293J0574j9636j0070J4349j155j6731Q897J9470q234
781D714j0177J5226M316k2399o774J6746j478j2812J3040J7294j1344j1870J0767
794E249l67j8731J809J8229l511j0961J3712J1520j6202r552J2166j317j6889
807a4845N413J8322l780q235J2289M047j9426o513J3675j352j1695J1045J6155
820A5100r772j0271J0571J619j7365j493J4633k283r085J2305J1630j2603q948
833e962R484k014j5912M600J7151k311q068J0216N247j5760o789J0939r69j0625
847a0773P524J3928o161p411R716J702j5825l976J1440q52p092J0492J1308r201
861D819q592O227j106j2540K206J3471j206o514Q505O012j1322o541P566j719
$$ y = [-14138, 8993, 5483, -7043, 7250, 17824, -1812, -11882, 2467, 1312, -15419, -6522, 12948, 4714, -5463, 9763, 14079, -8320, -15094, 1652, 174, -12638, 402, 17696, 6352, -5518, 5249, 4882, -13849, -12040, 6189, 2678, -8283, 5429, 16949, 747, -8805, 3361, 2044, -14845, -9432, 8890, 5110, -3125, 9164, 13211, -6215, -12728, 947, -405, -12100, -1055, 15100, 5328, -4943, 5628, 7247, -10118, -11611, 3022, 739, -8346, 3959, 15589, 2986, -5962, 3522, 1508, -14404, -9804, 7347, 5036, -3032, 7184, 12431, -3329, -10118, 821, -148, -10773, -3249, 10679, 4518, -2893, 6823, 8525, -7300, -11276, 164, -688, -7780, 2712, 14020, 4819, -3773, 2454, 1348, -11192, -8986, 4485, 3279, -3235, 5270, 11282, -40, -6581, 985, -734]
875g34r958N180J2392k272m744P070J245j3251m790Q396O2n098Q053R533o212
890D872p106N013l40j0170r8R172o48m315P589O285p630o022L895k254q057L685
906f129J0634Q6l648N055J010j0152m266N622K09l969N094P501k945m106L818
921C814m87q636k034N645M85j665O347N790m997n455R99j824n702K229P643J073
937C225k053L322J340o083l905K618p85l368L356O196R9j582K158j241o784k986
953f473K978J434L21M608M122k699m113k60j399l726O47M227J104o5K855J677
969E238l026l213r61j557k198K591M949K091jL26j712m597k698J046J273J106
985a343K705K654l54j577q12j696k702j009J223J428K288K617J531j189l241k674
$$ y = [-734, -10692, -5512, 6880, 4608, -136, 6934, 8179, -5072, -9862, -1466, -1404, -6502, 1551, 11084, 4872, -2234, 2779, 2439, -7731, -7829, 1343, 695, -3620, 3969, 10254, 2624, -3398, 497, -1757, -9814, -6129, 4505, 4591, 943, 5998, 7008, -3144, -7410, -1788, -1579, -5548, -454, 7047, 4102, -4, 3814, 3327, -5309, -7343, -1698, -1213, -2878, 3469, 9259, 4262, -1193, -194, -2018, -7720, -5491, 2152, 3225, 1172, 4494, 5834, -249, -4154, -1536, -2321, -5689, -2333, 3863, 3962, 2380, 4538, 3297, -3487, -6473, -3495, -2061, -1740, 2868, 6990, 4291, 178, -82, -1481, -5207, -4560, -333, 771, 706, 3561, 5238, 2212, -1001, -1962, -3519, -5717, -3126, 1823, 3914, 3913, 4239, 2527, -2070, -4768, -3722, -2449, -1343, 1362, 4016, 3662, 2085, 1273, -423, -3125, -4134, -2911, -1483, 805, 3422, 4953, 3764, 523, -2151]
1001b151k013l73J642L172K765Q26m84j500j999k082j021L15J105J553J937J882
1017C574J38j456k098k223j822n65K270L412J858P49n1k216l252j844M99N68J190
1034a269K348K021k37j027k18j569l011j209J685J249J456L070J587k156k705
1049A5j497j616j284J869L544J205l36J229l97l254j921N19m05q21K230L368N69
1066C017o11L66j662l930j622J728J474O78L096K117k095k701j88j034k315P25
1082b957K986P05j19K172R93k695k486m1j045j562K394M029L88l44N65j209m027
1099b253j632J804Q79O6K465K205j207j873P08j095l140r7K094Q07K76K643J800
1116D450k681k556m23j216j459J864L765L42n57J066n42l346j421J222k1q63K225
$$ y = [-2151, -4164, -4537, -2895, 277, 3042, 3868, 3384, 1884, -115, -2197, -3218, -2903, -1798, -245, 1692, 3574, 3712, 2256, 158, -2065, -3887, -4452, -2182, 1230, 3088, 3837, 3786, 1570, -1682, -3526, -3027, -2459, -1269, 1079, 3100, 2863, 1836, 1618, 49, -2962, -4171, -2486, -1237, 219, 3289, 4876, 2720, 15, -1482, -3098, -4382, -2513, 1031, 2236, 1900, 3129, 2732, -522, -2443, -1924, -2329, -3150, -920, 2448, 3017, 2406, 2772, 1110, -2820, -4442, -2714, -1240, -562, 2534, 4651, 2556, -145, -333, -1367, -3682, -2957, 29, 734, 615, 2787, 3780, 1085, -1401, -1442, -2487, -4049, -1655, 2374, 2762, 2418, 2983, 1774, -2253, -3885, -2081, -1202, -1136, 1329, 3534, 2327, 454, 1162, 67, -3073, -3170, -1076, -269, 7, 2650, 4450, 1769, -787, -1210, -2426, -3885, -2021, 1744, 2086, 1529, 2595, 2053, -1293, -2714, -1492, -1513, -2376, -151]
1133a51K872k48j181P57j351l490r47K025R65O76K599J401j908k478k39q85j472
1150c055Q25K784O01l71J338N61k431j826K77o85r41J825K927O66n63K36r12l099
1168a843j392J284J075L79J895J546j166j373r2q68k013J2J733J072K41J682Q11
1185B983j531j948r70o81n54J577K384P54k31J56o56k490r31N27K48L96J149J617
1203A799K31m24p02j025j920k16O63J061J202J402P68j158j810j248m51j10N66
1220a372J290J104N34M44n99j432r09n30l32J18J282J692R74k78p45j294j143
1237a196q04l5P81J887R63L46l78r72j015p82l42J0N73J249J218R1l37p5r62j721
1257a501j083Q86J356R44R06P02q80j060j156o43o49R47J524N62k89Q52N13j416
$$ y = [-151, 2721, 2473, 1292, 2049, 698, -2792, -3739, -1714, -749, -73, 2526, 3927, 2019, -459, -698, -1583, -3055, -2230, 554, 1155, 784, 2122, 2683, 252, -1574, -1297, -1982, -2923, -1098, 1829, 2495, 1932, 2168, 1256, -1843, -3235, -1951, -876, -497, 1398, 2944, 1778, 405, 313, -555, -2568, -2556, -823, 249, 490, 2172, 2983, 1452, -496, -1466, -2147, -2701, -1124, 1260, 2014, 1783, 1939, 1283, -1207, -2138, -1611, -1363, -967, 182, 1799, 2030, 1606, 904, -121, -2041, -2257, -1594, -533, 669, 2071, 2839, 1681, -129, -1377, -1828, -1938, -1372, -82, 1022, 1556, 2000, 1401, -31, -940, -1470, -1802, -1684, -402, 1290, 2264, 1986, 1241, -53, -1196, -2000, -2035, -1254, 633, 1596, 1942, 1564, 592, -423, -1205, -1547, -1537, -964, 285, 1503, 1594, 1257, 1182, 220, -1501, -2584, -1698, -342, 602, 1508, 2210, 1330, 270, -886, -1529, -2178, -1231, 293, 855, 566, 1418, 1931, 515]
1275E15j733l76K23j26P59J836N69k53P0q23k175q71J592N94m04J102J788m75
1293A812j548m33%j340l92J226Q76r3J639Q35j799j937L08O5j381N78K486J001
1311A903q98J48J11j853j288J071J53q48J602K006m99j331L88L7k140j190J693
1328i35J066k90J182J433j314j690K67k51j887M36K726O76j355Q18J455k061j962
1345a686P02K45r92J025K415Kj227Q09J1k677j341J973J109j132Q97K566j008
1362A691k091N00L0k070k87K471M51j142J297J979k021k474Q20P07k012M25L124
1379A398K75j372N82Q58k360j680J526Q44j598J083K723n55k010P26O40k529j292
1396b741K502P36r15J097K019j494k366Q10L47k100M1K783P21j311P28J425k163
$$ y = [515, -1218, -1594, -1371, -1497, -738, 1098, 1667, 1414, 1484, 661, -1514, -2385, -793, -199, -603, 499, 2287, 1812, 264, -169, -169, -1509, -1901, -675, 201, 108, 1747, 2582, 783, -1154, -846, -781, -2162, -1584, 902, 1903, 1005, 1153, 1264, -589, -1877, -806, -653, -1501, 101, 2107, 1608, 277, 665, 702, -1438, -2628, -935, 131, -159, 1023, 2456, 1142, -548, -281, -532, -2419, -1983, 743, 1419, 64, 882, 2337, 276, -1686, -984, -739, -1731, -706, 1709, 1711, 484, 1293, 1304, -1373, -2714, -741, 368, -764, 133, 2699, 1691, -400, 100, 130, -1940, -2227, 244, 695, -447, 850, 2829, 808, -1666, -846, -139, -2151, -1726, 1398, 1673, 301, 883, 1741, -619, -2299, -773, 71, -1527, -444, 2279, 1724, -286, 440, 1080, -1449, -2741, -239, 497, -418, 679, 2698, 1204, -1162, -352, -5, -2105, -2064, 719, 1440, 129, 857, 2282, 119]
1413A19k072J199N16j422O04K963Qj979Q91N89k596j519K072Q84j106Q51K767
1430B769j114k348L56O52k007n94K484J106j623Q86J909j689k451P61Q08j685
1446a780Q6K996N64j809P55R97k262k101J593R79j209P12K681l99k140N63Q33
1463A059k346j240K157J034j055Q53J985j053k580P17O55k015j84K714Q75j373
1479B03M00J577j902k331J021J002j185P7K792K12j742K96R21k138j818J898J119
1496D02r17N94K201o63k021J62N35j756p18K362R26j142M76J700j352k143M60
1513h94O13j332K09K448N99j141J85O13j654j658R60R15o43O35K273r8j955Q2
1531A57J97j493r55J487J042m21N85J502p14k119j61N56j025l23K072J141j034
$$ y = [119, -1953, -754, -238, -1660, -1056, 1907, 1915, -64, 827, 1416, -1180, -2699, -627, 257, -849, 2, 2769, 1655, -693, -337, 315, -1692, -2286, 198, 1304, -319, 567, 2476, 787, -1664, -903, -95, -1780, -1694, 1302, 1866, 57, 812, 1809, -453, -2554, -961, 18, -1191, -479, 2202, 1803, -337, 226, 1059, -1287, -2527, -370, 664, -391, 462, 2447, 1394, -1186, -469, 186, -1829, -2013, 701, 1576, 203, 603, 2180, 278, -2053, -1032, -30, -1215, -1138, 1654, 1866, 124, 420, 1341, -797, -2615, -717, 402, -515, 79, 2280, 1617, -404, -242, 293, -1463, -2181, 181, 1107, -35, 441, 2141, 789, -1354, -894, -281, -1613, -1404, 1044, 1643, 502, 687, 1300, -354, -2012, -1052, -137, -780, -145, 2128, 2030, 75, 157, 354, -1139, -2094, -607, 435, 14, 599, 2101, 1387, -732, -893, -337, -1362, -1685, 387, 1528, 494]
1548D94L97N50j272j730M28R20r59O87J783M64j237l06M57j378j230P21J251j38
1566i8K98J563l12j377l56l4j172k58J524J009j14L58L36r40j280j73L54m13L10
1585g75J550P44n23l59l2j198r89L38Q26Q8O01J121N4j005m92l87o64n51R00J046
1605B93K73L85M91n82j265n89k6j48K35J238P24J30o4l90q11p66l73J98L52P50
1625E5Q54M27j88o98p79n79n62K99O34Q99N70K03k15m43r16n07j96K97O03O77
1645D35Q36Q0l50o84q08o45k27N30J027L78N33K75m32j059m37n17j97J58J158
1664E4Q73j16M00j67r13j222j04L99L4O33J124N98p27l11m41r49q78O91Q02L32
1684A12L88R67r3j146n24l25o14l48J116J305j50K60N33q78j673J4K05q4J57J531
$$ y = [494, 891, 1441, 169, -1561, -1133, -213, -1172, -485, 1298, 1762, 525, 219, 676, -702, -1932, -1211, 40, -98, 200, 1763, 1451, 74, -282, -316, -1488, -1746, -222, 787, 673, 1031, 1367, 427, -853, -1026, -672, -1085, -775, 775, 1519, 996, 637, 605, -593, -1582, -1244, -418, -330, 271, 1392, 1446, 441, -51, -438, -1102, -1653, -753, 293, 566, 951, 1442, 860, -405, -994, -1020, -1168, -933, 305, 1029, 1159, 1095, 705, -106, -872, -1245, -1047, -695, 55, 909, 1336, 1148, 450, -329, -908, -1470, -1171, -537, 362, 932, 1135, 920, 477, -439, -946, -1142, -845, -242, 435, 1271, 1351, 1001, 317, -491, -1136, -1363, -833, 194, 572, 1105, 1380, 948, -111, -548, -1065, -1262, -1104, 54, 927, 811, 1211, 1044, 131, -1091, -1195, -796, -762, -129, 995, 1593, 866, 555, 114, -835, -1713, -1022, -220, 112, 500, 1467, 1374, 228, -296, -621, -1235, -1583, -467, 838, 688, 948, 1481, 603, -1070, -1056, -851, -935, -778, 753]
1704G53Q48o68l62L42j155j507M32R61mL68J513K03j298m75J03j277q15J245J427
1723F34k49O78O06n63j766k58N09r27j31J713R36l56k54Q57j214j724K66P28j45
1742f60J57J864N37j385n27L60j210j169R56J615n95L29J333m1j838m54O75j049
1760a102p85J716J467n57p6Q43q15j952P9O36l98MJ888R42j237k92L49j000j665
1779a955N53J581m39k4J878M09j810n23L73j074j149J648J496l74N4J305o99k438
1797a188k27J102o41k91J814R70j014p7P88r53k054K51J261k50n8J969Q59j733
1815E28n06J47j128j244J329J522k21m5J339k01k078l64P86q23r08J848J335m94
1833H22l69J180j157k115L08P72n30K08J981R98j527o42O39r73j351N67J487k30
$$ y = [753, 1601, 933, 571, 913, -242, -1749, -1317, -356, -360, 8, 1521, 1724, 426, -49, 54, -1223, -2038, -793, 634, 385, 1063, 1669, 1106, -660, -918, -409, -1336, -1467, 246, 1182, 826, 572, 1429, 215, -1509, -1243, -515, -660, -503, 1361, 1898, 513, -14, 346, -864, -2033, -1077, 538, -57, 272, 1605, 1564, -274, -728, -53, -1102, -1887, -171, 1296, 739, 663, 1506, 691, -1261, -1182, -546, -944, -940, 948, 1890, 653, 361, 710, -290, -1955, -1402, 179, -260, -284, 1594, 2003, 193, -330, 43, -1031, -2180, -532, 964, 590, 644, 1949, 1250, -1188, -1415, -313, -954, -1245, 569, 1539, 525, 448, 1236, 283, -1771, -1520, -259, -509, -567, 1402, 2261, 528, 22, 169, -959, -2203, -874, 648, 427, 382, 1721, 1520, -558, -922, -136, -959, -1867, -19, 1316, 822, 453, 1633, 476, -1639, -1331, -559, -1089, -881, 1100, 2098, 571, -71, 568, -405, -1756, -1189, 298, 68]
1851F8j81J642K19j716n14L37r71j021J860J563p19J50R13n56k102m13R13k92
1869h20k17J806R99r43l27N15q39j945K28J297J05q9J474O76j101j082L6r40q51
1888b018J254J502k91R7J059l13k113m81O69n2o31J225J396l42pK6q85j580o3
1907a548R00j06K72J622R13j220j001K77p87j025O63J190J46P6J127q1j325o29
1925e36K15j040m87J581J456j73j94K62l87j540o07M30J94L41J300Q35o99n69
1943C82J48o79j519K57J070M16Q4J202M13r18q45n49r47j20Q81J210J82J67N82
1962A417l57j648p57L39K72J44Q05Q24K62k18k61j085j175Q5L83M15N96J083M99
1981A623p19r08n85l47m80P15O86N69N16M73o82q57o09r8m10k68R68J187N42o4
$$ y = [68, -113, 1529, 1748, 32, -482, -145, -1116, -2137, -277, 1286, 567, 717, 1630, 1074, -1028, -1441, -528, -820, -1037, 769, 1768, 825, 498, 1013, 174, -1771, -1543, -246, -141, -230, 1244, 1920, 819, -263, -227, -1167, -2018, -764, 738, 447, 544, 1603, 1290, -823, -1304, -635, -687, -1318, -93, 1303, 961, 954, 980, 95, -1485, -1548, -648, -754, -482, 1140, 2053, 833, -168, 109, -678, -1703, -1040, 150, 296, 372, 1499, 1418, 93, -536, -321, -1361, -1848, -267, 1189, 1016, 822, 1084, 697, -843, -1450, -1020, -826, -485, 815, 1650, 951, 382, 530, -149, -1668, -1411, -341, 75, 159, 1361, 1774, 856, 11, -538, -1485, -1605, -724, 486, 668, 835, 1417, 1060, -588, -1345, -1006, -734, -590, 215, 1039, 1301, 1083, 822, -263, -1438, -1353, -970, -555, 41, 1124, 1623, 904, -4, -589, -936, -1416, -701, -15, 554, 1070, 1543, 861, 4, -605, -703, -1113, -1381, -413, 774, 1316, 1252]
2001A252l79q14p82n87J9N83P70J260Q8m68n13n94m92n82J27L77R25P91Q4j8k72
2022G75q29q97n62L37O91R14P66P9j07p49q56m86n97N49J034L74M52M09r0r25
2042B82r11m16k37K95Q19P70N95Nj12r59j139n12O57K59N29P87O29p8r19k65p49
2063f70n34N9O47L90P69O43K84j010q77n10l06k97P24J541K81j72K69o83j205
2082f57n00L7K51K75Q57R80o2m36k55n71j363q5O72O06M44J106N38r98r20l44
2102d25o61o00P60J373M24k15M69j0j230q23K60m77Q8J053J207J04l11k82o31
2121G3j434m82Q31P70J21R89P90o71q96j79o31o58L5J238M02K72P63N14j535j037
2141g25j06m18k53J082J475K18l85J06m81j480m11K64M95Q6J039R32l14p30n9
$$ y = [1252, 873, 59, -723, -1310, -1291, -708, 62, 1322, 1410, 942, 429, -165, -657, -1239, -1112, -735, 190, 981, 1065, 1047, 775, -54, -951, -1513, -1176, -485, 429, 1195, 1274, 1167, 418, -438, -924, -1521, -972, 62, 436, 888, 1297, 1207, 282, -629, -1045, -1282, -987, -168, 602, 1197, 1202, 1090, 131, -1008, -1520, -863, -604, -75, 712, 1341, 1263, 344, 79, -670, -1204, -1145, -498, -108, 661, 1304, 1588, 578, -299, -809, -1115, -1412, -688, 853, 1134, 962, 1231, 548, -657, -1157, -1120, -869, -594, 263, 1243, 1181, 745, 490, -81, -1444, -1529, -857, -251, 193, 1299, 1837, 839, -81, -425, -1086, -1686, -926, 447, 871, 656, 1125, 1115, -115, -938, -678, -1155, -1067, -14, 1193, 1297, 986, 704, 73, -1361, -1843, -1012, -242, -121, 868, 1658, 987, 91, -88, -719, -1377, -1342, -104, 298, 570, 1333, 1847, 312, -725, -831, -1249, -1502, -420, 1055, 1273, 888, 994, 513, -967, -1378, -1114, -619, -533, 506, 1438, 1124, 394, 335]
2160C35p45j072j87Q64P80O94P26M21j111j173l29m16j33O06J533L18m68M47j18
2179I72j417p31J17K58jJ033J134qn51j81o86j105n91Q30N73O16Q74N37p64j092
2199a83j45o13n17M74R53Q48j11O71j83j263p52j79k23%J104J281J45k82j33p80
2219A12j240l06M93M51O54P82M89m68n99l34q24m94%Q42P11O60O11r3r92r99m56
2240a000l60K26P33J039N20J06n39m90o10p62p6M38L89P29Q52J55n69p03p22n78
2260a222j67M25R17O30P59j01n75p50o67l67J33K74Q67O19L79J26o80n40r57n56
2280a453K11O92Q45O68L23K4q13r80m16k11o8Q67J079J02J03J60n98j081n77J09
2300a014n8N44Q53J107J14n14o55r05r26N0R30M10N30Q26K49j059o36n10k24l62
$$ y = [335, -410, -1482, -1669, -805, -25, 669, 1395, 1816, 705, -468, -797, -1213, -1346, -740, 793, 1111, 643, 1090, 972, -445, -1176, -1059, -801, -802, 231, 1365, 1357, 806, 625, -61, -1166, -1757, -927, -354, 262, 1136, 1673, 909, -183, -328, -941, -1458, -984, -31, 817, 706, 1377, 1194, -69, -821, -1000, -1223, -1223, -119, 1162, 1307, 1025, 892, 112, -1128, -1434, -941, -490, 164, 946, 1435, 967, 368, 34, -790, -1284, -1284, -442, 269, 929, 1540, 1447, 455, -544, -1000, -1360, -1134, -401, 638, 1158, 1264, 725, 235, -375, -1137, -1213, -775, -386, 343, 1195, 1350, 781, 78, -644, -1222, -1389, -964, -47, 583, 1342, 1241, 666, -84, -751, -1118, -985, -711, 156, 775, 1154, 1280, 600, 60, -897, -1453, -1242, -550, 295, 963, 1286, 1310, 497, -483, -899, -1110, -1178, -311, 768, 870, 973, 1133, 535, -546, -1123, -1014, -1072, -528, 325, 1432, 1546, 1032, 377, -528, -1454, -1404, -474, -64, 466, 1292, 1541, 482, -154, -664, -888, -1250]
2320a250K61J345M19J6K34J96j394q61J30Rn6Q90J402o8m90p1m54j506l20P30
2340h38P38k7R66Q01p20q34j97n57q46L37J205N77O6P12J17j509q52J88k97l92
2360a362J062J497k77l85L24q2j654m71P63J33p3J068J061m93p94ro00j332P6
2379a548J496M98k57J086L89j290j169N31l98q92Q05J621L6l16N17J0j633q54
2397a368O07K19n50J254J506l75q88J91m53j939l0J510M67m44J307R20j153j413
2415f32N03m08j307O47J740K57o32J229R1j896r70Q85k15p45J327J690l14q81
2433C69M04j09j788o60J353K98n52J353J435j090j288M35l83j664L85J944L19
2450G61o45R85Q04j896j173O85k17r18J009K050j62r16N73J84k096r14J311K95
$$ y = [-1250, -989, 356, 775, 791, 1025, 1221, -173, -1034, -904, -895, -951, -61, 1341, 1273, 783, 712, 258, -1248, -1568, -838, -100, -127, 839, 1640, 920, 86, -111, -668, -1514, -1177, 28, 605, 671, 1383, 1500, -9, -861, -673, -970, -1362, -300, 1197, 920, 535, 859, 777, -877, -1348, -585, -452, -525, 543, 1604, 1111, 317, 308, -292, -1624, -1548, -52, 446, 189, 1275, 1664, 374, -795, -264, -662, -1554, -749, 872, 908, 592, 1109, 1119, -514, -1368, -761, -542, -1092, 162, 1668, 1293, 405, 596, 143, -1796, -1826, -316, 151, -293, 1014, 1934, 781, -632, -129, -537, -1844, -1197, 543, 800, 168, 1397, 1488, -408, -1378, -493, -708, -1453, -126, 1564, 1250, 369, 773, 664, -1124, -1784, -431, -133, -685, 668, 2103, 1013, -275, 160, -223, -1887, -1502, 442, 761, 116, 1101, 1905, 9, -1164, -479, -696, -1614, -605, 1445, 1283, 367, 940, 1124, -972, -1886, -575, -280]
2468b80o15J086J729p43j291L59m6j938O6J812J37l95J229J097j774j327N33j08
2486d69j190P01J930R3q51J059Q8j862j291J181l1o20J243J938p76r78L23l9k012
2505a563m4J210N26n65J163J352j345j401N95k12j565N07K014Ln03R51N63j978
2523b92j067Q06n1j097R95K187k64j022P15J2k087p69J471M66o71J209J531j118
2541I54j267L75j56j766R6J994L26p06J336P97j680j395O08N7j107O34K062P3
2559A235r11N40L29k112q28J144L04o45J199J530m39j211K14k87j599m14J694
2576b57O71o57J333O63j252j217M44l25j076N98J897J19o70R13K41j794j070O74
2594g65K52n33P31J956k71j043M47k34j642n84J107O33m40J009J363r84j433L24
$$ y = [-280, -895, 191, 1920, 1177, -114, 245, 199, -1739, -1673, 139, 276, -119, 1110, 2207, 433, -894, -361, -469, -1659, -958, 972, 1065, 214, 1273, 1361, -501, -1792, -611, -642, -1262, -19, 1919, 1143, 165, 488, 449, -1563, -1607, -397, 129, -436, 727, 2079, 734, -667, -72, -284, -1849, -1342, 672, 675, 172, 1123, 1686, -292, -1359, -553, -604, -1701, -706, 1481, 1217, 195, 910, 922, -1165, -1934, -463, 3, -668, 541, 2072, 954, -313, 62, -94, -1860, -1764, 230, 556, -150, 1186, 1983, 303, -1092, -484, -427, -1534, -900, 1162, 1235, 324, 864, 1193, -919, -1747, -603, -299, -944, 255, 1785, 1346, 135, 349, 62, -1537, -1951, -257, 414, -243, 1090, 1753, 501, -716, -272, -597, -1673, -1075, 822, 941, 271, 1184, 1425, -369, -1439, -765, -513, -1046, -315, 1641, 1370, 327, 774, 540, -1102, -1686, -579, 54, -386, 623, 1986, 1002, -431, -107]
2612a07j09j311L30J472N76n04Q41J74j296j215M19P0p58Q78J789J21q52K20l7
2631G01j513p20O79N47k82J047J270o94q64R9m69j241J3J340N52k72P95M92r27
2650E53j262l1Lo86P70J300L02l15K64J04j491p14M21L77l84J021J171j99m60
2669G44l52l21j335j94R46M79L18Q02M52q27j027nm12o94L03J346N48P9J57O8
2689A075j044j007K22k94N2Q73J191K03m47j62o43r19l96M71M36M89O72P10m84
2708I98r63k81k49p31O4R55N38M77L12j0p50r74k41j95J04P78Q33M16o2k40l68
2729D11r48q03M22K40M76O69R27j68p63l55p11o01j6N96P22M69M44K18o65q05
2749b41m28m02n8P23O85O17K49n5n40p53n18l63J63K50R01Q20K78n60l34p94p33
$$ y = [-107, -216, -1527, -1197, 275, 851, 347, 1188, 1362, 66, -1149, -730, -660, -1418, -540, 1249, 1370, 518, 738, 701, -812, -1532, -853, -306, -588, 459, 1729, 1035, 171, 270, -199, -1440, -1427, -87, 465, 193, 988, 1480, 553, -709, -740, -737, -1423, -653, 647, 949, 634, 898, 1002, -489, -1203, -782, -405, -789, 232, 1403, 1204, 744, 392, 71, -1264, -1458, -512, -33, 285, 1087, 1539, 712, -315, -320, -732, -1426, -1123, 223, 771, 850, 1007, 1075, 31, -976, -754, -1048, -996, -123, 1068, 1271, 824, 662, 19, -900, -1296, -825, -389, 100, 772, 1482, 998, 35, -246, -495, -1226, -1162, -207, 331, 808, 1120, 1110, 360, -614, -855, -1050, -946, -168, 665, 1081, 1019, 779, 411, -537, -1340, -918, -678, -202, 467, 1394, 1226, 463, 108, -603, -1204, -1220, -624, 98, 567, 1011, 1229, 564, -241, -669, -1071, -1129, -406, 279, 896, 1145, 1090, 550, -203, -721, -1084, -921, -671, 230, 1050, 1328, 768, 434, -360, -1093]
2770a093j71O57M03O34P52n4j63o91o43m97l98M52O15P22K79M89m98o48o34n18
2790a005m9L38Q11O72L68k8m92q47m10l90k5N82O39O44K05L0m86p87m90m58J77
2811a001O86O44N20L13k54m78q10o72%J99O85O08N29J30j07r34o41l07l52M12
2831h30Q36O75K76K02k12q53q29k23j40M49P43P82J67o5m81o46n34m12K11L36
2851e48N92O38M33j61m84o14n42m84J32P12O58N48J60j7r25m64n86k07L43M38
2871c78P36O42Jl33l53p81l42j95K90M30P84P28Q8n54q90m04m75j63P13O53M75
2892F72M09j10l97m72q83l64k5N11P32O25K57J64p52o09o39k66J36O22O07N71
2912G89K70o8p28q44l31o4J58N95Q14L31rj45n99o89m88N9J36M15J010N43L8m64
$$ y = [-1093, -1264, -607, -204, 430, 1182, 1128, 965, 274, -369, -866, -1264, -812, -197, 525, 804, 1293, 795, 147, -487, -1005, -1054, -716, 95, 767, 1135, 1107, 615, -232, -642, -1032, -1057, -475, 164, 808, 1013, 1043, 557, -230, -720, -1178, -1001, -315, 329, 849, 1162, 908, 430, -380, -1052, -1052, -853, -168, 440, 969, 1099, 992, 58, -583, -890, -1242, -830, 6, 681, 957, 1159, 947, 94, -735, -958, -1098, -649, 94, 876, 1043, 978, 497, -149, -683, -1095, -884, -548, 44, 682, 1115, 954, 470, -144, -686, -1170, -1038, -326, 332, 880, 1040, 1023, 98, -366, -952, -1159, -816, -378, 358, 1000, 1001, 668, 315, -466, -808, -1003, -713, -283, 501, 1229, 1317, 763, -127, -531, -1006, -1169, -456, 197, 672, 1081, 971, 574, 102, -781, -1145, -1170, -659, 73, 698, 955, 1119, 367, -242, -881, -1147, -1011, -389, 218, 789, 1059, 991, 263, -581, -912, -976, -818, -223, 591, 922, 913, 768, 169, -520, -1008, -949, -813, -398, 612, 1155, 1193, 729]
2934G29q19l20p98q5Q50N21L75N04J13l96q30m55l74j16N86P12O01J93j35k35
2954F21q59n78j82J21K35P82R51K38o91k83n05q66j3M13N62L20O24N06o97p67
2974f8m75k26l70K5J163N99J20K16n4q35q68j23R4j18R40Q41K40l31K6m91j086
2995g81n47O35J99K12P13J006n16p36m10l44o15k9J046O74o4N48K13r94r40o4
3015g94K1m50Q71J026K79m33L15j18j170q57M60M15J16P05R45j96r06o9m73r46
3035a259k21J280L79J46N80N58r80r29J61k80q53N41J232L30n9K54P7j252j053
3054a348M91K93j87Q28J259j55p36O2j55j379m35J051L54p2P55Q41q83n70j18
3073a04l88q38L0J431N70k47M38L08j257q73K46J99n16P05J401N0n80J00j72j404
$$ y = [729, -90, -410, -1208, -1293, -443, 78, 453, 957, 1070, 674, -156, -611, -985, -1101, -515, 197, 798, 991, 856, 621, -238, -816, -998, -877, -642, 140, 1091, 1329, 638, 355, -150, -1016, -1029, -616, -54, 266, 890, 1396, 699, -68, -543, -769, -1139, -1114, 49, 648, 768, 984, 930, 95, -773, -896, -802, -920, 20, 861, 1101, 770, 796, 305, -781, -1328, -693, -494, -282, 431, 1437, 921, 185, -225, -569, -1184, -1213, -167, 507, 443, 991, 1204, 210, -730, -794, -773, -1223, -352, 674, 953, 520, 835, 717, -453, -1310, -850, -435, -319, 386, 1331, 1135, 229, 160, -313, -1259, -1480, -200, 179, 325, 905, 1463, 483, -446, -285, -565, -1418, -877, 355, 685, 626, 880, 957, -295, -1348, -857, -564, -751, 77, 1336, 1181, 445, 507, 352, -1027, -1462, -411, -57, -129, 626, 1467, 584, 14, -104, -492, -1330, -1300, 131, 701, 454, 892, 1200, -57, -930, -684, -485, -1001, -296, 1105, 1155, 575, 675, 503, -901]
3093i01m71Q60L48k89Q54J022m71r96k5q2j076j10J195M17L5N46M63j081j092
3112h54N32j43q64O15J514R0n75N70J20j428r53Q72K10l28Q19J388n97j093N10
3131D05k74j351k84J323M80l92P69P03p55j348M06j11r18M35J733M5o58N81M34
3150A223j435j095P28Q8k86O61J329r7q30K68j16j468m98J166M06l16P89J117
3168A634p29j227K82j80j056L8J631K37m73Q22K93j279j134P07m2n82N62J756
3186A260m07m42Q3Kj166p37J050J29l81J073J229q16j205K37K1j192J1J223M37
3205D09m62P59P30j028j182M80j42j012Q66J417K34p80M73K84j503r33P41L28
3223c21k90P66J210m55r81N10k33j369l95J406N60n86Q01P23n33j145n4j12n84
$$ y = [-901, -1372, -512, -164, -453, 401, 1423, 952, -44, -69, -151, -1227, -1337, -142, 275, 310, 856, 1319, 238, -854, -322, -465, -1329, -714, 800, 890, 315, 885, 1005, -423, -1376, -504, -294, -622, 197, 1585, 988, -105, 405, 131, -1220, -1504, -181, 299, -93, 676, 1379, 624, -724, -318, -429, -1347, -912, 821, 866, 208, 789, 1223, -212, -1307, -579, -491, -777, -116, 1213, 1116, 286, 554, 438, -1030, -1528, -362, 44, -272, 517, 1634, 905, -322, -40, -220, -1276, -1238, 393, 630, 157, 979, 1272, -7, -1141, -434, -476, -1058, -496, 1260, 853, 411, 494, 496, -670, -1407, -357, -228, -609, 464, 1693, 877, -328, -91, -70, -1262, -1251, -28, 409, -53, 706, 1436, 408, -774, -294, -436, -1448, -582, 835, 1069, 289, 762, 1046, -457, -1390, -649, -321, -611, 155, 1365, 910, -71, 439, 206, -1163, -1558, -152, 408, -178, 623, 1346, 813, -332, -386, -498, -1082]
3242a082K66J337J82k88M12P3j186j028P15L39o83Q30J123j73o61L43k28j118
3260h27m36J000K93l79Q58R26o44j250L64j67o98j08J353K32l05N75O35j273r94
3279h45M66N0n51N57J178K33p68K22Oj210o75Q93J64J60M59R71o42p86K15k05
3299a08q91j39R88M03jN68M76r79j031K29k5o20O23J212N9k92L05j44r14r72O95
3320e58m5j0R16R92m07p09R4k37j013k43Q76M39P9K86P60o55q50q4j55m33K25
3341g32J169J45PK74j50r34n19J88j24q7P40Q89L2m29kl65q97k80O39K82P2N47
3363D65O52l57p01k85j34p34K92Q95K90L0L25K18p82p78J98j90k23M80R57K69
3383H87k22Jl89q22l93N57O4K33M51Q22n38l56k15l93p70J57O77K68L45L91L05
$$ y = [-1082, -816, 521, 703, 415, 827, 900, -286, -1314, -599, -260, -943, -113, 1010, 837, 176, 519, 291, -827, -1263, -263, 30, -349, 509, 1435, 791, -459, -95, -262, -960, -1068, 285, 517, 212, 787, 1422, 149, -845, -379, -329, -880, -323, 855, 1088, 320, 542, 548, -662, -1337, -444, -280, -120, 339, 1310, 668, -118, 97, -108, -999, -1138, -150, 253, 252, 820, 1296, 317, -714, -485, -510, -1130, -507, 705, 764, 472, 777, 633, -281, -1253, -558, -603, -613, 303, 1295, 888, 179, 273, 36, -977, -1220, -344, 95, 174, 460, 1220, 565, -285, -369, -524, -957, -732, 437, 582, 589, 863, 713, -221, -740, -552, -676, -763, -23, 866, 898, 469, 467, 102, -795, -1075, -436, -154, -82, 465, 1117, 760, 59, -226, -360, -1094, -802, 93, 383, 413, 738, 956, 174, -604, -406, -596, -819, -339, 618, 887, 665, 666, 277, -545, -938, -381, -317, -84, 367, 1189, 651, 295, 80, -313, -1083, -926, -249, 19, 364, 755, 1060]
3404A060p36n67j54k05k01M18O60M44j18K24n25o60l55n2J54K01N50L66L04k74
3424E34j48o48o27Q3L13L05N30L67K08l53n47l27l18J0J93L61N07K72j4k43n40
3445h2o48J56O3J06L06O53L06m48j17l63m69k51K27K67O07M59N8k54n51k20l12
3466e07j91K05N91J34L27R8n9n56l55k83j21J36M99N36J45J38k75m22m48k52j16
3487g76M51K77M69K77N2m78j61n78j58qK71O34K83K4L5m23l46m45Nm8M12M18K06
3510C93K22m6l65l31m87J15J05J41N53L22J57l83l91m14p3k13L79J66N67J13M3
3531E73j23n11k24l64OK26L65K45N46l5l08l36n60j28o7M03L62M84O5Q9l36n34
3553a62l59j09L2L09L87L92J37k43q2n32k25j92PN01M38M10Pk61k86l69l74j36
$$ y = [1060, 324, -243, -397, -602, -803, -385, 275, 719, 601, 825, 300, -360, -715, -767, -613, -412, 138, 504, 808, 534, 386, -262, -889, -806, -493, -188, 342, 709, 917, 564, 17, -310, -628, -618, -425, -64, 443, 715, 701, 458, -82, -730, -574, -511, -405, -99, 554, 860, 412, 295, -68, -537, -788, -561, -294, 313, 772, 830, 576, 25, -195, -507, -698, -493, 98, 232, 559, 657, 598, 42, -313, -596, -717, -581, -82, 454, 599, 737, 462, 40, -408, -660, -776, -325, -48, 421, 698, 750, 272, 111, -467, -625, -633, -362, 272, 555, 579, 614, 191, -155, -600, -595, -643, -231, 187, 393, 615, 569, 204, -127, -614, -499, -394, -253, 300, 622, 779, 396, 5, -409, -482, -695, -316, -150, 417, 530, 573, 450, -61, -285, -649, -643, -417, -52, 193, 739, 704, 396, 60, -500, -628, -695, -292, 70, 554, 619, 708, 372, -162, -521, -630, -598, -289, 98, 490, 627, 384, 302, -230, -455, -647, -640, -139, 299, 709, 716, 455, 169, -200, -574, -710]
3575g10K86J95M46L22K22k31n15l22l15J81r6N36L18J72J08k98l08l55j89kL39
3596b16L99K92J93n8m92j03n95P9j76K69O87K42J52k69j51m86k42k98J96L15M34
3617A72L82q6J23n14k99j15l46K18M34K88K73K52k88m17l67k00k21K57M57M53
3637D56M4L3k71k98k55j22N9j48N75K05K34j58j95r7m92j11j6L47K57M02R3N4
3659E96k47k59m95j71M9L68L38L29Pq4k14p39J2O5j1K30O32J16q6P6j13q36m7
3682d84KM19n1L11M32om09j92k65k42j59L43K88NN62N0m21m67K01m01l4K91K56
3705B9M63m6J98l40l64n02L20j53K87J62M68j4j08j90j71m58l68N57J81J67K92
3726D10J61l14j96m91j0j35n0N87M36n0K18j15m23n10J7L0P7L65M68K12m66L0
$$ y = [-710, -424, -229, 217, 539, 761, 530, 15, -307, -622, -441, -537, -1, 317, 489, 597, 299, -9, -364, -553, -555, -216, 183, 475, 668, 610, 118, 15, -580, -501, -677, -408, 279, 521, 673, 404, 253, -233, -475, -773, -577, -262, 172, 554, 468, 591, 77, -222, -337, -683, -465, -31, 257, 530, 782, 494, 77, -290, -490, -711, -454, 3, 456, 500, 533, 262, -36, -291, -413, -354, -502, 73, 278, 512, 354, 159, 62, -430, -541, -557, -210, 47, 449, 542, 596, 349, 90, -405, -576, -527, -159, 179, 508, 515, 431, 217, -522, -510, -445, -456, -226, 406, 522, 436, 512, 399, -437, -484, -482, -63, -114, 197, 629, 623, 214, 22, -243, -485, -644, -301, -13, -8, 554, 604, 183, -284, -83, -484, -518, -227, 29, 492, 446, 644, 304, -60, -562, -242, -395, -108, 54, 522, 508, 400, 210, 39, -419, -787, -230, -49, 118, 410, 571, 257, 61, -430, -440, -575, -625, -38, 398, 348, 566, 451, 28, -482, -465, -435, -358, 7, 475, 687, 221, 251]
3748B51o3n15l08L97J95n8L95M15j82l64p3l10l90J31L54M27J50J4R5n34k96J26
3770a43j63k78K70P24J0j95K03j66m68l95K46K07j13L27L15Q0m80Q8k53j88j84
3791e56M04L40j09J52L58m20k32j75P6l30J66M42M15k13J00l2n97l01K28O7j20
3812c37J78O11J47o14P1j05m01k04L67K57m1L60L62m11k20j40j32j69K7M51K31
3833B88m8J60p0l15n01K08J42k37K98M54jj95N2n3m17j50N8K49m4P4P08n4p07
3856a01K70l26m15K18K16J63J73J73K20m00o36K25O6j77Q7N56n2J11q0o5n13j63
3878d50O7J74Q5J74M51j52k19l9m4n03j66M34Q7j8K44M22l83j83j47j23j22J05
3900c06O27J0qJ55k61l04l02N2K89l40K52N21k9j58j03k3m01j73L39K39qJ25K04
$$ y = [251, 188, -327, -635, -238, -43, -101, 294, 709, 527, 163, 90, -220, -610, -479, -125, 302, 452, 466, 561, 27, -269, -143, -306, -584, -314, 410, 420, 225, 428, 262, -206, -601, -355, -148, -261, 66, 381, 461, -19, 69, -184, -372, -556, -152, 188, 79, 231, 589, 169, -63, -238, -162, -492, -326, 116, 531, 318, 418, 386, -211, -512, -284, -217, -337, -159, 452, 599, -15, 56, -49, -450, -654, -287, -30, -71, 289, 651, 240, 20, -120, -252, -421, -394, 57, 288, 240, 400, 330, 15, -486, -278, -136, -373, -75, 379, 378, 183, 235, 182, -235, -385, -327, -78, -122, -48, 660, 606, -101, 169, -157, -572, -354, -138, 25, 198, 371, 591, 191, -445, -220, -154, -331, -244, 312, 260, 371, 291, 226, -287, -450, -383, -209, -124, 50, 501, 349, 130, 91, 47, -456, -622, -188, -101, -119, 125, 547, 164, -19, -166, -289, -411, -306, 321, 331, 323, 478, 217, -87, -389, -337, -48, -388, -136, 385, 356, 198, 95, 72, -329, -502, -163, 76, 68, 193, 397]
3923C97rm20Q6k32l69K2M89K54j13L30o1j47m54j49J53j51K54N68j30k78L44j47
3945B37m63j29J88K0qJ21M25j99n7o3r2j55j93K96K48j47K55J6p0m25Pr2J17j34
3969b97L79J95k27J73L0l88k31Q7P9J89J4K48K52l09j85N6k41k89K58L86j08k6
3991D5J13K8j47j97o9Q7r3L04J26o2P3K80m43k03j40Q2j48M04P5K15r3j27K70
4014C80n34N1j62K63nN7K46l2k89Nn9j95n4L07N7P2J69O8j11n29J74k9j01J00
4038a51K88K84l75J14q7j78k74J56O2K63n7L17pk01k46jq4j14J62J61K03lk7m4
4062A61j29j52k14J06JJ80K5K28M2m4r8k17k17J63j3LK13J13P9j57j72l3j3k8
4086a73J63J0J36J75l2l15Lr2p9k6K94L2R3j80K77j6l79O2k78K93k6J06K2J22
$$ y = [397, 388, -32, 54, -178, -547, -525, -36, 218, 105, 435, 374, 227, -227, -376, -223, -374, -120, 448, 318, 40, 384, 237, -226, -355, -167, -147, -155, -34, 391, 192, 135, 72, -20, -175, -368, -72, 176, 29, 284, 300, 230, -195, -188, -280, -163, -297, 82, 277, 50, 223, 253, -135, -366, -279, -200, -11, 3, 251, 503, 194, 9, 65, -176, -465, -207, 179, 71, 45, 158, 186, 39, -158, -227, -140, -233, 71, 197, 135, 208, 488, 45, -158, -298, -216, -364, 40, 115, 330, 237, 110, 380, -154, -103, -265, -2, -7, 50, 296, 264, -25, -20, -79, -274, -328, -21, 36, 108, 277, 345, 234, -295, -121, -150, -251, -151, 137, 421, 46, 160, 73, -105, -379, -223, -161, 102, 45, 362, 355, 154, -92, -93, -177, -291, -129, 32, 235, 232, 205, 161, 32, -120, -334, -228, -227, -47, -22, 206, 248, 204, 106, -111, -328, -165, -178, -175, 38, 151, 230, 73, -99, -132, -145, -173, -10, 0, 136, 311, 279, -36, -33, -125, -204, -230, 64, 96, 189, 9, 286, 270, -109, -47, -325, -32, -58, 48, 70, 192]
4110A92j90k4j3p1p8k4J57J34J79R4j37rk74j36q5J49M0J10mK47P9l47r1r8M8
4135a52L3J12K67K3j50J43j00l13k21L12q3l9R5L27M3r0l10kj10q0J61J14K61
4158B41Q3k15P7k54k31Q2J60J0J74N4J09j67o0L1j94Nj56J51R5L6J25P5j63J1
4182G9k32o5P3J78j1k6K15o7q4k5k04K3q3O3K89J55j74L4l6n8k22Kj0J62J51N1
4208A78K25k49j30n2j44P7o1NJ98K43j02Q6k68j39j99J09K26O5R3ll9M6l37pq3
4233b62l9L9J33K57M1q5K6Nl88J3J80R5m7K30M4R6k27q3j52j06k9K96m1J62j9
4258A39O9k10M2j33k68L69l4J03K90q0j32n4j54q4P1j58J33J32J70n4k1k26j14
4281b04J08k89K66J42K82j21J20j04j87q5j62k2R8J89K4K42p9o5k92n2j60L15
$$ y = [192, 2, -22, -35, -106, -184, -208, -51, 83, 262, 356, 219, 210, -64, -200, -285, -136, -96, 14, 10, 257, 336, -11, -102, -200, -152, -119, -7, 260, 283, 133, 276, 176, -137, -358, -46, -129, -168, -73, 254, 297, 207, -103, -105, -215, -295, -134, -20, 241, 324, 109, 186, -68, -299, -217, -57, -47, 127, 181, 290, 123, 63, 94, -100, -95, -251, -100, -5, 31, 156, 231, 68, 79, -153, -218, -145, 33, 22, -4, 211, 144, 60, 35, -169, -146, -229, -166, 123, 278, 104, 138, 102, 44, -178, -176, -186, -24, 127, 178, 403, 154, 24, -28, -172, -95, -156, -151, 47, 290, 188, 274, 6, -133, -332, -223, 3, 68, 161, 158, 119, 165, -172, -179, -262, -301, -262, -129, 128, 169, 84, 110, 115, -273, -260, -80, 15, -32, 198, 242, 338, 111, 28, -124, -230, -259, 37, -4, 158, 139, 208, -2, 40, -93, -361, 8, -26, 77, 367, 287, 155, 101, -53, -137, -66, -224, -91, 41, 211, 157, 136, -90, -204, -96, -385, -119, 23, 305, 184, 304, 200, 13, -72, -234, -256, -158, 31, 55, 297, 218, 153, -139, -191, -351, -36]
4303c6q5N9K79j2K60l06k05l06K49j9j3K70J35j99k0j30J64j97q1l9K79K0m0L90
4327D17j83k43L4k60K1M6K55Q7JJ46l0l34J37k59J5K26j25J77m1J84n7m29M2r0
4351b63J3J52pJ98J38R6k06j60k15j28J37J25J43J63J96q6j84j85n7k02J42L5
4373a55J52J77M3k7n2k5j84k52J08L7L65Q5p0l0j73j18p8O6L0n8K94O5o9P9k70
4398f0j8k23O0L0K24J26K95l3k77k87J23l22m4K87K53J08Q1K9k30j26k42j30K74
4421a02l6J26J93P5j7k48N5l80K15N3J9J80J74l3j09p3j84o2n1M8QL48kO0k18
4446C9l1q8k06o5O0K38J86J08Q0j57j05j50p8q6L4K43K5L81j52k19k8k32Kj62
4470c63L42J75J25rK3j76j67j54j02J98j39K74J40K22p2p6l13l5k90P4J09L03
$$ y = [-36, -121, -62, 217, 205, 465, 159, -46, -352, -103, -122, -135, 135, 270, 71, 51, -79, 85, -112, -193, -232, 47, 67, 27, 417, 234, -9, 25, -235, -214, -168, 87, 174, 175, 321, 291, -43, 94, -165, -150, 76, -49, 128, 87, 271, 214, -215, -173, -263, -250, -98, -105, 93, 231, 327, 121, -39, -254, -382, -245, -120, 23, 186, 382, 296, 112, -73, -130, -332, -190, -155, -3, 174, 217, 190, 138, 113, -71, -323, -215, -178, 187, 272, 202, 172, -1, -119, -197, -131, -101, -159, 135, 200, 131, 210, -60, -78, -301, -241, -211, 13, 139, 434, 401, 124, -163, -40, -362, -406, -119, 134, 242, 323, 352, 122, -4, -246, -376, -102, -138, -12, 181, 256, 239, -9, 46, -334, -119, -66, -47, 133, 307, 274, 165, 92, -92, -154, -205, -157, -149, 199, 197, 257, 39, 8, -80, -286, -351, -291, -53, 133, 241, 321, 164, 59, -91, -169, -255, -221, 22, 47, 428, 276, 57, 29, -203, -201, -363, -21, 154, 279, 270, 293, 117, -50, -204, -306, -108, -247, 27, 167, 389, 317, 241, -72, -107, -397, -323, -214, 89]
4492H9N9L47m32j22K6k46j22M1L42J22J40J71J01o47j86J05O8Qj16M67J45j37
4514B23k29J19k22j64J8J3K39L61p5p6k67N6j60j66J63N7Q8L16J06j93k39K5k86
4537b93n0R2K11J81Q2l6Q3k00n2k19m5m7L9J97J97K73k42n5j82j60M0m2L02J09
4561A83N8O8r9k57j31M0j27Q1L34q5O8K38J6m11j95j2j49K26lM73j59K19j21j34
4585A21l37k20J67K11J95K29J4j32j24k72j01j44RL65J02J82Q3n1r2m37m6N1k58
4608d85M41K22N1J73l54K71m34l39J84Q7O6L48K03k14j48k00Q2k49M4K02N6L2
4630C9L19Q9k60j51l15j82K23L2K43J36L6O3M0m40m7j41J83J9J27K02O8ro3k38
4654b7o9j80j00K97O0K71O7qj34j28k09j60O9K28K58N5QK4k33k59j27K9r5J96
$$ y = [89, 148, 495, 63, -59, -33, -279, -401, -360, -18, 104, 244, 415, 516, -131, -317, -212, -144, -136, -252, 215, 360, 223, -6, 113, -109, -273, -255, -242, -3, 358, 283, 207, -60, -4, -164, -330, -167, -110, -22, 294, 400, 207, -32, -7, -293, -343, -251, -40, 141, 223, 187, 270, 70, 18, -201, -246, -293, -254, -57, 140, 413, 171, 116, -66, -226, -186, -228, 74, 183, 241, 309, 210, -47, -178, -138, -265, -184, 150, 65, 133, 371, 387, -24, -219, -231, -380, -154, -157, 316, 157, 376, 255, 121, -216, -436, -269, -58, 137, 366, 380, 248, 124, -148, -249, -393, -384, -19, 83, 265, 348, 297, 205, -232, -278, -227, -485, -44, 178, 229, 402, 48, 319, -115, -454, -270, -183, -117, 231, 434, 220, 72, -128, -46, -295, -251, -49, 7, 39, 358, 447, 187, 36, -279, -461, -238, -206, 37, 173, 209, 272, 312, -128, -175, -316, -133, -114, 13, 215, 283, 274, 211, -27, -96, -276, -376, -79, -19, 252, 319, 311, 177, 49, -160, -320, -251, -23, 235, 290, 298, 322, 89, -170, -297, -268, -363, -167]
4678a67N18o7l0K1l01j19k16K22M7J28K2M87j2m79k06j27p6J23JK93K17L8J3k26
4702A04k73j03j22K0L48Q8J17Q8p5k05l26j15k2L02J09K58J87r6j09r4k73J4k68
4725d46K87J16K69K03j92J2l78j3j73j3J07K16J59J30N0Pl40k99Q1o2J17J17L74
4748C29J04k58l8m03J15k92J33K10K18J62j22K89m88j60q4l7o6L01J22L79l5k0
4770C59o7n97K05k02JJ58K87L84j20l52P3j90k67J08j20K88K75J46l3k03l01l7
4792b05l49N9L84J73K60J13j35jl27l00n2J45K2J71L64n7J0l03Nm05j45R5K65
4815b13M56R7J20j58r1m23k16k8Q5L40L60R8j69J6k89j98j75m2J66L68M5L49J25
4838F23l09k31l91k0j11K69L07J60J24l6j48m68J58m16K44J44K91K13k5Pj40l26
$$ y = [-167, 351, 284, 254, 275, -26, -145, -361, -139, -92, 36, 58, 545, 533, 54, -152, -279, -355, -232, -231, 62, 279, 317, 330, 104, -169, -272, -394, -374, -26, 62, 179, 267, 192, -13, -339, -454, -476, -174, -65, 193, 380, 284, 175, 81, -192, -178, -446, -159, -43, 226, 429, 237, 249, -129, -142, -315, -328, -221, -5, 154, 284, 334, 341, 1, -298, -217, -279, -162, -45, 329, 433, 175, 137, -266, -151, -443, -310, -100, 118, 280, 158, 447, -41, -201, -285, -322, -388, -87, 35, 414, 379, 359, 292, -305, -100, -302, -301, -143, 144, 528, 408, 56, 129, -61, -328, -220, -340, -52, 223, 369, 336, 133, -168, -205, -554, -495, -111, 62, 322, 435, 300, 299, -28, -328, -380, -235, -213, -42, 322, 265, 275, -28, -23, -428, -573, -478, -213, 243, 340, 460, 302, 211, -212, -428, -456, -371, -31, 329, 427, 258, 274, -15, -213, -388, -430, -264, 104, 149, 498, 623, 314, 83, -308, -328, -439, -170, 137, 297, 421, 385, 237, -231, -73, -489, -245, -101, 190, 403, 378, 385, 245, -81]
4860h1k08J9R5P4K40K64P6j90l5n02o0j48K50R9K31J67O6jl60L6l97K0K16L68
4884B39j04J05K57k22l71j79J9j18J77K53L09k9N0J0m94k38j03K06n5M06N4K05
4906C77J39j54m01j42j06j60L93Q7J73J57m8k74l81j56K02J49K60j7L85j0k51
4927B22o6l61r2M7n4K62M50L6J29k30l77k43j65RJ20L76K02R2k7l59k8j02j88
4950c47Q6j03M29J13K67l6l20l09k20J03q2K23N92J35j00p8j77l26l20O3Q3L6
4972b88N20R0J88k41l25j55j97J40j4J10M15J51q9k10l02P4q2j36K30jN95P5o9
4995D79l81j06m84K0O0K23J32L13K40k26k28j21k48k42R2L54J71J85J17jl78k47
5017b76j17j56K64K85K95j0J27q9q3m29j21k36L46J43J52M54k76k0r8m59k08R0
$$ y = [-81, -289, -270, -175, -101, 139, 403, 479, 289, 254, -248, -308, -456, -206, -107, 124, 291, 357, 356, -4, 32, -365, -345, -129, 239, 135, 240, 497, 275, -96, -275, -256, -374, -197, 56, 365, 336, 386, 396, -98, -336, -439, -233, -288, 118, 172, 377, 516, 362, -39, -181, -287, -447, -54, 33, 206, 363, 315, 41, -340, -496, -294, -145, 115, 98, 483, 473, 222, 156, -205, -297, -250, -304, -42, 408, 444, 573, 343, -34, -277, -442, -433, -313, 63, 265, 357, 330, -29, -57, -159, -347, -261, -364, 65, 178, 445, 409, 89, -220, -440, -337, -419, -196, 396, 531, 431, 353, 176, -150, -470, -407, -324, -288, 232, 322, 510, 269, -56, -211, -408, -268, -282, -172, 243, 394, 305, 95, -207, -133, -215, -351, -121, -122, 473, 548, 479, 98, -8, -492, -472, -412, -189, -57, 256, 496, 270, 42, -79, -327, -569, -477, -123, 48, 233, 350, 349, -29, -276, -393, -549, -285, 0, 295, 285, 412, 323, 240, -189, -310, -546, -200, -57, 95, 549, 273, 253, 155, -304, -512, -422]
5039d22K86P7L45K4J80l49j04l08k6o0O1L33L38P4L7j79k30l37k27L66j6L09J68
5062C40Q2k09j32l38k38J30j34M62P7L01L7j93n7j23j52r0j7J2N90J89j72k63
5084A02j60k95j05q1L50K65L86k58J28K3m20j97k89K86R5K42J54P4L2j36j61n56
5106e21J83P5K20K11J09K47l21r3k77J8r9k66L43M21L6J00j53l8m08j58m6n0L42
5129a25J70K65J03j48k61l27j80q8M15J72L50j00J34m2j95m22j20p6M09L9L21
5150B94J63j45N5l25j71k82O4K76J66K13K08j68l24j74r4J8j02J10L63J20Q1j70
5172A76n3k06k46k25J37L43K55J70J4j06j18k44l29J16M8L00P6L11Q9l02k49j80
5194b23j30k40L78L08K67L1O8j13m01l60K37j51L05O8L97k1m6j61l49j62k78J89
$$ y = [-422, -136, -59, 286, 310, 490, 141, 37, -271, -297, -357, -296, 37, 375, 449, 486, 307, 77, -260, -487, -121, -137, 172, 340, 422, 213, 81, -257, -495, -365, -499, -37, 40, 341, 378, 185, 128, 5, -147, -237, -254, -242, 348, 537, 365, 102, -58, -353, -458, -539, -189, 76, 462, 204, 332, 355, -65, -262, -551, -265, -170, 72, 226, 300, 332, 196, 35, -521, -338, -263, -43, 168, 277, 524, 203, 110, -167, -149, -248, -514, -171, 250, 286, 386, 233, 195, -213, -371, -417, -467, -125, 45, 310, 413, 265, 4, -323, -503, -591, -176, -4, 346, 246, 380, 338, 143, -279, -399, -475, -66, -27, 294, 457, 312, 367, 42, -129, -411, -347, -71, 95, 308, 516, 348, 24, -150, -244, -226, -328, -218, 145, 265, 346, 176, 123, -83, -329, -554, -417, -74, 181, 351, 365, 259, 141, -103, -432, -316, -268, 32, 108, 419, 508, 206, -43, -223, -353, -593, -215, 93, 360, 391, 459, 346, -55, -415, -178, -329, -24, 44, 441, 420, 374, 213, -136, -298, -576, -387]
5216c87R8L16K53O4P4m30k48j23K0L9M75N3R5p7O5j57k60k11o4J11L01J37K13
5239C57j01j26k88k02m6j7J85J45L05J63K9k43o0l19n3l8N3L34J82J74q9j99m57
5262c11J20j82r0R1L51K82P6m0p0l32k12J7Jl9M42L17k7j33l71o3j87l3J88K33
5286B8L21J19n0r5j81m07K4p4K01O4L36J19L6k78j7m16j40J08Q3J62L85N2j37
5309B43Pk86k08k06J40J38L50K35l0o0j40l07j86j64J56K34L16q4L71k50k79p1
5331h1j44q8L1K66K93QP7j99o8k37l47J01J77M44%K29k5j54k45k32j0j41J56L17
5355A28K30j6j7k5m65j00oq4K50J76K29j02J99m25m2j78j95P0K72K88K91J5j24
5378C69k55p7n56K52J3K14J66Q0J17Rj67l92Mj64R7L09J59R1K47m04j25k70j43
$$ y = [-387, -289, 27, 280, 344, 418, -12, -260, -383, -363, -324, 151, 204, 299, 222, 287, 130, -130, -341, -405, -294, 7, 144, 357, 256, 130, -158, -360, -406, -423, -238, -93, 212, 375, 404, 161, 101, -218, -271, -309, -256, 78, 260, 434, 345, 146, -311, -191, -373, -463, -372, -21, 261, 337, 297, 227, -105, -317, -300, -299, -338, 104, 421, 394, 261, -110, -173, -360, -393, -205, 28, 349, 468, 418, 323, 142, -265, -241, -315, -114, -50, 286, 405, 441, 163, 146, -270, -410, -302, -219, -57, 328, 380, 243, 250, -36, -244, -450, -310, -172, 178, 413, 383, 323, 183, -124, -310, -474, -318, -84, 232, 148, 519, 269, -10, -81, -225, -313, -282, -16, 277, 285, 362, 163, 95, -142, -489, -388, -211, 233, 233, 462, 437, 283, 38, -194, -204, -345, -189, 128, 358, 342, 325, 300, -165, -265, -271, -355, -105, 71, 300, 198, 397, -28, -70, -248, -443, -373, -101, 187, 478, 493, 369, 114, 37, -519, -267, -254, -40, 126, 206, 323, 332, 165, -227, -223, -387, -290, 19, 178, 269, 516, 112, -13, -283, -426]
$$ [...]
8191i9
##END NTUPLES=NMR FID
##END=
