##TITLE=1H ikalashn
S29
20.12.2024
##JCAMPDX= 6.0         $$ Bruker NMR JCAMP-DX V2.0
##DATA TYPE= NMR FID
##DATA CLASS= NTUPLES
##ORIGIN= UXNMR, Bruker Analytische Messtechnik GmbH
##OWNER= root
$$ TOPSPIN		Version 1.3
$$ 2024-12-20 15:57:05.906 +0400  Irina@DPX200
$$ Compression mode = diff/dup
##.OBSERVE FREQUENCY= 200.13180117
##.OBSERVE NUCLEUS= ^1H
##.DELAY= (6, 6)
##.ACQUISITION MODE= SIMULTANEOUS
##.ACQUISITION SCHEME= undefined
##.AVERAGES= 64
##.DIGITISER RES= 18
##SPECTROMETER/DATA SYSTEM= spect
##.PULSE SEQUENCE= zg
##.SOLVENT NAME= Pyr
##.SHIFT REFERENCE= INTERNAL, Pyr, 1, 17.49637
##AUDIT TRAIL= $$ (NUMBER, WHEN, WHO, WHERE, WHAT)
$$ ##TITLE= Audit trail, TOPSPIN		Version 1.3
$$ ##JCAMPDX= 5.01
$$ ##ORIGIN= Bruker BioSpin GmbH
$$ ##OWNER= Irina
$$ $$ F:/spectra/data/iren/nmr/1H/4/audita.txt
$$ ##AUDIT TRAIL=  $$ (NUMBER, WHEN, WHO, WHERE, VERSION, WHAT)
(   1,<2024-12-20 15:56:12.968 +0400>,<Irina>,<DPX200>,<TOPSPIN 1.3>,
      <created by zg
	started at 2024-12-20 15:51:58.578 +0400,
	POWCHK disabled, PULCHK disabled
       terminated by command 'halt'
       configuration hash MD5:
       BE 6D 3F 07 2A EA 11 49 91 17 2B D3 AF B3 58 0D
       data hash MD5: 16K
       43 33 3D E1 96 5A FC 1D 84 5A 24 8E 93 50 C2 0D>)
$$ ##END=
$$ 
$$ $$ hash MD5
$$ $$ 3B E3 42 ED 86 85 79 93 5E 71 1D B5 BD 1A D5 C1
##$RELAX= 
##$RELAX= 
##$RELAX= 
##$RELAX= 
##$RELAX= 
##$RELAX= 
##$RELAX= 
##$RELAX= 
##$RELAX= 
$$ Bruker specific parameters
$$ --------------------------
##$DU= <F:/spectra>
##$EXPNO= 4
##$NAME= <1H>
##$PROCNO= 1
##$TYPE= <nmr>
##$USER= <iren>
##$AMP= (0..31)
100 100 100 100 100 100 100 100 100 100 100 100 100 100 100 100 100 100 
100 100 100 100 100 100 100 100 100 100 100 100 100 100 
##$ANAVPT= -1
##$AQSEQ= 0
##$AQ_mod= 1
##$AUNM= <au_zg>
##$AUTOPOS= <>
##$BF1= 200.13
##$BF2= 200.13
##$BF3= 200.13
##$BF4= 200.13
##$BF5= 200.13
##$BF6= 200.13
##$BF7= 200.13
##$BF8= 200.13
##$BYTORDA= 1
##$CFDGTYP= 0
##$CFRGTYP= 5
##$CHEMSTR= <none>
##$CNST= (0..63)
1 1 145 1 1 1 1 1 1 1 1 1 1 1 1 1 1 1 1 1 1 1 1 1 1 1 1 1 1 1 1 1 1 1 
1 1 1 1 1 1 1 1 1 1 1 1 1 1 1 1 1 1 1 1 1 1 1 1 1 1 1 1 1 1 
##$CPDPRG= <>
##$CPDPRG1= <>
##$CPDPRG2= <>
##$CPDPRG3= <>
##$CPDPRG4= <mlev>
##$CPDPRG5= <mlev>
##$CPDPRG6= <mlev>
##$CPDPRG7= <mlev>
##$CPDPRG8= <mlev>
##$CPDPRGB= <>
##$CPDPRGT= <>
##$D= (0..63)
0 2 0 0 0 0 0 0 0 0.06 0 0.03 0 0 0 0 0.0002 0 0 0 0 0 0 0 0 0 0 0 0 0 
0 0 0 0 0 0 0 0 0 0 0 0 0 0 0 0 0 0 0 0 0 0 0 0 0 0 0 0 0 0 0 0 0 0 
##$DATE= 1734695770
##$DBL= (0..7)
120 120 120 120 120 120 120 120 
##$DBP= (0..7)
150 150 150 150 150 150 150 150 
##$DBP07= 0
##$DBPNAM0= <>
##$DBPNAM1= <>
##$DBPNAM2= <>
##$DBPNAM3= <>
##$DBPNAM4= <>
##$DBPNAM5= <>
##$DBPNAM6= <>
##$DBPNAM7= <>
##$DBPOAL= (0..7)
0.5 0.5 0.5 0.5 0.5 0.5 0.5 0.5 
##$DBPOFFS= (0..7)
0 0 0 0 0 0 0 0 
##$DE= 6
##$DECBNUC= <off>
##$DECIM= 32
##$DECNUC= <off>
##$DECSTAT= 4
##$DIGMOD= 1
##$DIGTYP= 9
##$DL= (0..7)
0 120 120 120 120 120 120 120 
##$DP= (0..7)
150 150 150 150 150 150 150 150 
$$ [...]
##$SW= 21.9925490350506
##$SWIBOX= (0..15)
0 0 2 0 0 0 0 0 0 0 0 0 0 0 0 0 
##$SW_h= 4401.40845070422
##$TD= 16384
##$TD0= 1
##$TE= 300
##$TE2= 300
##$TE3= 300
##$TEG= 300
##$TL= (0..7)
0 120 120 120 120 120 120 120 
##$TP= (0..7)
150 150 150 150 150 150 150 150 
##$TP07= 0
##$TPNAME0= <>
##$TPNAME1= <>
##$TPNAME2= <>
##$TPNAME3= <>
##$TPNAME4= <>
##$TPNAME5= <>
##$TPNAME6= <>
##$TPNAME7= <>
##$TPOAL= (0..7)
0.5 0.5 0.5 0.5 0.5 0.5 0.5 0.5 
##$TPOFFS= (0..7)
0 0 0 0 0 0 0 0 
##$TUNHIN= 0
##$TUNHOUT= 0
##$TUNXOUT= 0
##$USERA1= <user>
##$USERA2= <user>
##$USERA3= <user>
##$USERA4= <user>
##$USERA5= <user>
##$V9= 5
##$VALIST= <valist>
##$VCLIST= <CCCCCCCCCCCCCCC>
##$VD= 0
##$VDLIST= <DDDDDDDDDDDDDDD>
##$VPLIST= <PPPPPPPPPPPPPPP>
##$VTLIST= <TTTTTTTTTTTTTTT>
##$WBST= 1024
##$WBSW= 25
##$XGAIN= (0..3)
0 0 0 0 
##$XL= 0
##$YL= 0
##$YMAX_a= 108742
##$YMIN_a= -193901
##$ZGOPTNS= <>
##$ZL1= 120
##$ZL2= 120
##$ZL3= 120
##$ZL4= 120
##$ABSF1= 10
##$ABSF2= 0
##$ABSG= 5
##$ABSL= 3
##$ALPHA= 0
##$AQORDER= 0
##$ASSFAC= 0
##$ASSFACI= 0
##$ASSFACX= 0
##$ASSWID= 0
##$AUNMP= <proc_1d>
##$AXLEFT= 0
##$AXRIGHT= 0
##$AXTYPE= 0
##$AXUNIT= <>
##$AZFE= 0.1
##$AZFW= 0.1
##$BCFW= 1
##$BC_mod= 2
##$BYTORDP= 1
##$COROFFS= 0
##$CY= 7568.61572265625
##$DATMOD= 1
##$DC= 2
##$DFILT= <>
##$DTYPP= 0
##$F1P= 17.9538593292236
##$F2P= -4.03888763876832
##$FCOR= 0.5
##$FTSIZE= 32768
##$FT_mod= 4
##$GAMMA= 1
##$GB= 1
##$INTBC= 1
##$INTSCL= 1
##$ISEN= 128
##$LB= 0.02
##$LEV0= 0
##$LPBIN= 0
##$MAXI= 945.577
##$MC2= 0
##$MEAN= 0
##$ME_mod= 0
##$MI= -402.1523
##$NCOEF= 0
##$NC_proc= 0
##$NLEV= 6
##$NOISF1= 8.587773
##$NOISF2= 6.764455
##$NSP= 1
##$NTH_PI= 0
##$NZP= 0
##$OFFSET= 17.49637
##$PC= 1
##$PHC0= 338.5493
##$PHC1= 10.24457
##$PH_mod= 0
##$PKNL= yes
##$PPARMOD= 0
##$PPDIAG= 0
##$PPIPTYP= 0
##$PPMPNUM= 100
##$PPRESOL= 1
##$PSCAL= 0
##$PSIGN= 0
##$REVERSE= no
##$SF= 200.13
##$SI= 32768
##$SIGF1= 18.5376
##$SIGF2= -6.396296
##$SINO= 400
##$SIOLD= 32768
##$SREGLST= <1H.CDCl3>
##$SSB= 3
##$STSI= 0
##$STSR= 0
##$SW_p= 4401.40845070422
##$SYMM= 0
##$S_DEV= 0
##$TDeff= 0
##$TDoff= 0
##$TI= <>
##$TILT= no
##$TM1= 0
##$TM2= 0
##$TOPLEV= 0
##$USERP1= <user>
##$USERP2= <user>
##$USERP3= <user>
##$USERP4= <user>
##$USERP5= <user>
##$WDW= 1
##$XDIM= 8192
##$YMAX_p= 0
##$YMIN_p= 0
$$ End of Bruker specific parameters
$$ ---------------------------------
##NTUPLES= NMR FID
##VAR_NAME=  TIME,          FID/REAL,        FID/IMAG
##SYMBOL=    X,             R,               I
##VAR_TYPE=  INDEPENDENT,   DEPENDENT,       DEPENDENT
##VAR_FORM=  AFFN,          ASDF,            ASDF
##VAR_DIM=   8192,          8192,            8192
##UNITS=     SECONDS,       ARBITRARY UNITS, ARBITRARY UNITS
##FACTOR=    0.0002272,     1,               1
##FIRST=     0,             0,               0
##LAST=      1.8609952,     0,               -8
##MIN=       0,             -193901,         -193901
##MAX=       1.8609952,     108742,          108742
$$ Real data points
##PAGE= N=1
##DATA TABLE= (X++(R..R)), XYDATA
$$ [...]
1250D134j822o036L203N243p177j491Q872m963m348O493J252o488J054P446o905
$$ 4134 2312 -3724 -521 4722 -2455 -3946 4926 -37 -4385 2108 3360 -3128 -2074 5372 -1533
1265a533k957Q186k850n225M194M028o803m43Q353n639l606O760k08n991K050
$$ -1533 -4490 3696 846 -4379 -185 3843 -2960 -3403 4950 -689 -4295 2465 2257 -3734 -1684
1280a684O168o992j652Q095l933m271N152K537o587P35P524o490k626P250j788
$$ -1684 4484 -2508 -4160 3935 2 -4269 883 3420 -3167 -2432 5092 -1398 -4024 3226 1438
1295A438n304L369M848p117l57Q059n095l541N960J118o403J692O655o973j789
$$ 1438 -3866 -497 4351 -2766 -3123 4936 -159 -3700 2260 3378 -3025 -1333 5322 -1651 -3440
1310c440P363k836m673M069L992p004K85P694n777k891N902r3n796K100N762o875
$$ -3440 3923 1087 -3586 483 4475 -2529 -2244 5450 -327 -3218 2684 2591 -3205 -1105 4657 -2218
1326b218q24P137l643l590M430K450o469J044O509o395j712O074j690m830L413
$$ -2218 -3042 4095 452 -3138 1292 3742 -2727 -1683 4826 -1569 -3281 2793 1103 -3727 -314
1341c14M591p124M16P023n030k994N084R42o449K074O156p025q52O869k692m388
$$ -314 4277 -2847 -2431 4592 -438 -3432 1652 2594 -3855 -1781 4375 -2650 -3502 3367 675 -3713
1357c713M096L525p051Q18O629n704k233N463N2n628K757N400o919MO399l604
$$ -3713 383 3908 -3143 -2325 4304 -1400 -3633 1830 1882 -3746 -989 4411 -2508 -2504 3895 291
1373B91l408M077K317o515J575N908o007j111N607j192m600L260M148o941P94
$$ 291 -3117 960 3277 -3238 -1663 4245 -1762 -2873 2734 1542 -3058 202 4350 -2591 -1797
1388a797N963m614k452M615J086o071K556N307o579o9N635k490m051L835L074
$$ -1797 4166 -448 -2900 1715 2801 -3270 -714 4593 -1986 -2055 3580 1090 -2961 874 3948
1403C948o992J569N782n471j647N072p3n547L184M571o955N95N550l468l395M198
$$ 3948 -3044 -1475 4307 -1164 -2811 2261 2188 -3359 -175 4396 -2559 -1964 3586 118 -3277 921
1419I21K145o685K212N365n813p59N024j029m738L394L599o733J262N065m213
$$ 921 3066 -3619 -1407 3958 -1855 -2614 2410 1381 -3357 37 3636 -3097 -1835 3230 -983
1434i83k088M280R16n719L057M308o109L89M820k296l883L801K588o627K187M869
$$ -983 -3071 1209 2125 -3594 -537 3771 -2338 -1949 2871 575 -3308 493 3081 -3546 -1359 3510
1450C510m902j109M576J9n433L511L826o615R51M844l045l200M176J956o304K779
$$ 3510 -1392 -2501 2075 2094 -3339 172 3998 -2617 -1666 3178 133 -3067 1109 3065 -3239 -460
1466d60M474n350n25M406q79m745L612L046o512J809M444l829j935M252P84n784
$$ -460 4014 -1336 -1861 2545 1666 -3079 533 3579 -2933 -1124 3320 -509 -2444 1808 2592 -3192
1482c192L271L731n958N38M248k076l765M111K116o225K664L933m519j108M250
$$ -3192 79 3810 -2148 -1610 2638 562 -3203 908 3024 -3201 -537 3396 -1123 -2231 2019
1497B019k01n330L731L067o167J357M107k730k854M166J449o054L084L591n007
$$ 2019 1818 -3512 219 3286 -2881 -1524 2583 -147 -3001 1165 2614 -3440 -356 3235 -1772
1512a772l62M163j014m542L961K492o070K081L907l354k032M117O79n701L413
$$ -1772 -2134 2029 1015 -3527 434 2926 -3144 -1063 2844 -510 -2542 1575 2254 -3447 -34
1527c4L089n255N49L834j606l614M190J641n820K833L275m083r74L958m12m936
$$ -34 3055 -2200 -1651 2183 577 -3037 1153 2794 -3026 -193 3082 -1001 -1975 1983 1571 -3365
1543c365M051K277n505J728L591k656k703M401Q14n772L412K821m686r1L912j036
$$ -3365 686 2963 -2542 -814 2777 121 -2582 1819 2633 -3139 273 3094 -1592 -1683 2229 1193
1559A193m368M275J798n560K195L257l100k069M056K70n281L600K377m669O50
$$ 1193 -3175 1100 2898 -2662 -467 2790 -310 -2379 1677 1947 -3334 266 2643 -2026 -1376
1574a376L514j599l460M156J078n282K773K546l501j035L857n22m540M105J639
$$ -1376 2138 539 -2921 1235 2313 -2969 -196 2350 -1151 -2186 1671 1149 -3391 714 2353
1589B353m891J659L200k472k626M327L31n200L464K278m151l8L811j169m034M382
$$ 2353 -2538 -879 2321 -151 -2777 1550 1881 -3319 145 2423 -1728 -1766 2045 876 -3158 1224
1605A224J126n000K315K729k922j887M200j79m783L930J646m146O12L457j647
$$ 1224 2350 -2650 -335 2394 -528 -2415 1785 1606 -3177 753 2399 -1747 -1135 2322 675
1620F75l359M299M69m782K771K204l144j007L847p15m114M072J074m216J356K831
$$ 675 -2684 1615 2084 -2698 73 2277 -867 -1874 1973 1258 -2856 1216 2290 -1926 -570 2261
1636B261k188k628M246j18m512L442J675l468r4L533j400l602M298M63m390K169
$$ 2261 73 -2555 1691 1573 -2939 503 2178 -1290 -1384 2149 749 -2853 1445 1908 -2482 -313
1652c13K408k710j724M215o60m230L897J225l841N91L187j848l118M435l5m219
$$ -313 2095 -615 -2339 1876 1216 -3014 883 2108 -1733 -1142 2045 197 -2921 1514 1479 -2740
1668b740K700J981k862r95L836j054l695L883O06l690J273K627k101k243M173
$$ -2740 -40 1941 -921 -1916 1920 866 -2829 1054 1660 -2030 -757 1870 -231 -2474 1699
1683A699n27l773L258J158l084o1L393j585l175M209Ll721K044K152k483j579
$$ 1699 1172 -2601 657 1815 -1269 -1330 2063 478 -2697 1512 1515 -2206 -162 1990 -493 -2072
1699b072M095r47l650L611Q38l325M22L221j952k799M341m60l542K520J633k632
$$ -2072 2023 1076 -2574 1037 1875 -1450 -1028 2193 241 -2558 1783 1323 -2219 301 1934 -698
1715f98r88L825j436l249L819J95l234J167K523k162k008M126r32l243K955J020
$$ -698 -1686 2139 703 -2546 1273 1468 -1766 -599 1924 -238 -2246 1880 948 -2295 660 1680
1731A680k829k20L353j808k757M010l82l126J837J988k345j347L926j423l029
$$ 1680 -1149 -1369 1984 176 -2581 1429 1047 -2079 -242 1746 -599 -1946 1980 557 -2472
1746b472L381M33k927N52K920k079k136M069q26k945K321J465k618q90L781j705
$$ -2472 909 1342 -1585 -1033 1887 -192 -2328 1741 915 -2030 291 1756 -862 -1752 2029 324
1762C24k793L610O8k805J012K563k222j726L890j193k793K569R74k523k33L290
$$ 324 -2469 1141 1209 -1596 -584 1979 -243 -1969 1921 728 -2065 504 1478 -1045 -1278 2012
1778B012j963k142L682n61k629J637J816k475j039L725j723k428L154K08k564
$$ 2012 49 -2093 1589 1028 -1601 36 1852 -623 -1662 2063 340 -2088 1066 1274 -1290
1793a290N34K839k292j741L795j086k596K143J335k590n69L532j993k136L352
$$ -1290 -756 2083 -209 -1950 1845 759 -1837 306 1641 -949 -1518 2014 21 -2115 1237
1808A237j23k589R81K431k382j440L715j373k363K339Q61k387j10L083k049j823
$$ 1237 1114 -1475 -494 1937 -445 -1885 1830 457 -1906 433 1294 -1093 -1203 1880 -169 -1992
1824a992L436p18k324J444J782k399q55L577j913j972K814J31k311N19K692k368
$$ -1992 1444 726 -1598 -154 1628 -771 -1626 1951 38 -1934 880 1011 -1300 -781 1911 -457
1840d57j299L427j196k153J909J203k381l25L303k121j636L016l27k266R39K290
$$ -457 -1756 1671 475 -1678 231 1434 -947 -1272 2031 -90 -1726 1290 963 -1303 -364 1926
1856A926k557r55L426j597j920K271Q19k458J11L075k399j363L108q14k083J255
$$ 1926 -631 -1586 1840 243 -1677 594 1413 -1045 -934 2141 -258 -1621 1487 673 -1410 -155
1872a55J793k474m97L229j917j528K455J08k194N52K475k458r62L083j256j757
$$ -155 1638 -836 -1333 1896 -21 -1549 906 1014 -1180 -628 1847 -611 -1573 1510 254 -1503
1888a503J688J239k449l7K960k267j218K692m00k102R72K156k584n63L147j670
$$ -1503 185 1424 -1025 -1062 1898 -369 -1587 1105 705 -1397 -425 1731 -853 -1416 1731 61
1904F1j542K021P15k409K76K730k387r64K717p00j887J245J724k550k54K919j860
$$ 61 -1481 540 1255 -1154 -878 1852 -535 -1499 1218 518 -1369 -124 1600 -950 -1204 1715 -145
1921a45j185K104J69k095N77K327k485n47K709j176j515J528J172k500K49K644
$$ -145 -1330 774 943 -1152 -575 1752 -733 -1280 1429 253 -1262 266 1438 -1062 -813 1831
1937A831k263r16K409l42j977R87J977k640j45K710j583j309J807O59k333M06
$$ 1831 -432 -1348 1061 719 -1258 -271 1706 -934 -1079 1631 48 -1261 546 1205 -1128 -722
1953g22K526k373o61K420p62j674J217J591k515Q5K574j973r99J973K35k181P26
$$ -722 1804 -569 -1230 1190 428 -1246 -29 1562 -953 -868 1706 -267 -1266 707 942 -1239 -513
1970e13K188k491k43K341j053j422J350J123k379L31K356k143o14J980k33j783
$$ -513 1675 -816 -1059 1282 229 -1193 157 1280 -1099 -768 1588 -555 -1169 811 578 -1205
1986a205R73J764k516J50K268j588r98J595N99k278P04K139k353k35K131p56j640
$$ -1205 -232 1532 -984 -834 1434 -154 -1152 443 1042 -1236 -532 1607 -746 -981 1150 394 -1246
2003a246J304J427k559L66K301j864p86J730K69k117Q95J873k369q5K050j019
$$ -1246 58 1485 -1074 -708 1593 -271 -1057 673 942 -1175 -280 1593 -776 -861 1189 170
2019A70j227J261J057k356N96J973j922m26J697k19j689J029J513k502L94J903
$$ 170 -1057 204 1261 -1095 -499 1474 -448 -874 823 604 -1085 -56 1457 -1045 -651 1252
2035A252j371r42J483N33k206R47J782k268n5J779n40j553J306J148k471O39J828
$$ 1252 -119 -1061 422 955 -1251 -304 1478 -790 -845 934 394 -1159 147 1295 -1176 -537 1291
2052A291j634o04J537K31j986J059J506k265K45J703r66j173J353P61k243Q38
$$ 1291 -343 -947 590 821 -1165 -106 1400 -865 -620 1083 117 -1056 297 1058 -1185 -347
2068c47J694j848l22J567k00j669J187J210k285N44J557j197q36J382N42k179
$$ -347 1347 -501 -823 744 544 -1125 62 1272 -1013 -469 1088 -109 -945 437 979 -1200
2084a200J029J420j960N9J524n16j416J287R23k241Q24J451j507m59J395J37j898
$$ -1200 -171 1249 -711 -652 872 356 -1060 227 1150 -1091 -267 1184 -323 -782 613 750 -1148
2101a148J187J260k188M28J401q46j128J468N91k183J000J340j658j81J407k41
$$ -1148 39 1299 -889 -461 940 94 -1034 434 1025 -1158 -158 1182 -476 -657 750 509
2117E09j647J309R19k104O42J366j088q16J389L18j956J209J058j851K01J339
$$ 509 -1138 171 1090 -1014 -372 994 -94 -910 479 797 -1159 50 1108 -743 -542 797
2133G97n33j352J449O31k096R69J148j398l89J412qj762J287R41j953M71J212
$$ 797 264 -1088 361 992 -1104 -135 1013 -385 -774 638 630 -1132 155 1096 -857 -386 826
2150H26o86j138J393N37k061J079J016j456j24J318k26j631J466O59j883O93J131
$$ 826 140 -998 395 932 -1129 -50 966 -490 -614 704 478 -1153 313 972 -911 -218 913
2167I13r90p08J332J85j834J231Q00j582K11J211n53j249J517L55j884R83R54
$$ 913 -77 -785 547 732 -1102 129 929 -653 -442 769 216 -1033 484 839 -1045 -62 892
2184H92j198l97J350j57j678J493N75j694N30J039p64r25J511J62j854J204P78
$$ 892 -306 -703 647 490 -1188 305 880 -814 -284 755 -9 -934 577 739 -1115 89 867
2201H67j361j01J340l48j558J564M01j701P17R83q85p67J468rj708J307O15j418
$$ 867 -494 -595 745 397 -1161 403 804 -897 -180 803 -82 -849 619 610 -1098 209 824 -594
2219e94J96J114m87j211J458J89j641R88P64j050m49J393k58j501J499L02j471
$$ -594 -398 716 229 -982 476 665 -976 12 776 -274 -723 670 412 -1089 410 712 -759
2236g59M93J021p58r92J611p7j617J236N84j239r2J357m91j341J602J34j461P29
$$ -759 -266 755 -3 -995 616 539 -1078 158 742 -497 -589 768 277 -1064 538 672 -789 -60
2254f0P99q90p05J530k14j448J300M11j216J51J073n48j134J535n8j429R73O23
$$ -60 739 -151 -856 674 460 -988 312 723 -493 -342 731 183 -951 584 526 -903 70 693
2272F93r49l83J377l79j363J469J02j280N61Q57p17q78J555k69j370J197M06j057
$$ 693 -256 -639 738 359 -1004 465 567 -713 -152 705 -12 -890 665 396 -974 223 629 -428
2290d28j05J237n07j182J502k4j301P49P06p99o02J490l92j329J300K31j063J95
$$ -428 -533 704 197 -985 517 493 -808 -59 647 -152 -754 736 344 -985 315 546 -517 -322
2308c22J020o10r58J510k24j208Q75N67r07l68J398n55j113J333O0j037L61Q36
$$ -322 698 88 -870 640 416 -792 83 650 -257 -625 773 218 -895 438 498 -539 -178 658
2326F58p13p95J523m08j068J047L21q91j37J146n79r28J386j93j040N63P91q96
$$ 658 -55 -850 673 265 -803 244 565 -326 -463 683 104 -824 562 369 -671 -108 683 -213
2344b13m64J441n84j052J229J18r55J15J072o96q52J509l53j013P47N66q90k88
$$ -213 -677 764 180 -872 357 475 -480 -365 707 11 -841 668 315 -698 49 615 -275 -563
2362e63J317o28r44J289o9q97L20Q34p53o40J455n53q76R33K48q73p2J157p54
$$ -563 754 126 -818 471 402 -495 -175 659 -94 -734 721 168 -708 225 473 -400 -472 685 -69
2381f9o83J342k90r35N70O90r22l63J378p01p64J073J06r19J14J069p99o53J393
$$ -69 -752 590 300 -635 -65 625 -297 -660 718 17 -747 326 432 -487 -373 696 -103 -756 637
2400F37l77q63P17M02q10k42J260o98p26J172j06q71L09Q71q36m64J343o63o48
$$ 637 260 -603 114 516 -294 -536 724 26 -700 472 366 -505 -196 675 -161 -625 718 55 -593
2419e93Q67J90q69K1J116q29n26J162l08p86N35O10q27k78J203p36n92R35P4p67
$$ -593 274 464 -405 -384 732 -97 -623 539 231 -555 -20 590 -237 -515 688 -48 -640 295 369 -398
2439c98J15R87q99m21J205m52o69O16M34q63q2J168q19n39J089j65p95L49Q06
$$ -398 -283 704 -195 -616 589 137 -532 84 518 -345 -427 741 -78 -617 472 307 -488 -139 667
2458F67r16k86J258p11m87P34K28q52QJ102r02m04J096l69o25M31O10q93j55J155
$$ 667 -249 -535 723 12 -475 259 487 -365 -357 745 -157 -561 535 166 -459 -28 582 -311 -466 689
2478F89q13m51Q85%p12K06Q55r05k49J078n33n07N94L56r43O2J084q66l24Q85
$$ 689 -124 -575 310 310 -402 -196 659 -246 -495 583 50 -457 137 493 -450 -388 696 -170 -494 391
2498C91j57o73L55P23r45j60J107p16l97O66K25p94J55R46r31k36Q88l23n29M05
$$ 391 234 -439 -84 639 -306 -466 641 -75 -472 194 419 -375 -220 726 -205 -441 447 124 -405 0
2518@N59r09m4J078p82l57P43K9p65K91Q13r72r5R58n33m77N81L34r07J70R65
$$ 0 559 -350 -394 684 -98 -455 288 317 -448 -157 656 -316 -411 547 14 -463 118 452 -455 -285 680
2539F80r52j10P41j78o78L73P08r63L1R54p14l06N56K06p86K45Q07r21rP43k71
$$ 680 -272 -382 359 181 -497 -124 584 -379 -348 606 -108 -414 142 348 -438 -193 614 -307 -316 427 156
2560A56n89M38N52r58J58Q59p92j78O38L1p08K68P20r50L7P98m68m29N18L06q05
$$ 156 -433 5 557 -401 -243 616 -176 -354 284 315 -393 -125 595 -355 -318 480 12 -417 101 407 -398
2581c98K45P56q59q6O64j30o26L98N93j028K12P71o35k10N06K01r12L72P76r74
$$ -398 -153 603 -256 -342 322 192 -434 -36 557 -471 -259 512 -123 -333 173 374 -538 -166 610 -364
2601c64M8O69k61n17M97M74j036L14O93o71j60N54K6o79L66O07r37J92O28m48
$$ -364 -316 353 92 -425 72 546 -490 -176 517 -154 -314 240 266 -413 -47 560 -377 -185 443 -5
2621el52N17L14r53L53O75q69O2N43j36n97M64M94r31K20O48n86j85N43R2p83
$$ -5 -357 160 474 -479 -126 549 -320 -258 285 149 -448 16 510 -421 -201 447 -139 -324 219 311 -472
2642d72M34N24q42J66N59l00m81M98L84r26L53N46o45p3M95M6p03M93M04q25J76
$$ -472 -38 486 -356 -190 369 69 -412 86 470 -456 -103 443 -202 -275 220 266 -437 56 460 -365 -189
2663a89N97m40l02N19K24q77M73M50p38R5M62j00o15N60L14q72L59M39m79j87
$$ -189 408 -32 -334 185 409 -468 5 455 -283 -188 274 174 -441 119 433 -439 -80 359 -120 -307
2683c07N13O2p39N02M18q13J91N27k36n32N27K32q42M57M22n88p4N05J2p60N91
$$ -307 206 268 -471 31 449 -364 -173 354 118 -414 113 345 -497 -40 382 -206 -280 225 237 -523 68
2704F8L39q51L73M03l37l49N61J36q22N24L20o35O5M86j55n97O22J97p97M74L66
$$ 68 407 -444 -71 332 -5 -354 207 343 -479 45 365 -270 -205 281 126 -471 151 348 -449 25 391
2725C91m91j56M81M2p55N99K56p15K20L97k05m86O18N9p51N05L09n10r1N21l0
$$ 391 -100 -256 225 267 -488 111 367 -348 -128 269 64 -422 196 255 -496 9 318 -192 -283 238 208
2746B08o62O12J76p48L88L58l58l26N79L5p10N04K89o30R3M81j34n67N98J35p42
$$ 208 -454 158 334 -414 -26 332 -26 -352 227 262 -448 56 345 -285 -192 289 155 -412 186 321 -421
2767d21M94K47m31j67N56r1o79O71P5n51K02L90k39m28N95L4p40N64K05m75l7
$$ -421 73 320 -111 -278 278 187 -492 179 254 -297 -95 295 56 -372 223 257 -483 81 286 -189 -226
2788b26M83j76n87P18N1o64L72K47k46l26O29n3o82O37J03m80k4N04j51n91P06
$$ -226 257 81 -506 212 263 -401 -29 218 -28 -354 275 222 -460 177 280 -200 -224 280 129 -462 244
2809B44k1n89M41K39l82k71O06j28n69O38M2m88J60L41k20m37P13j08o11N31J07
$$ 244 223 -366 75 314 -68 -339 267 139 -430 208 250 -238 -78 263 43 -394 319 211 -400 131 238
2830B38l59j25N49k01n14O97r2m96K38L18l25k65O41j92n88O07R1m22RM69k33
$$ 238 -121 -246 303 102 -412 285 193 -303 -65 253 -72 -337 304 112 -476 131 222 -200 -191 278 45
2851D5m42O44n0n00L11K56l86j18N45k16n05O33Nm49J45L51k64l32O93k14m65
$$ 45 -397 247 197 -303 8 264 -122 -240 305 89 -416 217 222 -227 -82 269 5 -327 366 152 -313
2872c13M46J29l99j15N86k80m29O24q0m39K35K85l73j78O63l39m33N60L0l91M4
$$ -313 133 262 -137 -252 334 54 -375 249 169 -270 -35 250 -123 -301 362 23 -410 150 180 -211 -167
2893a67M50l25l47P15k36l83L30J63l37j16N92l03l69N99n0m48J58L91l62l08
$$ -167 283 -42 -389 326 90 -293 37 200 -137 -253 339 36 -333 266 216 -232 -74 317 -45 -353
2913c53O54k39l90M29R1l32j3N22l90k87N66j10l53K01K69l57j66N80k95l67N36
$$ -353 301 62 -328 101 192 -140 -153 369 -21 -308 258 148 -205 -4 265 -92 -258 322 27 -340 196
2934A96m9l49R3L77l26l08O48k70l51L70K01m27j13O40m11k16N14r7l78J44M29
$$ 196 147 -202 -109 268 -58 -366 282 12 -339 31 232 -195 -308 332 -79 -295 219 122 -256 -112 317
2955C17m24j99O40l66k54L81J42l78l3N55m86j68N32j38l45K22L06m22r2N69m20
$$ 317 -107 -306 334 -32 -286 95 237 -141 -174 381 -105 -273 259 121 -224 -2 304 -118 -210 359 -61
2976f1j59L94J6l93P2M95m47j69N52k66l09L50J67m10MN41m21k11M63j21k56J04
$$ -61 -220 174 190 -203 -131 364 -83 -252 300 34 -275 75 242 -168 -164 377 -44 -255 208 87 -169 -65
2998f5L58m40j03O20m14k15L46J14l53K8M45m17j22M48j70k69K54K02m07J0N19
$$ -65 293 -147 -250 370 -44 -259 87 201 -152 -124 321 -96 -218 230 60 -209 45 247 -160 -150 369
3019C69m25j31L84l2l66J10L90m48n1M99l23j86K43K48n07N0N04m27j22M00r8
$$ 369 -56 -187 197 165 -201 -91 299 -149 -200 299 -24 -210 33 281 -226 -176 328 -99 -221 179 81
3040H1l17J76L60m96NN15l38k31L04J12l86O3M57m67p2M01j39j71J63K77m76j5
$$ 81 -236 -60 300 -196 -191 324 -14 -245 59 171 -215 -152 305 -162 -234 167 28 -143 20 297 -179 -194
3062a94N12l96q5K81Rk94P8M31n23lM45k41k35K96J81m29P6M32m50m4M00j65l16
$$ -194 318 -78 -163 118 127 -167 -89 342 -181 -184 261 20 -215 81 262 -167 -91 341 -109 -153 247 82 -234
3085b34K17K99m86K0M51l03k02K62J14l73J06M41n27R6L10j35k47K09K70n27J43
$$ -234 -17 282 -204 -184 267 -36 -238 24 138 -235 -129 312 -215 -119 191 56 -191 18 288 -239 -96
3106i6M01m10j02L11K6l31J64L59n11R9L22k15k20K99J44n03J96L79m07o1L08
$$ -96 305 -105 -207 104 130 -201 -37 322 -189 -90 232 17 -203 96 240 -263 -67 312 -95 -156 152
3127A52k7l51K28L05n24J10L66k91j32L12O0m40K16K79m24j1L32j51k63K33K56
$$ 152 125 -226 2 307 -217 -107 259 -32 -164 148 208 -232 -16 263 -161 -172 160 9 -254 -21 235
3148B35m75J24K98l20k4K53M5m03K23K66l96P6K20j26k04K64J40l81J78K33l85
$$ 235 -240 -116 182 -138 -162 91 136 -267 -44 222 -174 -98 122 -4 -208 56 196 -185 -7 226 -159
3169a59O9K80n0l43K54K29m97J48L13k90j01K21O4l89K45K89m69R0K43j23k63
$$ -159 -90 190 140 -203 51 280 -217 -69 244 -46 -147 74 138 -251 -6 283 -186 -96 147 24 -239
3190b39L28J52n32K50K40k93p5L13rl91K82K08m30R8L11k71j62L07J35m87K50
$$ -239 89 241 -291 -41 199 -94 -169 144 135 -256 26 234 -196 -98 213 -58 -220 87 222 -265 -15
3211a5K04l42R4J82j2l23K15J85m13K03K29k32j39K92Q7m25K71J73l89O9K69j53
$$ -15 189 -153 -59 123 111 -212 3 188 -225 -22 207 -25 -164 128 215 -210 61 234 -155 -86 183 30
3233C0k51K88J05m34K93J85l31l3K58m0l48L27J87m70K17J90j96k19L26P8m62
$$ 30 -221 67 172 -262 31 216 -115 -148 110 70 -278 49 236 -234 -17 173 -23 -242 84 162 -300
3254c00L00J59k83L6K06j5k93K65J51m76K36J54j81j29L05J2m23L45J46l55P8
$$ -300 0 159 -124 -88 118 103 -190 75 226 -250 -14 140 -41 -170 135 147 -276 69 215 -140 -62
3275f2K29p6k76L54K0m34K48J84k55q9K79J4l58K94J37m54J93K14j51k25L40k1
$$ -62 167 91 -185 169 189 -245 3 187 -68 -157 122 136 -222 72 209 -245 -52 162 11 -214 126 105
3297A05l69L05R3k71M7K10k5l22L37M4l98K27J74k24n9K67nl77L86ok59Q4K48
$$ 105 -264 41 134 -137 -90 120 95 -227 110 154 -244 -17 157 -67 -126 141 136 -241 145 139 -120 -36 212
3320B12j72k26L84n0l78K44J46k40k4K24o4k59L10L1k94J11K12j35k37L69m7l09
$$ 212 40 -186 198 148 -230 14 160 -80 -104 120 56 -203 107 138 -156 -45 167 32 -205 164 117 -192
3342a92K43Q7l12L7K81j32k37L47l2l12K17J25j57j38L02l2l37L04Qk60Q9K39
$$ -192 51 138 -174 -137 144 12 -225 122 90 -222 -5 120 -37 -175 127 95 -242 62 70 -190 -101 138
3364A38j14k90L90ll37K77J19k17j33L69j52k44L97n9k79J33J88j69k17L98j24
$$ 138 24 -266 124 121 -216 61 180 -37 -170 199 47 -197 200 141 -138 -5 183 14 -203 195 71
3385G1k95L11P3k66oL01j96k89L99rk78K16J01k28q5L16r0k26K50N0k41K9K10
$$ 71 -224 87 160 -106 -112 189 -7 -296 103 94 -184 32 133 -95 -180 136 46 -180 70 120 -121 -92 118
3408A18j33k00M25j62k68K94M2j95r2L45j18k45L56j4k36J05J76k00j58L19j14
$$ 118 -15 -215 210 48 -220 74 116 -79 -171 174 56 -189 167 153 -83 22 198 -2 -160 159 45
3429D5k40L48k7j60l9J97p6k31L37p9k26J46J13j12k15M07j56k02L02k9j85KK41
$$ 45 -195 153 126 -34 -73 124 48 -183 154 75 -151 -5 108 -4 -219 188 32 -170 132 103 -82 -80 161
3452A61j56k04L36j11k16K37P7j73j02L30j58j82K83l5j86Q9J63j77q6K87j21
$$ 161 5 -199 137 26 -190 47 124 -49 -151 179 21 -161 122 87 -99 -10 153 -24 -110 177 56
3473E6k41K55R9k47j2K88k16j72L66j43j56J64J36k49o5L39j85j90L10o1j47P
$$ 56 -185 70 169 -78 -90 198 -18 -190 176 33 -123 41 177 -72 -137 202 17 -173 137 76 -71 -64
3495f4J78j90n7L03j86j56K05Q9k35l7L39k51j66L54n6j92R5J77k21j36L60j17
$$ -64 114 -76 -133 170 -16 -172 33 122 -113 -150 189 -62 -228 126 70 -122 -27 150 -71 -207 153 36
3517C6j56K29l4j33k4K65j84j78L57j12j88J30J64k12p6L36k40j01K16kj88O7
$$ 36 -120 109 75 -58 -82 183 -1 -179 178 66 -122 8 172 -40 -116 220 -20 -121 95 93 -95 -28
3539b8K39k68j10L55j72j22J48mj50j7L01k03j43L13p4j80M3J70j63j19L47j90
$$ -28 211 -57 -167 188 16 -106 42 38 -112 -129 172 -31 -174 139 65 -115 -72 98 -65 -184 163 -27
3561b7j39K02O9k45pL45k86r7L09j02j27J46J21k37j0K87k55o2K52m4k18O3K83
$$ -27 -166 36 105 -140 -147 198 -88 -185 124 22 -105 41 162 -75 -85 202 -53 -115 137 93 -125 -62 221
3584B21l09LK54k08o3J86M4j87p8L29k23r3K25r1j75Q4K55k78k8K76j79j34K22
$$ 221 -88 -85 169 -39 -102 84 128 -59 -137 192 -31 -124 101 10 -165 -81 174 -104 -132 144 -35 -169 53
3607E3Qk13P4K80k62l2K90j71j25R9J54k58M2K85k50k9J54J4j90Q9K21l33M7K49
$$ 53 61 -152 -78 202 -60 -92 198 27 -98 1 155 -103 -61 224 -26 -55 99 113 -77 12 233 -100 -53 196
3631A96k01j38J78J50k67NK30k20k4K31o9j50P1J96k88K5J92k05l1J00J59l07
$$ 196 -5 -143 35 185 -82 -77 153 -67 -91 140 71 -79 -8 188 -100 -75 117 -88 -119 -19 140 -167
3653a67N7K37k44l1L20k05q1J17J63k79J8K54k53JJ88Ok44J41K05k82K8J90j49
$$ -167 -110 127 -117 -148 172 -33 -114 3 166 -113 -95 159 -94 -93 95 101 -143 -2 203 -79 -51 139 -10
3676a0q5J31J05k61J01K27k91J2J36L2k35J34J50k89P5K18k00j1J24N3k61R3K40
$$ -10 -95 36 141 -120 -19 208 -83 -71 65 97 -138 -4 146 -143 -68 150 -50 -61 63 116 -145 -52 188
3699A88k76J5J71p6j58P1K19k64P5K03k15m0J71J4k15J37J60k89O2J64j62l2J48
$$ 188 -88 -73 98 22 -136 -65 154 -110 -35 168 -47 -87 84 98 -117 20 180 -109 -47 117 -45 -77 71
3722G1Q3k94J49J35j81qJ62o4j14K8J99l20J11J98k32oJ31M9k47J34J82l24P2
$$ 71 154 -140 9 144 -37 -45 117 53 -61 -33 166 -154 -43 155 -77 -83 48 97 -150 -16 166 -158 -86
3745h6J90o7j35Q8J06k34J13J66j42j25J65J0k26J51J61k43Q5J37j09j71K08K1
$$ -86 104 37 -98 -10 96 -138 -25 141 -1 -126 39 49 -177 -26 135 -108 -23 114 5 -166 42 63
3767F3j99J19J78k82P1J82n1k15J66J61l08Q4J68j55o0J55K3k22J42J39k52O3
$$ 63 -136 -17 161 -121 -50 132 81 -134 32 193 -115 -31 137 -18 -78 77 100 -122 20 159 -93 -30
3789c0J21p6j65J44J42k32P2J26k01j6J56O0k39J68P3k46R1J55j00j31J13Q9k31
$$ -30 91 15 -150 -6 136 -96 -24 102 -99 -115 41 101 -138 30 103 -143 -52 103 3 -128 -15 74 -157
3812a57J76P1k12L9J30k7j42J64J37l36J33J13j22o5J29J02k60J77Q5k09J00P2
$$ -157 19 90 -122 -83 47 20 -122 42 179 -157 -24 89 -33 -98 31 133 -127 50 135 -74 26 98
3834I8k7j90J81R3k87J40R1r6o6J28K2k17J88L9k53J22J08p1j20J53L2k25J26
$$ 98 71 -119 62 155 -132 8 99 3 -63 65 87 -130 58 97 -156 -34 74 3 -117 36 68 -157 -31
3857c1Q8j82J4J13J1j56J51J15k57J15J08q0j07J64K4k47K53Rj84O3J27r0j27
$$ -31 57 -125 -111 2 13 -143 8 123 -134 -19 89 9 -98 66 90 -157 96 105 -79 -16 111 21 -106
3880a06J18P2k42J52P7q7o0J19J1j91J73R2k56J09L8qr7J60K2k31J76O5j97L9
$$ -106 12 84 -158 -6 71 -16 -76 43 54 -137 36 128 -128 -19 19 11 -86 74 96 -135 41 106 -91 -52
3904e2J47l8k29J87P6j86Q0Q2q5r8J47P0k45J76P2k32J02M8k5j06K03lk08J75
$$ -52 95 57 -172 15 91 -95 -15 67 -18 -116 31 101 -144 32 104 -128 -26 22 -3 -109 94 91 -117 58
3928E8Q6j67k4J23k6j36J64K3j59MJ05j2j56J59J7j69J19J25j75m5J34rj49J32
$$ 58 144 -23 -47 76 50 -86 78 101 -58 -54 51 39 -117 42 59 -110 9 134 -41 -86 48 39 -110 22
3952B2M2j53K4Q7k2j47K44j38j21J93j1q5L5R5m5j50J85nj56J61qp8j02K06l0
$$ 22 64 -89 -65 22 0 -147 97 -41 -162 31 20 -65 -30 65 20 -130 55 50 -106 55 47 -31 -133 73 43
3977D3k01K69m9j59J21P6r8j19K02k9j74J64L7j18j3J22k9j57J98q0j51J44O2
$$ 43 -158 111 62 -97 24 100 2 -117 85 56 -118 46 83 -35 -48 74 45 -112 86 6 -145 -1 61
4000F1r4o4J83r5j11J71o3p4j4J68m7j44J49K6k10J98J7o5p2J44n7j45J26Q1j29
$$ 61 -33 -97 86 -9 -120 51 -12 -86 -100 68 21 -123 26 52 -158 40 57 -8 -80 64 7 -138 -12 69 -60
4025f0O5M3o4p0J53l4j26J59m5m2k3J87o4j71J71l0j28J04J3rj17J66l5j76J81
$$ -60 5 48 -16 -86 67 33 -93 66 21 -21 -44 143 79 -92 79 49 -79 25 38 29 -88 78 43 -133 48
4050D8k5o7mJ21k8k03K38o0j33J05P6j12p7J84m6j23J48J1r3K8J05j26j06K45
$$ 48 23 -44 -48 73 45 -158 80 20 -113 -8 68 -44 -121 63 17 -106 42 53 -40 -12 93 -33 -139 106
4074A06j21l3J04L1q9nJ20n4j60K00l9p0n6J45q0p8K07j23j09J41k2n3o0J67p4
$$ 106 -15 -48 56 87 -2 -7 113 59 -101 99 60 -10 -66 79 -1 -79 128 5 -104 37 15 -38 -98 69 -5
4099ej49K60j00j42J98j0o3o8J51j12r4J75k7n8kJ30j39m0J80n6j52J70no0L2
$$ -5 -154 106 6 -136 62 52 -11 -79 72 -40 -134 41 14 -44 -46 84 -55 -95 85 29 -123 47 42 -18 14
4124A4J10j55p5J98j43k6J08N4o8j21J86r7k8N3L0n5j0J13q4j27J54j9r7R6M6
$$ 14 124 -31 -106 92 -51 -77 31 85 17 -104 82 -15 -43 10 40 -15 -25 88 4 -123 31 12 -85 11 57
4149E7j04k7J68j22q1J53j4p9K2Q0q9n9J62p3l1K5K8n5p9J55l0r1J66o0o2O7K2
$$ 57 -47 -74 94 -28 -109 44 30 -49 -27 53 -36 -95 67 -6 -37 -12 16 -39 -118 37 7 -84 82 22 -40 27 49
4176D9j10j1J76j15q9J44M1r4J5J06j54QJ44j00k5L9M4q8m3J54q2m8N8j1n9K9
$$ 49 -61 -72 104 -11 -100 44 85 -9 6 112 -42 -34 110 10 -15 24 68 -20 -63 91 9 -39 19 8 -51 -22
4202b2J04j52lJ50j08n2R8jo2n1J54j19m9J51l5n7L9Q1j07k4J62j04m7Q6K2j11
$$ -22 82 -70 -73 77 -31 -83 15 14 -48 -99 55 -64 -113 38 3 -54 -15 66 -41 -65 97 -7 -54 32 54 -57
4228e7M9J07j30m2J91j20n6L1O5p4j9J66j35OQ8l9r3N5J06j35m9J61q5m3OP5j02
$$ -57 -8 99 -31 -73 118 -2 -58 -27 38 -36 -55 111 -24 -18 70 31 -62 -7 99 -36 -85 76 -9 -52 -46 29 -73
4255g3J6J44j50J3J05k4k6n9R6j42K0J11n7n9M3L4k1l7J51j64L7R7n0k1L2N2r0
$$ -73 -57 87 -63 -50 55 31 5 -54 42 -100 -80 31 -26 -85 -42 -8 -29 -66 85 -79 -42 55 5 -16 16 68 -22
4282b2OR1r8j1O7Kr7MJ71j43L9P7q3k8LP3j04oJ74j38j5P6j9j08J18O3j36K2J09
$$ -22 -16 75 -23 -34 33 35 -62 -58 113 -30 9 86 3 -25 -22 51 -53 -59 115 -23 -38 38 19 -89 29 92 -44 -22 87
4311H7j44J0K7P2o7J3J24j86PJ06p1k3KR7q7n0J53j15J4J02rj05PJ24j28L1R5
$$ 87 -57 -47 -20 52 -15 -2 122 -64 -57 49 -22 -45 -43 54 -33 -83 70 -45 -31 71 62 -43 -36 88 -40 -9 86
4338H6n7k8lN5j14M5R3j19L1pL7p2K1J05j05jQ0j02k3K0J04j29P4O7j36jR2j4
$$ 86 29 1 -2 53 -61 -16 77 -42 -11 -18 19 -53 -32 73 -32 -33 47 -55 -78 -58 46 -83 -9 58 -78 -79 13 -1
4366ak2M9P3j42O5L7r5k6J07K6j17k1Q5j4oN0j00M9k7O0q4M8R6j23K9M8k8j05
$$ -1 -23 26 99 -43 22 59 -36 -62 45 71 -46 -67 18 4 -2 48 -52 -3 -30 30 -54 -6 90 -33 -4 44 16 -89
4394h9O8J12j66N5P4p3l4Q4np7M0M4r9%P1o0j2O1K1p1K6M9n4K8K4lp8R4L5j44
$$ -89 -21 91 -75 -20 54 -19 -53 31 26 -51 -11 33 -66 -66 5 -55 -67 -6 15 -56 -30 19 -35 -7 17 14 -64 30 65 -79
4424g9JJ27o4J3M2k4p3M6Q2j05PM3O7p0J6K0j16Q0Jrj3K9jm3J8L1n0J1oK1n7N1
$$ -79 -78 49 -15 -2 40 16 -57 -11 71 -34 -27 16 83 13 29 49 -67 13 14 5 -8 21 20 -23 -5 26 -24 -13 -19 2 -55 -4
4456dj0n0N5On4j6Q5Oj28J12l4r0O6O5q3L8L4L8q7L5P3j14J9L8j4o4P7J01j31
$$ -4 -14 -64 -9 -3 -57 -73 12 18 -110 2 -32 -122 -56 9 -74 -36 -2 36 -51 -16 57 -57 -38 0 -14 -78 -1 100 -31
4485c1L6L9k5j0qN6q7J7J04j18JNL6r3M9J8k2J1L7r1P6m3N7n9J3R8j47J04p9o
$$ -31 5 44 19 9 1 57 -30 -13 91 -27 -26 -21 15 -78 -29 -11 -33 -22 15 -76 0 -43 14 -45 -32 66 -81 23 -56 -62
4515f2pJ00rq7O4K6qm8N3L7p3P1m9n8O4jm6JL4M8r1P7L5q8J1P0p1j7M3K2o7M1
$$ -62 -69 31 22 -65 -1 25 17 -31 22 59 -14 57 8 -50 14 13 -33 -32 2 50 -41 36 71 -17 -6 64 -7 -24 19 41 -26 15
4547A5J5k2k1L8l3o3M0O6q6M6j0k1l5J3P5j26J20k9Pn0P6o6m0Q0O0o6K0qm0M5
$$ 15 30 8 -13 25 -8 -71 -31 35 -51 -5 -15 -36 -71 -58 17 -109 11 -18 -11 -61 15 -51 -91 -11 49 -17 3 -5 -45 0
4577@O4j9p9M7J3n7L6Pm0j8M3Q3j52Q6J7r8Q1k1M8n1L0J0j00M1N6Kq3Q0k9m1K8
$$ 0 64 45 -34 13 26 -31 5 12 -28 -46 -3 80 -72 14 31 -67 14 -7 41 -10 20 30 -70 -29 27 29 -54 26 -3 -44 -16
4608a6prRKJ9n2qM5l7K4M5n9j8P3k0pL6l7LMQJ0o2R4l3kM3kkj9k2j9J8N7n2k6
$$ -16 -23 -32 -23 -21 -2 -54 -62 -17 -54 -30 15 -44 -62 11 -9 -16 20 -17 -14 -10 -2 8 -54 40 7 5 48 46 44 25 3 -16 2 59 7 -19
4644a9O4Mo5k2N9Lm9NL9o0j0K5K6j05J15Lq3N5Jkk8O2j2j5QJ4n9OO5m7k9O3k6
$$ -19 45 49 -16 -38 21 24 -25 -20 19 -41 -51 -26 0 -105 10 13 -70 -15 -14 -16 -44 18 6 -9 -1 13 -46 -40 25 -22 -51 12 -14
4677a4j0K7o6J1M1O3m3j2kM4Jo4M4JL8m8J1m7P8l8j3j0M1Rn6M3J4l8Prj7k6L1
$$ -14 -24 3 -63 -52 -11 52 9 -3 -5 39 40 -24 20 21 59 11 22 -25 53 15 2 -8 33 42 -14 29 43 5 12 3 -14 -40 -9
4710iJ7j03J04j4j6K4J8p4jP4l3j2O5l9nl4O7l7k1N7Kj1OL0o0k2P7l8m1K6L9k0
$$ -9 8 -95 9 -5 -21 3 21 -53 -54 20 -13 -25 40 1 -4 -38 29 -8 -29 28 30 19 25 55 -5 -27 50 12 -29 -3 36 16
4742A6k7K8Qo3L7m1J8J9RJ3l9J4K2k9J1k0jO7n8J4l6P6p0j9L6K6n7j2K4N5k7R
$$ 16 -11 17 25 -38 -1 -42 -24 -5 4 17 -22 -8 14 -15 -4 -24 -25 42 -16 -2 -38 38 -32 -51 -15 11 -46 -58 -34 21 -6 3
4774CJ2k8j4K5j4JL9Qm5K6lj1J0P7k9l0Knr7Q3M0j2p9M4j1ML5rl3k7O7k1k2J0
$$ 3 15 -13 -27 -2 -16 -15 24 32 -13 13 10 -1 9 86 57 27 29 24 -73 10 50 38 -41 3 -8 -4 31 22 -11 -38 29 8 -14 -4
4808dmkMJ2n5NP4r8M0L6M2p1Kkpl0P1k5M8l8k1K4k0O7K6m8J8j0l2lJ9LoJ02p7
$$ -4 -8 -10 -6 6 -49 -44 30 -68 -28 8 50 -21 -19 -21 -28 -58 13 -12 36 -2 -23 1 -19 48 74 26 44 34 2 -1 18 21 15 117 40
4843D0j4j6Kk1K4LljJ2Qn7P7k3o2k1J9J7prpjL6ol8N0Ml0m3L9L0j7l7P0l6M4O
$$ 40 26 10 12 -9 15 18 15 14 26 34 -23 54 31 -31 -52 -33 -16 -23 -32 -39 -40 -4 -10 -48 2 6 -24 -67 -28 2 -15 -52 18 -18 26 32
4879C2o7K5L4Jp6JJ07n2k3M3j7j6J%l2J09Jq6M8m2O7j18O4j8Jj2Rj8j8K6L8n4
$$ 32 -35 -10 24 25 -51 -50 57 5 -18 25 8 -8 -7 -7 -39 70 71 -15 33 -9 58 -60 4 -14 -13 -25 -16 -34 -52 -26 12 -42
4911d2K6j4%J8l2M9l8m4R1q7M2M6j0nrj8j4P9oj9m3M9Ko0O1Rn4M2M6m5k7N6k6
$$ -42 -16 -30 -30 -12 -44 5 -33 -77 14 -73 -31 15 5 0 -9 -27 -41 38 32 13 -30 19 21 -39 22 31 -23 19 65 20 -7 49 23
4944B3l6K5k0k5M0L6k3pOj6%lL6r0L3J7L7p1L0J%PJ4n0P0o7M0l0j0M9n2k4Q6m4
$$ 23 -13 12 -8 -33 7 43 20 13 19 3 3 0 36 -54 -21 -4 33 -38 -8 -7 -7 0 14 -36 34 -33 7 -23 -33 16 -36 -60 26 -18
4978a8l8O7j1k9Q5j7J3o0K2J9l6M0k4j0j7L3K4n6L7J7k8j8J8Prj1j4j9P2m5m5
$$ -18 -56 11 0 -29 56 39 52 -8 14 33 -3 37 13 3 -14 19 43 -13 24 41 13 -5 13 20 11 0 -14 -33 39 -6 -51
5009e1J0J8l5M3NJ3k6pM4m5pN0k8o%l3L1oN4p1L5M7K8o0J2N1r7L6j1K5k0K4m1
$$ -51 -41 -23 -58 -15 -10 3 -23 -30 14 -31 -38 12 -16 -22 -22 -55 -24 -30 24 -47 -12 35 63 3 15 66 -31 5 -6 19 -1 23 -18
5042a8K4J8K9p3J4L4J0k1K6k4o6k2M9J7l0L%qO0m4NoJ8J0l8K3L9l8J2j8L3%m0
$$ -18 6 24 53 -20 -6 28 38 17 43 19 -47 -69 -20 -3 -33 -30 -30 -38 22 -22 -17 -23 -5 5 -33 -10 29 -9 3 -15 18 18 -22
5075b2Pj8K9nJjM6j6Oj5MK2ok6j8KL1Rm8K9mqk4L0l5K5K1K1m6M9n2k1j5N2J5m8
$$ -22 -15 -33 -4 -9 -8 -9 37 21 27 12 16 38 32 6 -12 -10 21 30 -18 11 7 -1 -25 5 -30 -5 16 37 -9 40 -12 -33 -48 4 19 -29
5111b9M1l6n0K7J3l9k0N9J4m5O8m8L6k7k5N6k9K8Ml7K2K6K1l7K1m1L4oM7qpOj6
$$ -29 12 -24 -74 -47 -34 -73 -93 -34 -20 -65 3 -45 -9 -36 -61 -5 -34 -6 -2 -39 -17 9 30 -7 14 -27 7 1 48 40 33 39 23
5144B3l9L1mJ0K2o8OJ3k1L5n9O3l0k1N3%j0k5L5J4k4K0l6m0M6k1p8P4k5O2j6o
$$ 23 -16 15 11 21 43 -25 -19 -6 -27 8 -51 12 -18 -39 14 14 4 -21 14 28 4 24 -12 -52 -6 -27 -105 -31 -56 6 -10 -16
5176a6J3l9rN9k6k0J3NK6m5Q3p1Q3m8j5N5m4L6mj8M6l8l6L4mm9k5R7nj02J00r5
$$ -16 -3 -42 -51 8 -18 -38 -25 -20 6 -39 44 -27 56 8 -7 48 4 40 36 18 64 26 -10 24 20 -29 -54 43 38 -64 36 -59
5208e9M6Kl9kMM3Kp0Q4q0O6Mo4M8m0O4k3m2O2n9K2K6K1K0o7J8L5lJ4n2k5j9Q9
$$ -59 -13 -11 -50 -52 -48 -5 -3 -73 11 -69 -3 1 -63 -15 -55 9 -14 -56 6 -53 -31 -5 16 36 -31 -13 22 19 33 -19 -44 -63 26
5241B6k7o5Q7j9k6L3K0m1OK7l7m2R6j7k7k6O4l8Pk1J6j7j3L7l1J8J4k4qj1pL3
$$ 26 -1 -66 21 2 -24 9 29 -12 -6 21 -16 -58 38 21 -6 -32 32 -6 1 -20 -4 -21 -34 3 -28 -10 4 -20 -28 -39 -46 -13
5273a3mML1m2J7mKj4L4JJ0k6J8l1M6o0nN8k2J8Jl9J2mL4J3oL0m1K4p7OqLP1m9
$$ -13 -17 -13 18 -24 -7 -11 -9 -23 11 12 22 -4 14 -17 29 -31 -36 22 0 18 19 -20 -8 -12 22 35 29 59 18 42 -35 -29 -37 -34 37 -12
5309a2qlK1Nj9J5J9l2l3N8o7qL9L6j5ok5rL5j3j1m3R3m6QL1j2K5l5O3nl7jMj2
$$ -12 -20 -23 -2 3 -16 -1 18 -14 -47 11 -56 -64 -25 11 -4 -10 -35 -44 -9 -22 -33 -76 17 -29 -21 10 -2 23 -12 51 46 9 8 12 0
5344@rPmJ2No2K3L0L9n7j5M1J7l9L0j7n2O1j1n5M2N3o6K9kQp0N7K6l9k4L7Nnj5
$$ 0 -9 -2 -6 6 11 -51 -28 2 41 -16 -31 10 27 -12 18 1 -51 10 -1 -56 -14 39 -27 2 0 8 -62 -5 21 -18 -42 -5 0 -5 -20
5379b0M7p4K9lNJ2k3J5l0P0n9N9k8N4m1m0Q0n1k6M3J2nK1rl9%K8lqj8j1K6k4l8
$$ -20 27 -47 -18 -21 -16 -4 -27 -12 -42 28 -31 28 0 54 13 -27 53 2 -24 19 31 26 47 38 -1 -1 27 24 16 -2 -13 13 -11 -49
5413d9L3l2M3K8k9l6O1l0l2QJ1j4jJ4%J0J4Qp6N9M2m9L1pl6L2j5L0Jk2J7l3KN5
$$ -49 -16 -48 -5 23 -6 -42 19 -11 -43 -35 -24 -38 -39 -25 -25 -15 -1 7 -69 -10 32 -17 14 7 -29 3 -12 18 19 -3 14 -19 -17 38
5447C8m8qJ4K7kLJ4n5L3K7l8j1j4oM0k1K2o5qL6N2n4Kk1K7k6P0k5Pk7ljML3n7
$$ 38 -10 -18 -4 23 21 24 38 -17 16 43 5 -6 -20 -26 14 -7 15 -50 -58 -22 30 -24 -22 -43 -16 -42 28 3 10 -17 -20 -21 -17 16 -41
5482d1J0RnJ3M7k9%k2L4M6m6PJ1l3L8k0j5pM1l8j7K2K2m5K0Jj1J7%J0m6QJj6L9
$$ -41 -31 -22 -27 -14 33 4 4 -18 16 62 16 23 34 1 39 19 4 -3 38 0 -17 5 27 -18 2 3 -8 9 9 19 -27 -19 -18 -34 5
5517El3k4K5J7l9N9k6j7J0k0N3p1K5MpJ7J7J1l7MJ2L0Kk2Km0M5l3O4q6O7Mk7L7
$$ 5 -28 -52 -27 -10 -49 10 -16 -33 -23 -43 10 -61 -36 -32 -39 -22 -5 6 -31 -27 -15 15 17 -5 -3 -43 2 -31 33 -53 14 18 -9 28
5551B8No9L3m1K6m2O9l7K3Ml1LK3Pj3j8Pnk5J3QL7m2K9j3j4mM4J2o9M4j1Popk0
$$ 28 33 -36 -3 -44 -18 -60 9 -28 -5 -1 -32 -29 -6 1 -12 -30 -23 -28 -53 -40 -32 5 -37 -8 -21 -35 -39 5 17 -52 -8 -19 -12 -18 -25 -45
5587d5R8n5L6p6Q1k2m1J1K4NJ6K4m3k1M6M2j20O7Km1K7l9K4o5qR5q8M0L7n6k4
$$ -45 53 -2 34 -42 39 17 -24 -13 11 16 32 56 13 -8 38 80 -40 27 29 -12 15 -24 0 -65 -73 22 -66 -26 11 -45 -69
5618f9K5J4j5MmJ9%J4LJ3l4M7m4L4Km4PN6n2K6n4O7k8rK8k5J8J7l4j9N0J2%o4
$$ -69 -44 -30 -45 -41 -45 -26 -26 -12 -9 4 -30 17 -27 7 9 -35 -28 28 -24 2 -52 15 -13 -22 6 -19 -1 16 -18 -37 13 25 25 -39
5652c9J00o9L1j3J3o6L4L1o6L1j9K6l2P0n1lJ9J5m5Pj5N8l8k3kQlrN1Kj8J1Nl1
$$ -39 61 -8 23 10 23 -43 -9 22 -44 -13 -32 -6 -38 32 -19 -22 -3 12 -33 -26 -41 17 -21 -44 -46 -38 -41 -50 1 3 -15 -4 1 -30
5686c0j0J1kN8l9K3l9P6m5nJ9j5N3j5L3o1K4j5K0o2QQPK3ql1k6L4n2L5M3rn1L4
$$ -30 -40 -29 -31 27 -12 11 -28 48 3 -2 17 2 55 40 73 12 36 21 41 -21 -13 -5 2 25 17 -14 -40 -6 -58 -23 20 11 -40 -6
5720fK0o3j6N5M1j02P5m8M1k1m2M5n4J00n4K9LK0rMmJ0l5J9j2K0l0J1nK9n6L3
$$ -6 14 -49 -65 -10 31 -71 4 -44 -3 -24 -66 -21 -75 25 -29 0 3 23 14 18 14 24 -11 8 -4 16 -14 -3 -8 21 -35 -2
5752bmK2L9o2J8pk3N6n9J1JJ7l8QkJ5Pk8O9q5Oj1M7j3m8M5J0m1M3j9j6J5L5l5
$$ -2 -6 16 55 -7 11 4 -19 37 -22 -11 -10 7 -31 -23 -25 -10 -3 -31 38 -47 -41 -52 -5 -18 -66 -21 -11 -52 -9 -28 -44 -29 6 -29
5786b9K0K7j0m5L0N9p6jLN4o0N0Npl5L8q6Q7L5j1o0M7%k7j3j4M4n0K5k9K4j9K1
$$ -29 -9 18 8 -37 -7 52 -24 -25 -22 32 -28 22 27 20 -15 23 -63 24 59 48 -12 35 35 8 -5 -19 25 -25 0 -29 -5 -24 -3
5819cm9ON3jl9jM4J4n9M4l4m6M3rlM2l7j1N7Kl8PJ6oJ4J5K6m1l1N8k6J1o6P7k7
$$ -3 -52 -46 7 6 -33 -34 10 24 -35 9 -25 -71 -28 -37 -40 2 -35 -46 11 13 -25 -18 -2 -8 6 21 47 6 -25 33 7 18 -48 29 2
5854Bl8L0l2N7Kqj2J2nj6k8K4J5k2k2PJ5%n5K8K0J1j4J1LK3n7rL4K5j6LL2m1O
$$ 2 -36 -6 -38 19 21 13 1 13 8 -8 -36 -12 3 -19 -41 -34 -19 -19 -74 -46 -26 -15 -29 -18 -15 8 -49 -58 -24 1 -15 -12 20 -21 -15
5889a5M5j3QJ1k2J3j9nNL0pL5l5n5N2j2Lk0J8n2P1o2M1M3l7n3P0k7j7J7m0L2l1
$$ -15 30 17 25 36 14 27 8 3 8 38 31 66 31 -24 28 16 19 -1 17 -35 36 -26 15 58 21 -32 38 11 -6 11 -29 3 -28
5922b8L3j9k8M1JOm7L6k5J0n4O8j4pL4l7M3m9oJ1P7o3N1l5K0K5k0j9L1o0J7j1
$$ -28 5 -14 -42 -1 0 6 -41 -5 -30 -20 -74 -6 -20 -27 7 -30 13 -36 -42 -31 46 -17 34 -1 19 44 24 5 36 -24 -7 -18
5954a8K4K6l4R1j02J8j6K8lj0k4l7M8j2K2n1M5pj9J8j8j4j9J3mM0L3m2j5N6m5
$$ -18 6 32 -2 89 -13 5 -11 17 14 4 -20 -57 -9 -21 1 -50 -5 -12 -31 -13 -31 -45 -64 -51 -55 -15 18 -24 -39 17 -28
5985b8J8L6NK9m1oJ8q7N1j1J4K6j5J3o3J0P6p2QK9K2m9N9m6l6O5j6l7O0k8k6L8
$$ -28 -10 26 31 60 19 13 31 -56 -5 -16 -2 24 9 22 -41 -31 45 -27 -19 10 32 -17 42 -4 -40 25 9 -28 32 4 -22 16
6017A6k6j3J8J1M1q2OJ9%k9M6lm1K1J7J0o8L9O9p3N7m1QN1l8j1j4M3J4n7rO5k0
$$ 16 -10 -23 -5 6 47 -35 -29 -10 -10 -39 7 4 -37 -16 1 11 -57 -18 51 -22 35 -6 2 53 15 4 -10 33 47 -10 -19 46 26
6050B6rK3K7p5K5j3%K7NJm6M9K3r6O0o9K8M8qJ0l9j4L2o3N3k9M7j0l6Mo2J09n1
$$ 26 17 40 67 -8 17 4 4 31 36 37 -9 40 63 -33 27 -42 -14 34 26 36 -3 -17 15 -48 5 -24 23 13 -23 -19 -81 28 -23
6083b3j7lJ1M0m5L8L4m5M4m7J0J0m4K8rN5o7J02k0n6J9l7K2k2O9j5J1j4l0k6L0
$$ -23 -40 -43 -32 8 -37 1 35 -10 34 -13 -3 7 -37 -9 -18 37 -30 72 52 -4 15 -22 0 -22 47 32 43 29 -1 -27 3
6114Ck4jP0l4J5j0m3J8m1J17r0k6O4n1MJ4j5m8J7R5r1K0J9L1jk7J9k7L6lol5J4
$$ 3 -21 -22 48 14 29 19 -24 -6 -47 70 -20 -46 18 -33 -29 -15 -30 -78 -61 34 -57 -37 -18 13 12 -15 4 -23 13 10 4 -31 -17
6147a7ml8O1N1mOm0o8K5O9l6L9Oj8k2L7m1J6n4P0r0J9j1O3p2k4O8j8q8O2J2k0
$$ -17 -21 -59 2 53 49 55 15 -53 -28 41 5 44 50 32 10 47 6 22 -32 38 -52 -33 -44 19 -53 -77 -9 -27 -115 -53 -41 -61
6179f1M8J3l7L2J8k2k0J4L2l3rqM7k3J1kL1K7k4nK1m4o5N8L7n3K0k6N2m5J4M1
$$ -61 -13 0 -37 -5 13 -9 -29 -15 17 -16 -25 -33 14 -9 2 0 31 58 34 29 50 6 -59 -1 36 -17 3 -23 29 -16 -2 39
6211C9ooj7L3l9Kk8R9o1rKn8RN8J5p2N3k5j4LM1k9NK0m5omL4m1M2%O7r5P5l0J7
$$ 39 33 27 10 43 4 6 -22 77 16 7 9 -49 -40 18 33 -39 14 -11 -25 -22 19 -10 -5 15 -30 -36 -40 -6 -47 -5 -5 62 -33 42 12 29
6247B9PJ2m4L4Lk1j9M3j4j4J3j0K0j9M1l8n2ON8o5k6Q4j9n6Q6l8m5L2j3k3l5O0
$$ 29 36 48 4 38 41 20 1 44 30 16 29 19 39 20 61 23 -29 -23 35 -30 -56 28 9 -47 39 1 -44 -12 -25 -48 -83 -23
6279b3M2l1Nk9mJ6MP8q0J1k3lM4k0K5j9K2nrK4n1J7nNM8j9L0j8K1KMp5L2n5L3
$$ -23 19 -12 -7 -36 -40 -24 -20 58 -22 -11 -34 -37 7 -13 12 -7 15 10 1 25 -26 -9 -14 -9 39 20 50 32 53 55 59 -16 16 -39 -6
6314fL1n8L0j3M2k9loj5Rk0J8K2o5K8qQj6K8mj7Q8n2k1k2J00n0K9J5m8j9RoL8
$$ -6 25 -33 -3 -16 26 -3 -6 -12 -27 -18 -38 -20 2 -63 -35 -43 -35 -51 -23 -27 -44 44 -8 -29 -51 49 -1 28 43 -5 -24 -15 -21 17
6348A7j2K3M2p8jK0l1J1Q5o3k2L8Ol2K9l3%l4M2K7j0Np9N7K4j6m0KOj5mK2%m5
$$ 17 5 28 70 -8 -9 11 -20 -9 76 13 -9 29 35 3 32 -1 -1 -35 7 34 24 29 -50 7 31 15 -25 -23 -17 -32 -36 -14 -14 -59
6382e9N4K9q4O2K1k4Jn5P6kj4N9q6K7L7k6o6O7j9L0k4K7M0j16N7l7K1K7pJ9j4
$$ -59 -5 24 -60 2 23 -1 0 -55 21 19 5 64 -22 5 42 16 -50 17 -2 28 4 31 71 -45 12 -25 -4 23 16 35 21
6413B1J4o2N3o5P8m3m6P5l8j6N5j4m2j4J02p2l7J5nJ4j4J7JL5m8L9o3N7L6m0N4
$$ 21 35 -27 26 -39 39 -4 -50 25 -13 -29 26 12 -30 -44 58 -14 -51 -36 -41 -27 -41 -24 -23 12 -36 3 -60 -3 33 -7 47
6444D7k6n1j4N7Km8M5K7J0l8L5l5oL3m1k3L1K7l5J1oK7l5QjJ4m2L0k4j5K1Mk7
$$ 47 21 -30 -44 13 15 -33 12 39 49 11 46 11 5 38 -3 -26 5 32 -3 8 2 29 -6 2 1 15 -27 3 -21 -36 -15 -11 -38
6477c8J4nK5k9N9k2J0Mk7Ko2Q0k0M7Mj6n0PO3n0J7K6LKmj4lk4M3k8qK8j6J6J2
$$ -38 -24 -29 -4 -33 26 4 14 18 -9 -7 -69 11 -9 38 42 26 -24 -17 46 -4 13 39 42 44 40 26 23 -1 42 14 6 34 18 34 46
6512D6ql6k4M5J5j9J8k1l4P6o4jk2L6m3lM4Qn2LLk3K2L2mn8M2M4n7K6mk8M5j4
$$ 46 38 2 -22 23 38 19 37 16 -18 58 -6 -7 -29 7 -36 -39 5 13 -39 -36 -33 -56 -34 -2 -6 -64 -22 22 -35 -9 -13 -41 4 -10
6546a0K0JlJ9n8N1kK9j2k0J2km4OJ8m2O3k8K5o8O7J4rJ9p5O7q5L9l3j1Q7p5jN4
$$ -10 10 11 8 27 -31 20 18 47 35 15 27 25 -19 -13 5 -37 26 -2 23 -45 22 36 27 46 -29 38 -47 -8 -41 -52 35 -40 -41 13
6580A3j7n5J6K0K7m8P6n7L1L0k8m6k0M0j3OO8l0K0j3M5j00P2KrjmJ3k7mQm6M9
$$ 13 -4 -59 -43 -23 4 -44 32 -25 6 36 8 -38 -58 -18 -31 -25 43 13 33 20 65 -35 37 39 30 29 25 38 11 7 15 -31 18
6613A8kl3nP1o1LJ0N2q5j6Q8j13Q2Kj8nm4Q4o0k7J1N5l2L2J4n0QQk5j4L2K3J2
$$ 18 16 -17 -22 49 -12 -9 1 53 -32 -48 40 -73 9 11 -7 -12 -56 28 -32 -59 -48 7 -25 7 21 -29 -21 -13 -38 -52 -20 3 15
6646A5PQm6K1K6MNm2K8j2L7l1k9l2R5m6K8j1l5k5L2K5l9K2J6l6Kk3K5l5P7j0o4
$$ 15 22 30 -16 5 31 35 40 -2 26 14 51 20 -9 -41 54 8 36 25 -10 -35 -3 22 -17 5 21 -15 -13 -36 -11 -46 31 21 -43
6679d3K6J1Jm2N7j2l2j0J3L1mJN5n8k1K4K0k6k4N8o1N3K5m5KPO9r5N8J4n3nJ4
$$ -43 -17 -6 -5 -47 10 -2 -34 -44 -31 0 -4 -3 52 -6 -27 -3 17 -9 -33 25 -36 17 42 -3 -1 6 75 -20 38 52 -1 -6 8
6712HK7l6JM6l0j9L4l5m0O6o1OK1lJ9l1M6j9qk1L1ql2Kk0L7k1L2n9M5qJ6P7m5
$$ 8 35 -1 0 46 16 -3 31 -4 -44 22 -39 -33 -12 -15 4 -27 19 0 -8 -29 2 -6 -38 -36 -56 -19 -40 -8 -67 -22 -30 -14 63 18
6746A8l2OM8j5k9l6L0k9J6N4J8o5P3j0k9K4j2m1K8Po2M%N5o4L4Jo8N3K9Np4KM9
$$ 18 -14 -8 40 25 -4 -40 -10 -39 -23 31 49 -16 57 47 18 42 30 -11 17 24 -38 -34 -34 21 -43 -9 -8 -76 -23 6 11 -63 -61 -12
6780a2j7J0O6o4J8l5K8n6O0J9l9k7L5pQJ9RL6j4lJ4n0j0J7j5N5ql0L1j1j9l0J07
$$ -12 -29 -19 47 -17 1 -34 -6 -62 -2 17 -22 -49 -14 -21 -13 6 15 51 37 34 48 -2 -12 5 -10 45 37 7 38 27 8 -22 85
6813H5m9mJ5Kp7M4L8mr4L8LMk7L1J6n3O4j6m2K4pJ8Jl5k4K3M8m8K7J4J8q3N0J9
$$ 85 36 32 47 49 -28 16 54 50 -44 -6 -3 1 -26 5 21 -32 32 16 -26 -2 -9 9 10 -25 -49 -26 22 -26 1 15 33 -50 0 19
6847A9m2L7l6J5K6NK3np3M9pJ3jjOo5O9%jj3j0PJ6J2J7j13R6l3o7N0l8K2Nj1M
$$ 19 -23 14 -22 -7 19 24 47 42 -31 18 11 24 23 22 28 -37 32 32 31 18 8 15 31 43 60 -53 43 10 -57 -7 -45 -23 -18 -29 -25
6882b5l9L6K6nj2P%o1P0J3Mk6O1m2J2pL5l9K4J9k6m1Q3p2j6M4M6m2J8K1j4q8M0
$$ -25 -64 -28 -2 -7 -19 -12 -12 -73 -3 10 14 -12 49 7 19 12 47 8 32 51 25 -16 67 -5 -21 23 69 27 45 66 52 -36 4
6915Dk2RO0Mk9n5L4LJ6m1l7L2KL8n0M9k5Jk4J3On9J11o5%l6k8O3k9L8RK8o3O3
$$ 4 -18 -9 51 55 26 -29 5 8 24 -17 -54 -22 -20 18 -32 17 -8 -7 -31 -18 -12 -71 40 -25 -25 -61 -89 -26 -55 -17 -8 20 -43 20
6949B0k3lM5o7L0K6mk5OK0L1ll7mJmL6ko7M6Ln4N1Mk6KK3j7o3N3lj8m0J5M7o6
$$ 20 -3 -6 39 -28 2 28 24 -1 5 25 56 53 16 12 13 9 45 43 -24 22 25 -29 22 26 0 2 25 8 -55 -2 -5 -23 -63 -48 -1 -67
6985f7L6K0l2K0K6m1M7m0L9n9M5j3k1K3K2Mj8OL0o1P3kk5pM2O1j13P8o3j9J9m
$$ -67 -31 -11 -43 -23 3 -38 9 -31 8 -51 -6 -19 -40 -17 5 9 -9 -3 27 -34 39 37 12 5 47 108 -5 73 10 -9 10 6
7017Fk0N9no2j5M6K5o4M7o4J9L7rPk7Qj0NkJ6Lj1l6N0j7N3m2k7%L3K6l3K1l7Q
$$ 6 -14 45 40 -22 -37 9 34 -30 17 -47 -28 9 0 7 -20 -12 -22 -17 -19 -3 0 -11 -47 3 -14 39 -3 -30 -30 3 29 -4 17 -20 -12
7052a2K6KOl3N1kp8Q2j2l8J0L3l0J2L2n2M3m1K2j3j1J2Om7P8p5j1M7Mm6rO0n1
$$ -12 14 16 22 -11 40 38 -40 42 30 -8 2 35 5 17 49 -3 40 -1 21 8 -3 9 15 -32 46 -29 -40 7 11 -35 -44 16 -35
7085c5J3Mk8J4j0N4n6N3k4J1Jk3N7j1o5M5Qk2JoN2No1J8J1M3k6Qpk3J2knQJ8j4
$$ -35 -22 -18 -46 -32 -42 12 -44 9 -15 -4 -3 -26 31 20 -45 0 8 -14 -13 -19 33 38 -23 -5 6 49 23 31 24 1 13 11 6 14 32 18
7121A8K9p8L2J9n6L0L0lp3N1j3J8l8mj5l0O0J0m4L7K8Mo0O8K0q4P5l0K0j8lK1
$$ 18 47 -31 1 20 -36 -6 24 21 -52 -1 -14 4 -34 -38 -53 -83 -23 -13 -57 -20 8 12 -48 20 40 -44 31 1 21 3 0 21
7153B1j9J3PLlK1k7l2J26r7nL4L5k5m3jnj4l2O9m7J9K9m0o1L5pM7oJ5k3J1L0p5
$$ 21 2 15 22 25 22 43 16 -16 110 13 8 42 77 52 9 8 3 -11 -43 26 -21 -2 27 -13 -74 -39 -46 1 -5 10 -13 -2 28 -47
7187d7L7K4j2n3K0L1jm2L8k7OM1m6mmL3J4J2Mo5K0N2m9L8k8J2M2k8K7m2L7rK1
$$ -47 -10 14 2 -51 -31 0 -1 -43 -5 -32 -26 15 -31 -35 -39 -6 8 20 24 -41 -21 31 -18 20 -8 4 46 18 45 3 40 31 52
7220E2l4oJ5j3k4K0J8lj7O9j28Nj6KL8K2M8n8m8L6j6K0mmL5K1l0Mm8P1kl2Q6m8
$$ 52 18 12 27 14 -10 10 28 25 8 77 -51 -46 -62 -60 -22 0 48 -10 -58 -22 -38 -18 -22 -26 9 30 0 4 -44 27 25 -7 79 31
7254C1l2K1j9L1mn9K4kL6nk9j0N2m1L8K7m2JN1p1L0k0K5ok4l6RK5L2k6k7J9k0
$$ 31 -1 20 1 32 28 -31 -7 -9 27 22 -7 -17 35 -6 32 59 17 18 69 -2 28 8 33 27 3 -33 -24 1 33 7 -20 -1 -21
7287b1M3m8K3mk0jJ2lk3LL5j3jL2J6l2K9Jk1%L5On2Q4o0J4k8oJ8nN8j05O5O1j09
$$ -21 22 -26 -3 -7 -27 -28 -16 -19 -42 -39 -4 -17 -18 14 30 -2 27 28 7 7 42 48 -4 80 20 34 6 0 18 13 71 -34 31 92 -17
7322a7J4PJ5l1j4O1n0LM1j6j3k1J05j15j2O4k4k6M1K7j8mll0J1j4qOj4O1No7L4
$$ -17 -3 4 19 -12 -26 35 -15 -12 29 13 0 -21 84 -31 -43 21 -3 -29 12 39 21 17 14 -16 -5 -19 -27 -21 -35 26 31 -36 -2
7355bpN4k1J6k4J5K2l3%OJ5%k2L7j2J5J2n8Jj2rM9k5m3j6N8K8r5N4k6J8k9M1n
$$ -2 -9 45 24 40 16 31 53 20 20 26 41 41 19 56 44 59 71 13 14 2 -7 42 17 -26 -42 16 44 -51 3 -23 -5 -34 7 2
7389Bl0j5Q9p2L3%k7J7O1j00L8l3L3K9n0M3J5p4M6K2olL3j0Rk0k3K2j6ojL6k4
$$ 2 -28 -43 46 -26 7 7 -20 -3 58 -42 -4 -37 -4 25 -25 18 33 -41 5 27 21 18 51 41 50 30 7 29 13 7 6 42 18
7422A8Ok7J8L0q3L4L9m6k5M3n9K8oK5j6K5mj2M9np0M1k7J4K3kj9lJ6J9Qo2Q5m6
$$ 18 24 -3 15 45 -38 -4 35 -11 -36 7 -52 -24 -30 -5 -21 4 0 -12 37 32 -38 3 -24 -10 13 11 -8 -11 5 24 32 -30 55 9
7456IQRj8M2k8J8j2L8q5J6N8k4JN0q1N3o3M4o1N6K5n9j8L7Lk9N7o8L7J3k6n8K2
$$ 9 17 26 8 50 22 40 28 66 -19 -3 55 31 32 82 1 54 -9 35 -26 30 55 -4 -22 15 18 -11 46 -22 15 28 2 -56 -34
7489c4J5J1J1J3nr2N1K0J3mJ2J3n9N7l%M1o1M0j4Lj1m3nO7K2k1oJj0rL2j4l5K2
$$ -34 -19 -8 3 16 11 -81 -30 -10 3 -1 11 24 -35 22 19 19 60 -1 39 25 28 17 -26 -31 36 58 37 31 32 22 13 45 31 -4 18
7524A8jnl2J4L0p6N1m3L0L1l7rN6j7j1QOmn4PK3j5K9j4k0M9m3N7k3k6M8n0O1k1
$$ 18 17 12 -20 -6 24 -52 -1 -44 -14 17 -20 -29 27 10 -1 7 13 9 -45 -38 -15 -30 -1 -15 -35 14 -29 28 5 -21 27 -23 38 17
7558A7n4M9KK4o7M0L1o4J1M7m9K2L7J8n0K5j7N5q0Onql8J9oQMj9N2j0o0L8K2j4
$$ 17 -37 12 14 38 -29 11 42 -22 -11 36 -13 9 46 64 14 39 22 77 -3 3 -2 -10 -48 -29 -35 -27 -23 -42 10 0 -60 -22 0 -14
7592a4l6m0J00l2pJ6L7p1P2k0k3oL5j3k6O4n4J2k1Q5k6o8K1P8o2PK6nkm2J3N5
$$ -14 -50 -90 10 -22 -29 -13 24 -47 25 5 -18 -24 11 -2 -28 36 -18 -6 -27 58 32 -36 -15 63 1 8 34 29 27 -15 -2 53
7624E3m4K6L9o1nm8M1o1P3l4P3k1p8M2j1RJ3k3J7n9M5J3J0k9K0k5k5QJ6M1j9J2
$$ 53 9 35 74 13 8 -40 1 -60 13 -21 52 31 -47 -5 -16 -7 6 -17 0 -59 -14 -1 9 -20 0 -25 -50 -42 -26 15 -4 8
7656Hj1l2K6J7N6m0j9J1NJ0K6m3J3oJ8k7RK2l5N8n3MnnKk7M2L4m3Rk0k0pJ9j9
$$ 8 -3 -35 -9 8 64 24 5 16 21 31 57 14 27 21 39 12 21 43 8 66 13 17 12 7 9 -18 24 58 15 24 4 -16 -23 -4 -23
7691b3lK5M4kr5O8Rl8k3M5p0Q1k9PL4l2L1n7M2Nj8P2k5j0k4N2Mn1M7l1k3k5N2
$$ -23 -26 -1 43 41 -54 14 23 -15 -38 7 -63 18 -11 -4 30 -2 29 -28 14 19 1 73 48 38 14 66 70 19 66 35 12 -13 39
7724C9l1m4R6k5m5L8k8N%L8n2lK7ko5N7j8jj7K8l2L2Pk7J8j2L6n0k0L7%l3P2l9
$$ 39 8 -36 60 35 -10 28 0 5 5 43 -9 -12 15 13 -52 5 -13 -14 -31 -3 -35 -3 4 -23 -5 -17 19 -31 -51 -14 -14 -47 25 -14
7758a4jK6J0l0L7K0j9KL2n8jl8M7k4l1J4R3j05N4k8O6m7M3k7j1n1j7M0l2O7m1
$$ -14 -15 11 21 -9 28 48 29 31 63 5 4 -34 13 -11 -42 -28 65 -40 14 -14 52 5 48 21 10 -41 -58 -18 -50 17 -24
7789b4m1Q1k9l8j6M4K4m2L6J3J4l0NN2m5K1k8J1M3l7L2j0l0K6n1M1L3m0K1l2K0
$$ -24 -65 16 -13 -51 -67 -23 1 -41 -5 8 22 -8 -3 49 4 25 -3 8 51 14 46 36 6 32 -19 22 55 15 36 4 24
7820B4jK3kl4kOnM3k6qL8m7j3O4j1l5Nj2m2K7j5M2K2p5O1q0P7m8M1n4K9O3k4m8
$$ 24 23 46 44 10 8 14 9 52 26 18 56 9 -4 60 49 14 19 7 -35 -8 -23 19 41 -34 27 -53 24 -24 17 -37 -8 55 31 -17
7854a7O9n4j0rK0M4n2K7Mj4L4k0PJN1m2ol6L1J0j6M3p2L6J3k0k0oJ3J4n7M0rk1
$$ -17 52 -2 -12 -21 -1 43 -9 18 22 8 42 22 29 30 81 39 33 -3 28 38 22 65 -7 29 42 22 2 -4 9 23 -34 6 -3 -24
7888b4O6j6m1k9L2J0m0O3l1kJ0J7l4m1N8qJ8J3ol8oMN4o9N0%K6j4L6k3OJj6L2
$$ -24 42 26 -15 -44 -12 -2 -42 21 -10 -12 -2 15 -19 -60 -2 -10 8 21 15 -23 -29 -25 29 -40 10 10 36 22 58 35 41 42 26 58
7922E8K2k6k1j0NNlM5j03J6J0j%mpj8L7J7nrk2L5k4l3Rk9P0l4j2mM6m1j5J3M1
$$ 58 80 54 33 23 28 33 30 75 -28 -12 -2 -3 -3 -7 -14 -32 5 22 17 8 -14 21 -3 -36 -27 -56 14 -20 -32 -36 10 -31 -46 -33 8
7957Hk2N7k9Mj5l1O9p1j4O7k3RRO7o3j7L0%QJ4j4j3l2J1k7M7ok1kJ4k5L3j8on
$$ 8 -14 43 14 18 3 -28 41 -30 -44 23 0 9 18 85 22 5 35 35 43 57 43 30 -2 9 -18 29 23 2 0 14 -11 22 4 -2 -7
7992gMJ5Ml8K8lm3J3MK3k7K0lN8m0M3m1RK2l8MrO4n0J4J8o1L1K7j8K4m1J6j7j3
$$ -7 -3 12 16 -22 6 3 -40 -27 -23 0 -27 -7 -10 48 8 51 10 19 41 3 7 -2 62 12 26 44 -17 14 41 23 47 6 22 5 -8
8027hM3Mln5L6jJ0%j2L0l9K0k1k6M0j2k8K0k4K3Kk0N6r4L2NkMK6k2J4nM5p3P2
$$ -8 35 39 36 -19 17 16 26 26 14 44 5 25 4 -22 18 6 -22 -2 -26 -3 -1 -21 35 -59 -27 -22 -24 -20 6 -16 -2 -7 38 -35 37
8062C7k5k6J03l5k4r%J7l8N1l8LJ5Po4K5N5o6KJ7K5n4K5N3r8J5j3%L8Jl2K7l5
$$ 37 12 -14 89 54 30 21 21 38 0 51 13 16 31 38 -26 -1 54 -12 -10 7 32 -22 3 56 -42 -27 -40 -40 -2 -1 -33 -6 -41
8095d1O1p5O2j4%J3j3PlK5m5k5L7K8l9L7k3L0NK8m6MrJ9Oj2J3j4K2M8p5N7k7j3
$$ -41 20 -55 7 -7 -7 6 -7 0 -3 22 -23 -48 -11 17 -22 15 -8 22 27 55 9 13 4 23 29 17 30 16 38 86 11 68 41 28
8129B8L0n5LL7j5j2J3l5J7j3j8pjJ5j2m8K0J18qo0m4J5K6j3J8L0oJ2j7l5J2Ql7
$$ 28 58 3 6 43 28 16 29 -6 11 -2 -20 -27 -28 -13 -25 -73 -53 65 57 -3 -47 -32 -6 -19 -1 29 23 35 18 -17 -5 3 -34
8162c4nO1j7lKJ7l0K3J0rkM6o4M1Lm4j0M1k2j3K3l8K1oJl2N2k2J0
$$ -34 -39 22 5 2 4 21 -9 14 24 15 13 59 -5 36 39 -5 -15 26 4 -9 14 -24 -3 -9 -8 -40 12 -10 0
8191@
$$ Imaginary data points
##PAGE= N=2
##DATA TABLE= (X++(I..I)), XYDATA
0@%%%%%%%%%%%%%%%%%%%%%%%%%%%%Jo5J28j28J28j28J28j28J28j29J77k40K56
$$ 0 0 0 0 0 0 0 0 0 0 0 0 0 0 0 0 0 0 0 0 0 0 0 0 0 0 0 0 0 1 -64 64 -64 64 -64 64 -64 64 -65 112 -128 128
41A28k56K57l07L70l85L98m62N14n59O23o83P47q28R21j004J115j251J415j603
$$ 128 -128 129 -178 192 -193 205 -257 257 -302 321 -362 385 -443 478 -526 589 -662 753 -850
60h50J822k103K465k942L605m595O205r272J7017p0411j34842J24844r845j1515
$$ -850 972 -1131 1334 -1608 1997 -2598 3607 -5665 11352 -59059 -193901 -69057 -78902 -90417
74i0417J19827O8632p9277m6253M4073o1248m7805J07724O1921n5775p460L2859
$$ -90417 29410 98042 18765 -27488 16585 -44663 -92468 15256 77177 21402 13942 46801
86D6801j18941n1873J11730J1374p268Q6739K3794j02237m7218L5551o3577j4076
$$ 46801 -72140 -124013 -12283 -909 -8177 78562 102356 119 -47099 -11548 -75125 -89201
98h9201J11019K8553m9869J3298K1941r4911k0601J02793j1109k1424P7558K785
$$ -89201 21818 50371 502 13800 35741 -59170 -79771 23022 11913 -9511 68047 70832
110G0832j03239j0544N4145n1418K874J00193M536o4528Q314K2993r1532p529
$$ 70832 -32407 -42951 11194 -40224 -37350 62843 67379 2851 11165 34158 -57374 -64903
122f4903J05478k2773k3610O7267o271q8031k905N4903m6867M054Q6292j8452
$$ -64903 40575 17802 -5808 61459 55188 -32843 -35748 19155 -27712 -23658 62634 44182
134D4182n7297J6039J8135o6703N825Q5032l3273j9033N3308k6630p0169J6164
$$ 44182 -13115 2924 21059 -45644 -39819 45213 11940 -7093 46215 19585 -50584 -34420
146c4420N2477m0636J0305P3987l7153m8819K3221K338n4511J7135P1217l6127
$$ -34420 18057 -22579 -12274 61713 24560 -24259 -1038 1300 -53211 -36076 35141 -986
158i86j4360N3468k8969n3788L2164L8695m8195Q460N7777m9771m3275L6651O097
$$ -986 -15346 38122 9153 -44635 -12471 26224 -21971 -13511 44266 -5505 -48780 -12129 -6032
171f032m3661L3508O7968m3519j6338M6424l4396n0566K9569L0115m4092J2684
$$ -6032 -49693 -16185 51783 8264 -8074 38350 3954 -46612 -17043 13072 -31020 -18336
183a8336N4926m2085k4675M5757N075l6347K9884M3732n4629j3934L5734l9921
$$ -18336 36590 -5495 -30170 15587 20662 -15685 14199 57931 3302 -10632 25102 -14819
195a4819k9918M0137K5316l5983K0547M6227n0413j7145M0165j5443l2975L1248
$$ -14819 -44737 -4600 20716 -15267 5280 51507 1094 -16051 24114 8671 -24304 6944
207F944K8014n4080k15M3288l6929j6068M7097J2645l8822J8478L3612n6226j2167
$$ 6944 34958 -19122 -19337 23951 -12978 -29046 18051 30696 -8126 10352 43964 -12262 -24429
220b4429M3222j8207k6177L5594K2990n1317K832M0586l8767j4470M1841K106
$$ -24429 18793 586 -25591 10003 32993 -18324 -15492 25094 -13673 -28143 13698 15804
232A5804l6068J8159K6226m9250k550M1506k0326j9404L3851J1230m5896J1850
$$ 15804 -20264 -2105 24121 -25129 -27679 13827 -6499 -25903 7948 19178 -26718 -14868
244a4868L4202l8974j614M2066q475l1275K2825J8557m8233O913L9496k6902j1400
$$ -14868 19334 -19640 -21254 20812 12337 -18938 3887 22444 -25789 -18876 20620 -6282 -17682
257a7682L5650Q73m2129J9404K8317m4547L068L9774j8725k7388K8028J5104m4490
$$ -17682 17968 18841 -23288 -3884 24433 -20114 -17046 22728 4003 -23385 4643 19747 -24743
270b4743J5546L9910l2000r386L3803o150m0304J9733K6323m1023Q047L9503j9050
$$ -24743 -9197 30713 -1287 -10673 23130 16980 -23324 -3591 22732 -18291 -10244 29259 10209
283A0209j9160K7126Q587m0695J3931K8796l7318p040K9183j0825k8904K5432
$$ 10209 -8951 18175 26762 -13933 -2 28794 -8524 -15564 13619 2794 -26110 -678
295f78K1670l5761J5212L1674k9633j5931K4355l748l8626K0977K5693l6992N885
$$ -678 20992 -14769 443 32117 2484 -13447 10908 7160 -31466 -10489 15204 -21788 -15903
308a5903L4835j5059k1881L0402J2564m1845J5113K6033l7551j1607K9552m529
$$ -15903 18932 3873 -18008 12394 24958 -16887 -1774 24259 -13292 -24899 4653 124
320A24l1610K8506K5443l8066P938L0816k2961k2069K6879O986l9271J7726K5530
$$ 124 -31486 -2980 22463 -15603 -7665 23151 190 -21879 5000 11986 -27285 -9559 15971
333A5971l3210j799L0238o396k4255K6993J6394l7882J0876K4950k5898j2421
$$ 15971 -17239 -19038 11200 4804 -19451 7542 23936 -13946 -3070 21880 -4018 -16439
345a6439K8316K324l2725K2525J9920l5744M037K6938j4779k0372K7817R398l7553
$$ -16439 11877 14201 -18524 4001 23921 -11823 -7786 19152 4373 -15999 11818 21216 -16337
358a6337J6443K2343l0493o238K8993m982l1045K5823J6534l7264R796K7763j8719
$$ -16337 106 22449 -8044 -14282 14711 9729 -21316 4507 21041 -16223 -6427 21336 2617
371B617j6892K8780M765l7929J8237K0326l1970j378K8923p394k6210K6049J2235
$$ 2617 -14275 14505 19270 -18659 -422 19904 -12066 -13444 15479 8085 -18125 7924 20159
384B0159l6947J0974K2054k3116j2839K6107O08l1520K2362J7393l0102N584K4548
$$ 20159 -16788 -5814 16240 -6876 -19715 6392 7000 -24520 -2158 15235 -14867 -9283 15265
397A5265j4068k1527K4503M421l4894J8062K0703k3823k256K8972l957k7835K4940
$$ 15265 1197 -20330 4173 8594 -26300 -8238 12465 -11358 -13614 15358 11401 -16434 8506
410H506J0824l5362P938K1467j9606j6542K8772M240l0974K3649J9982k7012j328
$$ 8506 19330 -16032 -8094 13373 -6233 -22775 5997 10237 -20737 2912 22894 -4118 -5446
423e446K4309j1133k8411K3312Q154l2690J3744K2805j6733q682K8027O43k8924
$$ -5446 18863 7730 -20681 2631 10785 -21905 -8161 14644 -2089 -10771 17256 17899 -11025
436a1025K1320J1354l0129K100J9976j3484j9283K7111N947k8553J9073J7124
$$ -11025 10295 21649 -8480 -6380 13596 112 -19171 7940 13887 -14666 4407 21531
448B1531k2608n836K2987q059k7467K3694P644k9587J0164K0475j6350j3867K7838
$$ 21531 -1077 -6913 16074 8015 -19452 4242 11886 -17701 -7537 12938 -3412 -17279 10559
461A0559K37k9745K0940J3436k5920p18K3692r737k2973K6448N976k9625J2764
$$ 10559 10796 -18949 1991 15427 -10493 -11211 12481 2744 -20229 6219 12195 -17430 -4666
474d666J7621j8887j0266K6163k416k6643K2487J0417k5968K952K0209j2636j8956
$$ -4666 12955 -5932 -16198 9965 7549 -19094 3393 13810 -12158 -9206 11003 -1633 -20589
487b0589K5447K483k6417J6862J4621j8529l987K3413o631k3010K3161M656k5745
$$ -20589 4858 7341 -19076 -2214 12407 -6122 -10109 13304 6673 -16337 6824 11480 -14265
500a4265R309J7868j4298j1353K6925j696k5143K0203R117k3605p15K1374j1330
$$ -14265 -4956 12912 -1386 -12739 14186 12490 -12653 7550 16667 -6938 -7653 13721 2391
513B391j9960K6975L077k5167J4449J6344j8066j0353K4412o572k6291K1292P888
$$ 2391 -17569 9406 12483 -12684 1765 18109 43 -10310 14102 7530 -18761 2531 10419
526A0419k2839M823K2099j0156j5654K5711m40k5478J3557J0055k0106o082K2321
$$ 10419 -12420 -7597 14502 4346 -11308 14403 13963 -11515 2042 12097 -8009 -14091 8230
539H230p266j9313K4849N147k0925Q869J5676j5598j3498K2056o475k3286J8678
$$ 8230 964 -18349 6500 11647 -9278 -409 15267 -331 -13829 8227 1752 -21534 -2856
552b856Q194j8706K444K2572r866j6259K5032o90k3594J1271J2683j7811q439
$$ -2856 5338 -13368 -10924 11648 1782 -14477 10555 9865 -13729 -2458 10225 -7586 -16025
565a6025K4713o311j9894K2671O610j9790M113J8851j3264j5404K4145l154k2137
$$ -16025 8688 2377 -17517 5154 11764 -8026 -3913 14938 1674 -13730 10415 7261 -14876
578a4876J5066J0988j7557m227K3255q843j8390K2857K351j9872P653J5818j4331
$$ -14876 190 11178 -6379 -10606 12649 3806 -14584 8273 10624 -9248 -1595 14223 -108
591a08j0714K3863o150j9828J7661O591j8147M87K0572j1294j4439K3943j861
$$ -108 -10822 13041 6891 -12937 4724 11315 -6832 -6345 14227 2933 -11506 12437 10576
604A0576j9667J1026J1205j7232p520K2464r140j7664K0750M200j8143M637J8320
$$ 10576 -9091 1935 13140 -4092 -11612 10852 1712 -15952 4798 8998 -9145 -4508 13812
617A3812j4118j3160K3196n320j9887J3641J0040j6344l269K2926r007j5645K0961
$$ 13812 -306 -13466 9730 4410 -15477 -1836 8204 -8140 -11409 11517 2510 -13135 7826
630G826P47j8811N528J4244j4910r843K3166n887j6156J7080P136j6396k26J8867
$$ 7826 8573 -10238 -4710 9534 -5376 -15219 7947 2060 -14096 2984 10120 -6276 -6502 12365
644A2365j3357j3998K0968l558j7118J1195J2888j4647l985K3770r591j5440J8613
$$ 12365 -992 -14990 5978 2420 -14698 -3503 9385 -5262 -9247 14523 4932 -10508 8105
657H105J669j8700K876J7177j4483j0056K4037m123j5498J4025R805j6250l834
$$ 8105 9774 -8926 -6050 11127 -3356 -13412 10625 6502 -8996 5029 14834 -1416 -5250
670e250J9962j2509j4762J8735l07j6214O699J5618j3519p268K2109p264j4974
$$ -5250 14712 2203 -12559 6176 5869 -10345 -3646 11972 -1547 -8815 13294 6030 -8944
683h944J3710N015j6150p04J7938j2586j0675K0397k727j4689R528J1520j5324
$$ -8944 4766 9781 -6369 -7073 10865 -1721 -12396 8001 5274 -9415 113 11633 -3691
696c691m705K0494j0665j3337J6454K002j6061L296J6259j4628q356K1026o080
$$ -3691 -8396 12098 1433 -11904 4550 6552 -9509 -6213 10046 -4582 -12938 8088 2008
709B008j4278J2492Q695j5989j583J9879j2792j1639J8259q45j5604O477J4817
$$ 2008 -12270 222 8917 -7072 -8655 11224 -1568 -13207 5052 4207 -11397 -4920 9897
722I897j4655n493K1310p718j2586J3393N342j5801j72J7270j3329q944J8508
$$ 9897 -4758 -10251 11059 3341 -9245 4148 9490 -6311 -6483 10787 -2542 -11486 7022
735G022k703j2658Q592J1357j4355l586J8340j0756j0848J4011J618j3906M058
$$ 7022 4319 -8339 253 11610 -2745 -6331 12009 1253 -9595 4416 6034 -7872 -3814
748c814J5552j3645n207J9132o665j2325J0298P109j6126j117J8103j2494q563
$$ -3814 11738 -1907 -7114 12018 5353 -6972 3326 10435 -5691 -6808 11295 -1199 -9762
761i762J7334k02j3742O243J3268j6000n177J7968r563j1821J2283N464j4646
$$ -9762 7572 7370 -6372 -129 13139 -2861 -8038 9930 367 -11454 829 6293 -8353
774h353K180J7570j3009o720J6676l851j3269O730R718j5324k072J7422r990p634
$$ -8353 -6173 11397 -1612 -8332 8344 4493 -8776 -2046 7672 -7652 -9724 7698 -2292 -9926
788i926J4162K269j3102M116J3584j4930m861J5813p065j0757R759P499j4340
$$ -9926 4236 6505 -6597 -2481 11103 -3827 -8688 7125 60 -10697 -938 6561 -7779
801g779J413J6792j2060o345J4430j251j3024N526J1768j5175k276J6742q427
$$ -7779 -6366 10426 -1634 -7979 6451 5200 -7824 -2298 9470 -5705 -7981 8761 334
814C34q791J1685N116j4193K762J5236j3601m926J4889l610j1720P518R519j5298
$$ 334 -8457 3228 8344 -5849 -3087 12149 -1452 -6378 8511 4901 -6819 699 10218 -5080
828e080l55J5915j0649p155J2432K181j3245M492J2949j4426k957J4279o757r786
$$ -5080 -5435 10480 -169 -7324 5108 7289 -5956 -1464 11485 -2941 -5898 8381 1624 -8162
842h162R070O410j4351K477J4722j1995m427J3010j523j2370O278R971j5724n55
$$ -8162 908 7318 -7033 -4556 10166 -1829 -6256 6754 5231 -7139 -861 9110 -6614 -7169
856g169J4572q582p580J0919M690j3844L759J3144j3790l775J2726l960j1041
$$ -7169 7403 -1179 -8759 2160 6850 -6994 -3235 9909 -3881 -7656 5070 1110 -9931
869i931P795R055j4434J638J4559r599o018J0797J752j3323M422J1322j3920j114
$$ -9931 -2136 6919 -7515 -5877 8682 -917 -6935 3862 5614 -7709 -3287 8035 -5885 -6999
883f999J3381n178p998R163O551j4145K939J2177j2425m063J1199j415j1353P487
$$ -6999 6382 1204 -6794 2369 8920 -5225 -2286 9891 -2534 -6597 4602 3187 -8166 -679
897f79R987j4207J613J3216q366p141R741K974j4502M777J1588j3230j574J2533
$$ -679 9308 -4899 -3286 9930 1564 -5577 4164 7138 -7364 -2587 9001 -4229 -5803 6730
911F730k899r757Q284P693j4716K064J1789j0111n526J0003J484j2555O072J0307
$$ 6730 3831 -5926 2358 10051 -4665 -2601 9188 -923 -6449 3554 5038 -7517 -1445 8862
925H862j3304m8J1531n329q515Q318N367j4059L679J0906j0954l149J0239n32
$$ 8862 -4442 -4490 7041 1712 -6803 1515 6882 -7177 -3498 7408 -3546 -6695 3544 3012
939C012j1005P065Q347j3591K064J0961p444o174R302K885j3477N686R557j2405
$$ 3012 -7993 -928 7419 -6172 -4108 6853 -591 -6765 2537 5422 -8055 -2369 7188 -5217
953e217p49J0853l132r453Q888O677j4260L626J0547r619m906R726J011j2358
$$ -5217 -5966 4887 1755 -7698 1190 7867 -6393 -2767 7780 -1839 -6745 2981 3992 -8366
967h366P206R061j2594J170J0873m771q253Q522M629j3855M374R370r978k383
$$ -8366 -1160 7901 -4693 -3523 7350 2579 -5674 2848 7477 -6378 -2004 7366 -2612 -4995
981d995R857k19j0292P663P045j3035K174Q917o978o173Q628K497j2201O642Q367
$$ -4995 4862 4643 -5649 2014 9059 -3976 -1802 7115 137 -6036 2592 5089 -7112 -470 7897
996G897j0960j07R463l198r690Q181M905j3654M134R129q137l942R928J133j1946
$$ 7897 -3063 -3170 6293 3095 -6595 1586 6491 -7163 -3029 6100 -2037 -5979 3949 5082 -6864
1011f864P396P223j2569O81Q999m715p990Q815M012j2477N823Q296r270k243R001
$$ -6864 532 7755 -4814 -4133 4866 151 -7839 976 4988 -7489 -1666 6630 -2640 -4883 4118
1026D118j078j0778P758N441j2164L144Q396n701n431R145K201j1846O767O738
$$ 4118 3040 -7738 20 5461 -6703 -3559 4837 -864 -6295 2850 5051 -6795 -28 6710
1040F710j0317k71Q518k702q848Q740M080j1974M910P583p434l709R134L16j1263
$$ 6710 -3607 -3878 4640 1938 -6910 1830 5910 -6064 -1154 6429 -1005 -4714 4420 4736 -6527
1055f527P778N621j1043J426Q198m296p446R101K921j1927O068P070q430k150
$$ -6527 1251 6872 -4171 -2745 5453 1157 -6289 2812 5733 -6194 -126 6944 -1486 -3636
1069c636Q778j202j0339Q114M371j1304K954P580n302n527R152J507j1074O790
$$ -3636 5142 3940 -6399 1715 6086 -5218 -2264 5316 14 -5513 3639 5146 -5928 862
1083H62N287r283m73P592k817q453Q695K919j0682N133O502o651l443Q661o86
$$ 862 6149 -3134 -3607 3985 1168 -7285 1410 4329 -6353 -1220 5282 -1369 -4812 3849 3163
1098C163j0527P886L986j0056J877P757l943o748R607J818j1068O113N570p962
$$ 3163 -7364 522 4508 -5548 -3671 4086 143 -6605 3002 4820 -6248 -135 5435 -2527
1112b527k486Q441j422r537Q661L741r838L251O974m855n616Q787L82j0375O796
$$ -2527 -5013 3428 2006 -7531 1130 4871 -4967 -1716 5258 403 -5213 3574 3956 -6419 377
1127C77M354p987j58P826k342p662R003J835r783M688N276o219l590Q458r84r269
$$ 377 4731 -3256 -3414 4412 2070 -5592 3411 5246 -4537 151 5427 -792 -4382 4076 3092 -6177
1143f177Q190L212q604J818P020m187o554R078L52r952N953M598p075j821Q364
$$ -6177 2013 5225 -3379 -1561 5459 1272 -5282 3796 4148 -5804 149 4747 -2328 -4149 4215
1158D215k118q453Q846K162r146L057O211n087n332Q973m27r459P037L663p377
$$ 4215 2097 -6356 2490 4652 -4494 -1437 4774 -313 -5645 3328 2901 -6558 479 4142 -3235
1173c235k67P673k898p387Q816R46q888M221M967n619l588Q469j405q321P951
$$ -3235 -3502 4171 1273 -6114 2702 3648 -5240 -1019 3948 -1671 -5259 3210 1805 -6516 1435
1188A435K281p372J458O539l941n955Q838m83q517N805L741o195j516Q307k585
$$ 1435 3716 -3656 -2198 4341 400 -5555 3283 2800 -5717 88 3829 -2366 -3882 4425 1840
1203A840p411Q744J118q085K888N658n077m882R075j236q254O967L169o632l47
$$ 1840 -5571 3173 4291 -3794 -906 4752 -325 -5207 3868 2632 -5622 1345 4514 -2118 -2465
1218b465P604l467o924Q593J55q016L985M748n228l173Q551k027p252P438J548
$$ -2465 5139 1672 -5252 3341 3496 -4520 -535 4213 -1015 -4188 4363 2336 -4916 2522 4070
1233D070o854J088O133m395n404Q815j161p361N599L436n789j586P948l389o821
$$ 4070 -2784 -1696 4437 42 -5362 3453 2292 -5069 530 3966 -1823 -3409 4539 1150 -5671
1248e671Q057K21p054K560N555m830m007Q864j977o883O334K284o172n29P181
$$ -5671 2386 2607 -4447 -1887 3668 -1162 -5169 3695 1718 -5165 1169 3453 -2719 -3248 3933
1263C933l872n821Q467m58o709L827M528n074k890Q339k855o490O950J119o136
$$ 3933 61 -5760 2707 2249 -4460 -633 3895 -1179 -4069 4270 1415 -5075 1875 2994 -3142
1278c142Q63O390m369m536Q482j539o211M892L141n518j510P746l828n616P681
$$ -3142 -2279 4111 -258 -4794 3688 2149 -4062 830 3971 -1547 -3057 4689 861 -4755 2926
1293B926j68o047K471N277m987l335Q511k821n983N960J894n941k50O979m459
$$ 2926 2758 -3289 -818 4459 -528 -3863 4648 1827 -4156 1804 3698 -2243 -2493 4486 27
1308B7m819Q039j086n861L539M360n372k503Q081l492n597O348Q13n475P35O193
$$ 27 -4792 3247 2161 -3700 -161 4199 -1173 -3676 4405 913 -4684 1664 2477 -2998 -2263 3930
1324C930m479l894P978j951n341M213K819n276j345P145m127m406O958m61n166
$$ 3930 -549 -4443 3535 1584 -3757 456 3275 -2001 -3346 3799 -328 -4734 2224 1763 -3403
1339c403K330N077n259k652P985l430n043N346J658n490P2O958m718l743P709
$$ -3403 -1073 4004 -1255 -3907 4078 648 -4395 951 2609 -2881 -2809 4149 -569 -4312 3397
1354C397j445n312L216M129n537j996P710l844m505O077Q36n131R34O055n002
$$ 3397 1952 -3360 -144 3985 -1552 -3548 4162 318 -4187 1890 2726 -2405 -1471 4584 -418
1369d18l103P312k398m728L844K783n194p96O987m245l519O234m35m827J801M824
$$ -418 -3521 3791 1393 -3335 509 3292 -1902 -2698 4289 44 -3475 2759 2324 -2503 -702 4122
1385D122n248k109P103l317m016M713J635n115K60O419n042k893O616j795m573
$$ 4122 -1126 -3235 3868 551 -3465 1248 2883 -2232 -1972 4447 -595 -3488 3128 1333 -3240
1400c240K880L804n553j168P132m139l498N418O23n109J158N718n477k215O846
$$ -3240 -360 3444 -2109 -3277 3855 -284 -3782 1636 2259 -2850 -1692 4026 -1451 -3666 3180
1415C180k670m177L684K994n415m02O832m631k871N794n16m613J791M669n414
$$ 3180 510 -3667 17 3011 -2404 -2806 4026 -605 -3476 2318 1802 -2811 -1020 3649 -1765
1430a765j381O575l375l176M202J650m927O72N724n133j933N759j793m021K762
$$ -1765 -3146 3429 54 -3122 1080 2730 -2197 -1525 4199 -934 -2867 2892 1099 -2922 -160
1445a60L725n555l69O502m198k706M881M12m917J287N297n642j469O182k466l706
$$ -160 3565 -1990 -2359 4143 -55 -2761 2120 2532 -2385 -1098 4199 -1443 -2912 3270 804 -2902
1461b902L400K906n457K16O007m737k317N056n25m463J884M518n525o13N951l286
$$ -2902 498 3404 -2053 -1837 4170 -567 -2884 2172 1647 -2816 -932 3586 -1939 -2552 3399 113
1477A13k868L772J582n099Q86N367n274j399N291j612l696K737L452n585K74N700
$$ 113 -2755 1017 2599 -2500 -1614 3753 -1521 -2920 2371 759 -2937 -200 3252 -2333 -2059 3641
1493C641m294k160M237M37m799J645M825n451o69N358k353l189L183K592n448
$$ 3641 -653 -2813 1424 1861 -2938 -1293 3532 -1919 -2588 2770 417 -2772 411 3003 -2445
1508b445O66N429m725j610M474k82m251K169M244n567r1N316l107k699L519J667
$$ -2445 -1779 3650 -1075 -2685 1789 1507 -2744 -575 3669 -1898 -1989 3327 220 -2479 1040 2707
1524B707n202J200M942n021q20M603j190l586K635L167n444O54M836l951j847
$$ 2707 -2495 -1295 3647 -1374 -2194 2409 1219 -2367 268 3435 -2009 -1355 3481 -470 -2317
1539b317L837M50m573K054M147n328L4M646k450k970L135K147n458J306M657m588
$$ -2317 1520 1970 -2603 -549 3598 -1730 -1696 2950 500 -2470 665 2812 -2646 -1340 3317 -1271
1555a271j095M134l42m210K460L623n519M03M550k924k430L234J559n015J680
$$ -1271 -2366 1768 1426 -2784 -324 3299 -2220 -1817 2733 -191 -2621 613 2172 -2843 -1163
1570a163M218m614n03M044j043l531K657K786n315J037M121l492j493L481N71
$$ -1163 3055 -1559 -2062 1982 939 -2592 65 2851 -2464 -1427 2694 -798 -2291 1190 1761
1585A761m451K325L574n062L60M016k129k892L163J949n261J740M025m220p59
$$ 1761 -2690 -365 3209 -1853 -1493 2523 394 -2498 665 2614 -2647 -907 3118 -1102 -1861
1600a861L710k77m116K718L009n331R41L874k771k144L304J277m874K131L586
$$ -1861 1849 1572 -2544 174 3183 -2148 -1207 2667 -104 -2248 1056 2333 -2541 -410 3176
1615C176m532j23L565j066l501K850K385n144J413L578l155j462L305N79m381
$$ 3176 -1356 -1479 2086 1020 -2481 369 2754 -2390 -977 2601 -554 -2016 1289 1868 -2513
1630b513K448K888m621M85L244j735k629L032J675m859K082L134l719o22L302
$$ -2513 -65 2823 -1798 -1313 1931 196 -2433 599 2274 -2585 -503 2631 -1088 -1710 1592
1645A592l99l935K939K358m995J344L282k464j949L316Q96m736K514K853m190
$$ 1592 1193 -2742 197 2555 -2440 -1096 2186 -278 -2227 1089 1985 -2751 -237 2616 -1574
1660a574j9L326j026l428L137J978m822J780L021k867j365L181L38m206K710K305
$$ -1574 -1593 1733 707 -2721 416 2394 -2428 -648 2373 -494 -1859 1322 1660 -2546 164 2469
1676B469m251P19K994j536k554L092J210m463K266K474l395m21L066m89l709L107
$$ 2469 -1782 -1063 1931 395 -2159 933 2143 -2320 -54 2420 -975 -1396 1670 1181 -2528 579
1692E79J770m378J394K744k153j966L269O14m412K684K231l787J10L006r62l279
$$ 579 2349 -2029 -635 2109 -44 -2010 1259 1873 -2539 145 2376 -1411 -1301 1705 743 -2536
1708b536L240J442m427J850K498k615j302L068P1l927K866J779l804P59K682j427
$$ -2536 704 2146 -2281 -431 2067 -548 -1850 1218 1289 -2638 228 2007 -1797 -1038 1644 217
1724B17k444L190P21m084K315K032k955n78K984n69l416L220J283l868J468K377
$$ 217 -2227 963 1684 -2400 -85 1947 -1008 -1586 1398 829 -2587 633 1916 -1952 -484 1893
1740A893k011j822L161K29l924K785J653l252J84K760r82k911L288Q01l937J865
$$ 1893 -118 -1940 1221 1450 -2474 311 1964 -1288 -1104 1656 674 -2237 1051 1852 -2085 -220
1756b20K055k362j267L225k40l704L091J390l375O99K530j439k485L241M09l761
$$ -220 1835 -527 -1794 1431 1191 -2513 578 1968 -1407 -708 1822 383 -2102 1139 1548 -2213
1772b213K280J705k579n86K859n92l085L140O95l360J396J985j862j725L237j64
$$ -2213 67 1772 -807 -1393 1466 874 -2211 929 1624 -1736 -340 1645 -217 -1942 1295 1131
1788A131l461K793J184k873K26K603j234k597L309L07l489J921J821k216j136
$$ 1131 -2330 463 1647 -1226 -1000 1603 369 -2228 1081 1388 -2101 -180 1641 -575 -1711
1803a711L193o19l224L057Q15l029O72K441j538k194L334p2l271K228J437k369
$$ -1711 1482 863 -2361 696 1511 -1518 -846 1595 57 -2137 1197 1125 -2146 82 1519 -850
1819h50n44K866q65k784L176L37k950J253J879j750j589L176m16l013K671R03
$$ -850 -1394 1472 607 -2177 999 1336 -1614 -361 1518 -232 -1821 1355 939 -2074 597 1500
1835A500k495J12K518j307k325L244j13k895J814J495k020r71L079q74k767K910
$$ 1500 -995 -883 1635 328 -1997 1247 1134 -1761 53 1548 -472 -1443 1636 762 -2005 905
1851I05M48k644O99K143j599j919L292l66k842K200J143k270m71K831j156k473
$$ 905 1353 -1291 -592 1551 -48 -1967 1325 959 -1883 317 1460 -810 -1281 1550 394 -2079
1867b079L055P6k607J121J826j707j426L139o70k576K367O30k187K5K502j402
$$ -2079 976 1052 -1555 -434 1392 -315 -1741 1398 728 -1848 519 1149 -1038 -1013 1489 87
1883H7k067L178l27k470J618J319j890q60K946j169k332K808J86k294O39K167
$$ 87 -1980 1198 871 -1599 19 1338 -552 -1412 1534 365 -1967 841 1027 -1267 -628 1539
1899A539j617j669L218p14k456K008J007k078m32K759j319k106K861p8k218R65
$$ 1539 -78 -1747 1471 757 -1699 309 1316 -762 -1194 1565 246 -1860 1001 923 -1295 -330
1915c30J830j788j236L020r55k210K272N39k081J10K384j550j730K974n30k128
$$ -330 1500 -288 -1524 1496 541 -1669 603 1142 -939 -829 1555 5 -1725 1249 719 -1409
1931a409J475J327j917p52K882j414j867K508J32k081N54K146j858j282L026r52
$$ -1409 66 1393 -524 -1276 1606 192 -1675 833 965 -1116 -562 1584 -274 -1556 1470 518
1947E18j932J696R12j972l54K653j527j644K639k87j912Q73J704j871r42K884
$$ 518 -1414 282 1194 -778 -1132 1521 -6 -1650 989 702 -1210 -337 1367 -504 -1446 1438
1963A438j222j819K079M45j872P4K349j623j414K708n89j834J262J268j865o19
$$ 1438 216 -1603 476 921 -951 -877 1472 -151 -1565 1143 554 -1280 -18 1250 -615 -1234
1979a234K688j430j504K253J3j731M35J996j868q98K658j042j640J614Q52j941
$$ -1234 1454 24 -1480 773 786 -945 -510 1486 -382 -1280 1378 336 -1304 310 1162 -779
1995g79p4K477j704j244K430m76j722Q78J629j930o47K668j379j465J876M83j816
$$ -779 -853 1624 -80 -1324 1106 630 -1092 -214 1415 -515 -1162 1506 127 -1338 538 1021 -795
2012g95O5K222j769j025K394p27j516J051J267j813m02K483j474j217J967k7j630
$$ -795 -730 1492 -277 -1302 1092 365 -1151 -100 1167 -646 -1048 1435 -39 -1256 711 684 -946
2029i46M83J813j876o44K413j133j233J360P54j811K4K296j776r19K178m65j557
$$ -946 -463 1350 -526 -1170 1243 110 -1123 237 991 -820 -796 1500 -276 -1195 983 518 -1039
2046a039P77J579j919m39K386j346j153J624M18j768K72K040j884o75K159p08
$$ -1039 -262 1317 -602 -1041 1345 -1 -1154 470 888 -880 -608 1432 -452 -1127 1032 324
2062C24j321J019J111j874q4K217j590q74J736j8j564N15J715j872m03K139j067
$$ 324 -997 22 1133 -741 -825 1392 -198 -1072 664 646 -918 -403 1312 -560 -963 1176 109
2079A09j080J183P84j797K41J926j736n89J847m27j373P84J369j907j20K057j329
$$ 109 -971 212 996 -801 -560 1366 -370 -959 888 461 -912 -128 1241 -666 -786 1271 -58
2096e8q85J410L50j701M39J793j953l07J892p27j259J078J024j917J65J972j585
$$ -58 -943 467 817 -884 -445 1348 -605 -912 980 253 -1006 72 1096 -821 -656 1316 -269
2113b69p09J558jj568O56J527j915p1J849j006r15J062P21j814M20J704j696l59
$$ -269 -978 580 579 -989 -333 1194 -721 -792 1057 51 -864 198 919 -895 -475 1229 -467 -826
2131h26J559l46j301Q61J187j905J91J746j378o30J317K94j670O23J571j890n2
$$ -826 733 387 -914 -53 1134 -771 -580 1166 -212 -842 475 769 -901 -278 1293 -597 -649
2148f49J604p24j129J077R18j938M00J589j515m37J369J9j498P23J348j870R9
$$ -649 955 231 -898 179 1097 -841 -441 1148 -367 -804 565 584 -914 -191 1157 -713 -614
2165f14J555r57q23J084O17j809O00J454j644j63J387l48j249R62J005j918L84
$$ -614 941 -16 -839 245 862 -947 -347 1107 -537 -700 687 339 -910 52 1057 -861 -477
2182d77J488j239n81J295K22j713Q91J276j801O4J375o20r80R94P44j857N86J357
$$ -477 1011 -228 -809 486 708 -1005 -114 1162 -639 -575 800 180 -800 194 938 -919 -333 1024
2200A024j382k99J220m5j451R46J071j814K23J402r29p60J049N80j854P55J304
$$ 1024 -358 -657 563 518 -933 13 1084 -730 -507 895 -34 -794 255 835 -1019 -264 1040
2217A040j577l7J171k32j257R42Q82j794N37J173j044n11J104J92j558R56R99
$$ 1040 -537 -574 597 365 -892 50 932 -862 -325 848 -196 -707 397 589 -969 -13 986
2234I86j627K28J163o15r53J078O11j826Q93J041j366j76J128m7j472J108Q55
$$ 986 -641 -413 750 135 -818 260 871 -955 -62 979 -387 -563 565 518 -954 154 1009
2251A009j774M53J103q19p47J083M65j740R15J003j427l6J097k70j197J042O83
$$ 1009 -765 -312 791 -28 -775 308 773 -967 -52 951 -476 -512 585 315 -882 160 843
2268H43j693O31R93j029m25J076J55j543J030P89j487K95R99n55r18J130M54j660
$$ 843 -850 -219 774 -255 -680 396 551 -992 38 827 -660 -365 634 79 -839 291 745 -915
2286i15Q14Q86j098k10J088j45j379J187N61j503N33Q90p71o60J186J89j560R77
$$ -915 -101 785 -313 -523 565 420 -959 228 789 -714 -181 709 -62 -722 464 653 -907 70
2304G0P45j328J49R64l34j171J195M42j549O76Q65r37m36J105Lj373J058N54j305
$$ 70 815 -513 -364 600 266 -905 290 732 -817 -141 724 -213 -649 456 459 -914 144 698 -607
2323f07L08R09n46r10J215K60j484Q57O43r73k36J066j18j246J211K97j304N20
$$ -607 -299 610 64 -846 369 629 -855 2 645 -328 -564 502 384 -862 349 646 -658 -138
2341a38Q14p07o72J173P7j445J074N23j161P9R86l39j070J152K48j326O52O90
$$ -138 676 -31 -703 470 547 -898 176 699 -462 -383 603 264 -806 346 594 -732 -80 610
2359F10p76m12J066o2j339J152L67j215L26Q10m91q31J179O3j249Q64M44q87j19
$$ 610 -166 -578 488 426 -913 239 606 -609 -283 527 36 -795 384 447 -802 62 506 -381 -500
2378e00J004l01j028J168J79j177N22O68o22n70J177j55j173J001L88r45K8R12
$$ -500 504 203 -825 343 522 -655 -133 535 -87 -657 520 365 -808 193 581 -364 -336 576
2396E76l96r93J246P4j187O89N42p07l88J047j82j180J159K03r95K59P75m88q34
$$ 576 180 -813 433 507 -680 9 551 -156 -544 503 321 -859 300 503 -492 -233 542 54 -780
2415g80J259p0j184Q59M21p63k41J003l39r97J234J2j031M53O80o24n90J243l11
$$ -780 479 409 -775 84 505 -258 -499 504 165 -832 402 414 -617 -164 516 -108 -698 545 234
2434B34r74J020J41p92N5Q53m85q10J265j50r72O56M49o57l62J161l94r76J071
$$ 234 -740 280 421 -371 -316 537 52 -758 507 357 -615 41 490 -167 -529 632 238 -738 333
2453C33J45r29K84P35n76o49J151k08r37P88K96o82j73R30m21q46J142l8q82M69
$$ 333 478 -451 -167 568 -8 -657 494 286 -651 137 433 -249 -422 508 87 -759 383 345 -537 -68
2473f8N22o00m70J128l79q46R39J19p30N4R03n74p36J226k80p77N85N02p47k86
$$ -68 454 -146 -616 512 133 -713 226 345 -385 -331 572 -2 -738 488 208 -569 16 518 -229 -515
2493e15J111n30p86J108n5p10K59O83o24n59J212l88p86P23K68p20j00R90n85
$$ -515 596 66 -720 388 333 -377 -118 565 -59 -618 594 206 -580 143 411 -309 -409 581 -4
2512do28J021j68p13L79N63o01m39J138m89o82Q03J24o87O7Q56o73m80J073l33
$$ -4 -632 389 221 -492 -113 450 -151 -590 548 59 -623 180 304 -383 -316 540 -133 -613 460 127
2532A27n92M92L72o20k68J131o41n95R21q9o14J93P35o94m13J106m38o32O28K52
$$ 127 -465 27 399 -221 -489 642 1 -594 327 238 -376 -183 552 -142 -555 551 113 -519 109 361
2552C61o25r7R62o85m57R78k20o43L62N50o78l12J080n68n30P71K3o31Q7P97o67
$$ 361 -264 -361 601 -84 -541 437 217 -426 -64 486 -192 -504 576 8 -522 249 272 -359 -272 525 -142
2573a42l36R18l82n22M70L67o41j19R96p41l62Q26j57n32J45P74p36k54J007n05
$$ -142 -478 440 58 -464 6 373 -268 -387 609 -132 -494 332 175 -357 -212 562 -174 -428 579 74
2593G4m99O28J54o89L2R27p08l35Q01k44n14L21N67p59j58R37n80m08O22J55o76
$$ 74 -425 203 357 -332 -300 627 -81 -416 385 141 -373 -52 515 -244 -402 535 -45 -453 169 324 -352
2614c52J34P75p60k62Q70l92l94M03L83p33n6Q88o57k79P33j33n44K31P17q58
$$ -352 -218 557 -203 -465 405 13 -381 22 405 -328 -384 504 -153 -432 301 168 -376 -145 572 -286
2634b86j43Q85m79l37M77K14o65R0P60o98j55P12j96n13K90N22p73k0Q55o82k04
$$ -286 -429 456 -23 -360 117 331 -334 -244 516 -182 -337 375 179 -334 -44 478 -295 -315 540 -142 -346
2655c46O24Ro23J93O66p65j02P64l78m22M28L24p20O0P69o41j97N54n9m85K04
$$ -346 278 287 -336 -143 523 -242 -344 420 42 -380 48 372 -348 -288 481 -160 -357 197 138 -347 -143
2676a43O10p57l0P19n07k62M84J96o79J77P30q18j3O47k67m57L92M55q36J07P44
$$ -143 467 -290 -320 399 -108 -370 114 310 -369 -192 538 -280 -293 354 87 -370 22 477 -359 -252 492
2697D92o62j25N17O4o07J97O23p99L0O51l00m00M00L22p71K31O27o95r3N12m1
$$ 492 -170 -295 222 286 -321 -124 499 -300 -270 381 81 -319 81 403 -368 -137 490 -205 -298 214 173
2718A73n54K72N71q61J73N95m44k30L82K15o85L02N78p53qN59k04m31L42M18q28
$$ 173 -381 -109 462 -399 -226 369 -75 -305 77 292 -393 -91 487 -266 -274 285 81 -350 -8 410 -418
2739d18K96N06n64r2M88K1o62M03N29q01J44M59k74l62M51K55q39L79N08o15o0
$$ -418 -122 384 -180 -272 216 237 -425 -22 507 -294 -150 309 35 -327 124 379 -460 -81 427 -188 -248
2760b48N06j10m96M19L80q50J97N65m03l06M56J41p26M00M62o97J43L53j89l47
$$ -248 258 148 -348 71 451 -399 -202 363 -40 -346 110 251 -475 -75 387 -310 -167 186 -3 -350
2780c50L61L21p23L10M43n11o7L77K9o12M31L83p12J72M69l10l55M58J81o97M02
$$ -350 11 332 -391 -81 362 -149 -216 161 190 -422 9 392 -320 -148 321 11 -344 114 295 -402 0
2801@L63n88Q8L96p2n63L98L77p91L48L11l47k10M22J54p27M58L43o19J05M05
$$ 0 363 -225 -137 259 187 -376 22 399 -392 -44 267 -80 -290 132 286 -441 17 360 -259 -154 251
2822B51k14m17M73K03p41M26L23m70j00M16M7o66N15K74o48J91M12k68l14M56
$$ 251 37 -380 93 296 -445 -19 304 -166 -266 150 197 -469 46 320 -328 -137 275 7 -307 149
2842A49J22o95M31K58m34K5L66n5n32M62K69o72K69L26l09k84M92Q7o75M72K86
$$ 149 271 -424 7 265 -169 -144 222 167 -365 97 366 -306 -37 289 -20 -304 188 275 -400 72 358
2863C58o49J76L12j95l48M85J27o65L60K92l93m8L83Jo04N41J48o19K52L67k78
$$ 358 -291 -115 197 2 -346 139 266 -399 -39 253 -140 -188 195 196 -408 133 281 -338 -86 281 3
2884Ck91M39N7o30M80K09m54J2M20j66m75N70N5n57L52K35k58k58M63nn64M68
$$ 3 -288 151 208 -422 58 267 -187 -175 245 79 -396 174 229 -328 24 259 1 -257 206 201 -363 105
2906A05J85m98J39K93k04l19M93L8o08L86K62l37j62M12o3m98N37M5n08K21K91
$$ 105 290 -208 -69 224 20 -299 194 232 -376 10 272 -65 -227 185 122 -376 161 206 -302 -81 210
2927B10k41l18N10k3n56N15R8m11jM66k28l59N51J2n22L47J89l17j66N33j37n21
$$ 210 -31 -349 161 138 -418 97 195 -216 -217 249 21 -338 213 225 -297 50 239 -78 -244 289 152 -369
2949c69N08M0l99J76L32k59l08N00o1m93M12J54l19j09M57j80m35N52j8m13J64
$$ -369 139 179 -220 -44 288 29 -279 221 160 -333 79 233 -86 -195 262 82 -353 199 181 -232 -68
2970f8K54k25k65N32j15m92N27ol27%M07k20l64N43o8m29L37J79k68k33N63j83
$$ -68 186 -39 -304 228 113 -379 148 142 -185 -185 222 2 -362 181 113 -316 21 200 -68 -301 262 79
2992G9m44N98n2m35J15L62k49k81O01j80m37M28J72l68j15N17k76l96N98q8l54
$$ 79 -365 233 181 -254 -139 223 -26 -307 294 114 -323 105 277 -91 -206 311 35 -361 237 149 -205
3013b05J96K37k55k72N57j82l79L76M6k71l1L93k52k57N60j90l16K98J50k94j77
$$ -205 -9 228 -27 -299 258 76 -303 73 119 -152 -183 210 -42 -299 261 71 -245 53 203 -91 -268
3034b68N91l07l61M96l4l35J36L14l03k51O01k24l80M18J21l54n3N26l51k63N63
$$ -268 323 16 -345 151 117 -218 -82 232 -71 -322 279 55 -325 93 214 -140 -193 333 -18 -281 282
3055B82j62l21J83L11m06j29N37k59l25M41l8k33rM30l64k50N24j80k81K85J72
$$ 282 120 -201 -18 293 -113 -242 295 36 -289 152 114 -119 -128 302 -62 -312 212 32 -249 36 208
3076B08l90p8M81k80k93N14n5k85P1L62l67j42M91k86j95K61J23k81m7M72l43
$$ 208 -182 -260 221 -59 -352 162 107 -178 -107 255 -112 -254 237 -49 -244 17 140 -141 -188 284 -59
3097e9k43N14j06k74J44K54l17j31N47l15k44L64m0k40LM75m06j75N12k24k17
$$ -59 -302 212 106 -168 -24 230 -87 -218 329 14 -230 134 94 -146 -143 332 -74 -249 263 39 -178
3118a78K15J97l49j5M11l36j85M17q6k52R5L68m57k2M65l16k36L55P5l54P2M27
$$ -178 37 234 -115 -130 281 -55 -240 177 91 -161 -66 302 -155 -177 288 -28 -264 91 166 -188 -116 311
3140C11m19j10L61j40j96J47K44l92lM92l08j82K70L8l15P9M20m05j15L94j67
$$ 311 -108 -218 143 3 -193 -46 198 -194 -197 295 -13 -195 75 113 -202 -123 297 -108 -223 171 4
3161Dj77K13J78l71PL95l28j28L18n8k67J23L35m33J0M38l33j57K50J69l35mM21
$$ 4 -173 40 218 -153 -146 249 -79 -207 111 53 -214 -91 244 -189 -179 259 -74 -231 19 188 -147 -151 270
3184B70m45m1L63j18k67J69K76l87M6M31l62j41L04N9k98R2L63m41kL18j41k34
$$ 270 -175 -216 147 29 -238 -69 207 -180 -134 297 -65 -206 98 157 -141 -49 314 -127 -129 189 48 -186
3206a86L09J10l78J9L90l42m2K82p6k49J09L13m02J0L36k48j48K38J13l54Q6L31
$$ -186 123 233 -145 -126 264 -78 -120 162 86 -163 -54 259 -143 -133 203 -45 -193 45 158 -196 -110 221
3228B21m08jL43j42k05J68J90l74R9L34l15q7K88Ml47J61L35m30M4L04j80j90
$$ 221 -187 -188 155 13 -192 -24 166 -208 -109 225 -90 -177 111 115 -232 -71 264 -166 -122 182 2 -188
3250a88J88K11m44J31L66l78j7L00m9k71J77K32m20Q4K72k18j52J85J88l88J59
$$ -188 0 211 -233 -102 264 -114 -131 169 120 -151 26 258 -162 -78 194 -24 -176 9 197 -191 -32
3271c2K63m45J03K43j30j90K04J76m20J37L21l42oJ84j3k69J86K59l96J07J81
$$ -32 231 -214 -111 132 2 -188 16 192 -228 -91 230 -112 -118 66 53 -216 -30 229 -167 -60 121
3292A21j48j99K35J67l98J96K41k98RJ78%k74J86K42m40R9K68k06j52K41Q4l44
$$ 121 -27 -226 9 176 -222 -26 215 -83 -74 104 104 -170 16 258 -182 -83 185 -21 -173 68 152 -192
3314a92J55K36l04l3K73p5k49J95K34m67J86K28l02l1K28K3l84K56J76l72J09
$$ -192 -37 199 -105 -138 135 60 -189 6 240 -227 -41 187 -115 -146 82 105 -279 -23 153 -219 -110
3335a10J67n1k26K40J16l55J90K15l29L2K31qk96K29J69l88J51K23k21j11K45
$$ -110 57 6 -220 20 136 -219 -29 186 -143 -111 120 112 -184 45 214 -174 -23 200 -21 -132 113
3356A13N8l69K60J55l13O0K02o6k95K72Q2l99K21J74j86q4J83P4l56K34J50l70
$$ 113 171 -198 62 217 -96 -36 166 100 -195 77 159 -240 -19 155 -31 -115 68 142 -214 20 170 -200
3378b00J66J77j51k34L42L5m40K59J51k63J6K67j33k42L00J09m28K16J49j10j59
$$ -200 -34 143 -8 -242 100 135 -305 -46 105 -158 -142 125 -8 -250 50 159 -269 -53 96 -14 -173
3399a73L13J8l74K54J54k58N0J59p3k51K94Q3m25K69J09j68j35K24P5l54K39J24
$$ -173 140 158 -216 38 192 -66 -16 143 70 -181 113 196 -229 40 149 -19 -154 70 145 -209 30 154
3421A54l03Q8J71p3k47K95K7l70K73J43k60k3K50o9k76K85Q7l49J68J18j54j13
$$ 154 -149 -61 110 37 -210 85 112 -258 15 158 -102 -125 125 56 -220 65 152 -197 -29 89 -65 -178
3443a78K51Ql36L34L0k31Q9J94p9k84K89N8l32K32J12j33r1J81Ql53L43L0k53
$$ -178 73 81 -255 79 109 -122 -33 161 82 -202 87 145 -187 45 157 24 -67 114 122 -231 112 142 -111
3466a11J19J49j50j61L00Lm20L50M0k37qK26q7l05L47K7k54J37J32j03j22K80
$$ -111 8 157 7 -154 146 149 -271 79 119 -118 -126 100 13 -292 55 82 -172 -35 97 -6 -128 152
3488A52o1l21L12K7k21N8J84j19k04L28ql21K22J19j93o0K52m5k78L11Kk29K9
$$ 152 91 -230 82 109 -112 -54 130 11 -193 135 127 -194 28 147 -46 -106 146 101 -177 134 136 -93 -64
3511f4J84j48j24L01n1k96K60M6j53n3K52j17k70L34k6j99J20M9r0j27K96m6l41
$$ -64 120 -28 -152 149 98 -198 62 108 -45 -98 154 37 -233 101 75 -124 -4 45 -45 -172 124 78 -263
3534b63K61P9k42P7J75r1j57L00j06k18K03j1o8j12L09j03k16K31k2j56N7K50
$$ -263 -2 77 -165 -88 87 -4 -161 139 33 -185 18 7 -61 -173 136 33 -183 48 26 -130 -73 177
3556A77k03j57L23n0k55K99Oj83m7K95j23k47L08j8k44J10J58j58j28K77r7k31
$$ 177 -26 -183 140 90 -165 134 140 -43 -90 205 82 -165 143 125 -119 -9 149 -9 -137 140 43 -188
3578a88K91n4j41N4J74j88j30K93p4k09K12M2j27j01K99j88j30K98r3j27M2K21
$$ -188 103 49 -92 -38 136 -52 -182 111 37 -172 40 82 -45 -146 153 -35 -165 133 40 -87 -45 176
3600A76k29j27L58j46j45J65Q1j89m5K66q9k37L05p1j25P4R7j54j22L18j32k10
$$ 176 -53 -180 178 32 -113 52 133 -56 -101 165 76 -161 144 73 -52 22 119 -35 -157 161 29 -181
3622a81K34j0j23%K01j55j37L41j44j61R4J03j77J2K56k07j10K20K1k20Q3J82
$$ -181 53 43 -80 -80 121 -34 -171 170 26 -135 -41 62 -115 -103 153 -54 -164 56 77 -143 -60 122
3644A22j95p7L44j74j59J92L3j10o1K48j90j38K67k9j85J13J50k12n0K80j61j52
$$ 122 -73 -150 194 20 -139 53 86 -24 -85 163 -27 -165 102 73 -112 1 151 -61 -111 169 8 -144
3666a44K43L6j77k3K65k32o9K62j59j31J42O4j36j00L04j71j64K99p3j54N5J70
$$ -144 99 135 -42 -65 200 -32 -101 161 2 -129 13 77 -59 -159 145 -26 -190 109 36 -118 -63 107
3688A07j85p2K70k20l7K20mj79m2K98k35r2K43rk05J47J46j60j09K48j04j64J84
$$ 107 -78 -150 120 -100 -137 83 79 -100 -142 156 -79 -171 72 63 -142 5 151 -9 -118 130 26 -138 46
3711D6j3j73J04J99k19n8K57j49j33J78R1k26m8L18k20q3K12p9j08K9K24k44M
$$ 46 33 -140 -36 163 -56 -114 143 -6 -139 39 130 -96 -144 174 -46 -129 83 4 -104 -75 149 -95 -91
3734i1K15j31j21J60O3k03j9K60j93o1K17j18j00O2J89k27m2K73j51k4J36K7j74
$$ -91 124 -7 -128 32 95 -108 -127 133 -60 -121 96 -22 -122 -60 129 -98 -140 133 -18 -42 94 121 -53
3757e3L6K12k28o5K24j37m8J19N7j90oK64j82m7J89j19j11J0K04k49j1K65k00
$$ -53 -17 195 -33 -98 126 -11 -59 60 117 -73 -79 185 3 -44 145 26 -85 -75 129 -120 -131 134 -66
3780f6q9J39P0j78N5K08k46m7K28p9q4M0J58k41J2K60j91q4J29Q3j88M8J73k37
$$ -66 -155 -16 54 -124 -69 139 -107 -154 74 -5 -89 -49 109 -132 -120 140 -51 -135 -6 77 -111 -63 110 -127
3804a27k4K96j55j06J21J12j82K9K26k49L8Q3J0j48J08J31k17j6J94r6p5P6J19
$$ -127 -151 145 -10 -116 5 117 -65 -36 190 -59 -21 62 72 -76 32 163 -54 -70 124 28 -47 29 148
3827A48k24L1J63k16O0J13o4j53J21J16k27R5J84k07m2J65mk05R4J60k17N1J89
$$ 148 -76 -45 118 -98 -38 75 11 -142 -21 95 -132 -37 147 -60 -102 63 59 -146 -52 108 -109 -58 131
3850A31j31j23J11J44k49J02J83k26LJ37qj58Q7J40k74J14J32j11o9Q2Q2k31J54
$$ 131 0 -123 -12 132 -117 -15 168 -58 -55 82 74 -84 3 143 -131 -17 115 4 -65 17 99 -132 22
3873B2J30k68M6J41p2j56J58J16k76J03J39j54k1Q4N4k02J00J54j90J7J50j09
$$ 22 152 -116 -70 71 -1 -157 1 117 -159 -56 83 -71 -92 -8 46 -156 -56 98 -92 -75 75 -34
3895c4r2J23O1j57P0J41k10L9O5P4j66J34R8k24N6J30j34l9J21L7j64N5J66k29
$$ -34 -126 -3 58 -99 -29 112 -98 -59 6 80 -86 48 146 -78 -22 108 -26 -65 56 93 -71 -16 150 -79
3919g9O1Q2k5j26J35P0k27R6J21j73K1O4oj10J07J00k64R8Q8q0n1Q7J08k41R5
$$ -79 -18 64 39 -87 48 118 -109 -13 108 -65 -44 20 14 -96 11 111 -153 -55 33 -47 -98 -11 97 -144 -49
3944d9J59k00K1J13j3j82J25Q3k05J09O7j1j28R9Q2j77J03J37j70qJ39m2j19J08
$$ -49 110 -90 -69 44 31 -151 -26 57 -148 -39 28 17 -111 -12 70 -107 -4 133 -37 -45 94 52 -67 41
3968D1J40k45Q2M6r9r0J25N2j54R1Q0k23J31Q2p9j47J61N3j58Q2O7j38L4J15m9
$$ 41 181 -64 18 64 -35 -125 0 52 -102 -11 69 -154 -23 59 -20 -167 -6 47 -111 -29 38 -100 -66 49 0
3993@j31J07J05k18R8J56j31j22J98J8j65Q7O1j42N8N7N2j95J62L2j58J14K4j22
$$ 0 -131 -24 81 -137 -39 117 -14 -136 62 80 -85 2 63 -79 -21 36 88 -107 55 87 -71 43 67 -55
4017e5J6J10L2j93J32P9j96O5O2Nj51Q8L9j21R0P8j40L0J10p8j37J64J9j66J32
$$ -55 -39 71 103 -90 42 121 -75 -10 52 57 -94 -6 33 -88 2 80 -60 -30 80 2 -135 29 48 -118 14
4042A4rJ3j35J35N6k44K29M4j73k2J32Qj52J73L1k18R3R4p2l7O1N6j83J50N9j64
$$ 14 5 18 -117 18 74 -170 59 103 -70 -92 40 48 -104 69 100 -118 -25 69 -3 -40 21 77 -106 44 103 -61
4068f1N3M3J5j37J43Oj07P0L2p6r4J52k0j27J20Pj11J00J9l7p8J03K2j89J75O1
$$ -61 -8 35 50 -87 56 62 -45 25 57 -19 -113 39 19 -108 12 19 -92 8 27 -10 -88 15 37 -152 23 84
4094H4j33j8J20l1j28R2J04j67K2J20m7p6J14K3j26M8Q8j57N9O3l5j20K08l4j35
$$ 84 -49 -67 53 22 -106 -14 90 -77 -55 65 18 -58 56 79 -47 1 89 -68 -9 54 19 -101 107 73 -62
4119f2J09mm0m9J24j7j25J06L4j20M9M3j00q1J39O9j43R4L3q3l6O0K2j44J43P
$$ -62 47 43 3 -46 78 61 -64 42 76 -44 5 48 -52 -133 6 75 -68 26 59 -24 -60 0 22 -122 21 28
4145B8j37R5K3j6r0J27m2j38J83J7q3K8O5l1j14J71o4j27J03L3k0p8J00J6j57
$$ 28 -109 -14 9 -7 -97 30 -12 -150 33 50 -33 -5 60 29 -85 86 22 -105 -2 31 11 -67 33 49 -108
4170a08J70J5j37J03%Nj06J20L2j74J22K9j50k1J08J7j43J21L9j35M9M7pj13J04
$$ -108 62 77 -60 43 43 48 -58 62 94 -80 42 71 -79 -100 8 25 -118 3 42 -93 -44 3 -4 -117 -13
4195a3J1q9J19kr4j1R4k8q5J42l6o5Q6m2l0PR6j0j36J29j4l2k5O7k7j04K08o8
$$ -13 -2 -91 28 26 -68 -79 15 -13 -98 44 8 -57 29 -13 -43 -36 60 50 -86 43 29 -3 -28 39 12 -92 116 48
4223D8j40J05L4r2j7J25n5j35J90m9n6M5K4n1n4J57n7j13J19p5Jl2J11n2m8J27
$$ 48 -92 13 47 -45 -62 63 8 -127 63 14 -42 3 27 -24 -78 79 22 -91 28 -47 -46 -78 33 -19 -67 60
4249F0q8m8N7Q0o8r9J70n0j18J25K2n0J1O6o4o7J43p7m5J22l0l5n1J31p0j15J74
$$ 60 -28 -76 -19 61 -7 -106 64 14 -104 21 43 -7 4 70 6 -61 82 5 -40 82 52 17 -34 97 27 -88 86
4276H6p5p8Q2N7r6m7J36m9r5J11Oo7J2Q2q0l8J14n0q1P3J1k7o4J58o2n1P5n0m9
$$ 86 11 -67 15 72 -24 -71 65 16 -79 32 38 -29 -17 65 -15 -53 61 11 -70 3 14 -13 -77 81 19 -32 43 -7 -56
4305e6L7N3l4o4J83j36k9O5L3k1m8Q3l7l5J16m6r0M8O1o7n4J13j09k9R7L4m0l0
$$ -56 -19 34 0 -64 119 -17 -46 19 52 31 -17 66 29 -6 110 64 -26 22 83 16 -38 75 -34 -63 34 68 28 -2
4333bO6q7n4J07n8j1J2O1m1o8J09r3l1J00n2j8M0O8q1m4Q9Op3R6Mo0j0O8o3MJ11
$$ -2 64 -23 -77 30 -28 -39 -27 34 -7 -75 34 -59 -90 10 -42 -60 -20 48 -33 -77 12 18 -55 41 45 -15 -25 43 -20 -16 95
4364I5n3k6j8N9l7k4J06o8m3P6j5p7pJ26p7r5J13p5J7M2J6qp0J07q9JK1J2l7k8
$$ 95 42 16 -2 57 20 -4 102 34 -9 67 52 -25 -32 94 17 -78 35 -40 -23 19 35 27 -43 64 -25 -24 -3 9 -28 -56
4394e6Q4j14L6P9m5j9O3k3j5j7J19j29J4P5m2krL8o5j0P6l6pO5j3l2J3Q0p0j04
$$ -56 28 -86 -50 29 -16 -35 28 5 -10 -27 92 -37 -23 52 10 8 -1 37 -28 -38 38 2 -5 60 47 15 28 108 38 -66
4424f6J33o0m2O2km0l2R9q0qj8P4q3NJ20o5r0J31k5n7O5qq8L9J03j10J3L2M2q6
$$ -66 67 7 -35 27 25 -15 -47 52 -28 -36 -54 20 -63 -58 62 -3 -93 38 13 -44 21 13 -75 -36 67 -43 -30 2 44 -42
4454d2j0R4r7J9J22q3j0K9L3q3OJ20j02kN8nm9O0Lq4L8P5o3l0N2j6m0K6K4o7m7
$$ -42 -52 42 -55 -36 86 3 -7 22 55 -28 -22 98 -4 -6 52 47 -2 58 61 -23 15 90 27 -3 49 33 -7 19 43 -24 -71
4485g1J08l7l9L7K5q3j8J45r2L1N2j7n6L9L3p7J3R2j30L5L0L4l4l2O9p0J6R7o1
$$ -71 37 0 -39 -2 23 -60 -78 67 -25 6 58 41 -15 24 57 -20 -7 85 -45 -10 20 54 20 -12 57 -13 3 100 39
4514C9o7M7N7o5k3P2Kp9L8P4r4L6O3j01jL5k4k8J8L8q0O1J6q5L7Mpm3L7N1j29
$$ 39 -28 19 76 11 -12 60 62 -17 21 95 1 37 100 -1 -2 33 9 -19 -1 37 -43 18 34 -51 -14 -10 -17 -60 -23 28 -101
4545a01R8J8n0j7N9Qk8J6J1o7J3M9O3p3N7Kr5J6O4q0M8M0on3N1J5j29J06L2p5
$$ -101 -3 15 -35 -52 7 15 -13 3 14 -53 -40 9 72 -1 56 58 -37 -21 43 -37 11 51 45 -8 43 58 -71 35 67 -8
4575hPM1J5q5N2L4o7K4mJ9r2O4N3r4k7J6K4j9M6k5nJM8j27O1R3n0k4n4P5l4M3
$$ -8 -1 40 55 -30 22 56 -11 13 9 28 -64 0 53 -41 -68 -52 -28 -47 -1 -26 -31 -30 18 -109 -48 45 -5 -29 -83 -8 -42 1
4607Aj2k8M8K8k7k9J4M0m1M0Qj6j9J6J2p3M3J5m9lL1J4n0J7N0o3L2O0q2k1M8M4
$$ 1 -11 -39 9 37 10 -19 -5 35 -6 34 42 26 7 23 35 -38 5 20 -29 -32 -1 13 -37 -20 30 -33 -1 59 -23 -44 4 48
4639D8j11P8Ln4N9oj5Kj3K5m4J1K8o7J5N2jl5L8k8m2M6M8J1m2jL7m4P5jj13P2
$$ 48 -63 15 18 -36 23 17 2 4 -9 16 -28 -17 11 -56 -41 11 10 -25 13 -15 -57 -11 37 48 6 5 42 -2 73 72 -41 31
4671C1L6m3j7K8N1j06N9j5mm5J0N6r5K4O4o5L0pN1q2L5M0r4M5l2M0l9j2O6o3N8
$$ 31 67 24 7 35 86 -20 39 24 20 -25 -15 41 -54 -30 34 -31 -1 -8 43 -39 -4 36 -58 -13 -45 -5 -44 -56 10 -53 5
4702EL2o2J4RPk0R%m7M4j2M7l1L0j3j6N3l1%L1Jn7O7J3l1n1K5Rp6L2J0N3m3%N
$$ 5 37 -25 -11 -2 5 -15 -6 -6 -53 -9 -21 26 -5 25 12 -4 49 18 18 49 50 -7 60 73 42 -9 16 25 -51 -19 -9 44 1 1 6
4737Fk4J4nm2pJ7L6k8jQ9j04J4L9l9nJ07p9p8J25l1L1p7P0l6k3P7n0k6O6m1km
$$ 6 -18 -4 -9 -51 -58 -41 -5 -33 -34 55 -49 -35 4 -35 -40 67 -12 -90 35 4 35 -42 28 -8 -31 46 -4 -30 36 -5 -7 -11
4769a1K8Rj7%M2p0M3Okm7M5m0j4N3k6J2noK2m5P%k7rM9rl5K6K2o7O2nn9M0M7o0
$$ -11 17 26 9 9 51 -19 24 30 28 -19 26 -14 -28 25 -1 11 6 0 22 -23 -16 -16 -43 -52 -3 -12 -47 -21 1 -66 -4 -9 -68 -28 19 -41
4805d1J6M7l8n1N2ML2m8O3j0l1O4j1n3M1oL0m2oM2m2M0q3N2m2k3M8m2P6l2n3J0
$$ -41 -25 22 -16 -67 -15 -11 21 -27 36 26 -5 59 48 -5 36 30 60 18 12 54 12 52 -31 21 -21 -44 4 -38 38 6 -47 -37
4837c7Njm8J15n2k7P2k8p2L6K8k0jM0l0k7KJ0J6m4J7J9j9M3K7o9O6rj5k7K8l3
$$ -37 -32 -33 -81 34 -18 -45 27 -1 -73 -37 -9 -29 -30 10 -20 -47 -45 -35 -19 -63 -46 -27 -46 -3 24 -45 21 12 -3 -30 -2 -35
4869c5K2JP4k4m4Ol9K8O5k4rm5M8L2p4P0l7l3L1l2k9L0Mk4j9N7om6L0J2j6Rk6
$$ -35 -13 -12 62 38 -6 0 -39 -11 54 30 21 -24 24 56 -18 52 15 -18 13 -19 -48 -18 -14 -38 -57 0 -6 -52 -22 -10 -26 -17 -43
4902d3J4KL5j02M0L7M6k5o5K1L0j6RK0ORk3LKK1J0n0l5J11rr3O1k9N4j6K4p3O0
$$ -43 -29 -27 8 -94 -54 -17 29 4 -61 -40 -10 -26 -17 3 9 18 -5 -2 0 21 31 -19 -54 57 48 -45 16 -13 41 25 49 -24 36
4935C6m4QoJK2Rj6k9K9m2l5L3l2N0Jn5L4L5Nn8O8q4O0l0K0jj0N6ok6L5kk4j1N8
$$ 36 -8 0 -6 -5 17 26 10 -19 10 -32 -67 -34 -66 -16 -15 -70 -36 -1 4 -54 14 -70 -10 -40 -20 -21 -31 25 19 -7 28 26 2 -9 49
4970D9o0mQ5p8K6J8m1k3K9J4j0J3K0p3L2j8K6K7k3j8%%l0M7n6N0j2j3m4P5k3L
$$ 49 -11 -15 70 -8 18 36 -5 -28 1 15 5 18 38 -35 -3 -21 5 32 9 -9 -9 -9 -39 8 -48 2 -10 -23 -67 8 -15 -12
5002a2L8rp3N1l7J6kjRQJ8J7k9K6L4n7jM5Jp7K7LjO1K7j07K9Q2o7n2K1L3n2L8
$$ -12 26 17 -56 -5 -42 -26 -28 -29 -20 -12 6 23 -6 20 54 -3 -4 41 42 -35 -8 -5 -6 55 82 -25 4 86 19 -33 -12 21 -31 7
5036Gj1oj7M1m4j1J0K9m9L9qk4j8N6K8m4PP7p7j5L4L6m5mjJ7l6J0J9l4J2K6l1
$$ 7 -4 -10 -27 14 -30 -41 -31 -2 -51 -12 -20 -44 -62 -6 22 -22 -15 62 -15 -30 4 40 -5 -9 -10 7 -29 -19 0 -34 -22 4 -27
5069b7Q0m0JPj1L5l9L8qj4k8K2l6j5K6M5k3M5n9Qlo9P2m2L4Lp3JO9J4J5n9Rk9
$$ -27 53 13 14 21 10 45 6 44 36 22 -6 16 -20 -35 -9 36 13 58 -1 7 4 -65 7 -35 -1 2 -71 -70 -1 13 28 -31 -22 -51
5103e1L2J8k9K9Mk3J0j4J4M1k8k1K9ml7M0j7L3k7K3J8j8Rm9qP7n7NN0n1l0K4R4
$$ -51 -19 -1 -30 -1 3 -20 -10 -24 -10 31 3 -18 11 7 -30 10 -7 26 -1 22 40 22 31 -18 -26 51 -6 -1 49 -2 -32 -8 86
5136H6j27Q9l9j9oLoL3j3J3nm7Q0o6J5Kj5J8L4m4n3M6L4lJ0j5Jj5j8J01r8M3L4
$$ 86 -41 48 9 -10 -16 -13 -19 14 1 14 9 -38 42 -24 -9 -7 -22 -4 30 -14 -67 -21 13 10 20 5 6 -9 -27 74 -24 19 53
5169E3o2MJ9l3M1pkLl7J3K7k0M4o8L1M1m5J0j4O5m6n8L6j5rN7k3rk5JL3n1K7l
$$ 53 -9 -5 14 -19 22 15 13 16 -21 -8 19 -1 43 -25 6 47 2 12 -2 63 17 -41 -5 -20 -29 28 5 -4 -29 -28 5 -46 -19 -22
5203b2k9J1J9k9k6O2k6j0j0N6j9n1N2j2J3j7J1N6n2J9K4m8K2OL6m2M1NM0l5m9
$$ -22 -51 -40 -21 -50 -76 -14 -40 -50 -60 -4 -23 -74 -22 -34 -21 -38 -27 29 -23 -4 20 -28 -6 0 36 -6 35 40 80 45 -4
5234dqM5j0j1K4m2L8o6J0N4p7N2Qk3l9N3%n6N6j7nn1M7k9L0mKk9K3RK6j0L9J7
$$ -4 -12 33 23 12 36 -6 32 -34 -24 30 -47 5 13 -10 -49 4 4 -52 4 -13 -18 -69 -22 -51 -21 -25 -23 -52 -29 -20 6 -4 35 52
5268E2j35Q0l1N2L6mq3L2j8N9m7L1J0l7N7m5l0L0m0jlQ7p7L2m8K6rl4K1J8ol5
$$ 52 -83 -3 -34 18 54 50 -33 -1 -19 40 -7 24 34 -3 54 9 -21 9 -31 -32 -35 52 -25 7 -41 -15 -24 -58 -37 -19 -25 -60
5300f0K6k4M2Qj5J6k0l2J8l8P4n5M4J8j7Qj2qN8j5k2J1j5J6J7l3L7kk1m7P6m5
$$ -60 -34 -58 -16 -8 -23 -7 -27 -59 -41 -79 -5 -60 -16 2 -15 -7 -19 -27 31 16 -6 5 -10 6 23 -10 27 25 4 -43 33 -12
5332a2nP3n5K0l3N0l9ORLMj6l9m0M6M1l9k0J1MJM6j1j8m8N0k2J9k6L5J9p5N8k3
$$ -12 -17 56 1 21 -12 38 -1 5 14 17 21 5 -34 -74 -28 13 -26 -46 -35 -31 -30 16 5 -13 -61 -11 -33 -14 -40 -5 14 -61 -3 -26
5366b6k6N1Rk3NJ6J1m0LN7o8K6K1j0RK8k9m5K3pPNK3n1O5jk3qj3Nl5qQ4q2J1K
$$ -26 -52 -1 8 -15 -10 6 17 -23 -20 37 -31 -5 16 6 15 43 14 -31 -8 -15 -8 -3 20 -31 34 33 10 2 -11 -6 -41 -49 35 -47 -36 -34
5402c4K2m1K9J9qoK4k6k0K4K6KK7m8l3K2J6N5o4pK8PlK9l7K7l6J6qk3NK4J7ql0
$$ -34 -12 -53 -24 -5 -13 -19 5 -21 -41 -17 9 11 38 -10 -43 -21 -5 50 -14 -21 7 14 11 40 3 30 -6 10 2 -21 -16 8 25 17 -13
5437a3J0M4k3l5rj2K3K1N2q1mJ4pJ3l2J8k1Pj5J8K0k0K7l4l4N5n3M9QK1n8P6l0
$$ -13 -3 41 18 -17 -26 -38 -15 6 58 -23 -27 -13 -20 -7 -39 -21 -42 -35 -50 -32 -12 -32 -5 -39 -73 -18 -71 -22 -14 7 -51 25 -5
5470epNM6olJ3p1P8o4Ql6J02m9L0o6M0k7J6l3L2jJ6m6L2j9ON6n2p1O1L6k7m1j4
$$ -5 -12 -7 39 33 30 43 -28 50 -14 -6 -42 60 11 41 -25 15 -12 4 -29 3 2 18 -28 4 -15 -9 47 -5 -76 -15 21 -6 -47 -61
5504f1N3l9L1k6K3K8j5Qk7L9k2Lj9L8J1n9J8M5k8J8k9k2M4j7qN3q7M8K6K1po6
$$ -61 -8 -47 -16 -42 -19 9 -6 2 -25 14 -8 -5 -24 14 25 -34 -16 29 1 19 -10 -32 12 -5 -13 40 -47 1 27 48 41 -25
$$ [...]
8191h
##END NTUPLES=NMR FID
##END=
