##TITLE=1H ikalashn
IPACAT-37
18.12.2024
##JCAMPDX= 6.0         $$ Bruker NMR JCAMP-DX V2.0
##DATA TYPE= NMR FID
##DATA CLASS= NTUPLES
##ORIGIN= UXNMR, Bruker Analytische Messtechnik GmbH
##OWNER= root
$$ TOPSPIN		Version 1.3
$$ 2024-12-18 13:42:05.578 +0400  Irina@DPX200
$$ Compression mode = diff/dup
##.OBSERVE FREQUENCY= 200.131300845
##.OBSERVE NUCLEUS= ^1H
##.DELAY= (6, 6)
##.ACQUISITION MODE= SIMULTANEOUS
##.ACQUISITION SCHEME= undefined
##.AVERAGES= 64
##.DIGITISER RES= 18
##SPECTROMETER/DATA SYSTEM= spect
##.PULSE SEQUENCE= zg
##.SOLVENT NAME= DMSO
##.SHIFT REFERENCE= INTERNAL, DMSO, 1, 17.49637
##AUDIT TRAIL= $$ (NUMBER, WHEN, WHO, WHERE, WHAT)
$$ ##TITLE= Audit trail, TOPSPIN		Version 1.3
$$ ##JCAMPDX= 5.01
$$ ##ORIGIN= Bruker BioSpin GmbH
$$ ##OWNER= Irina
$$ $$ F:/spectra/data/iren/nmr/1H/4/audita.txt
$$ ##AUDIT TRAIL=  $$ (NUMBER, WHEN, WHO, WHERE, VERSION, WHAT)
(   1,<2024-12-18 13:41:27.343 +0400>,<Irina>,<DPX200>,<TOPSPIN 1.3>,
      <created by zg
	started at 2024-12-18 13:37:14.218 +0400,
	POWCHK disabled, PULCHK disabled
       configuration hash MD5:
       BE 6D 3F 07 2A EA 11 49 91 17 2B D3 AF B3 58 0D
       data hash MD5: 16K
       FA B0 22 D9 E2 79 A4 4A CD 96 25 11 2B 8D 53 9C>)
$$ ##END=
$$ 
$$ $$ hash MD5
$$ $$ 59 2A 73 C0 7A 30 99 06 38 3A 05 B9 02 54 6F 67
##$RELAX= 
##$RELAX= 
##$RELAX= 
##$RELAX= 
##$RELAX= 
##$RELAX= 
##$RELAX= 
##$RELAX= 
##$RELAX= 
$$ Bruker specific parameters
$$ --------------------------
##$DU= <F:/spectra>
##$EXPNO= 4
##$NAME= <1H>
##$PROCNO= 1
##$TYPE= <nmr>
##$USER= <iren>
##$AMP= (0..31)
100 100 100 100 100 100 100 100 100 100 100 100 100 100 100 100 100 100 
100 100 100 100 100 100 100 100 100 100 100 100 100 100 
##$ANAVPT= -1
##$AQSEQ= 0
##$AQ_mod= 1
##$AUNM= <au_zg>
##$AUTOPOS= <>
##$BF1= 200.13
##$BF2= 200.13
##$BF3= 200.13
##$BF4= 200.13
##$BF5= 200.13
##$BF6= 200.13
##$BF7= 200.13
##$BF8= 200.13
##$BYTORDA= 1
##$CFDGTYP= 0
##$CFRGTYP= 5
##$CHEMSTR= <none>
##$CNST= (0..63)
1 1 145 1 1 1 1 1 1 1 1 1 1 1 1 1 1 1 1 1 1 1 1 1 1 1 1 1 1 1 1 1 1 1 
1 1 1 1 1 1 1 1 1 1 1 1 1 1 1 1 1 1 1 1 1 1 1 1 1 1 1 1 1 1 
##$CPDPRG= <>
##$CPDPRG1= <>
##$CPDPRG2= <>
##$CPDPRG3= <>
##$CPDPRG4= <mlev>
##$CPDPRG5= <mlev>
##$CPDPRG6= <mlev>
##$CPDPRG7= <mlev>
##$CPDPRG8= <mlev>
##$CPDPRGB= <>
##$CPDPRGT= <>
##$D= (0..63)
0 2 0 0 0 0 0 0 0 0.06 0 0.03 0 0 0 0 0.0002 0 0 0 0 0 0 0 0 0 0 0 0 0 
0 0 0 0 0 0 0 0 0 0 0 0 0 0 0 0 0 0 0 0 0 0 0 0 0 0 0 0 0 0 0 0 0 0 
##$DATE= 1734514886
##$DBL= (0..7)
120 120 120 120 120 120 120 120 
##$DBP= (0..7)
150 150 150 150 150 150 150 150 
##$DBP07= 0
##$DBPNAM0= <>
##$DBPNAM1= <>
##$DBPNAM2= <>
##$DBPNAM3= <>
##$DBPNAM4= <>
##$DBPNAM5= <>
##$DBPNAM6= <>
##$DBPNAM7= <>
##$DBPOAL= (0..7)
0.5 0.5 0.5 0.5 0.5 0.5 0.5 0.5 
##$DBPOFFS= (0..7)
0 0 0 0 0 0 0 0 
##$DE= 6
##$DECBNUC= <off>
##$DECIM= 32
##$DECNUC= <off>
##$DECSTAT= 4
##$DIGMOD= 1
##$DIGTYP= 9
##$DL= (0..7)
0 120 120 120 120 120 120 120 
##$DP= (0..7)
150 150 150 150 150 150 150 150 
##$DP07= 0
##$DPNAME0= <>
$$ [...]
##$SW= 21.9926040160658
##$SWIBOX= (0..15)
0 0 2 0 0 0 0 0 0 0 0 0 0 0 0 0 
##$SW_h= 4401.40845070422
##$TD= 16384
##$TD0= 1
##$TE= 300
##$TE2= 300
##$TE3= 300
##$TEG= 300
##$TL= (0..7)
0 120 120 120 120 120 120 120 
##$TP= (0..7)
150 150 150 150 150 150 150 150 
##$TP07= 0
##$TPNAME0= <>
##$TPNAME1= <>
##$TPNAME2= <>
##$TPNAME3= <>
##$TPNAME4= <>
##$TPNAME5= <>
##$TPNAME6= <>
##$TPNAME7= <>
##$TPOAL= (0..7)
0.5 0.5 0.5 0.5 0.5 0.5 0.5 0.5 
##$TPOFFS= (0..7)
0 0 0 0 0 0 0 0 
##$TUNHIN= 0
##$TUNHOUT= 0
##$TUNXOUT= 0
##$USERA1= <user>
##$USERA2= <user>
##$USERA3= <user>
##$USERA4= <user>
##$USERA5= <user>
##$V9= 5
##$VALIST= <valist>
##$VCLIST= <CCCCCCCCCCCCCCC>
##$VD= 0
##$VDLIST= <DDDDDDDDDDDDDDD>
##$VPLIST= <PPPPPPPPPPPPPPP>
##$VTLIST= <TTTTTTTTTTTTTTT>
##$WBST= 1024
##$WBSW= 25
##$XGAIN= (0..3)
0 0 0 0 
##$XL= 0
##$YL= 0
##$YMAX_a= 333978
##$YMIN_a= -247396
##$ZGOPTNS= <>
##$ZL1= 120
##$ZL2= 120
##$ZL3= 120
##$ZL4= 120
##$ABSF1= 10
##$ABSF2= 0
##$ABSG= 5
##$ABSL= 3
##$ALPHA= 0
##$AQORDER= 0
##$ASSFAC= 0
##$ASSFACI= 0
##$ASSFACX= 0
##$ASSWID= 0
##$AUNMP= <proc_1d>
##$AXLEFT= 0
##$AXRIGHT= 0
##$AXTYPE= 0
##$AXUNIT= <>
##$AZFE= 0.1
##$AZFW= 0.1
##$BCFW= 1
##$BC_mod= 2
##$BYTORDP= 1
##$COROFFS= 0
##$CY= 7568.61572265625
##$DATMOD= 1
##$DC= 2
##$DFILT= <>
##$DTYPP= 0
##$F1P= 17.9538593292236
##$F2P= -4.03888763876832
##$FCOR= 0.5
##$FTSIZE= 32768
##$FT_mod= 4
##$GAMMA= 1
##$GB= 1
##$INTBC= 1
##$INTSCL= 1
##$ISEN= 128
##$LB= 0.02
##$LEV0= 0
##$LPBIN= 0
##$MAXI= 945.577
##$MC2= 0
##$MEAN= 0
##$ME_mod= 0
##$MI= -402.1523
##$NCOEF= 0
##$NC_proc= 0
##$NLEV= 6
##$NOISF1= 8.587773
##$NOISF2= 6.764455
##$NSP= 1
##$NTH_PI= 0
##$NZP= 0
##$OFFSET= 17.49637
##$PC= 1
##$PHC0= 90.0705
##$PHC1= 12.25992
##$PH_mod= 0
##$PKNL= yes
##$PPARMOD= 0
##$PPDIAG= 0
##$PPIPTYP= 0
##$PPMPNUM= 100
##$PPRESOL= 1
##$PSCAL= 0
##$PSIGN= 0
##$REVERSE= no
##$SF= 200.13
##$SI= 32768
##$SIGF1= 18.5376
##$SIGF2= -6.396296
##$SINO= 400
##$SIOLD= 32768
##$SREGLST= <1H.CDCl3>
##$SSB= 3
##$STSI= 0
##$STSR= 0
##$SW_p= 4401.40845070422
##$SYMM= 0
##$S_DEV= 0
##$TDeff= 0
##$TDoff= 0
##$TI= <>
##$TILT= no
##$TM1= 0
##$TM2= 0
##$TOPLEV= 0
##$USERP1= <user>
##$USERP2= <user>
##$USERP3= <user>
##$USERP4= <user>
##$USERP5= <user>
##$WDW= 1
##$XDIM= 8192
##$YMAX_p= 0
##$YMIN_p= 0
$$ End of Bruker specific parameters
$$ ---------------------------------
##NTUPLES= NMR FID
##VAR_NAME=  TIME,          FID/REAL,        FID/IMAG
##SYMBOL=    X,             R,               I
##VAR_TYPE=  INDEPENDENT,   DEPENDENT,       DEPENDENT
##VAR_FORM=  AFFN,          ASDF,            ASDF
##VAR_DIM=   8192,          8192,            8192
##UNITS=     SECONDS,       ARBITRARY UNITS, ARBITRARY UNITS
##FACTOR=    0.0002272,     1,               1
##FIRST=     0,             0,               0
##LAST=      1.8609952,     45,              10
##MIN=       0,             -247396,         -247396
##MAX=       1.8609952,     333978,          333978
$$ Real data points
##PAGE= N=1
##DATA TABLE= (X++(R..R)), XYDATA
$$ plain form
0 0 0 0 0 0 0 0 0 0 0 0 0 0 0 0 0 0 0 0 0 0 0 0 0 0 0 0 0 0 0 0 0 -15 54 -63 64 -64 64 -64 64 -64 74 -102 125
43 125 -128 128 -141 165 -189 194 -217 247 -268 293 -326 357 -395 434 -485 543 -605 681 -766
62 -766 877 -1017 1198 -1439 1789 -2289 3066 -7930 125659 117824 -108091 -247396 -174784 -6778
76 -6778 40484 -48952 -145423 -121696 -11970 66090 38648 -24193 -13831 77206 137925 107393
88 107393 52134 64804 117543 116776 41495 -25844 -26778 2335 -12231 -73875 -123780 -122574 -100778
101 -100778 -99829 -106938 -73519 -3187 37537 11429 -20474 24614 131066 189160 130347 22105
113 22105 -7357 73455 151034 97039 -62475 -161663 -95888 34141 46698 -82502 -188129
124 -188129 -136915 -411 53713 -13057 -80317 -40037 65273 108583 43471 -38758 -25430
$$ packed form
0@%%%%%%%%%%%%%%%%%%%%%%%%%%%%%%%j5O9j17J27j28J28j28J28j28J38j76K27
43A25k53K56k69L06l54L83m11M64n15N61o19O83p52Q29r19J028j148J286j447
62g66J643j894K215k637L228m078N355j0996J33589p835k25915j39305P2612J68006
76f778M7262q9436r6471K3727J09726P8060k7442o2841J0362R1037O0719l0532
88A07393n5259J2670N2739p67p5281o7339r34K9113j4566o1644m9905J206K1796
101a00778R49p109L3419P0332M0724k6108l1903M5088J06452N8094n8813j08242
113B2105k9462Q0812P7579n3995j59514r9188O5775J30029J2557j29200j05627
124a88129N1214J36504N4124o6770o7260M0280J05310M3310o5112q2229J3328
$$ plain form
135 -25430 73050 130085 65489 -44909 -68236 11451 77542 41143 -47375 -78567 -29790 24436
147 24436 20531 -22158 -48130 -40760 -24438 -16121 -4161 18042 24265 -7995 -47154 -32488 40949
160 40949 97364 67899 -14853 -48054 11201 88529 81956 -8764 -79445 -48396 36783 57606
172 57606 -22939 -108253 -91392 2500 49101 -4412 -72966 -51622 40363 89403 36885 -43073
184 -43073 -42771 42836 108249 67413 -37860 -88152 -31986 48486 47628 -29388 -81006 -46699 20356
197 20356 37169 -449 -26965 -5356 29889 34718 15638 8753 20624 19515 -10268 -37739 -25925
210 -25925 11775 21934 -15797 -54949 -41379 11998 40505 14334 -20673 -4445 48313 64929
222 64929 15225 -40395 -27673 36677 59409 -3739 -82427 -78819 1183 52122 7009 -75789
$$ packed form
135b5430R8480N7035o4596j10398k3327P9687O6091l6399q8518l1192M8777N4226
147B4436l905m2689k5972P370J6322Q317J1960K2203O223l2260l9159J4666P3437
160D0949N6415k9465q2752l3201N9255P7328o573r0720p0681L1049Q5179K0823
172E7606q0545q5314J6861R3892M6601n3513o8554K1344R1985M9040n2518p9958
184d3073L02Q5607O5413m0836j05273n0292N6166Q0472q58p7016n1618L4307O7055
197B0356J6813l7618k6516K1609L5245M829j9080o885J1871j109k9783k7471J1814
210b5925L7700J0159l7731l9152J3570N3377K8507k6171l5007J6228N2758J6616
222F4929m9704n5620J2722O4350K2732o3148p8688L608Q0002N0939m5113q2798
$$ plain form
234 -75789 -84718 1610 86942 75630 -11429 -64702 -20459 64962 86255 21333 -48139 -44919
246 -44919 9414 33945 -1885 -42975 -34639 7150 25450 4102 -16409 -3951 22597 24109
258 24109 375 -13420 2422 21438 9494 -25242 -39895 -17318 11790 8318 -16677 -18974
270 -18974 14500 40584 21420 -18090 -17388 31645 64779 28602 -42221 -63694 -13100 38199
282 38199 17490 -52352 -82216 -31310 38847 44934 -13076 -52743 -17386 54727 78933 31529
294 31529 -22312 -16568 31555 48052 5168 -44330 -39480 5383 24768 -10752 -53007 -46371 1422
307 1422 33468 19293 -11266 -13466 14686 34453 22977 -2002 -8657 3997 10031 -3693 -17595
320 -17595 -12011 1112 -4937 -25905 -26217 9136 42743 29840 -17463 -38650 -2639 46476 44079
$$ packed form
234g5789q929Q6328Q5332j1312q7059n3273M4243Q5421K1293o4922o9472L220
246d4919N4333K4531l5830m1090Q336M1789J8300k1348k0511J2458K6548J512
258B4109k3734j3795J5842J9016j1944l4736j4653K2577K9108l472k4995k297
270a8974L3474K6084j9164l9510P02M9033L3134l6177p0823k1473N0594N1299
282C8199k0709o9842k9864N0906P0157O087n8010l9667L5357P2113K4206m7404
294C1529n3841N744M8123J6497m2884m9498M850M4863J9385l5520m2255O636M7793
307A422L2046j4175l0559k200K8152J9767j1476k4979o655J2654O034j3724j3902
320a7595N584J3123o049k0968l12L5353L3607j2903m7303k1187L6011M9115k397
$$ plain form
333 44079 -10892 -52028 -30929 20747 32794 -12644 -55843 -39550 19604 49866 19042 -27130
345 -27130 -24015 25288 55633 29095 -18117 -23905 14053 37383 7784 -41796 -50664 -12263 22297
358 22297 10938 -25130 -35125 -6360 25119 23804 1684 -5176 13700 30018 19573 -5174 -13599
371 -13599 -249 7633 -8128 -27720 -22547 2225 11382 -9735 -29925 -15461 22937 39238 15979
384 15979 -14263 -10031 20435 32172 4532 -29834 -27177 6958 24524 -2685 -41309 -39359 4814
397 4814 38992 23164 -17618 -24392 15533 50435 34303 -14776 -36167 -6841 30304 24300 -18790
410 -18790 -46376 -29808 5619 15915 -3868 -18676 -5016 19749 24084 6666 -5168 5583
422 5583 20652 14328 -8568 -19698 -7448 5167 -6291 -28918 -30001 -2224 22563 15016 -10025
$$ packed form
333D4079n4971m1136K1099N1676J2047m5438m3199J6293N9154L0262l0824m6172
345b7130L115M9303L0345k6538m7212n788L7958K3330k9599m9580q868L8401L4560
358B2297j1359l6068r995K8765L1479j315k2120o860J8876J6318j0445k4747q425
371a3599J3350P882j5761j9592N173K4772R157k1117k0190J4464L8398J6301k3259
384A5979l0242M232L0466J1737k7640l4366K657L4135J7566k7209l8624J950M4173
397D814L4178j5828m0782o774L9925L4902j6132m9079k1391K9326L7145o004m3090
410a8790k7586J6568L5427J0296j9783j4808J3660K4765M335j7418j1834J0751
422E583J5069o324k2896j1130J2250J2615j1458k2627j083K7777K4787p547k5041
$$ plain form
435 -10025 -14368 11785 35016 26668 -1828 -12268 6570 23274 7920 -27366 -39670 -15140
447 -15140 14733 10056 -21341 -34421 -6959 29237 31346 1010 -16805 5003 37608 36776 951
460 951 -28261 -19029 9467 15341 -9819 -32602 -24187 2725 12575 -4197 -19553 -7672 19630
473 19630 28906 10209 -10753 -7482 11411 15922 -2417 -19321 -13647 4697 7978 -8618 -19534
486 -19534 -6846 15240 19324 3848 -5878 6330 22719 16528 -10002 -25036 -10070 14258 12014
499 12014 -17838 -38900 -23310 11812 24009 2207 -19231 -6449 27359 39719 16513 -12250
511 -12250 -10710 14759 25795 4927 -23387 -27315 -8238 2716 -10158 -27127 -21256 3924 18324
524 18324 6506 -11239 -7347 15952 29402 16601 -4309 -6293 9773 16846 852 -19560 -18705
$$ packed form
435a0025m343K6153K3231q348k8496j0440J8838J6704j5354l5286j2304K4530
447a5140K9873m677l1397j3080K7462L6196K109l0336j7815K1808L2605q32l5825
460I51k9212R232K8496N874k5160k2783Q415K6912R850j6772j5356J1881K7302
473A9630R276j8697k0962L271J8893M511j8339j6904N674J8344L281j6596j0916
486a9534J2688K2086M084j5476r726J2208J6389o191k6530j5034J4966K4328k244
499A2014k9852k1062J5590L5122J2197k1802k1438J2782L3808J2360k3206k8763
511a2250J540K5469J1036k0868k8314l928J9077J0954j2874j6969N871K5180J4400
524A8324j1818j7745L892K3299J3450j2801k0910j984J6066P073j5994k0412Q55
$$ plain form
537 -18705 -150 10297 -1266 -17047 -13754 4775 14199 3259 -10700 -5374 13650 19971 2380
550 2380 -19150 -17430 4353 17336 3673 -17185 -15971 7412 22315 9433 -11762 -10367 13523
563 13523 28148 12855 -13985 -20380 -1865 12823 1049 -22996 -28028 -7731 12047 6044 -15270
576 -15270 -20215 1959 25603 24692 5060 -4826 6954 20067 14302 -4340 -12230 -2219 6810
589 6810 -2127 -19385 -22332 -7193 5773 293 -12769 -11050 8046 21913 13149 -6437 -10223
602 -10223 7501 23397 15321 -8141 -18420 -5085 10460 6115 -11818 -17584 -1908 14492 10436
615 10436 -7708 -14231 -189 16066 12881 -6120 -15944 -4756 10342 6682 -12870 -22323 -7586
628 -7586 14110 15510 -2259 -13402 -1636 17873 20226 4301 -7340 212 13884 11180 -8153
$$ packed form
537a8705J8555J0447j1563j5781L293J8529R424j0940j3959N326J9024O321j7591
550B380k1530J720K1783J2983j3663k0858J214K3383J4903j2882k1195J395K3890
563A3523J4625j5293k6840o395J8515J4688j1774k4045n032K0297J9778o003k1314
576a5270m945K2174K3644r11j9632r886J1780J3113n765j8642p890J0011R029
589F810q937j7258k947J5139J2966n480j3062J719J9096J3867q764j9586l786
602a0223J7724J5896q076k3462j0279J3335J5545m345j7933n766J5676J6400m056
615A0436j8144o523J4042J6255l185j9001r824J1188J5098l660j9552r453J4737
628g586K1696J400j7769j1143J1766J9509K353j5925j1641P552J3672k704j9333
$$ plain form
641 -8153 -20910 -12758 3324 4756 -9827 -19329 -9135 8303 11005 -1338 -8062 3337 19510
654 19510 19062 2216 -9502 -2490 10213 8406 -7994 -17119 -7432 7815 6273 -10252 -18504 -5177
668 -5177 15012 17296 791 -12320 -4933 11733 14317 -1507 -15669 -10845 5474 10425 -2707
681 -2707 -16008 -11209 5933 13856 5039 -4632 -33 12661 15061 1605 -10328 -5775 8127 10481
695 10481 -4781 -19767 -16180 247 7314 -2893 -14535 -8653 9124 16945 6323 -7101 -4082
708 -4082 11133 18168 6984 -7811 -7900 3934 7971 -3836 -16142 -11762 4315 10807 -300 -13009
722 -13009 -8999 6800 13993 4064 -8519 -6531 6970 12410 685 -13640 -12063 3269 12473
735 12473 3566 -9798 -8858 5423 14130 6205 -6503 -5877 7048 14341 5125 -10514 -13818 -3013
$$ packed form
641h153j2757Q152J6082J432j4583r502J0194J7438K702j2343o724J1399J6173
654A9510m48j6846j1718P012J2703j807j6400r125R687J5247j542j6525q252J3327
668e177K0189K284j6505j3111P387J6666K584j5824j4162M824J6319M951j3132
681b707j3301M799J7142P923q817r671M599J2694K400j3456j1933M553J3902K354
695A0481j5262j4986L587J6427P067j0207j1642N882J7777P821j0622j3424L019
708d082J5215P035j1184j4795q9J1834M037j1807j2306M380J6077O492j1107j2709
722a3009M010J5799P193r929j2583J988J3501N440j1725j4325J577J5332R204
735A2473q907j3364R40J4281Q707p925j2708O26J2925P293r216j5639l304J0805
$$ plain form
749 -3013 5892 706 -10961 -12377 -1267 7585 2655 -7102 -5641 7818 16571 9958 -3213 -4810
763 -4810 6012 13272 4992 -9872 -12331 -313 9071 1388 -13975 -17075 -3323 9742 7088 -5399
777 -5399 -8941 1672 11895 8094 -3863 -7344 2687 11882 6590 -7125 -11099 -1339 8325 3875
791 3875 -7823 -9536 2112 11732 6135 -7265 -10679 663 11569 8133 -5539 -11741 -3849 6303
805 6303 4162 -7027 -10915 -900 10320 8667 -2754 -7561 1079 11566 10480 -833 -6756 -234
819 -234 7791 4480 -7870 -13673 -5742 5264 4219 -6846 -11803 -3610 8013 8155 -1741 -6332 2193
834 2193 13194 11402 -1965 -10404 -3634 8030 8059 -4210 -12604 -6709 4777 5777 -4226 -10335
848 -10335 -3209 8902 10377 677 -6879 -2264 7141 7523 -2278 -8725 -3177 6423 5683 -5591 -11943
$$ packed form
749c013Q905n186j1667j416J1110Q852m930r757J461J3459Q753o613j3171j597
763d810J0822P260q280j4864k459J2018R384p683j5363l100J3752J3065k654j2487
777e399l542J0613J0223l801j1957l481J0031R195n292j3715l974R760R664m450
791C875j1698j713J1648R620n597j3400l414J1342J0906l436j3672o202P892J0152
805F303k141j1189l888J0015J1220j653j1421m807Q640J0487j086j1313n923O522
819b34Q025l311j2350n803P931J1006j045j1065m957Q193J1623J42r896m591Q525
834B193J1001j792j3367q439O770J1664K9j2269q394N895J1486J000j0003o109
848a0335P126J2111J475r700p556M615R405L82r801o447N548R600p40j1274o352
$$ plain form
863 -11943 -4448 8178 10155 -42 -7880 -2476 8511 9854 -419 -9011 -5017 5352 7327 -2489
877 -2489 -11545 -8544 1948 5669 -553 -6551 -2344 7284 9581 1320 -5801 -1883 8135 10147 465
892 465 -9095 -6867 2373 5061 -3280 -10963 -6549 4637 8715 532 -7907 -4779 6738 11623 4496
907 4496 -4883 -4329 4421 7465 -414 -9764 -8145 1917 7109 324 -8472 -6866 3024 8198 2577
922 2577 -4675 -2806 5983 9071 1213 -7859 -6582 2817 7148 86 -8567 -7392 2198 7530 1345
937 1345 -7011 -5448 4800 10970 4949 -5260 -6430 1385 6982 2533 -5969 -7071 216 5174 538
952 538 -7086 -6235 2623 8328 4039 -3568 -4055 3804 8753 2955 -5716 -6389 1968 7517 1737 -8608
968 -8608 -10148 -1160 6389 3723 -4638 -6237 1613 8392 4956 -3558 -5171 2371 8478 4685 -4550
$$ packed form
863a1943P495J2626J977j0197p838N404J0987J343j0273q592L994J0369J975r816
877b489r056L001J0492L721o222n998M207R628K297q261p121L918J0018K012r682
892D65r560K228R240K688q341p683M414J1186M078q183q439L128J1517M885p127
907D496r379N54Q750L044p879r350J619J0062N192o785q796J606R890N174n621
922B577p252J869Q789L088p858r072J277R399M331p062q653J175R590N332o185
937A345q356J563J0248O170o021j0209j170P815N597m449q502j102P287M958m636
952E38p624Q51Q858N705m289p607m87P859M949n798q671o73Q357N549n780j0345
968h608j540Q988P549k666q361j599P850O779l436q514j613P542O107l793r235
$$ plain form
983 -4550 -7506 -1459 4529 1538 -5906 -7236 483 6687 3421 -5049 -6375 1456 8872 5931 -2861
998 -2861 -5734 542 6707 3282 -5625 -8358 -1080 6582 4465 -4155 -7677 -1521 6606 5700 -1478
1013 -1478 -4966 245 6773 5005 -3159 -7174 -1918 4818 3555 -3956 -7249 -1950 4831 3491 -3500
1028 -3500 -5503 1019 8360 6658 -2266 -6717 -1384 6214 5583 -2939 -7681 -3182 4203 3849 -3578
1043 -3578 -8005 -2584 5555 6523 -304 -4723 -1195 5556 5679 -1054 -5048 -1024 4930 3997 -3532 -8292
1059 -8292 -3658 4112 5224 -1426 -5972 -1945 5493 6291 -591 -5825 -2090 5645 6484 -659 -7210
1074 -7210 -4929 2120 4074 -1056 -6029 -3159 3935 5749 -171 -4958 -1877 5012 6815 1071 -4547
1089 -4547 -2795 3255 3954 -2113 -6927 -3838 3571 5221 -1189 -6638 -3613 4068 6877 1238 -4421
$$ packed form
983d550k956O047N988k991p444j330P719O204l266q470j326P831P416k941q792
998b861k873O276O165l425q907k733P278P662k117q620l522O156Q127r06p178
1013a478l488N211O528j768q164m015N256O736j263p511l293N299O781j340o991
1028c500k003O522P341j702q924m451N333P598o31q522m742M499P385l54p427
1043c578m427N421Q139R68o827m419L528O751J23o733l994M024N954r33p529m760
1059h292M634P770J112o650m546M027P438P98o882n234L735P735Q39p143o551
1074g210K281P049J954n130m973K870P094J814n920m787L081O889J803n744n618
1089d547J752O050O99o067m814L089P409J650o410n449L025P681K809n639n659
$$ plain form
1104 -4421 -2293 4766 6546 247 -6200 -4758 2454 5745 459 -5896 -5073 1483 4711 649 -4402
1119 -4402 -2696 3511 5829 1051 -5003 -3853 2571 5372 753 -5161 -4223 2078 4894 420 -5146
1134 -5146 -4370 2923 7101 2870 -4065 -4633 1587 5509 2026 -4061 -4528 1047 4584 730 -5090 -5195
1150 -5195 932 5337 2236 -3223 -3283 2368 5445 1797 -3995 -3613 2795 6374 1814 -5150 -6014 173
1166 173 4965 1993 -4367 -5101 1043 5546 2429 -3947 -4977 834 6157 3948 -2508 -4624 -95
1181 -95 4368 2395 -2938 -4302 448 4640 2273 -3449 -4803 32 4370 2661 -2519 -3986 415
1196 415 4612 2264 -3578 -5158 371 5228 3471 -2704 -5306 -989 4216 3438 -2110 -4442 -160
1211 -160 4848 3514 -2327 -5159 -1100 4075 3567 -1811 -4600 -1186 3496 2291 -3049 -5065 -311
$$ packed form
1104d421K128P059J780o299o447J442P212L291n286o355Q23O556L228m062n051
1119d402J706O207K318m778o054J150O424K801m619n914R38O301K816m474n566
1134e146P76P293M178m231o935n68O220L922l483o087m67N575L537l854n820j05
1150e195O127M405l101n459o0N651L077l648n792L82O408L579m560o964q64O187
1166A73M792k972o360p34O144M503l117o376j030N811N323k209o456k116M529
1181i5M463j973n333j364M750M192k367n722j354M835M338j709n180j467M401
1196D15M197k348n842j580N529M857j757o175k602M317N205p78n548k332M282
1211a60N008j334n841k832M059N175n08n378k789L414M682j205n340k016M754
$$ plain form
1226 -311 5218 3919 -2195 -5010 -998 4709 4353 -1392 -4432 -534 4419 3874 -2106 -5637 -2292 3645
1242 3645 4121 -1170 -4811 -2226 2733 2991 -1040 -3925 -882 3713 3701 -1035 -4284 -1569 3312 3543
1258 3543 -958 -3946 -1170 3594 3501 -1439 -4977 -1797 3941 4677 -620 -4767 -2881 2317 4121 -460
1274 -460 -4645 -2387 3007 4382 -207 -4743 -2696 2563 4829 939 -3285 -2020 2675 3819 -302
1289 -302 -4242 -2312 2768 3918 -530 -5078 -3321 1835 3470 -343 -4334 -2558 2912 4570 358
1304 358 -4025 -2697 3015 5269 1524 -3131 -2767 1721 3493 184 -3631 -2987 1444 3537 39 -3863
1320 -3863 -3289 1262 3523 690 -3149 -2270 2285 4079 632 -3727 -2937 2226 5118 1883 -3245 -3812
1336 -3812 867 4026 1365 -3095 -3514 635 3888 1366 -3358 -4181 -62 3630 1793 -2267 -3050 677
$$ packed form
1226c11N529j299o114k815M012N707l56n745l040L898M953n45n980l531L345N937
1242C645M76n291l641K585M959K58m031k885L043M595j2m736l249K715M881K31
1258C543m501k988K776M764r3m940l538L180N738P36n297m147J886N198J804m581
1274d60m185K258N394J375m589m536K047N259K266l890m224J265M695J144m121
1289c02l940J930N080J150m448m548J757N156J635l813l991J776N470J658m212
1304C58m383J328N712K254l745m655L64M488J772l309l815O44M431K093l498l902
1320c863N74M551K261k833l839Q79M555J794l447m359P90N163K892l235n128n67
1336c812M679L159k661m460m19M149L253k522m724q23M119L692j837m060p83L727
$$ plain form
1352 677 3396 1463 -2699 -2662 1714 4710 2380 -2367 -3260 785 3976 1689 -2824 -3566 558 3528
1368 3528 1158 -3781 -4573 -100 3680 2173 -2478 -3583 280 3680 2351 -1878 -2781 1020 4184
1383 4184 2580 -2066 -3544 -327 2813 1435 -2374 -3498 -320 2790 1268 -2560 -3781 38 3950
1398 3950 3051 -1634 -3292 -482 3412 2587 -1511 -3550 -561 3464 2899 -1424 -3956 -1330 2726 2858
1414 2858 -689 -2740 -696 2641 2083 -1696 -3446 -643 2902 2378 -1620 -3823 -1032 2815 2461 -1058
1430 -1058 -3153 -179 3717 3223 -1263 -3697 -1046 3252 3286 -946 -3800 -1918 2088 2192 -1289 -3568
1446 -3568 -1313 2671 3106 -413 -2977 -980 2535 3014 -170 -2508 -893 2178 2344 -1351 -3580 -1417
1462 -1417 2280 2969 -466 -3128 -1752 2171 3079 -88 -3068 -1485 2318 3381 -116 -3342 -2394 1208
$$ packed form
1352F77K719j933m162L7M376K996k330m747q93M045L191k287m513p42M124K970
1368C528k370m939p92M473L780j507m651j105L863L400j329m229r03L801L164
1383D184j604m646j478L217L140j378l809j124L178L110j522l828j221L819L912
1398C950q99m685j658K810L894q25m098k039K989M025n65m323k532K626M056J32
1414B858l547k051K044L337n58l779j750K803L545n24l998k203K791L847l54l519
1430a058k095K974L896m94m486k434K651M298L4m232k854J882M006J04l481k279
1446c568K255L984M35l519k564J997L515M79l184k338J615L071J66l695k229K163
1462a417L697O89l435k662J376L923R08l167k980J583L803J063l497l226R48L602
$$ plain form
1478 1208 2814 207 -2604 -2046 1436 2681 16 -2732 -1530 2159 3403 525 -2672 -1884 1610
1493 1610 2747 -236 -3050 -2066 1681 3050 -65 -3526 -2578 1578 3381 1006 -2223 -1918 1295 2813
1509 2813 579 -2539 -2205 1270 2931 613 -2680 -2533 692 2454 595 -1898 -1578 1372 2870 393
1525 393 -2521 -2041 1391 3200 941 -2448 -2542 701 2650 721 -2591 -2416 839 3362 1490 -1979
1541 -1979 -2790 480 3181 1499 -1559 -2147 430 2358 947 -2139 -2549 380 2512 1242 -1649 -2477
1557 -2477 414 2491 1189 -1618 -1999 929 2986 1308 -2185 -3165 -165 2611 1589 -1812 -2723 -113
1573 -113 2625 1587 -1549 -2361 124 2850 2160 -1050 -2511 -350 2074 1460 -1539 -2367 -242 1978
1589 1978 867 -1886 -2692 -199 2616 1984 -1070 -2214 128 2617 2050 -1175 -2579 -104 2427 2012
$$ packed form
1478A208J606k607k811N58L482J245k665k748J202L689J244k878l197P88L494
1493A610J137k983k814R84L747J369l115l461R48M156J803k375l229L05L213J518
1509B813k234l118L34L475J661k318l293J47L225J762j859k493L20K950J498k477
1525C93k914M80L432J809k259l389r4L243J949j929l312J75L255K523j872l469
1541a979q11L270K701j682l058n88K577J928j411l086m10K929K132j270k891q28
1557b477K891K077j302k807l81K928K057j678l493r80L000K776j022l401r11K610
1573a13K738j038l136q12K485K726o90l210j461K161K424o14k999q28K125K220
1589A978j111k753q06K493K815o32l054j144K342K489n67l225j404K475K531m15
$$ plain form
1605 2012 -1321 -3081 -1307 1704 1915 -917 -2222 -584 2065 1715 -861 -2208 -612 2189 2080 -556
1621 -556 -2170 -804 1603 1418 -852 -2365 -371 2188 2255 -913 -2815 -1107 2119 2354 -360 -2501
1637 -2501 -1194 1516 1626 -1112 -3052 -1338 1545 2333 12 -2060 -1082 1573 2296 441 -1391 -438
1653 -438 1777 1977 -481 -2523 -1174 1201 1745 -633 -2506 -1521 1180 1552 -420 -2261 -1106 1953
1669 1953 2828 215 -2029 -1409 1278 2333 301 -1729 -1513 844 1891 -75 -2214 -1605 1019 1937
1685 1937 304 -1743 -1432 833 1860 -64 -1834 -1090 1260 2090 -5 -2261 -1821 1030 2563 744
1701 744 -1591 -1266 1210 2549 616 -1783 -1608 825 2181 474 -1971 -2307 -149 1537 327 -1838
1717 -1838 -1633 569 2177 718 -1302 -1257 666 2489 1342 -1054 -1577 747 1985 464 -1907 -1973
$$ packed form
1605B012l333j760J774L011K11k832j305J638K649l50k576j347J596K801j09k636
1621e56j614J366K407j85k270j513J994K559O7l168j902J708L226K35k714k141
1637b501J307K710J10k738j940J714K883P88k321k072R78K655P23j855j832R53
1653d38K215K00k458k042J349K375N44k378j873R85K701L72j972j841J155L059
1669A953Q75k613k244O20K687J055k032k030K16K357J047j966k139O09K624R18
1685A937j633k047L11K265J027j924j770P44K350Q30k095k256M40K851J533j819
1701G44k335L25K476J339j933k399J75K433J356j707k445l36K158J686j210k165
1717a838K05K202J608j459k020M5J923J823j147k396n23K324J238j521k371o6
$$ plain form
1733 -1973 236 1943 688 -1963 -2271 118 2041 1121 -1131 -1639 494 1951 962 -1280 -1735 236
1749 236 1892 1030 -997 -1562 18 1551 873 -1072 -1285 612 1907 744 -1462 -2145 -228 1615
1765 1615 861 -1702 -2266 -104 1736 788 -1165 -1766 -38 2237 2122 -160 -1515 -83 1745 1266
1781 1266 -602 -1595 -205 1256 654 -1273 -2285 -827 1199 1133 -854 -1684 -192 1655 1480 -616
1797 -616 -1463 187 2222 1863 -699 -2041 -769 1347 1266 -633 -1761 -550 1341 1278 -531 -1977 -636
1814 -636 1395 1276 -485 -1603 -886 965 1020 -751 -1641 -299 1603 1634 -395 -1559 -566 1664 1906
1831 1906 0 -1352 -615 1223 1346 -478 -2232 -1332 836 1296 -282 -1836 -1205 717 1544 274
1847 274 -980 -430 1353 1746 351 -1349 -787 781 1147 -49 -1578 -1072 355 1150 -415 -1620 -894
$$ packed form
1733a973K209J707j255k651l08K389J923r20k252n08K133J457r89k242m55J971
1749B36J656q62k027n65J580J533o78j945k13J897J295j163k206o83J917J843
1765A615p54k563n64K162J840r48j953o01J728K275j15k282j355J432J828m79
1781A266j868r93J390J461o02j927j012J458K026o6j987q30J492J847j75k096
1797f16q47J650K035l59k562j342J272K116q1j899j128J211J891o3j809j446J341
1814f36K031j19j761j118P17J851N5j771q90J342J902L1k029j164R93K230K42
1831A906j906j352P37J838J23j824j754R00K168M60j578j554O31J922Q27j270
1847B74j254N50J783L93j395j700N62J568L66j196j529N06J427P95j565j205P26
$$ plain form
1864 -894 1340 1896 176 -1553 -896 940 1881 310 -1449 -1006 664 1571 -61 -1701 -1165 854 1840
1881 1840 539 -1119 -730 689 1505 188 -1292 -1085 748 1500 32 -1562 -1254 257 1488 471
1897 471 -1125 -899 663 1650 452 -1052 -1076 712 1642 776 -1101 -1561 -100 956 269 -1025 -1217
1914 -1217 315 1297 305 -986 -990 403 1438 643 -826 -794 410 1384 247 -1241 -1347 481 1525
1931 1525 718 -1531 -1401 221 1564 978 -930 -1238 383 1725 823 -971 -1688 -252 1291 750 -767
1948 -767 -1310 -242 1158 641 -870 -949 78 1452 881 -635 -1186 -68 1157 858 -821 -1221 -162
1965 -162 1138 355 -925 -1435 -121 1476 983 -376 -1175 -115 1179 975 -266 -1169 -132 1176 890
1982 890 -572 -1323 -566 1047 891 -744 -1266 -173 1347 1032 -519 -1225 -243 1174 1021 -399 -1476
$$ packed form
1864h94K234N56j720j729O57J836R41j571j759M43J670R07j632j640N36K019R86
1881A840j301j658L89J419Q16j317j480K07J833P52j468j594L08J511J231j017
1897D71j596K26J562R87j198j504k4J788R30q66j877m60J461J056o87j294j92
1914a217J532R82r92j291mJ393J035p95j469L2J204R74j137j488j06J828J044
1931A525q07k249J30J622J343n86j908l08J621J342r02j794p17J436J543n41j517
1948g67n43J068J400n17j511p9J027J374n71j516n51J118J225k99j679m00J059
1965a62J300p83j280n10J314J597m93j359p99J060J294k04j241r03J037J308k86
1982H90j462p51P57J613j56j635n22J093J520l15j551p06R82J417j53j420j077
$$ plain form
1999 -1476 -699 882 952 -449 -1475 -550 1226 1362 -190 -1305 -685 1010 1351 98 -888 -452 592
2016 592 681 -366 -1231 -456 837 845 -482 -1070 -342 956 965 -113 -845 -153 1199 870 -487 -1419 -448
2035 -448 1115 1198 -164 -1224 -730 748 1045 -39 -1163 -572 760 1352 82 -1262 -920 409 1154
2052 1154 89 -1246 -798 384 781 -41 -1155 -829 684 1327 249 -707 -1046 466 1125 467 -963
2069 -963 -800 464 1173 169 -1196 -899 293 1175 303 -828 -713 467 998 68 -696 -512 746 1079
2087 1079 205 -980 -817 404 916 -44 -1154 -728 482 972 73 -1277 -992 637 1371 720 -885
2104 -885 -1226 70 1259 346 -1003 -1119 101 1048 654 -774 -1166 136 925 878 -181 -790 67 963
2122 963 499 -623 -796 0 858 476 -611 -942 85 1044 513 -562 -622 246 1075 789 -631 -934 120
$$ packed form
1999a476P77J581P0j401j026R25J776J36j552j115O20J695L41j253r86M36J044
2016E92Q9j047q65P75J293Qj327n88P28J298Rj078p32O92J352l29j357r32R71
2035d48J563Q3j362j060M94J478K97j084j124N91J332N92j270j344L42J329P45
2052A154j065j335M48J182L97q22j114L26J513O43j078r56l39J512O59o58j430
2069i63J63J264P09j004j365K97J192Q82q72j131J15J180N31r30p64J84J258L33
2087A079q74j185J63J221N12r60j110M26J210M90q99j350K85J629P34o51j605
2104h85l41J296J189r13j349j16J220R47l94j428l92J302P89m7j059o09Q57Q96
2122I63m64j122j73P96Q58l82j087l31J027R59n31j075o0Q68Q29k86j420l03J054
$$ plain form
2141 120 928 363 -739 -851 29 875 208 -905 -843 105 1211 758 -509 -1096 -9 852 753 -615 -1019
2160 -1019 51 998 637 -817 -1342 -300 983 924 -416 -985 -272 762 876 -221 -877 -319 794
2177 794 789 -140 -934 -492 405 505 -82 -458 -131 704 496 -271 -642 -181 823 525 -335 -789 -90 554
2197 554 721 -502 -945 -58 871 843 -579 -1242 -456 830 1135 -25 -878 -319 806 781 -246 -1116 -555
2216 -555 691 1086 13 -891 -576 557 1017 74 -539 -528 453 841 5 -809 -490 331 677 233 -849
2235 -849 -618 299 820 151 -754 -174 564 898 129 -659 -305 480 617 107 -454 -301 510 482 -336 -917
2255 -917 -555 472 891 14 -991 -557 664 966 58 -926 -662 668 1229 235 -873 -872 292 1004 393
2274 393 -541 -647 234 917 322 -633 -779 215 878 442 -533 -813 43 575 168 -511 -365 400 671 106
$$ packed form
2141A20Q08n65j102j12Q80Q46o67j113O2R48J106m53j267n87J087Q61r9j368m04
2160a019J070R47l61j454n25J042J283n9j340n69P13J034J14j097o56N58J113
2177G94nr29p94M42Q97J00n87l76L27Q35k08p67l71M61J004k98q60m54O99O44
2197E54J67j223m43Q87R29k8j422o63P86J286L05j160q53N59J125k5j027q70N61
2216e55J246L95j073r04L15J133M60r43o13J1R81L88q36q14L19Q21L46m44j082
2235h49K31R17N21o69r05N80P38L34p69p88L54P85J37n10n61J53Q11k8q18n81
2255i17L62J027M19q77j005M34J221L02r08r84K64J330N61r94j108JJ164P12o11
2274C93r34j06Q81O83n95r55j46R94O63m36r75k80Q56N32m07o79J46P65K71n65
$$ plain form
2294 106 -269 -275 297 921 476 -351 -341 263 663 120 -790 -555 501 771 3 -747 -618 250 753 339 -551
2315 -551 -568 231 662 314 -742 -698 216 723 582 -662 -674 -140 780 555 -470 -732 49 883 610 -382
2335 -382 -881 -226 696 652 -98 -662 -145 348 241 -59 -318 -115 481 526 -105 -444 -123 412 290 -268 -568
2356 -568 96 644 195 -580 -750 -98 639 354 -370 -634 139 792 478 -575 -781 -105 749 818 -453 -867
2376 -867 -329 582 651 -120 -827 -287 521 768 -147 -854 -420 475 739 112 -598 -205 343 480 -76 -363
2396 -363 -113 408 496 -174 -750 -193 424 622 192 -549 -80 276 495 -212 -526 -63 133 453 -154 -380
2416 -380 -390 410 534 -193 -634 -120 731 693 -21 -1026 -173 458 595 -34 -903 -406 336 533 -93 -703
2436 -703 -407 353 906 289 -634 -691 146 703 404 -475 -603 164 507 190 -503 -416 84 366 382 -304 -460
$$ packed form
2294A06l75oN72O24m45q27J0O04M00n43r10K35J056K70p68p50J29Q68N03m14q90
2315e51j7P99M31l48j056M4R14N07j41j244j2N34R20k25j025k62P81Q34k73r92
2335c82m99O55R22m4p50n64N17M93j07l00k59K03N96M5o31l39L21N35j22n58l00
2356e68O64N48m49p75j70O52P37k85p24k64P73O53l14j053k06O76Q54O9j271m14
2376h67N38R11O9p71p07N40Q08K47r15p07M34Q95K64o27p10L93N48J37n56k87
2396c63K50N21Q8o70n76N57O17J98m30p41M69L56K19p07l14M63J96L20o07k26
2416c80j0Q00J24p27m41N14Q51l8p14j005Q53O31J37o29q69M97P42J97o26o10
2436g03K96P60N53o17r23n7Q37N57k99q79j28P67L43l17o93Q7N00K82J6o86j56
$$ plain form
2457 -460 155 317 -47 -397 -216 360 333 -76 -561 -358 141 266 69 -420 -285 258 543 15 -534 -644
2477 -644 393 599 229 -501 -407 220 444 92 -664 -387 208 707 79 -466 -510 83 707 462 -389 -620
2497 -620 -41 491 184 -451 -555 -64 523 455 -191 -528 -41 316 419 21 -273 136 451 267 -294 -647
2517 -647 -22 258 107 -299 -200 47 341 284 -375 -435 180 416 285 -242 -566 247 673 261 -421 -498 46
2538 46 499 457 -378 -741 -30 563 471 -46 -571 -182 612 330 -141 -361 -60 397 423 83 -524 45 206
2559 206 278 -85 -234 -18 289 287 -250 -388 -6 371 257 -135 -335 -94 96 282 -294 -337 -106 365 246
2580 246 -212 -564 -48 327 348 -282 -514 -37 436 279 -308 -477 -110 658 386 -42 -690 -234 450 462 -7
2601 -7 -548 -152 439 375 56 -530 -404 326 616 136 -230 -403 -73 228 -231 -233 -165 326 311 -11 -242 -174 253
$$ packed form
2457d60O15J62l64l50J81N76k7m09m85K03M99J25j97m89J35N43K85n28n49j10
2477f44J037K06l70p30R4O27K24l52p56K77N95M99o28n45m4N93O24k45q51k31
2497f20N79N32l07o35j04M91N87o8o46l37M87L57J03l98k94M09L15j84n61l53
2517f47O25K80j51m06R9K47K94n7o59o0O15K36j31n27l24Q13M26m12o82p7N44
2538D6M53m2q35l63P11N93r2n17n25L89P94k82m71k20L01M57K6l40o07N69J61
2559B06P2l63j49K16L07kn37j38L82L77j14l92k00K41J90J86n76m3K31M71j19
2580B46m58l52N16L75K1o30k32M77M73j57n87j69L67P68k72m28o48M56O84J2m69
2601gn41L96N91o4l19n86J26P30K90m80l66j73L30L01m59kO8M91j5l22k31O8M27
$$ plain form
2624 253 161 35 -380 -195 388 282 -47 -279 -171 451 425 121 -424 -280 214 456 107 -324 -313 147 529
2645 529 10 -427 -315 291 454 42 -279 -333 265 481 146 -466 -301 326 417 201 -329 -402 -12 345 318
2666 318 -302 -257 164 455 128 -358 -350 -3 511 153 -12 -168 78 344 -72 -290 -56 168 340 216 -413
2687 -413 -243 -67 385 109 -221 -25 280 355 180 -214 -295 53 400 337 -390 -521 -28 502 37 -423 -412
2708 -412 54 345 114 -307 -445 -224 447 328 -20 -293 -59 215 14 -192 -414 -25 385 166 -124 -331
2728 -331 -31 325 208 -222 -202 -37 278 82 -85 -342 -67 306 298 -45 -184 -50 428 71 -138 -319 -83
2749 -83 249 245 -214 -323 -52 130 373 -312 -345 -37 363 212 -251 -398 -146 362 304 -127 -611 -202 244 246
2771 246 -172 -328 -238 282 421 -14 -432 -326 205 392 190 -233 88 179 189 -117 -268 -75 228 223 -5 -348
$$ packed form
2624B53r2j26m15J85N83j06l29k32J08O22k6l04n45J44M94K42l49m31J1M60L82
2645E29n19m37J12O06J63m12l21n4N98K16l35o12J65O27R1k16n30p3L90L57k7
2666C18o20M5M21K91l27m86QL47N14l58j65j56K46K66m16k18K34K24J72j24o29
2687d13J70J76M52k76l30J96L05P5j75l94q1L48L47o3p27j31M93N30m65m60J1
2708d12M66K91k31m21j38K21O71j19l48k73K34K74k01k06k22L89M10k19k90k07
2728c31L00L56j17m30K0J65L15j96j67k57K75L73ql43j39J34M78l57k09j81K36
2749h3L32mm59j09K71J82K43o85l3L08M00j51m63j47K52N08n8m31m84M09M46K
2771B46m18j56R0N20J39m35m18J06N31J87k02m23L21R1J0l06j51J93L03nk28l43
$$ plain form
2793 -348 -222 167 112 -53 -379 -62 196 341 -230 -377 -86 322 268 -64 -338 -102 203 333 -34 -265 -173
2814 -173 275 330 -60 -541 -326 170 341 -48 -336 -149 172 292 -5 -326 -263 348 502 251 -225 -165 216
2835 216 343 26 -148 -156 4 246 108 -294 -351 -13 198 159 -294 -316 208 218 -10 -129 -76 152 231 88 -226
2858 -226 -184 19 131 -48 -286 -205 277 272 145 -237 -506 75 237 180 -101 -341 -77 275 -69 -198 -303 2
2880 2 247 126 -126 -452 -173 232 168 -383 -111 57 124 -18 -134 -190 186 309 327 -70 -261 -14 376 119
2902 119 -203 -173 130 583 41 -285 -409 97 326 313 -168 -320 -68 147 81 -240 -330 -25 427 157 -40
2923 -40 -133 132 260 59 -149 -243 -172 230 260 -31 -393 -149 327 146 -112 -304 -53 234 199 72 -189 -113
2945 -113 258 270 101 -237 -61 80 101 42 -123 77 233 374 -10 -175 42 163 22 -148 -16 -185 173
$$ packed form
2793c48J26L89n5j65l26L17K58J45n71j47K91M08n4l32k74K36L05J30l67k31R2
2814a73M48N5l90m81K15M96J71l89k88J87L21J20k97l21O3O11J54k51m76O0L81
2835B16J27l17j74qJ60K42j38m02n7L38K11l9m53k2N24J0k28j19N3K28P9j43l14
2858b26M2K03J12j79k38Q1M82nj27l82k69N81J62n7k81k40K64L52l44j29j05L05
2880BK45j21k52l26K79M05o4n51K72J68O7j42j16n6L76J23J8l97j91K47L90k57
2902A19l22L0L03M53n42l26j24N06K29j3m81j52K52K15o6l21r0L05M52k70j97
2923d0r3K65J28k01k08r4P1M02L0k91l62K44M76j81k58j92K51K87l5j27k61P6
2945a13L71J2j69l38J76J41K1n9j65K00J56J41l84j65K17J21j41j70J32j69L58
$$ plain form
2966 173 283 -184 -414 -2 93 115 -174 -270 -113 156 260 -45 -129 -177 167 1 0 -188 -137 209 251 86 -238
2989 -238 -77 148 132 -2 -222 35 268 200 81 -383 -161 67 182 -70 -258 -134 -121 293 5 -191 -223
3010 -223 200 267 66 -88 -313 -134 202 -45 -256 -83 117 126 -142 -314 -163 66 250 73 -347 -106 37
3031 37 182 119 -231 -132 159 204 128 -206 -120 141 369 93 -228 -112 171 248 101 -84 -277 146 195 64 4
3054 4 -245 44 208 -27 -221 -83 197 229 16 -405 -304 14 272 83 -83 -172 77 213 38 -54 -266 -69
3076 -69 138 199 -87 -225 55 154 106 -78 -312 129 266 142 -339 -135 -1 202 48 -77 -5 -14 448 80
3098 80 101 -176 97 395 138 -106 -200 45 257 114 -73 -255 -262 120 76 -155 -153 12 196 249 -139 -185 -38
3121 -38 -29 -23 -66 -132 -87 29 58 -52 -167 -70 134 139 -282 -186 46 157 152 44 -88 -7 234 255 20 -257 86 72
$$ packed form
2966A73J10m67k30M12R5K2k89r6J57K69J04l05q4m8L44j66jj88N1L46M2j65l24
2989b38J61K25j6j34k20K57K33o8j19m64K22K28J15k52j88J24J3M14k88j96l2
3010b23M23O7k01j54k25J79L36k47k11J73K00Rk68j72J51K29J84j77m20K41J43
3031C7J45o3l50R9K91M5p6l34Q6K61K28k76l21J16K83P7j47j85j93M23M9j31o0
3054Dk49K89J64k35j94J38K80L2k13m21J01L18K58j89j66q9K49J36j75r2k12J97
3076f9K07O1k86j38K80R9m8j84k34M41J37j24m81K04J34K03j54j25P2rM62l68
3098H0K1k77K73K98k57k44r4K45K12j43j87j82pL82m4k31KJ65J84N3l88m6J47
3121c8ROm3o6M5J16K9j10j15R7K04Nm21R6K32J11nj08j32Q1K41K1k35k77L43j4
$$ plain form
3147 72 129 33 -165 85 187 -8 -36 -108 -110 161 118 -162 -220 67 -24 132 -135 -197 139 260 267 -158 -203 -51 191
3172 191 257 67 -164 -92 62 101 -193 -114 -71 5 35 28 -274 -126 81 263 140 -143 -188 276 138 -40 -97 -59
3196 -59 98 183 -46 -172 -177 113 82 54 -174 -127 257 289 -24 33 15 160 117 31 -90 24 48 150 171 -326 20
3221 20 29 236 49 -255 -51 69 200 -77 -333 -155 13 216 145 -158 -53 141 184 -65 -119 -179 -53 130
3243 130 48 -333 -5 47 184 154 -43 -126 274 56 -29 24 -214 -7 149 66 -149 -120 40 163 36 -65 6
3266 6 76 65 22 -65 -109 -93 170 56 -54 -172 -192 228 31 -56 -178 14 31 60 -126 -106 49 122 320 -42 -52
3291 -52 162 229 30 -59 -54 38 15 -41 -70 -209 123 70 -37 -2 -11 -65 223 62 -50 -262 -116 106 85 -78 -161
3316 -161 85 -15 47 -136 -247 112 174 123 -88 34 66 101 194 -138 -55 25 209 246 -30 -145 6 252 145
$$ packed form
3147G2N7r6j98K50J02j95k8p2kK71m3k80n8K87r1J56k67o2L36J21Pm25m5J52K42
3172A91O6j90k31P2J54L9k94P9M3P6L0pl02J48K07J82j23k83m5M64j38j78n7L8
3196e9J57Q5k29j26nK90l1k8k28M7L84L2l13N7j8J45m3q6j21J14K4J02K1m97L46
3221B0RK07j87l04K04J20J31k77k56J78J68K03p1l03J05J94M3k49n4o0J26J83
3243A30q2l81L28N2J37l0j97q3M00k18q5N3k38K07J56q3k15K9J60J23j27j01P1
3266FP0j1m3q7m4J6K63j14j10j18k0M20j97q7j22J92J7K9j86K0J55P3J98l62j0
3291e2K14O7j99q9NR2k3n6k9j39L32n3j07L5rn4K88j61j12k12J46K22k1j63q3
3316a61K46j00O2j83j11L59O2n1k11J22L2L5R3l32Q3Q0J84L7k76j15J51K46j07
$$ plain form
3339 145 123 -62 46 128 156 -59 -43 -225 124 37 -190 -149 114 123 16 79 -128 -63 46 -50 -74 -36 11 114 146
3364 146 -140 -201 -63 94 285 70 -326 -61 -39 219 123 -27 -282 130 144 153 -245 8 16 121 148 43 84
3387 84 143 253 30 -168 -61 163 8 -132 -37 57 141 117 59 -267 7 62 212 -25 55 0 -33 104 109 -42
3411 -42 -210 161 -80 0 -189 -67 20 176 220 -230 45 -14 311 -19 -293 -137 53 41 -37 -29 -127 78 136 -47
3435 -47 -51 -152 -47 5 173 -185 -221 14 203 35 -292 -278 69 145 -92 9 -145 -6 220 -119 8 -11 34
3458 34 81 -12 -58 -35 97 176 -66 -85 -67 -74 151 108 -1 -28 -14 82 130 -172 -109 27 225 -85 -120 -233 -26 -81
3484 -81 217 85 -151 -137 7 -1 0 -67 114 111 97 115 -308 -113 60 20 -48 -93 -10 212 40 -64 -81 -92 183 -94
3510 -94 75 -37 -7 80 47 -141 -78 -44 72 98 28 -194 8 47 184 -39 26 213 127 124 -174 -211 -8 149 -77
$$ packed form
3339A45k2j85J08Q2K8k15J6j82L49q7k27M1K63Rj07O3k07O5J09r6k4L8M7J03L2
3364A46k86o1J38J57J91k15l96K65K2K58r6j50k55M12J4Rl98K53QJ05K7j05M1
3387H4N9J10k23j98J07K24j55j40R5R4Q4k4n8l26K74N5J50k37Q0n5l3J37Nj51
3411d2j68L71k41Q0j89J22Q7J56M4m50K75n9L25l30k74J56J90j2p8Qr8K05N8j83
3435d7mj01J05N2J68l58l6K35J89j68l27J4L47P6k37J01j54J39K26l39J27j9M5
3458C4M7r3m6K3J32P9k42j9J8pK25m3j09k7J4R6M8l02O3J36J98l10l5j13K07n5
3484h1K98j32k36J4J44qJo7J81lj4J8m23J95J73m0o8m5Q3K22j72j04j7j1K75k77
3510i4J69j12L0Q7l3j88O3L4J16K6p0k22K02L9J37k23O5J87q6lk98l7K03J57k26
$$ plain form
3535 -77 -38 -174 92 -3 118 -113 -54 116 131 237 -24 -125 57 139 -124 41 -109 231 283 -31 40 -19 -74
3558 -74 141 310 -131 -53 -24 -48 97 -83 -85 -62 -26 230 -41 -190 -119 159 61 79 -178 -70 -57 10 103 -143 -89
3583 -89 -10 108 -76 18 81 44 25 62 -114 -175 42 107 8 -81 -84 -39 100 235 -285 -223 207 -60 -53 -43 33 80 125
3610 125 90 -80 84 -94 122 2 69 47 1 100 -128 -109 -9 18 125 36 -72 -122 45 149 285 -181 -218
3633 -218 85 145 69 -163 -60 50 -38 106 -145 -87 127 266 58 -95 -111 -159 220 10 -127 -106 -30 152 -71
3656 -71 -127 -64 -70 -4 -130 -25 -63 -139 132 54 118 -22 -82 32 -6 -15 -70 119 -177 112 -49 -3 -18 -44 -18 76 -34
3683 -34 -49 77 24 -174 -241 3 -76 7 -90 -107 -76 175 168 -104 -16 -103 152 140 -87 -95 -47 -47 11 -127 -209 -38 141
3710 141 -59 -11 -207 -14 108 -30 61 -80 -15 89 222 -181 -40 48 351 180 -17 -87 -73 29 34 -95 -271
$$ packed form
3535g7L9j36K66r5J21k31N9J70J5J06k61j01J82Q2k63J65j50L40N2l14P1n9n5
3558g4K15J69m41P8K9k4J45j80kK3L6K56k71j49P1K78r8J8k57J08J3O7R3k46N4
3583h9P9J18j84R4O3l7j9L7j76o1K17O5r9q9lM5J39J35n20O2M30k67PJ0P6M7M5
3610A25l5j70J64j78K16j20O7k2m6R9k28J9J00K7J07q9j08n0J67J04J36m66l7
3633b18L03O0p6k32J03J10q8J44k51N8K14J39k08j53j6m8L79k10j37K1P6J82k23
3656g1n6O3oO6j26J05l8p6K71p8O4j40o0J14l8rn5J89k96K89j61M6j5k6K6R4j10
3683c4j5J26n3j98o7K44p9Q3r7j7L1K51pk72Q8q7K55j2k27qM8%N8j38q2J71J79
3710A41k00M8j96J93J22j38R1j41O5J04J33m03J41Q8L03j71j97p0J4J02Nj29j76
$$ plain form
3733 -271 -99 64 -164 -148 -197 -33 96 213 122 70 -63 106 64 -10 -7 -79 -172 206 -45 -17 -122 14 225 84
3757 84 46 -79 20 94 -34 -268 6 -23 85 140 -290 -24 81 186 97 -34 -171 45 73 158 -173 -88 299
3780 299 51 81 -234 -71 -33 37 80 -22 182 63 105 128 -143 -93 135 259 -97 -66 -92 -92 -12 102 -123 -86
3804 -86 158 151 -101 -2 77 -71 47 75 23 62 43 45 182 83 -125 -95 138 -130 51 -58 -13 125 -9 111 -128
3829 -128 187 -95 41 -170 26 77 -109 -144 -14 7 -109 45 124 -30 -209 19 242 -249 -155 -149 -93 102 87
3852 87 9 25 20 45 27 -67 -29 -243 73 -12 170 20 119 -111 124 118 52 -76 24 -80 -120 -54 -72 -131 9 -48
3878 -48 -94 151 -40 26 -163 -50 74 -161 -10 -125 -63 -53 -36 97 -81 -10 27 56 35 81 -200 -46 105 -17
3902 -17 214 -10 2 70 98 102 -43 9 140 -6 72 18 -97 31 3 88 89 -36 82 -6 52 -103 20 123 -5
$$ packed form
3733b71J72J63k28J6m9J64J29J17r1n2j33J69m2p4Lp2r3L78k51K8j05J36K11j41
3757H4l8j25R9P4j28k34K74k9J08N5m30K66J05J05q9j31j37K16K8Q5l31Q5L87
3780B99k48L0l15J63L8P0M3j02K04j19M2K3k71N0K28J24l56L1k6%Q0J14k25L7
3804h6K44pk52R9P9j48J18K8n2L9j9KJ37r9k08L0K33k68J81j09M5J38j34J20k39
3829a28L15k82J36k11J96N1j86l5J30K1j16J54P9j54j79K28K23m91R4ON6J95j5
3852H7p8J6nK5j8r4L8k14L16q5J82j50R9k30K35oo6j28J00j04m0O6j8n9J40n7
3878d8m6K45j91O6j89J13J24k35J51j15O2J0J7J33j78P1L7K9k1M6k81J54J51j22
3902a7K31k24J2O8K8Mj45N2J31j46P8n4j15J28k8Q5Jj25J18q8N8j55J23J03j28
$$ plain form
3927 -5 18 18 21 26 23 118 -112 -126 54 102 23 -73 -29 46 187 -68 -51 87 27 90 85 -136 -1 39 -47 -80 -83 -144 102 86
3957 86 91 -85 -158 118 55 17 -21 57 132 91 -39 -42 -91 20 166 -15 -89 65 -177 132 47 -17 -27 1 -15 -199
3983 -199 -43 -277 -39 191 2 20 -1 -31 34 75 -51 -126 88 -7 33 -187 90 94 158 -126 -132 -7 -25 227 -104
4008 -104 21 -94 65 40 9 73 -54 23 -262 21 -35 -51 -40 31 -31 -181 -2 -43 166 13 16 -128 28 155
4032 155 135 219 -82 50 -49 216 -122 -73 54 -65 -228 -167 -300 -174 186 -121 -114 -48 64 27 11 -42 -224 -183
4056 -183 71 117 -33 178 227 43 -97 -125 -89 -114 228 -103 -71 1 -71 50 89 40 -122 -7 7 -79 -203 -167
4080 -167 -88 42 48 -55 -100 -186 -2 -121 -162 -11 -283 6 122 -170 -112 -210 -21 64 -85 -73 -42 83 21 -8
4104 -8 -128 112 -51 37 -64 -94 85 -118 -67 -137 65 -103 53 140 -122 -45 233 101 190 93 10 -19 14 -51 121
$$ packed form
3927eK3%LNlR5k30j4J80M8p9r6M4P5J41k55J7J38o0O3nk21J35M0q6l3lo1K46j6
3957H6Nj76p3K76o3l8l8P8P5m1j30lm9J11J46j81p4J54k42L09q5o4j0K8j6j84
3983a99J56k34K38K30j89J8k1l0O5M1j26p5K14r5M0k20K77MO4k84oJ25j8K52l31
4008a04J25j15J59k5l1O4j27P7k85K83n6j6J1P1o2j50J79m1K09j53Lj44J56J27
4032A55k0Q4l01J32r9K65l38M9J27j19j63O1j33J26L60l07PO6J12l7j6n3j82M1
4056a83K54M6j50K11M9j84j40k8L6k5L42l31L2P2p2J21L9m9j62J15J4q6j24L6
4080a67P9J30Oj03m5q6J84j19m1J51k72K89J16k92N8r8J89Q5j49J2L1J25o2k9
4104hj20K40j63Q8j01l0J79k03N1p0K02j68J56Q7k62P7K78j32Q9r7q3k9L3o5J72
$$ plain form
4129 121 -106 -50 69 -126 94 -142 -39 -238 185 6 -69 -182 -66 40 280 -76 -49 43 10 31 85 234
4151 234 -7 -26 -210 -188 -48 -201 -60 127 -99 -38 -70 -30 -116 27 58 26 -98 -166 -79 -60 85 236 -18 59
4175 59 18 2 -15 79 -122 -138 -57 225 101 29 67 -24 36 66 -3 30 -134 -42 59 -125 -123 -32 -49 -3 12 18 154 -4
4203 -4 -58 -170 -187 79 98 -17 149 22 9 56 -84 47 -42 -214 199 122 54 72 135 291 -26 -39 -14 178 9
4228 9 17 61 -1 67 107 -288 -95 -89 87 -133 90 -17 -76 51 211 44 94 51 -122 -52 -208 -14 64 25 82 124
4254 124 0 148 104 14 3 -141 -132 136 70 -43 -133 55 -76 96 79 163 10 108 78 -32 -21 7 151 118 1
4279 1 -235 -102 96 -12 -44 -39 -22 18 177 61 14 -36 5 67 -56 -184 -92 -148 72 46 -11 -21 31 37 58 62 140 -161
4307 -161 -5 -119 -106 18 -87 -74 128 -6 -31 60 49 33 46 76 -158 125 61 38 39 -187 54 -3 -84 -239 68
$$ packed form
4129A21k27N6J19j95K20k36J03j99M23j79p5j13J16J06K40l56K7R2l3K1N4J49
4151B34k41j9j84K2J40j53J41J87k26O1l2M0q6J43L1l2j24o8Q7J9J45J51k54P7
4175E9m1j6j7R4k01j6Q1K82j24p2L8r1O0L0o9L3j64R2J01j84KR1j7M6J5OJ36j58
4203dn4j12j7K66J9j15J66j27j3M7j40J31q9j72M13p7o8J8O3J56l17j3K5J92j69
4228IQM4o2O8M0l95J93OJ76k20K23j07n9J27J60j67N0m3j73P0j56J94P8l9N7M2
4254A24j24J48m4r0j1j44RK68o6j13r0J88j31J72j7Q4j53R8l0j10J1K8J44l3j17
4279Ak36J33J98j08l2NJ7M0J59j16m7n0M1O2j23j28R2n6K20k6n7j0N2OK1MP8l01
4307a61J56j14J3J24j05J3K02j34k5R1j1j6J3L0k34K83o4k3Jk26K41n7q1j55L07
$$ plain form
4332 68 -233 -75 -88 -100 -115 31 -91 -194 -61 -146 2 100 -83 48 36 -32 27 -225 -82 -108 140 -91 -56 -18
4356 -18 -62 125 -125 -168 -96 76 102 15 42 -56 -9 -23 149 -20 49 -23 15 -115 -131 -146 10 35 76 -41 -91 -259
4382 -259 -76 -109 52 32 79 -141 83 -60 -224 187 -156 96 284 60 -197 96 -22 -72 -147 -81 65 185
4404 185 -126 28 -42 -159 -121 85 22 -19 -152 -69 -95 -2 -87 -61 -17 15 38 3 -60 -50 129 -231 -69 -31 63 -58
4430 -58 -43 -108 -34 -70 -94 -184 26 -113 -52 155 -31 -69 79 -50 -87 -170 -26 -97 -31 -55 -24 31 127 -46 80 27
4456 27 134 -30 66 -120 16 -86 16 31 117 3 67 144 23 48 -9 -69 116 -97 205 182 3 36 -204 47
4480 47 43 53 52 62 133 1 -104 140 -91 -59 68 40 94 94 47 -69 -85 -21 104 151 53 -30 -190 13 -56 -173 -139
4507 -139 -295 -46 -33 50 32 89 32 -184 3 21 3 -11 147 -94 -296 13 2 -78 9 -56 82 70 37 4 103
$$ packed form
4332F8l01J58j3j2j5J46j22j03J33q5J48R8j83J31j2o8N9k52J43k6K48k31L5L8
4356a8m4J87k50m3P2J72K6q7K7r8M7j4J72j69O9p2L8j30j6j5J56K5M1j17n0j68
4382b59J83l3J61k0M7k20K24j43j64M11l43K52J88k24k57K93j18n0p5O6J46J20
4404A85l11J54p0j17L8K06o3m1j33Q3k6R3q5K6M4L2K3l5o3J0J79l60J62L8R4j21
4430e8J5o5P4l6k4r0K10j39O1K07j86l8J48j29l7q3J44p1O6k4L1N5R6j73J26n3
4456B7J07j64R6j86J36j02J02J5Q6j14O4P7j21K5n7o0J85k13L02k3j79L3k40K51
4480D7mJ0jJ0P1j32j05K44k31L2J27k8N4%m7j16j6O4J25M7r8q3j60K03o9j17L4
4507a39j56K49J3Q3j8N7n7k16J87J8j8j4J58k41k02L09j1q0Q7o5J38j2l3l3R9
$$ plain form
4532 103 -37 18 51 -111 148 25 58 89 -2 -7 148 -24 -65 78 76 63 4 123 -106 100 -105 -51 -136 -35 104
4557 104 -104 92 122 -170 25 106 28 52 154 -85 83 80 40 23 12 -53 -34 136 0 -83 -98 -56 -17 192 -25
4582 -25 32 8 -141 86 56 -235 -129 92 -168 4 72 -59 -77 49 10 81 14 -54 -4 40 -279 101 51 82 5
4607 5 -74 42 -116 108 102 108 130 189 62 -14 87 -63 180 58 -63 193 49 -81 226 -14 -33 -71 -25 -71 -189
4632 -189 146 66 -101 -57 136 89 -89 49 36 130 51 56 -2 172 17 -14 -21 -48 67 -6 -183 -72 40 173 267
4657 267 -18 22 27 74 -65 -157 -117 80 -14 30 57 171 -5 153 -17 10 6 -13 -18 328 -35 -64 1 -82 161 -12
4683 -12 128 -108 -192 -152 131 86 7 80 -29 -33 21 67 187 -71 -100 -147 61 -11 -107 -108 -86 95 -148 -173 12 -157
4709 -157 111 81 -37 -113 -57 -80 64 -238 -130 34 -58 -1 96 28 95 9 -64 73 -8 8 -28 50 -35 5 -122 -11
$$ packed form
4532A03j40N5L3j62K59j23L3L1r1nJ55j72m1J43kj3n9J19k29K06k05N4q5J01J39
4557A04k08J96L0k92J95Q1p8K4J02k39J68lm0j7j1o5J9J70j36q3j5M2L9K09k17
4582b5N7k4j49K27l0k91J06K21k60J72O8j31j8J26l9P1o7o8N0M4l19L80n0L1p7
4607Ep9J16j58K24oOK2N9j27p6J01j50K43j22j21K56j44j30L07k40j9l8M6m6j18
4632a89L35q0j67M4J93m7j78J38j3R4p9Nn8J74j55l1pk7J15p3j77J11J12J33R4
4657B67k85M0NM7j39r2M0J97r4M4K7J14j76J58j70K7mj9nL46l63k9O5q3K43j73
4683a2J40k36q4M0K83m5p9P3j09mN4M6J20k58k9m7K08p2r6jK2J81k43k5J85j69
4709a57K68l0j18p6N6k3J44l02J08J64r2N7R7o8O7q6p3J37q1J6l6P8q5M0j27J11
$$ plain form
4735 -11 -73 17 0 35 -216 -65 16 316 -202 9 43 90 11 -201 -19 229 139 -89 16 -32 78 13 -69 -90 -21
4760 -21 -147 -47 -21 -35 -35 133 173 -117 1 19 -62 193 -66 -30 70 24 -15 0 45 -172 6 113 6 82 62
4785 62 -47 99 38 -91 162 -127 31 -114 -86 85 -7 6 -51 -82 -98 104 -211 -54 -165 -76 45 59 -103
4808 -103 -111 -10 49 -10 -98 -49 -55 74 85 264 -19 175 38 48 -19 -78 -36 177 -127 -39 58 -24 -123 -155 -6 -183
4834 -183 80 -154 -159 -27 -34 -136 177 87 233 -119 42 24 -107 -18 -190 21 9 53 94 -229 51 -29 15 33
4858 33 -132 -90 -221 66 -131 -61 -156 107 -2 99 35 -98 -85 2 -12 -1 -32 -52 -61 57 -38 53 57 -87 -65 -156
4884 -156 26 93 77 111 -22 15 130 69 -18 -110 38 256 18 162 69 -13 -27 219 14 -32 47 -86 -106 111
4908 111 120 -152 -101 146 9 -227 157 -25 -46 44 5 -125 74 -7 83 -32 -170 13 210 23 67 -7 -140
$$ packed form
4735a1o2R0j7L5k51J51Q1L00n18K11L4M7p9k12J82K48r0k28J05m8J10o5q2k1O9
4760b1j26J00K6j4%J68M0k90J18J8q1K55k59L6J00m6l9J5M5k17J78J07j07P6k0
4785F2j09J46o1j29K53k89J58j45K8J71r2J3n7l1j6K02l15J57j11Q9J21J4j62
4808a03qJ01N9n9q8M9oJ29J1J79k83J94j37J0o7n9M2K13l04Q8R7q2r9l2J49j77
4834a83K63k34nJ32pj02L13r0J46l52J61j8j31Q9j72K11j2M4M1l23K80q0M4J8
4858C3j65M2j31K87j97P0r5K63j09J01o4j33J3Q7j4J1l1k0rJ18r5R1Mj44K2r1
4884a56J82O7j6L4j33L7J15o1q7r2J48K18k38J44r3q2j4K46k05m6P9j33k0K17
4908A11Rk72N1K47j37k36L84j82k1R0l9j30J99q1R0j15j38J83J97j87M4p4j33
$$ plain form
4931 -140 53 99 106 -143 -2 0 -109 260 -48 66 -57 -95 30 -95 -15 -200 161 -133 50 -150 68 130 102
4954 102 25 116 55 -108 -36 -138 24 165 38 48 -117 -191 21 -207 -35 -74 30 -47 190 141 -131 -17 160
4977 160 77 -130 78 -69 45 142 -52 118 60 -103 -105 -57 -126 -51 -56 -29 -91 -19 230 35 157 25 133 -78
5001 -78 -11 -35 120 160 -3 -72 45 45 -36 -84 -67 12 129 -133 -33 -90 -9 62 -42 150 2 121 -79 110 -19
5026 -19 -140 137 -54 187 5 -37 77 -48 -70 13 115 10 -94 16 20 85 97 101 -100 -70 -89 -22 66 14 124
5051 124 50 1 6 26 231 127 -57 76 -72 67 28 46 -142 -106 -47 -82 33 -148 -51 -80 -101 60 70 -5 101
5076 101 20 -60 -135 -34 -41 47 195 -8 -10 -22 173 3 -92 -109 57 -92 59 -211 101 -15 -169 -86 75 -128
5100 -128 12 -41 0 -60 -26 46 92 -64 33 -54 128 -13 -92 64 143 -112 93 -48 -21 -75 31 -116 243 -22
$$ packed form
4931a40J93M6Pk49J41Kj09L69l08J14j23l8J25j25Q0j85L61k94J83k00K18O2k8
4954A02p7R1o1j63P2j02J62J41j27J0j65p4K12k28J72l9J04p7K37m9k72J14J77
4977A60q3k07K08j47J14R7j94J70n8j63kM8o9P5nK7o2P2K49j95J22j32J08k11
5001g8O7k4J55M0j63o9J17%q1m8J7P9J17k62J00n7Q1P1j04J92j48J19k00J89j29
5026a9j21K77j91K41j82m2J14j25k2Q3J02j05j04J10MO5J2Mk01L0j9O7Q8n2J10
5051A24p4m9NK0K05j04j84J33j48J39l9J8j88L6N9l5J15j81R7k9k1J61J0p5J06
5076A01q1q0p5J01pQ8J48k03kj2J95j70r5j7J66j49J51k70L12j16j54Q3J61k03
5100a28J40n3M1o0L4P2M6j56R7q7J82j41p9J56P9k55K05j41K7n4J06j47L59k65
$$ plain form
5124 -22 -21 -166 237 19 -155 -224 8 -56 15 54 -25 86 -26 27 -7 -138 -57 76 -48 -21 144 -53 65 40
5148 40 -61 -77 69 -31 -147 -10 -151 29 124 20 5 18 -29 -68 -43 30 47 93 47 211 31 -38 -205 -28
5172 -28 -31 136 1 -23 -4 -103 -50 133 -77 -151 109 188 57 -17 -33 -30 -86 -75 110 -134 92 49 -6 89 5 -47 17
5199 17 -33 -160 -32 -28 -59 2 -36 -47 73 -21 33 -113 7 82 -51 85 -95 36 40 102 95 45 -60 -75 -41 -56 -155
5226 -155 -43 61 -120 86 104 -27 -52 107 -44 34 -19 80 26 -47 -49 -188 -92 -41 -174 -22 100 -20 40 63
5250 63 86 -34 -237 -34 -39 95 -61 -52 92 -4 -8 53 -62 -169 -29 13 -21 94 5 -102 -10 -81 167 -146 -67
5275 -67 53 -288 91 52 28 137 93 -73 -8 43 76 -42 64 -68 29 245 -11 58 -18 -58 -32 -34 -82 27 -2
5300 -2 193 -13 38 -85 26 202 1 14 13 23 52 -80 32 11 219 -103 26 10 -11 79 -43 -22 176 -71
$$ packed form
5124b2Jj45M03k18j74o9K32o4P1L9p9J11j12N3l4j31Q1J33j24K7J65j97J18k5
5148D0j01j6J46j00j16J37j41J80R5j04j5J3m7l9K5P3J7M6m6J64j80o9j67J77
5172b8lJ67j35k4J9r9N3J83k10p4K60P9j31p4j6Ln6J1J85k44K26m3n5R5q4n2O4
5199A7n0j27J28Ml1O1l8j1J20r4N4j46J20P5j33J36j80J31MO2pn0j05j5L4j5r9
5226a55J12J04j81K06J8j31k5J59j51P8n3R9n4p3kj39R6N1j33J52J22j20O0K3
5250F3K3j20k03K03nJ34j56RJ44r6mO1j15j07J40M2l4J15q9j07R2p1K48l13P9
5275f7J20l41L79l9k4J09m4j66O5N1L3j18J06j32R7K16k56O9p6m0K6km8J09k9
5300bJ95k06N1j23J11J76k01J3jJ0K9j32J12k1K08l22J29j6k1R0j22K1J98k47
$$ plain form
5324 -71 36 0 -6 -53 -69 -102 21 155 -90 -149 14 0 120 -92 44 116 -8 76 29 6 -182 4 -22 -90 -75
5349 -75 -48 22 36 89 0 -100 79 -44 14 127 -36 -116 50 -81 32 151 -5 -63 -125 95 136 -53 14 -266
5373 -266 -82 48 -148 26 -90 52 -30 -76 -87 -100 -100 -14 -104 102 -24 276 -42 56 -24 -25 -187 -16 53 46 -57
5398 -57 -80 13 45 -133 -56 83 150 -24 43 75 -44 145 82 -42 -57 47 -57 -9 64 38 117 121 49 34 -210 91
5424 91 -88 114 70 -142 -106 47 59 -130 -79 160 -8 -19 -118 -82 41 -80 -15 16 38 -33 -32 -64 23 -40 -30 -153
5450 -153 13 -73 -61 38 79 -208 4 -40 2 -65 48 -84 -219 42 0 -74 102 59 -96 -60 91 -102 -27 -30 72
5475 72 129 141 27 -2 221 -38 -75 94 16 -59 64 -13 -22 -87 40 70 -65 144 -120 -237 -80 -47 31 -36 95
5500 95 60 130 0 -13 117 16 -87 -46 -86 -36 166 -126 14 -120 -91 141 -199 -12 -7 -29 109 -85 -122 61
$$ packed form
5324g1J07l6om7j6l3J23J34k45n9J63j4J20k12J36P2j24Q4m7k3j88J86k6o8J5
5349g5K7P0J4N3q9j00J79j23N8J13j63q0J66j31J13J19j56n8o2K20M1j89O7k80
5373b66J84J30j96J74j16J42q2m6j1j3%Q6r0K06j26L00l18R8q0jj62J71O9pj03
5398e7k3R3L2j78P7J39O7j74O7L2j19J89o3j24j5J04j04M8P3k6P9Mp2j5k44L01
5424I1j79K02m4k12L6J53J2j89N1K39j68j1r9L6J23j21O5L1K2p1Jl2Q7o3J0j23
5450a53J66q6J2R9M1k87K12m4M2o7J13j32j35K61m2p4J76m3j55L6J51j93P5lJ02
5475G2N7J2j14k9K23k59l7J69p8p5J23p7ro5J27L0j35K09k64j17J57L3P8o7J31
5500I5l5P0j30j3J30j01j03M1m0N0K02k92J40j34K9K32l40J87Nk2J38j94l7J83
$$ plain form
5524 61 58 -40 -53 8 -146 36 2 103 -9 -96 26 16 41 22 -186 77 36 -106 -85 -211 -84 -47 227 42 13
5549 13 5 2 -67 23 173 166 -122 213 -140 60 27 78 103 -38 60 -99 20 -9 -55 -24 -20 47 46 36 -95 -5 273 137
5577 137 81 18 -83 -80 -23 4 48 -197 -7 112 -54 -82 -122 96 -133 -148 -75 99 88 127 -50 -31 -9 -73 -49 121
5603 121 -163 90 26 117 104 26 -45 106 -13 -11 28 48 -38 42 -150 -291 -35 188 83 36 -111 -141 17 102 -27
5628 -27 44 -24 -91 85 40 47 -209 24 93 -142 44 217 86 239 -62 110 79 -151 16 -5 37 -157 -95 -5
5652 -5 133 119 -26 -34 -22 107 -76 2 142 -47 -170 -69 -56 -98 77 8 30 -1 224 81 62 -55 99 25 -57
5677 -57 -86 -26 -5 123 139 -73 171 4 10 195 178 -20 -15 27 2 -30 71 -144 29 -18 -7 -88 -251 50 -11 173
5703 173 -12 -194 1 44 -76 48 -17 -139 41 -34 98 7 22 20 -76 -145 -21 141 -56 75 -110 -141 6
$$ packed form
5524F1lr8j3O1j54J82l4J01j12q7J22j0K5j9k08K63m1j42K1j26J27L7K74j85k9
5549A3qlo9R0J50pk88L35l53K00l3N1K5j41R8j59J19k9m6L1MO7jj0j31R0K78j36
5577A37n6o3j01LN7K7M4k45J90J19j66k8m0K18k29j5P3J74j1L9j77J9K2o4K4J70
5603A21k84K53o4R1j3p8p1J51j19KL9K0q6Q0j92j41K56K23j05m7j47l0J58Q5j29
5628b7P1o8o7J76m5Pk56K33O9k35J86J73j31J53l01J72l1k30J67k1M2j94O2R0
5652eJ38j4j45qJ2J29j83P8J40j89j23J01J3m2J75o9K2l1K25j43j9j17J54p4q2
5677e7k9O0K1J28J6k12K44j67OJ85j7j98NM2k5l2J01k15J73m7J1q1j63L01o1J84
5703A73j85j82J95M3j20J24o5j22J80p5J32r1J5kr6o9J24J62j97J31j85l1J47
$$ plain form
5726 6 -49 -29 34 -34 25 -7 62 10 -43 53 -54 -101 -109 27 -55 -10 84 -20 20 -5 -42 183 122 -26 56 142 22 -276
5754 -276 -102 -46 31 -45 22 -68 8 112 119 -4 15 125 85 12 63 -96 -124 -49 133 -83 -142 71 -49 -108 -50 -71
5780 -71 -60 105 -19 14 -8 -43 111 120 -26 -5 203 -36 -45 43 -1 -77 86 0 54 66 -26 44 -7 -100 61 60 -79
5807 -79 20 28 -70 -152 -2 -79 106 105 168 -91 -161 80 -82 -87 90 1 -28 53 -127 131 -13 57 -8 17 -62 139 89
5834 89 47 58 34 25 -11 -126 -60 -100 69 -25 -55 99 102 71 -28 -101 -131 159 -35 1 46 82 -18 155 22 -54 45
5861 45 38 62 -25 -120 17 -12 59 -109 -45 92 -98 110 -53 -40 -110 25 -72 -66 4 -64 -135 -84 183 -124 6 21
5887 21 -2 -81 60 -36 -63 38 -37 28 176 -109 -93 134 -31 -104 -4 193 148 123 35 -75 -25 -106 -103 -146 -69 -22
5913 -22 -56 -212 29 1 -102 61 -39 -105 78 -111 14 -30 22 11 10 109 136 53 98 4 16 -10 102 -107 232
$$ packed form
5726Fn5K0O3o8N9l2O9n2n3R6j07m7qJ36q2M5R4j04M0k5l7K25o1j48Q2Q6j20k98
5754b76J74N6P7p6O7r0P6J04Pj23J9J10m0p3N1j59k8P5J82k16n9K13j20n9N8k1
5780g1J1J65j24L3k2l5J54Rj46K1K08k39rQ8m4p6J63q6N4J2r2P0n1r3J61jj39
5807g9R9Qr8q2J50p7J85jO3k59p0K41j62nJ77q9k9Q1j80K58j44P0o5K5p9K01n0
5834H9m2J1k4rl6j15O6m0J69r4l0J54Ll1r9p3l0K90j94L6M5L6j00J73j33p6R9
5861D5pK4q7r5J37k9P1j68O4J37j90K08j63J3p0J35r7OP0o8p1N1K67l07J30J5
5887B1k3p9J41r6k7J01p5O5J48k85J6K27j65p3J00J97m5k5q8j10N0q1Lm3P7M7
5913b2l4j56K41k8j03J63j00o6J83j89J25m4N2j1jR9K7q3M5r4J2k6J12k09L39
$$ plain form
5938 232 27 159 68 42 -93 -21 38 -88 103 89 -14 -46 30 61 94 139 -138 -74 159 -155 143 52 92 40 76
5963 76 29 -37 29 100 -72 -61 32 -85 -44 -92 -131 -253 6 -46 -115 -171 141 -14 143 18 -101 -27 64 -65 -30
5988 -30 -17 5 228 77 -67 30 100 80 92 94 14 -135 -1 23 51 138 104 -102 -21 -286 -25 16 -44 118 -155 -54
6014 -54 -24 -20 -212 -26 347 -1 51 -59 -98 88 -65 -122 127 93 85 46 88 119 -15 -61 -58 147 62 -77 25 139
6040 139 15 -36 -101 133 78 78 -115 16 113 30 105 0 -76 -72 43 -34 151 -50 85 25 -14 -24 -13 19 -84 132
6066 132 -54 -78 103 -84 -120 -156 -103 -142 51 -218 -88 94 -43 -168 -176 -33 161 31 4 -18 -50 153 79 11
6090 11 96 -32 28 -27 -6 -75 33 47 -96 -69 133 -24 -16 -73 44 144 -8 18 199 30 -48 -218 -38 -10 58
6115 58 -70 45 -29 -21 42 -132 14 16 91 35 67 32 -202 -162 -104 -56 -21 -42 -106 -14 -161 -2 177 -58 -80 -90 5
$$ packed form
5938B32k05J32r1k6j35P2N9j26J91j4j03l2P6L1L3M5k77O4K33l14K98r1M0n2L6
5963G6m7o6O6P1j72J1R3j17M1m8l9j22K59n2o9n6L12j55J57j25j19P4R1j29L5
5988c0J3K2K23j51j44R7P0k0J2Kq0j49J34K4K8Q7l4k06Q1k65K61M1o0J62k73J01
6014e4L0Mj92J86L73l48N2j10l9J86j53n7K49l4ql9M2L1j34m6LK05q5j39J02J14
6040A39j24n1o5K34n5%j93J31R7q3P5j05p6MJ15p7J85k01J35o0l9j0J1L2j03K16
6066A32j86k4J81j87l6l6N3l9J93k69J30J82j37j25qJ43J94j30k7k2l2K03p4o8
6090A1Q5j28O0n5K1o9J08J4j43K7K02j57Qn7J17J00j52K6J81j69p8j70J80K8O8
6115E8j28J15p4QO3j74J46KP5n6L2l5k34M0N8M8L5k1o4R2j47J59J79k35k2j0R5
$$ plain form
6142 5 15 -165 -21 6 -81 -136 -94 53 -157 7 57 75 -50 230 50 122 -100 -205 61 41 -155 46 117 -50
6166 -50 -28 -26 189 -180 171 70 -139 144 -35 140 -146 -26 -60 -8 -98 -83 -81 33 28 142 -110 154 34 -143
6190 -143 173 -155 193 162 187 60 -169 21 -132 44 -118 -3 83 108 -2 100 18 -7 -27 -36 -112 -20 141 -65
6214 -65 28 28 -74 -73 177 121 83 -30 67 1 4 90 1 -94 -38 -87 -75 -31 -80 158 -104 -159 -130 -83 89 61 117 145 10
6243 10 234 -115 19 -37 30 22 -26 -93 -2 -129 41 91 152 132 15 43 9 51 65 -20 -128 21 51 -119 -117 -27 -123
6270 -123 237 -24 -59 111 -17 -8 -55 -172 164 -77 55 40 49 28 17 -32 -90 -47 -129 -21 164 -60 132 80 -180
6295 -180 68 -30 90 -43 -8 88 -87 40 -33 77 0 12 50 -77 -98 40 18 108 55 -81 77 54 140 -8
6319 -8 -74 10 86 83 -97 -212 16 65 -63 -2 146 15 -95 -89 98 -207 62 -114 -181 100 -23 -25 -103 -50 104
$$ packed form
6142EJ0j80J44K7q7n5M2J47k10J64N0J8j25K80j80P2k22j05K66k0j96K01P1j67
6166e0K2KK15l69L51j01k09K83j79J75k86J20l4N2r0J5KJ14nJ14k52K64j20j77
6190a43L16l28L48l1K5j27k29J90j53J76j62J15Q6K5j10J02q2k5k0rp6R2J61k06
6214f5R3%j02JK50n6l8j13R7o6LQ6q9r5N6m9J2M4m9K38k62n5K9M7J72k8N6K8j35
6243A0K24l49J34n6O7qm8o7R1j27J70N0O1k0j17K8l4M2J4q5j08J49L0j70KR0r6
6270a23L60k61l5J70j28Rm7j17L36k41J32j5Rk1j1m9n8M3q2J08J85k24J92n2k60
6295a80K48r8J20j33L5R6j75J27p3J10p7J2L8j27k1J38k2R0n3j36J58k3Q6j48
6319ho6Q4P6lj80j15K28M9j28O1J48j31j10OJ87l05K69j76o7K81j23kp8N3J54
$$ plain form
6344 104 61 38 161 200 202 -55 -152 65 50 -111 41 61 75 -82 -89 66 66 89 207 106 7 -30 36 25 75 112 137
6371 137 114 -47 117 136 15 9 1 163 53 158 133 -227 -8 56 106 56 -12 -130 114 -40 54 -130 52 25
6395 25 115 -68 -50 -167 124 97 44 -22 -30 127 -36 -138 -33 104 9 -14 66 -129 121 140 -36 -65 100 5 -13
6420 -13 -91 -72 -42 -57 13 47 -101 -13 2 11 95 -141 205 -164 25 241 29 42 -9 -176 44 145 -6 31 -26
6445 -26 -66 13 -111 25 21 49 -142 62 28 54 -22 65 -67 113 76 -63 -81 6 1 77 72 -50 17 -25 -6 1 -27 116
6473 116 -36 -104 126 -37 53 -54 -70 49 6 82 -107 57 33 90 16 156 -1 74 33 125 -274 41 -47 24
6497 24 -19 -13 -66 -35 188 52 56 -108 -67 -75 -65 -61 130 75 -48 4 77 31 -107 -39 150 -18 61 124 -89 -159 49
6524 49 -43 152 29 45 264 -15 24 20 -37 -12 105 -116 21 -106 -13 -142 23 54 22 88 4 -79 115 33 37 74
$$ packed form
6344A04m3k3J23L9Kk57r7K17j5j61J52K0J4j57pJ55%K3J18j01r9l7O6j1N0L7K5
6371A37k3j61J64J9j21oqJ62j10J05k5l60K19O4N0n0o8j18K44j54R4j84J82k7
6395B5R0j83J8j17K91k7n3o6qJ57j63j02J05J37r5k3Q0j95K50J9j76k9J65r5j8
6420a3p8J9L0j5P0L4j48Q8J5RQ4k36L46l69J89K16k12J3n1j67K20J01j51L7n7
6445b6m0P9j24J36mK8j91K04l4K6p6Q7j32J80l7j39j8Q7nP6nj22O7m2J9Pk8J43
6473A16j52o8K30j63R0j07j6J19m3P6j89J64k4N7p4J40j57P5m1R2l99L15q8P1
6497B4m3On3L1K23j36Mj64M1qJ0MJ91n5j23N2P3m6j38O8J89j68P9O3k13p0K08
6524D9r2J95j23J6K19k79L9mn7K5J17k21J37j27R3j29J65L1l2O6q4q3J94q2ML7
$$ plain form
6550 74 104 70 -118 53 34 38 82 21 -25 218 -41 87 -33 2 18 79 22 10 -50 68 -100 86 -43 -81 -35 -190
6576 -190 -167 -53 -223 104 19 55 -95 -51 170 77 5 25 -133 9 76 -24 -76 82 -2 5 -89 137 101 -38 150
6601 150 30 -36 -86 8 -2 26 111 -52 72 -50 -7 12 88 -9 1 -133 -81 84 195 124 -58 276 -13 -12 -93
6626 -93 -24 -35 71 -159 -70 133 -45 158 -62 60 17 206 -6 169 84 -11 -122 -37 146 -132 23 78 113
6649 113 -128 -132 91 85 -6 -189 53 1 68 11 126 -56 105 41 81 92 111 -46 91 114 -53 75 -26 -80 -256
6674 -256 49 -57 -8 118 -70 82 -18 -47 -20 -63 -138 -62 -149 -76 44 33 -15 -158 -20 -52 187 34 -56 36
6698 36 16 -144 -14 106 28 50 80 34 -54 33 27 76 -104 99 -186 -142 -38 -7 14 -47 -118 137 14 -104 -35 -28
6724 -28 -100 -218 -137 58 -112 62 49 31 122 -132 -138 -155 79 -11 -75 -79 -31 -113 9 99 -142 8 89 -207 26 -51
$$ packed form
6550G4L0l4j88J71j9MM4o1m6K43k59J28j20L5J6O1n7j2o0J18j68J86j29l8M6j55
6576a90K3J14j70L27q5L6j50M4K21r3p2K0j58J42O7j00n2J58q4Pr4K26l6j39J88
6601A50j20o6n0R4j0K8Q5j63J24j22M3J9P6r7J0j34N2J65J11p1j82L34k89Jq1
6626i3O9j1J06k30Q9K03j78K03k20J22m3J89k12J75q5r5j11Q5J83k78J55N5L5
6649A13k41mK23or1j83K42n2O7n7J15j82J61o4M0J1J9j57J37K3j67J28j01n4j76
6674b56L05j06M9J26j88J52j00k9K7m3p5P6q7P3J20j1m8j43J38l2K39j53r0R2
6698C6k0j60J30J20p8K2L0m6q8Q7oM9j80K03k85M4J04L1K1o1p1K55j23j18O9P
6724b8p2j18Q1J95j70J74j3j8R1k54oj7K34r0o4mM8q2J22R0k41J50Q1k96K33p7
$$ plain form
6750 -51 8 156 28 122 -139 -53 -33 173 196 35 38 -8 -96 -63 -137 -37 -18 -3 -52 297 99 -198 15 29 4 -4
6776 -4 1 -49 -125 -37 99 -127 60 66 -7 10 26 -100 116 -107 -39 31 139 -56 4 178 34 137 95 -1 -98 148
6802 148 160 -32 -117 3 198 14 -32 -229 -41 -23 119 -4 180 -38 -18 67 -73 -90 103 -10 -31 267 -2
6825 -2 4 -18 -5 153 -74 -120 -129 -224 65 -46 -11 -16 55 -119 -66 183 -83 -15 16 -23 104 4 218 10 87 -36
6851 -36 39 -152 -220 144 -13 77 100 147 -39 176 -48 -103 26 -111 -118 -93 -6 90 -113 -169 19 63 -89 -5 43
6876 43 144 -34 -174 -251 -41 -97 53 -79 -97 1 -257 -153 120 84 -94 138 221 -177 0 -49 -76 -37 51 171
6900 171 -112 -95 48 64 -6 119 9 19 -93 52 4 113 80 61 80 105 93 98 275 38 33 -51 -63 247 17
6925 17 73 -102 -156 -49 52 118 -69 63 84 -11 -38 2 -20 -77 -31 -59 41 187 122 -19 -26 -104 -42 -35 140 -12
$$ packed form
6750e1N9J48j28R4k61Q6K0K06K3j61Lm6q8L3p4J00J9J5m9L49j98k97K13J4k5q
6776dNn0p6Q8J36k26J87Op3J7J6j26K16k23O8P0J08j95O0J74j44J03m2r6r7K46
6802A48J2j92q5J20J95j84m6j97J88J8J42j23J84k18K0Q5j40j7J93j13k1K98k69
6825bOk2J3J58k27m6rr5K89j11L5nP1j74N3K49k66O8L1l9J27j00K14k08P7j23
6851c6P5j91o8L64j57R0K3M7j86K15k24n5J29j37pK5Q7R6k03n6J88M4j52Q4M8
6876D3J01j78j40p7K10n6J50j32j8R8k58J04K73l6j78K32Q3l98J77m9k7L9Q8J20
6900A71k83J7J43J6p0J25j10J0j12J45m8J09l3j9J9K5j2NJ77k37nq4j2L10k30
6925A7N6j75n4J07J01O6j87J32K1r5k7M0k2n7M6k8J00J46o5j41pp8O2PJ75j52
$$ plain form
6951 -12 -19 -161 -47 -135 -31 -122 -207 28 1 235 189 -16 -53 -41 -72 -46 121 -57 60 123 29 -97 -55 -46 88 105
6977 105 126 94 -47 -119 -31 -77 77 46 -55 172 -28 48 -40 -35 -26 15 -107 83 -121 39 30 80 116 91 110 -11
7003 -11 17 -30 -82 -37 152 -211 -66 19 -26 45 298 143 93 131 80 -15 -49 -25 42 23 -83 -131 97 -138 -25 133
7029 133 -62 -83 -63 86 -130 -10 33 60 -72 -60 -29 11 36 11 69 12 -115 94 187 15 -10 -92 -32 -92 -58 173
7055 173 99 -57 41 -24 -26 46 -38 -62 102 49 -57 -97 -71 20 199 -172 48 -52 -157 -25 123 -329 52 -64
7079 -64 46 -49 162 153 -46 19 162 38 27 -77 99 6 -159 -42 124 -65 35 51 106 63 -130 127 -254
7102 -254 -64 44 36 -44 -160 -127 -18 -101 93 -46 -27 -65 1 -99 -63 189 -64 50 146 138 -119 -89 100 -34
7126 -34 30 20 -171 -19 -28 -38 134 -117 27 88 -103 67 -164 101 -200 -177 66 -11 -110 75 55 -129 -112 -65
$$ packed form
6951a2pj42J14q8J04r1q5K35k7K34m6k05l7J2l1K6J67j78J17O3r4j26M2RJ34J7
6977A05K1l2j41p2Q8m6J54l1j01K27k00P6q8NRM1j22J90k04J60rN0L6k5J9j21
7003a1K8m7n2M5J89l63J45Q5m5P1K53j55n0L8n1r5l4K4O7j9j06m8K28k35J13J58
7029A33j95k1K0J49k16J20M3K7j32J2L1M0K5k5N8n7j27K09R3j72k5q2O0o0L4K31
7055A73p4j56R8o5kP2q4k4J64n3j06m0K6R1J79l71K20j00j05J32J48m52L81j16
7079f4J10r5K11rj99O5J43j24j1j04J76r3j65J17J66j89J00J6N5m3j93K57l81
7102b54J90J08qq0j16L3J09q3J94j39J9l8O6j00L6K52k53J14R6qk57L0J89j34
7126c4O4j0j91J52rj0J72k51J44O1j91J70k31K65l01K3K43p7r9J85k0j84J7M7
$$ plain form
7150 -65 116 -86 -47 -25 -31 -134 -70 42 33 98 23 -28 37 -133 -85 48 -101 1 45 -144 112 -10 -34 37 -51 -2
7176 -2 40 133 77 43 -16 -75 47 -152 45 57 -50 70 -19 8 84 -67 -86 20 -68 91 -186 -66 -118 -5 -78
7201 -78 -40 -40 27 121 52 115 5 -26 147 53 60 -34 70 -44 67 113 100 189 53 87 38 -87 15 -6 -10 -70 46
7228 46 46 -159 76 17 111 -12 -64 -51 75 197 15 57 93 76 -19 50 -91 193 -4 -54 -150 246 -92 -64 -228
7253 -228 44 26 118 38 -99 15 226 6 -47 211 -37 102 -30 -21 -93 -73 -135 27 -172 -99 50 86 -30 94
7277 94 -37 1 -17 44 -170 -39 -109 247 70 -85 47 -72 -192 -136 48 -142 120 -96 -46 -42 -28 -122 12 24
7301 24 116 168 66 54 175 -76 -57 186 183 -204 -44 -98 79 143 179 -79 69 -4 100 76 175 16 -75 39 40
7326 40 -60 -114 51 -251 120 45 22 -217 -21 26 -52 -60 -174 -60 11 1 -30 277 -83 -78 -36 9 -44 27 107 14
$$ packed form
7150f5J81k02L9K2oj03O4J12rO5p5n1O5j70M8J33j49J02M4j89K56j22k4P1q8M9
7176bM2R3n6l4n9n9J22j99J97J2j07J20q9K7P6j51j9J06q8J59k77J20n2J13p3
7201g8L8%O7R4o9O3j10l1J73r4Pr4J04j14J11M6j3Q9j36L4m9j25J02k1mo0J16
7228D6%k05K35n9R4j23n2J3J26J22j82M2L6j7r5O9j41K84j97n0r6L96l38K8j64
7253b28K72j8R2q0j37J14K11k20n3K58k48J39j32Rp2K0o2J62j99P3J49L6j16J24
7277I4j31L8j8O1k14J31p0L56j77j55J32j19j20N6J84j90K62k16N0MJ4r4J34J2
7301B4R2N2j02j2J21k51J9K43ll87J60n4J77O4L6k58J48p3J04k4R9j59r1J14J
7326D0j00n4J65l02L71p5k3k39J96M7p8qj14J14P1j0l1L07l60NM2M5n3P1Q0r3
$$ plain form
7352 14 45 195 -57 -85 -13 -1 -118 -138 -102 41 168 -30 40 -52 -31 56 84 -70 21 -66 -72 -53 6 -55 63 93 68
7379 68 4 -159 -125 37 -130 29 -210 193 -11 -53 -79 34 98 37 -88 97 18 -13 128 -179 47 -36 -93 -7
7403 -7 104 -27 16 -5 77 -172 21 -78 -222 70 49 53 84 48 36 54 11 104 -12 75 68 8 48 -42 -128 112 225
7430 225 18 -82 24 -48 189 -43 59 32 -31 41 -39 100 -99 19 72 132 -116 101 171 23 120 -19 -76
7453 -76 -73 -39 -43 -28 -171 -8 131 -21 -27 -66 -55 -118 127 -69 89 -155 -14 66 -59 81 64 99 82 76 -10 -58 69
7480 69 77 -102 70 -110 21 32 -111 -21 -129 7 147 187 -122 -64 15 178 64 53 -183 82 -33 84 -47
7503 -47 13 39 149 71 -12 -123 -41 19 -3 100 109 4 -30 79 49 43 74 -90 65 44 54 228 11 -231 46 153
7529 153 55 -4 -86 -41 38 72 126 -71 30 -122 -126 -76 12 -96 29 -155 -27 -65 -11 30 -193 53 -8 65 -284
$$ packed form
7352A4L1J50k52k8P2J2j17k0L6J43J27j98P0r2K1Q7K8j54R1q7oJ9N9o1J18L0k5
7379F8o4j63L4J62j67J59k39M03k04m2k6J13O4o1j25J85p9l1J41l07K26q3n7Q6
7403gJ11j31M3k1Q2k49J93r9j44K92k1ML1l6j2J8m3R3j16Q7po0M0r0q6K40J13
7430B25k07j00J06p2K37k32J02k7o3P2q0J39j99J18N3O0k48K17P0j48R7j39n7
7453g6LL4mJ5j43J63J39j52ol9J1o3K45j96J58k44J41Q0j25J40j7L5j7oq6m8J27
7480F9Qj79J72j80J31J1j43R0j08J36J40M0l09N8P9J63j14j1k36K65j15J17j31
7503d7O0K6J10p8q3j11Q2O0k2J03Rj05l4J09l0oL1j64J55k1J0J74k17k42K77J07
7529A53r8n9q2M5P9L4N4j97J01j52mN0Q8j08J25j84J28l8N4M1k23K46o1P3l49
$$ plain form
7554 -284 29 252 118 -65 -11 30 22 -74 -191 107 59 -127 -97 108 -66 73 -42 44 -145 82 78 7 -88 -31
7578 -31 0 108 98 172 32 -31 62 98 219 31 49 -34 137 -90 123 -5 103 17 -108 -98 -98 -26 5 130 160
7603 160 147 -129 47 -23 -104 -38 0 -188 30 25 -66 -185 35 2 -38 3 -107 54 -37 122 65 32 -45 -10 16 86
7629 86 -159 46 3 109 -3 -180 -78 41 -69 71 51 47 -87 -195 -77 17 -61 41 -98 -41 28 45 8 -80
7653 -80 29 -129 -113 -42 -124 86 164 7 17 -5 127 4 109 15 31 74 21 23 87 -37 5 23 -11 47 -53 -19
7679 -19 -103 -13 82 233 -58 154 -166 106 128 -16 128 -10 43 107 -3 -101 -28 -63 45 155 -67 -85 -16 160
7703 160 139 32 62 -119 -131 75 47 39 -94 9 -46 33 -92 60 139 75 132 -182 -131 -70 -229 39 34 -57 -84 128
7729 128 105 -110 -72 0 24 -42 159 67 -138 153 -73 67 -101 -37 31 65 55 -59 -9 -26 46 24 70 -93 -19
$$ packed form
7554b84L13K23j34j83N4M1qr6j17K98m8j86L0K05j74J39j15Q6j89K27mp1r5N7
7578c1L1J08j0P4j40o3R3L6J21j88J8q3J71k27K13j28J08q6j25J0%P2L1J25L0
7603A60j3k76J76p0q1O6L8j88K18nr1j19K20l3m0M1j10J61r1J59n7l3p7L5K6P0
7629H6k45K05m3J06j12j77J02J19j10J40k0mj34j08J18R4p8J02j39N7O9J7l7q8
7653h0J09j58J6P1q2K10P8j57J0k2J32j23J05r4J6M3n3KO4j24M2J8l4N8j00L4
7679a9q4R0R5J51k91K12l20K72K2j44J44j38N3O4j10r8P3l5J08J10k22j8O9J76
7703A60k1j07L0j81j2K06k8qj33J03n5P9j25J52P9o4N7l14N1O1j59K68nr1k7K12
7729A28k3k15L8P2K4o6K01r2k05K91k26J40j68O4O8L4j0j14N0j7P2k2M6j63P4
$$ plain form
7754 -19 141 41 -59 -56 -49 -10 -47 169 -20 -23 10 -92 -135 27 146 24 -26 -39 -60 30 154 66 98 -17 156 30
7780 30 188 127 12 141 -1 107 51 72 -93 19 69 10 23 137 81 113 -92 -23 26 75 -29 -95 69 -191
7804 -191 -30 31 -129 -5 -144 113 14 108 5 57 -39 62 158 -102 44 -57 -57 51 110 -131 47 -24 13 -86
7828 -86 22 -65 28 -55 -19 -115 -55 13 -169 118 183 -109 -29 8 60 113 -90 -54 -45 -109 8 -76 56 79 -66 87
7854 87 49 98 50 127 -148 -54 -7 9 -16 53 19 208 -51 -93 143 -184 -10 188 79 106 24 21 -122 45 -69
7879 -69 -29 126 -51 -61 -55 -5 80 111 15 -30 -63 38 -115 -112 -23 -215 71 72 51 174 23 97 89 -23 -79 94 -4
7906 -4 173 -3 -4 80 -170 -97 220 -93 19 107 116 16 -169 160 22 106 -35 106 -32 -14 32 -18 -50 67 -62
7931 -62 39 86 20 100 99 185 47 -3 79 -136 121 97 -139 -33 -102 -6 -26 -209 2 139 27 -20 -129 -30 124
$$ packed form
7754a9J60j00j00LPL9l7K16j89lL3j02m3J62J19j22n0j3k1R0J24q8L2j15J73j26
7780C0J58o1j15J29j42J08n6K1j65J12N0n9J3J14n6L2k05O9M9M9j04o6J64k60
7804a91J61O1j60J24j39K57r9R4j03N2r6J01R6k60J46j01%J08N9k41J78p1L7r9
7828h6J08q7R3q3L6r6O0O8j82K87O5k92Q0L7N2N3k03L6Ro4J17q4J32K3j45J53
7854H7l8M9m8P7k75R4M7J6k5O9l4J89k59m2K36l27J74J98j09K7q2lj43J67j14
7879f9M0J55j77j0ON0Q5L1r6m5l3J01j53LQ9j92K86Jk1J23j51P4qj12n6J73r8
7906dJ77j76jQ4k50P3L17l13J12Q8Rj00j85L29j38Q4j41J41j38J8M6n0l2J17j29
7931f2J01M7o6Q0jQ6j38n0Q2k15K57k4k36J06o9R6k0j83K11J37j12m7j09R9J54
$$ plain form
7956 124 86 42 61 -75 169 195 207 56 135 129 53 5 188 -49 88 -32 -59 25 -204 -79 -126 61 123 -25 78
7981 78 13 49 56 146 -53 94 -21 14 97 89 -62 -111 -168 89 -4 -19 -43 208 13 -80 42 103 72 41 -93 -6 5
8008 5 25 155 27 27 39 4 6 88 -34 92 129 34 15 74 -46 72 -83 -24 -106 86 6 29 -29 146 -21 28 72
8035 72 19 -74 -9 -142 27 35 -103 -25 -142 -34 -40 -55 96 115 -65 -109 76 84 60 -247 175 55 -201 -31 107
8060 107 210 134 143 22 167 -176 100 55 -67 -5 -15 71 -2 -101 63 -49 -100 188 -96 46 -151 175 178 -112
8084 -112 72 7 88 -41 -89 -23 -2 -101 72 -51 -28 -7 71 73 97 160 -119 -77 57 27 30 -79 -61 -22 -6 68 39
8111 39 -131 -75 -190 -4 21 -35 -55 47 -109 72 94 6 25 125 -69 23 -95 96 -13 -14 43 53 38 -90 54
8136 54 67 -109 137 -120 -55 6 30 -154 -19 -175 -121 80 -6 25 -21 2 -89 -58 -181 21 82 63 98 83 -85
$$ packed form
7956A24l8m4J9j36K44K6J2j51P9op6m8J83k37J37j20k7Q4k29J25m7J87O2j48J03
7981G8o5L6PR0j99J47j15L5Q3qj51m9n7K57r3j5k4K51j95r3J22O1l1l1j34Q7J1
8008EK0J30j28%J2l5KQ2j22J26L7r5j9N9j20J18j55N9q2J92q0K3n8J75j67M9M4
8035G2n3r3O5j33J69Qj38P8j17J08oj5J51J9j80m4J85Qk4l07M22j20k56J70J38
8060A07J03p6Rj21J45l43K76m5j22O2j0Q6p3r9J64j12n1K88k84J42j97L26Lk90
8084a12J84o5Q1j29m8O6K1r9J73j23K3K1P8KK4O3k79M2J34l0Lj09J8L9J6P4k9
8111C9j70N6j15J86K5n6k0J02j56J81K2q8J9J00j94R2j18J91j09jN7J0j5j28J44
8136E4J3j76K46k57O5O1K4j84J35j56N4K01q6L1m6K3r1L1j23K02O1j9L5j5j68
$$ plain form
8161 -85 52 32 -78 -55 -103 44 -122 227 34 52 -13 89 -13 -113 115 50 2 75 -65 -178 86 -4 101
8184 101 50 51 11 69 86 25 45
$$ packed form
8161h5J37k0j10K3m8J47j66L49j93J8o5J02j02j00K28o5m8P3j40j13K64r0J05
8184A01n1Jm0N8J7o1K0
8191D5
$$ Imaginary data points
##PAGE= N=2
##DATA TABLE= (X++(I..I)), XYDATA
$$ plain form
0 0 0 0 0 0 0 0 0 0 0 0 0 0 0 0 0 0 0 0 -1 64 -64 64 -64 64 -65 65 -128 129 -129 178 -193 193 -257 258 -321
35 -321 325 -386 450 -498 531 -590 662 -751 832 -904 1016 -1104 1224 -1350 1485 -1640 1804
52 1804 -1991 2194 -2430 2692 -2987 3326 -3722 4194 -4758 5447 -6328 7478 -9057 11378
66 11378 -15104 22202 -40456 201250 333978 8593 -67414 12223 149886 73299 -97768
77 -97768 -231298 -192012 -105230 -66351 -133082 -179297 -133966 -9448 53823 34292 4298 56461
89 56461 127894 134300 67103 30132 56866 94854 66939 -1643 -45304 -32524 -12050 -21636 -45073
102 -45073 -35345 -5116 -8679 -62946 -97307 -53433 27189 39584 -40220 -116080 -82640 37629
114 37629 112587 55882 -54981 -63004 70938 200480 170950 21852 -57943 16621 122792
$$ packed form
0@%%%%%%%%%%%%%%%%%%jO5j28J28j28J28j29J30j93K57k58L07l71L86m50N15n79
35c21O46p11Q36r48J029j121J252j413J583j736J920k120K328k574K835l125L444
52A804l795M185m624N122n679O313p048P916q952J0205j1775J3806j6535K0435
66A1378k6482L7306o2658K41706J32728l25385p6007P9637J37663p6587j71067
77i7768j33530L9286Q6782L8879o6731m6215M5331J24518O3271j9531k9994N2163
89E6461P1433O406o7197l6971K6734L7988k7915o8582m3661J2780K0474r586k3437
102d5073R728L0229l563n4267l4361M3874Q0622J2395p9804p5860L3440J20269
114C7629P4958n6705j10863q023J33942J29542k9530j49098p9795P4564J06171
$$ plain form
125 122792 101166 -32898 -125599 -93721 -19878 -26835 -116658 -173874 -113727 6343 55823 -3471
137 -3471 -66270 -20721 100903 163264 106407 18967 8508 64558 91560 41895 -34324 -70665
149 -70665 -61426 -46085 -45593 -44782 -34682 -32241 -49228 -55279 -10849 64218 95131 43322 -30039
162 -30039 -32379 41294 95906 53874 -43188 -83460 -22308 58718 52446 -35343 -90414 -35553
174 -35553 62902 82423 6259 -56010 -20126 59875 68561 -13689 -86158 -60530 26338 60140
186 60140 -7500 -96947 -96861 -2030 77753 56458 -22294 -47949 11317 75337 65573 5902 -25899
199 -25899 -3695 22648 9851 -22443 -33029 -20133 -16453 -32853 -38247 -7522 33182 36675 93
212 93 -24044 4066 51641 56637 9671 -30026 -14964 24375 19514 -36134 -71939 -34103 34212
$$ packed form
125A22792k1626j34064r2701L1878P3843o957q9823n7216O0147J20070M9480n9294
137c471o2799M5549J21624O2361n6857q7440j0459N6050K7002m9665p6219l6341
149g0665R239J5341M92Q11J0100K441j6987o051M4430P5067L0913n1809p3361
162c0039k340P3673N4612m2032r7062m0272O1152Q1026o272q7789n5071N4861
174c5553R8455J9521p6164o2269L5884Q0001Q686q2250p2469K5628Q6868L3802
186F0140o7640q9447Q6R4831P9783k1295p8752k5655N9266O4020r764n9671l1801
199b5899K2204K6343j2797l2294j0586J2896L680j6400n394L0725M0704L493l6582
212I3k4137K8110M7575M996m6966l9697J5062L9339m861n5648l5805L7836O8315
$$ plain form
225 34212 44432 -17199 -63995 -22215 66072 92192 23220 -51924 -37502 45897 87721 25366
237 25366 -76354 -105181 -35970 40985 33880 -41179 -84864 -41651 33817 55715 16733 -14002
249 -14002 9831 52120 54639 17169 -10770 -1797 15210 3801 -26531 -36634 -17636 -393
261 -393 -13038 -36669 -32888 3080 31814 22580 -2663 -1419 27540 39321 9727 -25849 -16008
274 -16008 28320 41819 -6281 -61828 -52255 14544 55182 18459 -44684 -48854 15179 67193
286 67193 40775 -30815 -58832 -11622 46493 39285 -25407 -67210 -37956 19495 31320 -10219
298 -10219 -39421 -9733 43343 52369 10219 -24532 -5611 38070 46980 8578 -31501 -31216 -4213
311 -4213 7494 -12438 -33711 -28261 -4195 8218 471 -5361 7236 21910 16271 -832 2168
$$ packed form
225C4212J0220o1631m6796M1780Q8287K6120o8972p5144J4422Q3399M1824o2355
237B5366j01720k8827O9211P6955p105p5059m3685M3213P5468K1898l8982l0735
249a4002K3833M2289K519l7470k7939Q973J7007j1409l0332j0103J8998J7243
261c93j2645k3631L781L5968K8734r234k5243J244K8959J1781k9594l5576R841
274a6008M4328J3499m8100n5547R573O6799M0638l6723o3143m170O4033N2014
286F7193k6418p1590k8017M7210N8115p208o4692m1803K9254N7451J1825m1539
298a0219k9202K9688N3076R026m2150l4751J8921M3681Q910l8402m0079K85K7003
311d213J1707j9932k1273N450K4066J2413p747n832J2597J4674n639j7103L000
$$ plain form
324 2168 29072 41130 9988 -37024 -42677 1204 38579 17603 -37601 -57064 -14933 36589
336 36589 33193 -17065 -45396 -12242 42334 48824 -554 -42912 -26213 23621 39015 -12
348 -12 -40206 -28287 17699 34815 87 -36808 -24747 23214 46450 19035 -20962 -23984 7879
361 7879 28386 11571 -17754 -22006 -1529 11595 -2133 -21810 -18578 3501 14648 1921 -10437
374 -10437 865 22890 22595 -3173 -20125 -2884 26406 25410 -9479 -35143 -20677 11896 17491
387 17491 -11579 -33464 -15719 21972 29779 -2698 -32230 -16805 26980 43391 10327 -30706
399 -30706 -26613 15267 37323 7475 -36697 -38289 4457 36956 19057 -24052 -36103 -4422
411 -4422 30277 27850 -1624 -16514 -755 18989 13999 -8346 -16921 -2231 12117 3551 -15797
$$ packed form
324B168K6904J2058l1142m7012n653M3881L7375k0976n5204j9463M2131N1522
336C6589l396n0258k8331L3154N4576O490m9378m2358J6699M9834J5394l9027
348a2m0194J1919M5986J7116l4728l6895J2061M7961K3236k7415l9997l022L1863
361G879K0507j6815k9325m252K0477J3124j3728j9677L232K2079J1147j2727j2358
374a0437J1302K2025k95k5768j6952J7241K9290r96l4889k5664J4466L2573N595
387A7491k9070k1885J7745L7691P807l2477k9532J5425M3785J6411l3064m1033
399c0706M093M1880K2056k9848m4172j592M2746L2499j7899m3109j2051L1681
411d422L4699k427k9474j4890J5759J9744m990k2345q575J4690J4348q566j9348
$$ plain form
424 -15797 -18110 104 12279 71 -17794 -11533 15165 27732 7845 -18876 -17500 9586 24776
437 24776 7204 -19646 -20135 5016 19539 1838 -24991 -22440 9720 31819 15226 -18494 -24241
450 -24241 5722 30842 16735 -19106 -29335 -1715 25802 14458 -21250 -34883 -9016 23846
462 23846 23925 -3318 -18687 -1532 23889 23434 -673 -15379 -2112 18819 15964 -10116 -27421
475 -27421 -16377 4985 7044 -10948 -21221 -7440 12032 11860 -5416 -11821 4363 21981 17980
488 17980 -1534 -8889 4744 17266 6616 -16396 -20649 1179 20672 9572 -20540 -31304
500 -31304 -7367 22291 20491 -9782 -27108 -8102 22420 23612 -5316 -25724 -10630 19918
512 19918 26137 2360 -19065 -10998 13087 19950 2068 -14150 -6168 13679 15790 -5334 -23306
$$ packed form
424a5797k313J8214J2175j2208j7865O261K6698J2567j9887k6721J376K7086J5190
437B4776j7572k6850m89K5151J4523j7701k6829K551L2160K2099j6593l3720n747
450b4241K9963K5120j4107l5841j0229K7620K7517j1344l5708j3633K5867L2862
462B3846P9k7243j5369J7155K5421m55k4107j4706J3267K0931k855k6080j7305
475b7421J1044K1362K059j7992j0273J3781J9472j72j7276o405J6184J7618m001
488A7980j9514p355J3633J2522j0650k3012m253K1828J9493j1100l0112j0764
500c1304K3937K9658j800l0273j7326J9006L0522J192k8928k0408J5094L0548
512A9918O219k3777k1425Q067K4085O863j7882j6218P982J9847K111k1124j7972
$$ plain form
525 -23306 -15572 6456 12769 -5011 -21954 -14649 6836 13397 -1241 -13715 -3658 17598 22812
538 22812 6301 -8749 -2488 13690 15740 -1281 -14392 -7121 8431 8028 -12113 -26625 -15778
551 -15778 7945 15008 -3105 -20271 -11527 12915 21263 3309 -14228 -5519 19352 26363 5910
564 5910 -16616 -12630 10401 20402 3251 -18975 -17628 3992 15538 192 -22196 -21434 2331
577 2331 19103 8267 -13306 -16499 1820 15885 9022 -6382 -6718 8080 15874 5070 -9724
590 -9724 -8007 7192 14080 2216 -12425 -9664 6539 11922 -2956 -20276 -16583 4562 16032
603 16032 2967 -17068 -17845 2307 17094 9161 -7924 -8314 9251 20482 9850 -8568 -10564
616 -10564 5930 17595 7554 -12064 -16410 -1814 10379 1850 -16727 -19351 -961 15983 9077
$$ packed form
525b3306P734K2028O313j7780j6943P305K1485O561j4638j2474J0057K1256N214
538B2812j6511j5050O261J6178K050j7021j3111P271J5552m03k0141j4512J0847
551a5778K3723P063j8113j7166Q744K4442Q348j7954j7537Q709K4871P011k0453
564E910k2526L986K3031J0001j7151k2226J347K1620J1546j5346k2388P62K3765
577B331J6772j0836k1573l193J8319J4065o863j5404l36J4798P794j0804j4794
590i724J717J5199O888j1864j4641K761J6203N383j4878j7320L693K1145J1470
603A6032j3065k0035p77K0152J4787p933j7085l90J7565J1231j0632j8418j996
616a0564J6494J1665j0041j9618m346J4596J2193q529j8577k624J8390J6944o906
$$ plain form
629 9077 -11039 -16790 -219 17616 14364 -3417 -10252 2500 15408 9654 -8078 -14104 -779
642 -779 13598 8916 -8504 -15407 -3351 10552 6754 -8513 -13146 353 13181 7249 -9464
655 -9464 -14887 -1700 11714 7637 -7330 -11230 2290 14575 8318 -8434 -11755 4325 19411
668 19411 13219 -6678 -15538 -3226 12253 9653 -7955 -17484 -6951 8721 8466 -7118 -16808
681 -16808 -7209 9427 12257 -221 -8810 -1370 10929 10105 -2945 -9948 20 13195 10718 -5495
695 -5495 -15555 -6409 9537 10665 -4031 -14276 -5987 9208 10355 -4221 -14900 -6824 9135
708 9135 12256 -960 -12020 -6086 7898 10172 -1696 -10396 -1743 12811 13728 -1454 -12101 -4540
722 -4540 10265 12279 -1868 -12247 -6772 6537 7660 -5486 -16174 -9235 6548 10676 -1769
$$ packed form
629I077k0116n751J6571J7835l252j7781o835J2752J2908n754j7732o026J3325
642g79J4377m682j7420o903J2056J3903l798j5267m633J3499J2828n932j6713
655i464n423J3187J3414m077j4967l900J3520J2285o257j6752l321J6080J5086
668A9411o192j9897q860J2312J5479k600j7608r529J0533J5672k55j5584r690
681a6808R599J6636K830j2478q589P440J2299q24j3050p003R968J3175k477j6213
695e495j0060R146J5946J128j4696j0245Q289J5195J147j4576j0679Q076J5959
708I135L121j3216j1060N934J3984K274j1868q700Q653J4554R17j5182j0647P561
722d540J4805K014j4147j0379N475J3309J123j3146j0688O939J5783M128j2445
$$ plain form
735 -1769 -13292 -7684 7801 12748 2286 -7878 -2775 11398 14878 2418 -10191 -7720 5287
748 5287 10902 1412 -10712 -9995 781 5664 -2497 -11729 -7626 5702 10777 1299 -9259 -5916
762 -5916 7581 12832 3125 -8582 -5613 7946 13236 1384 -12373 -10538 4727 13046 4236 -9620
776 -9620 -10362 1665 9163 2012 -9279 -8890 3119 9342 1424 -10604 -10000 2546 10179 3077 -7628
791 -7628 -5553 6843 13305 4197 -7960 -6516 6542 13875 5164 -9105 -11307 -1051 6891 1082
805 1082 -10269 -11369 49 8524 3128 -8024 -8471 3227 12336 8519 -2462 -5140 3852 10362
819 10362 4443 -7248 -9513 457 8518 2903 -8994 -11255 -971 8130 4718 -5744 -7430 2891
833 2891 11298 5911 -7016 -10771 -217 10468 6733 -6369 -11290 -1893 8515 6203 -4764 -8100
$$ packed form
735a769j1523N608J5485M947j0462j0164N103J4173L480j2460j2609K471J3007
748E287N615r490j2124P17J0776M883q161r232M103J3328N075r478j0558L343
762e916J3497N251r707j1707K969J3559N290j1852j3757J835J5265Q319q810j3856
776i620p42J2027P498p151j1291L89J2009O223p918j2028O04J2546P633p102j0705
791g628K075J2396O462r108j2157J444J3058P333q711j4269k202J0256P942n809
805A082j1351j100J1418Q475n396j1152m47J1698R109l817j0981k678Q992O510
819A0362n919j1691k265R970Q061n615j1897k261J0284R101l412j0462j686J0321
833B891Q407n387j2927l755J0554J0685l735j3102m921R397J0408k312j0967l336
$$ plain form
847 -8100 1285 11135 8297 -3073 -8114 -940 7313 4851 -5760 -9522 -1927 5938 2280 -8447
861 -8447 -10798 -345 10799 8480 -3180 -7547 1162 10907 8962 -2642 -8280 -1424 7912 5885
875 5885 -5856 -12124 -5914 4583 5381 -3041 -7656 -1604 7422 6578 -1850 -6109 522 9529 8095
890 8095 -2728 -9413 -4074 5365 5053 -4231 -9806 -3063 7110 6972 -2802 -8902 -2658 8554 9839
905 9839 162 -7421 -3649 5366 6358 -3033 -10090 -5016 5335 7136 -1821 -8785 -4146 6251 8590
920 8590 1035 -5271 -1355 6687 7063 -2290 -9110 -4618 4847 6074 -2825 -10047 -5847 4317 6871
935 6871 -880 -7427 -2511 8046 10723 1884 -6936 -4997 4299 7606 589 -7566 -6540 1428 4206
950 4206 -1891 -8237 -4827 4576 7814 1413 -5324 -2840 5673 8285 1516 -6068 -3754 4924 7054
$$ packed form
847h100R385R850k838j1370n041P174Q253k462j0611l762P595P865l658j0727
861h447k351J0453J1144k319j1660m367Q709R745j945j1604n638O856R336k027
875E885j1741o268O210J0497P98q422m615O052R026q44q428m259O631R007j434
890H095j0823o685N339R439l12r284n575O743J0173j38r774o100O244J1212J285
905I839r677p583L772R015R92r391p057N074J0351J801q957o964M639J0397K339
920H590p555o306L916Q042L76r353o820M492R465J227q899p222M200J0164K554
935F871p751o547M916J0557K677q839q820J939R296L307p017q155J026P968K778
950D206o097o346L410R403L238o401o737K484Q513K612o769p584K314Q678K130
$$ plain form
965 7054 -1096 -10178 -8020 2235 7381 1433 -6663 -5662 3236 8122 2700 -4942 -3854 4464 8495
980 8495 2038 -6589 -6833 803 5124 205 -6567 -5633 2611 6927 1406 -5927 -4508 4674 9551 3763
996 3763 -4989 -5352 1867 5957 454 -7739 -7538 1021 6462 1612 -6739 -6893 1720 8537 5439 -2243
1012 -2243 -3602 2751 7602 3213 -4888 -6620 -95 5050 1329 -6515 -7639 -681 4936 2204 -4023
1027 -4023 -3696 3629 8829 4372 -3962 -5708 1220 7409 3591 -5350 -8149 -1577 4700 1947 -5469
1042 -5469 -7234 249 7419 5602 -1963 -4708 709 6761 4883 -2420 -4908 -296 4564 1332 -6186
1057 -6186 -8195 -1331 5804 4249 -3063 -5491 489 7365 5758 -1413 -4828 738 7088 4761 -3687
1072 -3687 -8337 -3891 3164 3295 -3364 -6616 -1943 4700 4708 -1427 -4481 374 7025 6323 -768 -5070
$$ packed form
965G054q150r082K158J0255N146n948q096J001Q898M886n422p642J088Q318M031
980H495o457q627k44P636M321m919o772R34Q244M316n521p333J419R182M877n788
996C763q752l63P219M090n503q193K01Q559N441m850q351j54Q613O817l098p682
1012b243j359O353M851m389q101j732O525N145l721p844j124O958N617k732o227
1027d023L27P325N200m457q334j746O928O189l818q941k799O572O277k753p416
1042e469j765P483P170j817p565k745N417O052j878p303k488M612M860l232p518
1057f186k009O864P135j555p312k428N980O876j607p171l415N566O350k327q448
1072c687m650M446P055J31o659l252M673O643Qo135l054M855O651p02p091m302
$$ plain form
1088 -5070 -1855 3605 2949 -3773 -6987 -1903 4376 3588 -3391 -6888 -1256 6475 6597 -248 -4812 -775
1104 -775 5500 4887 -2352 -7083 -3388 3720 4477 -1941 -7041 -3919 3289 5181 274 -3644 -521 5478
1120 5478 5746 -593 -5151 -2389 3647 4374 -1854 -6910 -3931 2149 3441 -1934 -6069 -2447 5387
1135 5387 7139 1226 -4552 -2481 4266 6515 1173 -4513 -3875 1920 3711 -1757 -6655 -4679 2161
1150 2161 4642 191 -4592 -2644 3699 5853 994 -3728 -1460 4553 5782 -428 -6615 -4947 1985
1165 1985 4786 -7 -5785 -4319 2426 5629 1016 -4398 -3068 3670 6891 2233 -4249 -4531 739
1180 739 4126 396 -4780 -4314 1042 3994 653 -4372 -3472 2661 6046 2694 -2428 -2306 2399 4767
1196 4767 800 -4746 -4594 887 4250 406 -5713 -5972 277 4892 2490 -2580 -3055 2168 6229 3352
$$ packed form
1088e070L215N460o56o722l214N084O279p88o979l497N632P731J22o845m564M037
1104g75O275o13p239m731L695P108P57o418n100L122P208J892m907l918L123N999
1120E478K68o339m558K762O036P27o228n056K979O080J292n375m135L622P834
1135E387J752n913n778K071O747K249n342n686O38N795J791n468m898J976O840
1150B161K481m451m783J948O343K154m859m722K268O013J229o210o187J668O932
1165A985K801m793n778J466O745L203m613n414J330O738L221m658o482k82N270
1180G39L387l730n176M66N356K952l341n025R00O133L385l352n122J22M705K368
1196D767l967n546J52N481L363l844o119k59O249M615k402n070m75N223M061k877
$$ plain form
1212 3352 -2554 -3819 1022 4881 2247 -3742 -5332 -847 2795 557 -4244 -4169 1361 5669 2916
1227 2916 -3187 -4057 1521 6007 3343 -2806 -4644 -38 3930 1521 -4450 -5766 -706 4515 3345
1242 3345 -1983 -3947 137 4564 3909 -982 -2927 715 3818 1835 -3548 -5409 -1349 2770 1575
1257 1575 -2828 -4275 -35 4271 3134 -1519 -2962 1477 6107 4440 -1426 -4833 -1635 3220 2513
1272 2513 -3037 -5776 -2393 2790 2473 -2345 -5034 -1146 4661 4909 165 -3177 -610 3774 3657 -1420
1288 -1420 -4394 -1110 3136 2866 -2266 -5172 -2072 3343 3803 -863 -3895 -449 4213 4044 -1352 -4734
1304 -4734 -1749 3272 3595 -1309 -5049 -2831 2026 3200 -530 -3315 -713 3781 4559 206 -3109
1319 -3109 -951 3212 3736 -798 -4308 -2683 1463 1657 -2539 -5393 -3014 2846 4142 66 -3630
$$ packed form
1212C352n906j265M841L859k634n989j590M485L642k238m801P5N530M308k753
1227B916o103q70N578M486k664o149j838M606L968k409n971j316N060N221j170
1242C345n328j964M084M427o55m891j945L642L103j983n383j861M060M119j195
1257A575m403j447M240M306j137m653j443M439M630j667n866l407L198M855p07
1272B513n550k739L383N183l17m818k689L888N807K48m744l342K567M384j17n077
1288a420k974L284M246k70n132k906L100N415M60m666l032L446M662j69n396l382
1304d734K985N021L23m904l740K218M857J174l730k785K602M494P78m353l315
1319c109K158M163N24m534l510J625M146J94m196k854K379N860J296m076l696
$$ plain form
1334 -3630 -1820 3513 5522 1812 -2535 -1625 2753 4132 123 -4642 -3825 692 3109 -54 -4020
1349 -4020 -3188 1009 3115 403 -2743 -1623 2998 4567 968 -3360 -2760 1951 3669 368 -3580
1364 -3580 -2753 1641 3679 214 -3851 -2726 2190 4817 1571 -2925 -3261 1136 3386 692 -3531
1379 -3531 -3541 839 2934 417 -3641 -3192 1169 4057 2022 -1656 -1644 2140 4154 1306 -2708 -2832
1395 -2832 1114 3457 709 -3862 -4561 -487 2685 1043 -2783 -3200 1092 4421 2657 -1576 -2663
1410 -2663 1014 4142 2828 -1654 -3338 -668 2026 675 -2830 -3634 -15 3177 1499 -2371 -3119
1425 -3119 749 3912 2222 -1686 -2582 758 3606 1572 -2921 -4250 -352 3164 2253 -2208 -3533
1440 -3533 -124 3362 2688 -1023 -2533 446 3369 2339 -1786 -3430 -965 2417 1561 -1928 -3364
$$ packed form
1334c630J810N333K009l710m347R10M378J379m009m765Q17M517K417l163l966
1349d020Q32M197K106k712l146J120M621J569l599m328O00M711J718l301l948
1364c580Q27M394K038l465m065J125M916K627l246m496l36M397K250k694m223
1379c531j0M380K095k517m058M49M361K888k035l678J2L784K014k848m014j24
1395b832L946K343k748m571o99M074L172j642l826m17M292L329j764m233j087
1410b663L677L128j314m482j684K670K694j351l505q04L619L192j678l870p48
1425c119L868L163j690l908q96L340K848k034m493j329L898L516r11m461j325
1440c533L409L486o74l711j510K979K923j030m125j644K465L382q56l489j436
$$ plain form
1455 -3364 -633 2453 1466 -1575 -2879 432 3725 3055 -811 -2874 -513 2709 2187 -1523 -3650 -1333
1471 -1333 2357 2019 -1587 -4023 -1163 2684 3376 -37 -2499 -511 2457 2793 -613 -2900 -942 2414
1487 2414 2109 -1617 -3848 -1478 1864 2317 -545 -2717 -424 3229 3040 -581 -3300 -985 2837 3194
1503 3194 -524 -3770 -2269 1353 2071 -732 -3303 -1566 1948 3085 103 -2377 -1076 2064 3069
1518 3069 387 -2206 -1231 1614 1999 -1077 -3438 -1870 1813 2580 -343 -2823 -1770 1776 2768 285
1534 285 -2342 -1223 2222 3027 87 -3016 -2414 1109 2554 454 -2472 -2234 952 2502 296 -2009
1550 -2009 -1416 1758 3197 916 -2222 -1967 1047 2520 268 -2344 -2071 1105 2528 5 -2841 -2141
1566 -2141 1357 3346 1272 -1929 -2227 963 2813 637 -2283 -2171 635 2607 832 -2456 -2455 258
$$ packed form
1455c364K731L086r87l041j304L311L293o70l866k063K361L222n22l710k127K317
1471a333L690l38l606k436K860L847O92l413k462J988K968L36l406k287J958L356
1487B414l05l726k231K370L342M53k862k172K293L653j89l621k719K315L822L57
1503C194l718l246J501L622P18k803k571J737L514J137k982k480J301L140J005
1518C069k682k593R75K845L85l076k361J568L683P67k923k480J053L546R92k483
1534B85k627J119L445Q05k940l103O02L523J445k100k926K38L186J550k206k305
1550b009N93L174J439k281l138K55L014J473k252k612K73L176J423k523k846P00
1566b141L498J989k074l201k98L190J850k176k920J12K806J972j775l288JK713
$$ plain form
1582 258 2382 1200 -1545 -1686 1059 2386 830 -1762 -2054 861 2672 817 -2176 -2591 96 2276
1598 2276 696 -2159 -2057 979 3047 1465 -1551 -2101 520 3000 1962 -1124 -2180 -58 2009
1613 2009 738 -1938 -2483 -47 2115 1262 -1661 -2269 33 2201 1331 -1151 -1904 488 2530 1331
1629 1331 -1503 -2535 60 2453 1638 -1433 -2525 -407 2050 1458 -1385 -2226 -119 2395 1921 -1139
1645 -1139 -2433 -847 1742 1691 -875 -2241 -375 2111 1544 -864 -2007 -6 2520 2220 -572 -2012
1661 -2012 -343 1979 1713 -1014 -2461 -821 1807 1431 -1389 -2925 -1191 1569 2002 -206 -2020 -520
1677 -520 1841 2055 -222 -1947 -681 1793 1867 -393 -2095 -1156 1235 1303 -700 -2304 -700 1768 1650
1694 1650 -610 -2333 -858 1844 2178 -64 -1954 -1122 1373 1934 -103 -2147 -1042 1658 2469 92
$$ packed form
1582B58K124j182k745j41K745J327j556k592k92K915J811j855k993m15K687K180
1598B276j580k855J02L036K068j582l016n50K621K480j038l086j056K122K067
1613B009j271k676n45K436K162q53k923o08K302K168q70k482p53K392K042j199
1629A331k834j032K595K393q15l071j092K118K457n92k843q41K107K514m74l060
1645a139j294J586K589n1k566j366J866K486n67k408j143K001K526l00k792j440
1661b012J669K322k66k727j447J640K628l76k820j536J734K760M33k208j814J500
1677e20K361K14k277j725J266K474P4k260j702R39K391O8k003j604J604K468j18
1694A650k260j723J475K702L34k242j890Q32K495N61k037k044J105K700Q11k377
$$ plain form
1710 92 -1954 -1315 1174 2048 228 -1710 -1132 972 1454 -473 -2456 -1496 686 1647 -152 -1990 -1243
1727 -1243 978 1918 52 -1549 -795 1749 2565 420 -1913 -1505 795 2086 257 -2034 -1668 379
1743 379 1548 51 -1822 -1592 939 1909 494 -1348 -1269 672 1841 562 -1281 -925 1202 1759 190
1760 190 -1867 -1506 1004 1958 656 -1410 -1678 361 1665 347 -1858 -2097 217 1764 515 -1546
1776 -1546 -2056 -12 1735 1154 -786 -1245 695 1951 1192 -1136 -1224 296 1777 671 -1293 -1873 -161
1793 -161 1288 327 -1748 -1814 133 1861 808 -1387 -1741 205 2153 1535 -585 -1347 413 1874 1279
1810 1279 -1113 -1523 27 1720 1044 -1125 -1666 -420 1092 679 -1133 -1628 106 1527 742 -1145
1826 -1145 -1843 -53 1639 1298 -659 -1500 151 1795 1326 -743 -1657 -239 1716 1366 -641 -1967
$$ packed form
1710I2k046O39K489Q74j820j938N78K104M82j927j983R60K182R61j799j838P47
1727a243K221R40j866j601P54K544Q16k145k333M08K300J291j829k291L66K047
1743C79J169j497j873K30K531R70j415j842P9J941J169j279j843L56K127N57j569
1760A90k057L61K510R54j302k066k68K039J304j318k205k39K314J547j249k061
1776a546n10K044J747n81j940m59J940J256p59k328q8J520J481j106j964n80J712
1793a61J449r61k075o6J947J728j053k195l54J946J948o18k120p62J760J461n95
1810A279k392m10J550J693o76k169n41J246J512m13j812m95J734J421p85j887
1826a145o98J790J692l41j957q41J651J644m69k069r14J418J955l50k007j326
$$ plain form
1842 -1967 -792 1008 956 -628 -1592 -668 1236 980 -786 -1469 -367 1552 1490 -147 -1090 -53 1422
1859 1422 1203 -336 -1724 -385 1449 1355 -721 -2142 -750 1116 1349 -528 -1697 -627 1262 1358
1875 1358 -374 -1777 -653 1253 1527 -181 -1652 -740 972 1479 -300 -1334 -505 1138 1279 -463
1891 -463 -1603 -855 851 1460 -143 -1347 -826 987 1244 -226 -1714 -1003 1129 1474 313 -1545 -1097
1908 -1097 746 1384 367 -856 -704 644 1266 -61 -1318 -891 572 1161 -37 -1204 -931 425
1924 425 1144 -78 -1303 -773 1152 1623 107 -1585 -1339 573 1528 460 -1172 -1047 487 1527 250
1941 250 -1476 -1390 447 1699 595 -1021 -1291 187 1050 466 -815 -1029 680 1289 292 -1156 -1154 366
1959 366 1322 648 -915 -871 378 1190 268 -1114 -920 395 1397 346 -1118 -1339 -189 1084 431
$$ packed form
1842a967J175J800n2j584r64R24J904k56j766o83J102J919o2j637r43J037J475
1859A422k19j539j388J339J834r4k076j421J392J866K33j877j169J070J889R6
1875A358j732j403J124J906K74j708j471R12J712N07j779j034Q29J643J41j742
1891d63j140P48J706O09j603j204N21J813K57j470j488P11K132L45j161j858M48
1908a097J843O38j017j223J52J348O22j327j257M27J463N89j198j167K73J356
1924D25P19j222j225N30J925M71j516j692K46J912R55j068j632J25J534J040j277
1941B50j726Q6J837J252j104j616k70J478Q63n84j281k14J709O09r97j448KJ520
1959C66R56o74j563M4J249Q12r22j382J94J315J002j051j464k21J150J273o53
$$ plain form
1976 431 -1042 -1039 267 1151 462 -995 -1209 237 1293 931 -666 -1186 15 1290 577 -781 -1183 262
1994 262 1470 831 -885 -1460 96 1227 898 -686 -1299 -182 1186 1052 -889 -1390 -214 1177 1146
2011 1146 -424 -1205 -234 906 679 -364 -909 19 812 612 -663 -1132 -260 1032 557 -656 -1195 -19
2029 -19 1061 532 -810 -1243 -4 1171 833 -565 -1367 -349 1129 858 -265 -1016 -340 1121 1115 -356
2047 -356 -1202 -508 1172 1169 -1 -952 -424 776 868 -320 -1089 -330 920 1048 -85 -1236 -749 859
2065 859 1115 139 -962 -428 798 1048 -295 -1052 -524 867 1069 22 -980 -720 443 783 -333
2082 -333 -869 -375 822 815 -379 -1130 -384 717 772 -169 -1129 -393 974 944 -302 -1409 -569 1068 1435
2101 1435 158 -1124 -933 623 1263 177 -886 -760 418 1156 346 -1142 -965 350 1002 472 -655
$$ packed form
1976D31j473LJ306Q84o89j457k14J446J056l62j597n20J201J275p13j358m02J445
1994B62J208o39j716n75J556J131l29j584o13J117J368j34j941n01J176J391l1
2011A146j570p81R71J140k27j043n45R28P93k00j275m69Q72J292m75j213n39J176
2029a9J080n29j342m33J239J175l38j398q02J018J478k71j123p51O76J461oj471
2047c56q46O94J680lj170r51N28J200R2j188p69P59J250J28j133j151M87J608
2065H59K56r76j101N34J226K50j343p57N28J391K02j047j002K60J163L40j116
2082c33n36M94J197pj194p51P46J101N5r41r60P36J367l0j246j107Q40J637L67
2101A435j277j282J91J556O40j086j063J26J178P38q10j488J77J315O52n30j127
$$ plain form
2118 -655 -513 173 885 327 -594 -588 605 769 255 -751 -924 23 611 199 -818 -760 368 850 3 -947
2138 -947 -756 470 1080 460 -902 -771 350 1055 205 -882 -696 418 1179 137 -816 -971 346 1307
2156 1307 417 -784 -767 309 989 391 -783 -1001 198 1301 647 -728 -904 -40 1057 757 -322
2173 -322 -736 172 839 594 -437 -964 -228 622 462 -174 -703 -121 362 120 -549 -580 280 764 335 -776
2193 -776 -777 167 742 434 -490 -789 95 957 404 -749 -1133 68 1163 872 -289 -1007 49 798 613
2212 613 -512 -953 -68 939 748 -423 -995 -476 792 937 -180 -897 -128 579 741 -291 -729 -332
2230 -332 636 789 -109 -953 -289 310 583 -306 -845 -358 447 600 -454 -685 -252 532 866 -226 -690
2249 -690 88 627 536 -419 -515 -263 802 647 -275 -661 -97 780 785 -312 -1038 -155 943 917 -365 -1056
$$ packed form
2118f55J42O86P12n58r21OJ193J64n14j006j73R47N88m12j017N8J128M82q47r50
2138i47J91J226O10o20j362J31J121P05q50j087J86J114P61j042r53j55J317R61
2156A307q90j201J7J076O80n98j174k18J199J103o54j375j76Q64J097l00j079
2173c22m14R08O67k45j031n27P36Q50j60o36n29N82M83k42o69l1Q60M84m29j111
2193g76jR44N75l08r24k99Q84Q62n53j153l84J201J095k91j161p18J056P49j85
2212F13j125m41Q85J007j91j171n72N19J268J45j117p17P69P07J62j032m38L97
2230c32R68J53q98q44O64N99K73q89n39M87Q05J53j054k31M33P84L34j092m64
2249f90P78N39r1r55r6K52J065j55r22l86N64Q77Nj097p26Q83J098k6j282o91
$$ plain form
2269 -1056 -505 770 1058 146 -852 -727 247 913 142 -668 -575 304 884 213 -718 -550 118 637 98 -416
2289 -416 -445 134 309 -68 -830 -440 442 735 31 -639 -323 418 788 69 -663 -277 625 750 92 -833
2309 -833 -498 288 697 -20 -635 -372 338 904 14 -805 -469 548 1057 328 -825 -715 219 634 250
2328 250 -547 -827 283 752 388 -689 -843 128 755 419 -481 -663 -246 425 255 -558 -534 32 759 185
2348 185 -161 -463 270 455 352 -231 -162 312 695 60 -619 -553 98 754 15 -683 -514 309 908 223 -656
2369 -656 -609 246 800 406 -581 -814 -32 761 608 -520 -798 -120 647 570 -535 -935 9 594 523 -196
2389 -196 -671 -199 499 378 -114 -515 -38 561 295 -219 -541 -170 627 560 -211 -385 253 442 311 -319
2409 -319 -614 -44 550 179 -224 -577 -132 321 96 -484 -459 1 354 455 -351 -584 80 972 680 -502
$$ packed form
2269a056N51J275K88r12r98J25R74O66p71q10R3Q79N80o71r31J68O68N19n39n14
2289d16k9N79J75l77p62L90Q82K93p04o70L16P41L70p19p32L86R02J25o58r25
2309h33L35P86M09p17o15K63P10N66q90q19L36J017N09p29j153J10R34M15l84
2328B50p97k80J110M69l64j077j54R71O27l36r00j82M17O71j70q13K4N66P27n74
2348A85l46l02P33J85j03n83O9M74L83o35o79O6O51O56p39o98J69Q23N99o85q79
2369f56M7Q55N54l94r87k33P82P93j53j128k78O78P67p7j105m00R44N85p1p19
2389a96m75M72O98j21m92m01M77N99k66n14l22L71P97o7p71j74O38J89j31o30
2409c19k95N70N94l71m03l53M45M53k25n80K5M60L53J01q06k33O64Q92k92j182
$$ plain form
2429 -502 -819 -220 340 397 -423 -900 -143 588 501 -276 -947 -447 373 595 28 -515 -337 130 631 39 -609
2450 -609 -139 359 403 175 -420 -242 287 367 95 -296 -115 321 211 -206 -531 -69 544 509 -94 -528 -60
2471 -60 530 328 -164 -587 -155 522 610 6 -656 -270 524 516 -417 -615 -339 480 472 119 -759 -511 249 558
2493 558 282 -435 -473 36 589 194 -552 -461 179 660 179 -370 -464 -153 407 138 -190 -315 290 482 294
2514 294 -186 -234 189 479 284 -182 -302 47 280 -67 -447 -228 384 502 -101 -566 -277 228 668 35
2534 35 -504 -545 5 465 177 -474 -628 -71 470 117 -466 -589 56 508 308 -387 -140 -36 365 277 -400
2555 -400 -358 -263 408 187 -158 -328 -25 388 260 -120 -288 139 595 252 -295 -414 53 445 412 -230 -304
2576 -304 196 375 177 -400 -325 122 466 259 -289 -481 16 361 202 -277 -443 -69 321 300 -588 -563 -7
$$ packed form
2429e02l17N99N60N7q20m77P57P31q7p77o71N00Q20K22n67n43J78M67N01n92o48
2450f09M70M98M4k28n95J78N29Q0k72l91J81M36j10m17l25M62O13l5o03m34M68
2471f0N90k02m92m23M32O77Q8o04o62L86P94qr33j98K76Q19ql53q78K48P60L09
2493E58k76p17l8N09N53l95p46R1O40M81m81n49r4L11N60k69l28j25O05J92j88
2514B94m80m8M23K90j95m66j20L49K33l47l80K19O12J18o03m65K89N05M40o33
2534C5n39m1N50M60k88o51j54N57N41l53n83j23O45M52k00o95K47J04M01q8o77
2555d00M2R5O71k21l45j70L03M13j28l80j68M27M56l43n47j19M67L92l3o42p4
2576c04N00J79j98n77P5M47L44k07n48j92M97L45j59m79j66L74L90k1q88K5N56
$$ plain form
2597 -7 362 241 -221 -487 -102 250 458 -113 -279 -14 519 517 22 -398 -26 366 313 80 -362 125 335 259
2619 259 -162 -417 2 332 313 -74 -289 66 279 228 -164 -447 27 420 265 -153 -344 -47 261 513 -102
2640 -102 -387 -127 351 189 -112 -491 -321 306 478 -119 -423 -224 324 353 -63 -348 -404 292 579 136 -537
2661 -537 -173 205 568 177 -294 -323 16 304 -35 -499 -153 154 659 97 -272 -253 50 200 -32 -116 -26
2682 -26 188 123 -51 -324 -294 276 88 80 -317 -61 386 249 -181 -381 7 327 455 28 -467 -411 -44 232
2704 232 24 -268 -202 263 507 41 -482 -326 271 565 271 -378 -144 -128 266 265 -262 -128 -12 371 211
2725 211 -278 -233 217 293 -1 -339 -404 27 350 -81 -409 -209 -45 467 258 -112 -423 88 172 68 -301
2746 -301 -229 177 461 182 -146 -291 122 596 234 -212 -492 194 278 119 -285 -334 134 611 377 -169 -255
$$ packed form
2597gL69j21m62k66L85L52K08n71j66K65N33km95m20L72L92n3k33m42M87K10p6
2619B59m21k55M19L30j9l87k15L55K13n1l92k83M74L93j55m18j91K97L08K52o15
2640a02k85K60M78j62l01l79J70O27J72n97l04J99N48K9m16k85n6O96K87m43o73
2661e37L64L78L63l91m71k9L39K88l39m64L46L07N05n62l69J9L03J50k32q4R0
2682b6K14o5j74k73L0N70j88ql97K56M47j37m30k00L88L20J28m27m95N6L67K76
2704B32k08k92O6M65K44m66n23J56N97K94k94o49K34J6L94jn27J34J16L83j60
2725B11m89M5M50P6k94l38o5M31L23m31l28K00J64N12k09l70l11N11Q4j04l69
2746c01P2M06K84k79l28j45M13M74l62m46k80O86Q4j59m04m9M68M77k34n46q6
$$ plain form
2767 -255 -35 514 250 -22 -242 16 384 356 -197 -229 -99 154 365 74 -73 -16 287 12 -210 -348 -93
2788 -93 344 13 -217 -176 -129 204 37 -215 -331 94 382 111 -114 -363 43 345 338 -42 -483 -167 361 334
$$ packed form
2767b55K20N49k64k72k20K58L68k8n53l2J30K53K11k91j47N7L03k75k22j38K55
2788i3M37l31k30M1M7L33j67k52j16M25K88k71k25k49M06L02pl80m41L16N28k7
$$ [...]
8191A0
##END NTUPLES=NMR FID
##END=
