##TITLE=1H ikalashn
EP-1
19.11.2024
##JCAMPDX= 6.0         $$ Bruker NMR JCAMP-DX V2.0
##DATA TYPE= NMR SPECTRUM
##DATA CLASS= NTUPLES
##ORIGIN= UXNMR, Bruker Analytische Messtechnik GmbH
##OWNER= root
$$ TOPSPIN		Version 1.3
$$ 2024-11-19 10:11:18.875 +0400  Irina@DPX200
$$ Compression mode = diff/dup
##.OBSERVE FREQUENCY= 200.13140091
##.OBSERVE NUCLEUS= ^1H
##.ACQUISITION MODE= SIMULTANEOUS
##.ACQUISITION SCHEME= undefined
##.AVERAGES= 512
##.DIGITISER RES= 18
##SPECTROMETER/DATA SYSTEM= spect
##.PULSE SEQUENCE= zg
##.SOLVENT NAME= DMSO
##.SHIFT REFERENCE= INTERNAL, DMSO, 1, 17.99637
##AUDIT TRAIL= $$ (NUMBER, WHEN, WHO, WHERE, WHAT)
$$ ##TITLE= Audit trail, TOPSPIN		Version 1.3
$$ ##JCAMPDX= 5.01
$$ ##ORIGIN= Bruker BioSpin GmbH
$$ ##OWNER= Irina
$$ $$ F:/spectra/data/iren/nmr/1H/4/pdata/1/auditp.txt
$$ ##AUDIT TRAIL=  $$ (NUMBER, WHEN, WHO, WHERE, VERSION, WHAT)
(   1,<2024-11-19 10:08:19.656 +0400>,<Irina>,<DPX200>,<TOPSPIN 1.3>,
      <created by zg
	started at 2024-11-19 09:35:01.484 +0400,
	POWCHK disabled, PULCHK disabled
       configuration hash MD5:
       BE 6D 3F 07 2A EA 11 49 91 17 2B D3 AF B3 58 0D
       data hash MD5: 16K
       E6 C6 A8 A6 8D CB 6A 28 C3 B6 B4 E7 73 B4 05 60>)
(   2,<2024-11-19 10:09:53.765 +0400>,<Irina>,<DPX200>,<TOPSPIN 1.3>,
      <Start of raw data processing
       efp BC_mod = 2 LB = 0.02 FT_mod = 6 PKNL = 1 PHC0 = 308.7526 PHC1 = 18.2476 SI = 32K 
       data hash MD5: 32K
       00 0D AF 28 1F 69 A9 83 CF 29 02 77 EC 63 9E 88>)
(   3,<2024-11-19 10:11:05.609 +0400>,<Irina>,<DPX200>,<TOPSPIN 1.3>,
      <pk fgphup PHC0 = 15.31958 PHC1 = -23.2 
       data hash MD5: 32K
       71 AE 26 17 F9 6D 30 AE 38 7E 89 04 21 21 9B EA>)
$$ ##END=
$$ 
$$ $$ hash MD5
$$ $$ 09 F7 8B C5 09 73 23 2B 5E 92 21 13 00 ED D0 BF
##$RELAX= 
##$RELAX= 
##$RELAX= 
##$RELAX= 
##$RELAX= 
##$RELAX= 
##$RELAX= 
##$RELAX= 
##$RELAX= 
$$ Bruker specific parameters
$$ --------------------------
##$DU= <F:/spectra>
##$EXPNO= 4
##$NAME= <1H>
##$PROCNO= 1
##$TYPE= <nmr>
##$USER= <iren>
##$AMP= (0..31)
100 100 100 100 100 100 100 100 100 100 100 100 100 100 100 100 100 100 
100 100 100 100 100 100 100 100 100 100 100 100 100 100 
##$ANAVPT= -1
##$AQSEQ= 0
##$AQ_mod= 1
##$AUNM= <au_zg>
##$AUTOPOS= <>
##$BF1= 200.13
##$BF2= 200.13
##$BF3= 200.13
##$BF4= 200.13
##$BF5= 200.13
##$BF6= 200.13
##$BF7= 200.13
##$BF8= 200.13
##$BYTORDA= 1
##$CFDGTYP= 0
##$CFRGTYP= 5
##$CHEMSTR= <none>
##$CNST= (0..63)
1 1 145 1 1 1 1 1 1 1 1 1 1 1 1 1 1 1 1 1 1 1 1 1 1 1 1 1 1 1 1 1 1 1 
1 1 1 1 1 1 1 1 1 1 1 1 1 1 1 1 1 1 1 1 1 1 1 1 1 1 1 1 1 1 
##$CPDPRG= <>
##$CPDPRG1= <>
##$CPDPRG2= <>
##$CPDPRG3= <>
##$CPDPRG4= <mlev>
##$CPDPRG5= <mlev>
##$CPDPRG6= <mlev>
##$CPDPRG7= <mlev>
##$CPDPRG8= <mlev>
##$CPDPRGB= <>
##$CPDPRGT= <>
##$D= (0..63)
0 2 0 0 0 0 0 0 0 0.06 0 0.03 0 0 0 0 0.0002 0 0 0 0 0 0 0 0 0 0 0 0 0 
0 0 0 0 0 0 0 0 0 0 0 0 0 0 0 0 0 0 0 0 0 0 0 0 0 0 0 0 0 0 0 0 0 0 
##$DATE= 1731996497
##$DBL= (0..7)
120 120 120 120 120 120 120 120 
##$DBP= (0..7)
$$ [...]
##$SW_h= 4401.40845070422
##$TD= 16384
##$TD0= 1
##$TE= 300
##$TE2= 300
##$TE3= 300
##$TEG= 300
##$TL= (0..7)
0 120 120 120 120 120 120 120 
##$TP= (0..7)
150 150 150 150 150 150 150 150 
##$TP07= 0
##$TPNAME0= <>
##$TPNAME1= <>
##$TPNAME2= <>
##$TPNAME3= <>
##$TPNAME4= <>
##$TPNAME5= <>
##$TPNAME6= <>
##$TPNAME7= <>
##$TPOAL= (0..7)
0.5 0.5 0.5 0.5 0.5 0.5 0.5 0.5 
##$TPOFFS= (0..7)
0 0 0 0 0 0 0 0 
##$TUNHIN= 0
##$TUNHOUT= 0
##$TUNXOUT= 0
##$USERA1= <user>
##$USERA2= <user>
##$USERA3= <user>
##$USERA4= <user>
##$USERA5= <user>
##$V9= 5
##$VALIST= <valist>
##$VCLIST= <CCCCCCCCCCCCCCC>
##$VD= 0
##$VDLIST= <DDDDDDDDDDDDDDD>
##$VPLIST= <PPPPPPPPPPPPPPP>
##$VTLIST= <TTTTTTTTTTTTTTT>
##$WBST= 1024
##$WBSW= 25
##$XGAIN= (0..3)
0 0 0 0 
##$XL= 0
##$YL= 0
##$YMAX_a= 5252044
##$YMIN_a= -6669070
##$ZGOPTNS= <>
##$ZL1= 120
##$ZL2= 120
##$ZL3= 120
##$ZL4= 120
##$ABSF1= 0
##$ABSF2= 0
##$ABSG= 0
##$ABSL= 0
##$ALPHA= 0
##$AQORDER= 0
##$ASSFAC= 0
##$ASSFACI= 0
##$ASSFACX= 0
##$ASSWID= 0
##$AUNMP= <proc_1d>
##$AXLEFT= 0
##$AXRIGHT= 0
##$AXTYPE= 0
##$AXUNIT= <>
##$AZFE= 0.1
##$AZFW= 0.1
##$BCFW= 0
##$BC_mod= 2
##$BYTORDP= 0
##$COROFFS= 0
##$CY= 7568.61572265625
##$DATMOD= 1
##$DC= 0
##$DFILT= <>
##$DTYPP= 0
##$F1P= 17.9538593292236
##$F2P= -4.03888763876832
##$FCOR= 0.5
##$FTSIZE= 32768
##$FT_mod= 6
##$GAMMA= 0
##$GB= 0
##$INTBC= 0
##$INTSCL= 1.367314e-010
##$ISEN= 128
##$LB= 0.02
##$LEV0= 0
##$LPBIN= 0
##$MAXI= 945.577
##$MC2= 0
##$MEAN= 0
##$ME_mod= 0
##$MI= -402.1523
##$NCOEF= 0
##$NC_proc= -1
##$NLEV= 6
##$NOISF1= 8.587773
##$NOISF2= 6.764455
##$NSP= 0
##$NTH_PI= 0
##$NZP= 0
##$OFFSET= 17.99637
##$PC= 1
##$PHC0= 324.0722
##$PHC1= -4.9524
##$PH_mod= 1
##$PKNL= yes
##$PPARMOD= 0
##$PPDIAG= 0
##$PPIPTYP= 0
##$PPMPNUM= 100
##$PPRESOL= 1
##$PSCAL= 0
##$PSIGN= 0
##$REVERSE= no
##$SF= 200.13
##$SI= 32768
##$SIGF1= 16.12182
##$SIGF2= -4.496377
##$SINO= 3.521527
##$SIOLD= 32768
##$SREGLST= <1H.CDCl3>
##$SSB= 0
##$STSI= 32768
##$STSR= 0
##$SW_p= 4401.40845070423
##$SYMM= 0
##$S_DEV= 0
##$TDeff= 16384
##$TDoff= 0
##$TI= <>
##$TILT= no
##$TM1= 0
##$TM2= 0
##$TOPLEV= 0
##$USERP1= <user>
##$USERP2= <user>
##$USERP3= <user>
##$USERP4= <user>
##$USERP5= <user>
##$WDW= 1
##$XDIM= 32768
##$YMAX_p= 384184561
##$YMIN_p= -274081
$$ End of Bruker specific parameters
$$ ---------------------------------
##NTUPLES= NMR SPECTRUM
##VAR_NAME=  FREQUENCY,     SPECTRUM/REAL,   SPECTRUM/IMAG
##SYMBOL=    X,             R,               I
##VAR_TYPE=  INDEPENDENT,   DEPENDENT,       DEPENDENT
##VAR_FORM=  AFFN,          ASDF,            ASDF
##VAR_DIM=   32768,         32768,           32768
##UNITS=     HZ,            ARBITRARY UNITS, ARBITRARY UNITS
##FACTOR=    0.134324425510551, 1,           1
##FIRST=     4401.40845070423, -255958,      -522948
##LAST=      0,             -248190,         -535226
##MIN=       0,             -274081,         0
##MAX=       4401.40845070423, 384184561,    0
$$ Real data points
##PAGE= N=1
##DATA TABLE= (X++(R..R)), XYDATA
$$ [...]
13016G17148o239N662L261q292q685J546K892q359j3456k758R181Q122O05q19
$$ 717148 710909 716571 719832 711540 702855 704401 707293 698934 685478 682720 691901 700023 700628 699809
13002F99809K404J899j706k389p60j168k012Q73M631K422n418j0696p792M2M944
$$ 699809 702213 704112 702406 700017 699257 698089 696077 696950 701581 704003 698585 687889 680097 680139 685083
12987F85083K397m552q287n192J2J525R61K574L676o41n874l621K240j65r079
$$ 685083 687480 682928 674641 669449 669461 670986 671947 674521 678197 677556 671682 668061 670301 670136 661057
12972F61057r310J462O152k990r333J90J1244N498q089q589K105N231j574l546
$$ 661057 651747 653209 659361 656371 647038 647228 658472 663970 655881 647292 649397 654628 653054 649508
12958F49508J852J350p363j0416l186K221J49j52M453L592m951p884n40K902n024
$$ 649508 651360 652710 645347 634931 631745 633966 634115 633963 638416 642008 637057 629173 628633 631535 626511
12943F26511j0227k007P215M039k319J953R315M508p828j1107l897J660J925K510
$$ 626511 616284 614277 621492 625531 623212 625165 634480 638988 631160 620053 616156 617816 619741 622251
12929F22251K423l207q884n913ml232j1624r922K890J1778R253K852j408n598
$$ 622251 624674 621467 612583 606670 606666 603434 591810 581888 584778 596556 605809 608661 607253 601655
12915F01655q601n160J893L813J373K713N979J305r228j2003m465J092q25k265
$$ 601655 593054 587894 589787 593600 594973 597686 603665 604970 595742 583739 579274 580366 579541 577276
12901E77276l84k863r552q766R22M926k714q005m74R910J0095K191n462r731p291
$$ 577276 576892 574029 564477 555711 556633 561559 558845 550840 550366 560276 570371 572562 567100 557369 550078
12886E50078M484J4047M376j6330j7801O210K3049J0076j0747j1239j391m202
$$ 550078 554562 568609 572985 556655 538854 545064 568113 578189 567442 556203 554812 550610
12874E50610j1452k465J2016O359j1741j2425L593P001o662r838N563J2841j385
$$ 550610 539158 536693 548709 555068 543327 530902 534495 541496 534834 524996 530559 543400 542015
12861E42015j3619n003Q610P773J31p29R1l778k733P371R957m188j5793p528N593
$$ 542015 528396 523393 532003 539776 539907 539178 539269 535491 532758 540129 550086 545898 530105 522577 528170
12846E28170J824j0200q060N848J1307M914j68p13l034l282N498J2535K486j4772
$$ 528170 529994 519794 511734 517582 528889 533803 533635 532922 529888 526606 532104 544639 547125 532353
12832E32353j4989J554R908N92q000k728M990K578l418k402K443L306J286N24
$$ 532353 517364 518918 528826 529418 521418 518690 523680 526258 522840 520438 522881 526187 527473 527997
12818E27997l86l079m673l985l707l305M97M631K751j747N19O790L782q955j4487
$$ 527997 527611 524532 519859 515874 512167 508862 509359 513990 516741 514994 515513 522303 526085 517130 502643
12803E02643m125Q588Q630mm693k991m84L45k20k391l030K315Q446L643j0075
$$ 502643 498518 507106 515736 515732 511039 508048 507564 507909 507689 505298 502268 504583 513029 516672 506597
12788E06597j4211m67J4144J1165l143r711m266K291L358J385j601m830m303J159
$$ 506597 492386 491919 506063 517228 514085 504374 500108 502399 505757 507142 505541 500711 496408 497567
12774D97567M265P6l935J57O151M202j235Q13P581O673k442p496l525J376J129
$$ 497567 501832 501908 497973 498130 504281 508483 507248 508061 515642 522315 519873 512377 508852 510228 511357
12759E11357j232k681l685j988M679R521L505q264j1057k659L831J865J89M658
$$ 511357 510125 507444 503759 501771 506450 515971 519476 511212 500155 497496 501327 503192 503381 508039
12745E08039P116P17p185p173j846J826M261P506O802j017q158o231j15N3m033
$$ 508039 515155 515872 508687 501514 499668 501494 505755 513261 520063 519046 510888 504657 504542 504595 500562
12730E00562k415N005P254K48o294m151J224N86m230l828L455Q593N000k626n831
$$ 500562 498147 503152 510406 510654 504360 500209 501433 502019 497789 493961 497416 506009 511009 508383 502552
12715E02552l420j1K185L683K641k557o701l026M487M687k628m668L096P731L44
$$ 502552 499132 499121 501306 504989 507630 505073 498372 495346 499833 504520 501892 497224 500320 508051 508395
12700E08395p448k780N310Q36j0295q739N447J2231M244l544j069K469o32k564
$$ 508395 500947 498167 503477 504313 494018 485279 490726 502957 507201 503657 502588 505057 504425 501861
12686E01861K423M904k329r337n125M285O842K379k383n927p821l493N953R828
$$ 501861 504284 509188 506859 497522 492397 496682 503524 505903 503520 497593 489772 486279 492232 502060
12672E02060M043j295l24j841r102p824Q463J9713Q289j0013r965K521L705n510
$$ 502060 506103 504808 504484 502643 493541 485717 494180 513893 522182 512169 502204 504725 508430 502920
12658E02920m648N379L578r163q035R495J4178n021j8373l450J6964J1832r432
$$ 502920 498272 503651 507229 498066 490031 499526 513704 508683 490310 486860 503824 515656 506224
12645E06224j5817l419O250M651K367L239M82l695K62Q301O428l834o005K782
$$ 506224 490407 486988 493238 497889 500256 503495 503977 500282 500544 508845 515273 511439 505434 508216
12631E08216O119l011r394j358R163O073n212p097L340J1927Q702r10o452m694
$$ 508216 514335 511324 501930 500572 509735 515808 510596 503499 506839 518766 527468 526558 520106 515412
12617E15412L35L456K311j260k574R43N902O260O85n663p307m206O6L766P532
$$ 515412 515747 519203 521514 520254 517680 518623 524525 530785 531470 525807 518500 514294 514360 518126 525658
12602E25658J0111P913R38m576l391J174J706k528m767q43N305P617N016R18j016
$$ 525658 535769 543682 544620 540044 536653 537827 539533 537005 532238 531395 536700 544317 549333 550251 549235
12587E49235L86K687J927j626k339J939M301r41p106m475L164M188j130k046K266
$$ 549235 549621 552308 554235 552609 550270 552209 556510 555569 548463 543988 547152 551340 550210 548164 550430
12572E50430J747l567j932O036M392q287j0813M591J3748r40j7502q395J2639
$$ 550430 552177 548610 546678 552714 557106 548819 538006 542597 556345 555405 537903 529508 542147
12559E42147J2385o685j2191K736J0633p18r604j850N529j153o349M543J6083
$$ 542147 554532 547847 535656 538392 549025 548307 538703 536853 542382 541229 534880 539423 555506
12546E55506Q618p665j0179JM607m24l859k040j171j555J657N862N295L296N487
$$ 555506 564124 556459 546280 546281 550888 550464 546605 544565 543394 541839 543496 549358 554653 557949 563436
12531E63436O779O43n689k282M096O02p451m240P850J0014j931j0750n930K534
$$ 563436 570215 570858 565169 562887 566983 567585 560134 555894 563744 573758 571827 561077 555147 557681
12517E57681M756N269Q020N578n012j1261l534P778P099l477r578n932M61L878
$$ 557681 562437 567706 575726 581304 576292 565031 561497 569275 576374 572897 563319 557387 557848 561726
12503E61726M576K628k094n033j404M867N088j121m627q9O619P212J924k413j911
$$ 561726 566302 568930 566836 561803 560399 565266 570354 569233 564606 564517 571136 578348 580272 577859 575948
12488E75948R52K378J798O04o28j548p04K282M505L288R84J716L926K398k020
$$ 575948 576900 579278 581076 581680 581052 579504 578800 581082 585587 588875 589859 591575 595501 597899 595879
12473E95879k522J676K669k487n461q77L445L61k469M346J2957Q758n139j1485
$$ 595879 593357 595033 597702 595215 589754 588877 592322 592683 590214 594560 607517 616275 611136 599651
12459E99651n004K617L844L593M490J722l314j515O356P627o07n226N1M066J05
$$ 599651 594647 597264 601108 604701 609191 610913 607599 606084 612440 620067 619460 614234 614285 618351 618456
12444F18456j103O649R749j050r415J522J7786J4213m546j1127O52Q241q21j0328
$$ 618456 617353 624002 633751 632701 623286 624808 642594 656807 652261 641134 641786 650027 649206 638878
12430F38878m531P608J0329N396L707N312K855k812m012M94M298L617R78k11J036
$$ 638878 634347 641955 652284 657680 661387 666699 669554 666742 662730 663224 667522 671139 672117 671906 672942
12415F72942M336P844Q227M284l51r61K522N839O022M572M213L852J3n462m006
$$ 672942 677278 685122 693349 697633 697282 696321 698843 704682 710704 715276 719489 723341 723354 717892 713886
12400G13886P323J6205Q699q177j1977L065J5681Q707n649o626L426P934N689
$$ 713886 721209 737414 746113 737936 725959 729024 744705 753412 747763 741137 744563 752497 758186
12387G58186P993J2820P555m079m051Q352J2633J182p679m97J0846J2103Q465
$$ 758186 766179 778999 786554 782475 778424 786776 799409 800591 792912 792415 803261 815364 823829
12374H23829Q448N966m084r796q81J1148J0674L027K258N863L034j917K814J2515
$$ 823829 832277 838243 834159 824363 823482 834630 845304 848331 850589 856452 859486 857569 860383 872898
12360H72898J2347L242o11L040L848J193M355J0561O487n662p152O355J5633Q612
$$ 872898 885245 888487 887876 890916 894764 895957 900312 910873 917360 911698 904546 910901 926534 935146
12346I35146q76K838J2564J2436L083k513P94P375J1568J1058N262j538j400O433
$$ 935146 934270 937108 949672 962108 965191 962678 963472 970847 982415 993473 998735 997197 995797 1002230
12332A002230J2766J1843Q808Q190N731m01j525P662J6721J3493L193N74Q211
$$ 1002230 1014996 1026839 1035647 1043837 1049568 1049167 1047642 1055304 1072025 1085518 1088711 1089285 1097496
12319A097496J5482J5980J3668J2877J2877J2410J1339Q485M589N116J2849K0703
$$ 1097496 1112978 1128958 1142626 1155503 1168380 1180790 1192129 1200614 1205203 1210319 1223168 1243871
12307A243871K0081J3459J0027J1594J2448J1161J1825J4090J2700Q259Q457J5849
$$ 1243871 1263952 1277411 1287438 1299032 1311480 1322641 1334466 1348556 1361256 1369515 1377972 1393821
12295A393821K3099K3369J8021J1343N447L500R867K1673K7122J8986N399N72
$$ 1393821 1416920 1440289 1458310 1469653 1475100 1478600 1488467 1510140 1537262 1556248 1561647 1562219
12283A562219P559J6693J9551J7025J2813O576j441m546L140J4556J4423k20j2949
$$ 1562219 1569778 1586471 1606022 1623047 1635860 1642436 1640995 1636449 1639589 1654145 1668568 1668348 1655399
12270A655399q680N834J2626Q107M253O685P853M215L567R200J2351Q657P016
$$ 1655399 1646719 1652553 1665179 1673286 1677539 1684224 1692077 1696292 1699859 1709059 1721410 1730067 1737083
12257A737083J2009J3173M894J233J3688K8270K5632J2743J0841K0172K2803J5945
$$ 1737083 1749092 1762265 1767159 1768392 1782080 1810350 1835982 1848725 1859566 1879738 1902541 1918486
12245A918486J4633K1377K1290J1522Q325J7455K3569J8670J5520K0600J9276
$$ 1918486 1933119 1954496 1975786 1987308 1995633 2013088 2036657 2055327 2070847 2091447 2110723
12234B110723L867p440O91J4094J2640J910j725j013p430j4689r992j528o700
$$ 2110723 2114590 2107150 2107841 2121935 2134575 2136485 2134760 2133747 2126317 2111628 2101636 2100108 2093408
12221B093408j9723j9477o149j355j1536j8921j2676l564j757k986l344o430r375
$$ 2093408 2073685 2054208 2048059 2046704 2035168 2016247 2003571 2000007 1998250 1995264 1991920 1985490 1976115
12208A976115k820Q751Q355m432r027J862Q232k713j2541k097J5138J4760Q64
$$ 1976115 1973295 1982046 1990401 1985969 1976942 1978804 1987036 1984323 1971782 1969685 1984823 1999583 2000447
12195B000447l155O643J2734Q745P228J3042J3415J902p604k063R648R884j479
$$ 2000447 1997292 2003935 2016669 2025414 2032642 2045684 2059099 2061001 2053397 2051334 2060982 2070866 2069387
12182B069387p262J841J3447J0028o551j6282p962N277N228n379j0029n899n147
$$ 2069387 2062125 2063966 2077413 2087441 2080890 2064608 2056646 2061923 2067151 2061772 2051743 2045844 2040697
12169B040697r596o868L065J999j4124k1539n728J0575J303j9923k1044k579O700
$$ 2040697 2031101 2024233 2027298 2029297 2015173 1993634 1987906 1998481 1999784 1979861 1958817 1956238 1962938
12156A962938j580o912p03K5j2539k0571j1961o64r16m828j635J883k701p659
$$ 1962938 1961358 1954446 1953743 1953768 1941229 1920658 1908697 1908033 1907117 1902289 1900654 1902537 1899836 1892177
12142A892177m182J077P65J817Q889R691l720j4682n318J2685J4731J256o068
$$ 1892177 1887995 1889072 1889837 1891654 1900543 1910234 1906514 1891832 1886514 1899199 1913930 1915186 1909118
12129A909118j30M764K71n061l980n9L309O751O497k158j2542j2980n319j730
$$ 1909118 1908988 1913752 1914023 1908962 1904982 1904923 1908232 1914983 1921480 1919322 1906780 1893800 1888481 1886751
12115A886751m503n620m740r015j5479j3638o285o821j4117j2845k574j765j5328
$$ 1886751 1882248 1876628 1871888 1862873 1847394 1833756 1827471 1820650 1806533 1793688 1791114 1789349 1774021
12102A774021k3363j3746j775k820q266o182m260j1282j5223l971Q094P00j7095
$$ 1774021 1750658 1736912 1735137 1732317 1724051 1717869 1713609 1702327 1687104 1683133 1691227 1691927 1674832
12089A674832k0083p188j45n765q248m20M596r68n827p85N337J237r595j6102
$$ 1674832 1654749 1647561 1647416 1641651 1633403 1632983 1637579 1636611 1630784 1629999 1635336 1636573 1626978 1610876
12075A610876j3456l907O198P222m909j8775j8746p278j652p383j2060q873o966
$$ 1610876 1597420 1593513 1599711 1606933 1602024 1583249 1564503 1557225 1555573 1548190 1536130 1527257 1520291
12062A520291j1546j2976n940j383o781j1153m448L270j259j1394j2656p186o741
$$ 1520291 1508745 1495769 1489829 1488446 1481665 1470512 1466064 1469334 1468075 1456681 1444025 1436839 1430098
12049A430098r558m711N324O801k234r506q946o610n939l653j211m048p999l116
$$ 1430098 1420540 1415829 1421153 1427954 1425720 1416214 1407268 1400658 1394719 1391066 1389855 1385807 1377808 1374692
12035A374692O718N844p273j4567o113M613L608k205j69N590L463l822m499P72
$$ 1374692 1381410 1387254 1379981 1365414 1359301 1363914 1367522 1365317 1365148 1370738 1374201 1370379 1365880 1366652
12021A366652M60o649q374N94R358O780l444r397n835K669Q783Q510L118j978
$$ 1366652 1367112 1360463 1352089 1352683 1362041 1368821 1365377 1355980 1350145 1352814 1361597 1370107 1373225 1371247
12007A371247k166J142K262j077m554l001K726O455L718k965o509l273K617M704
$$ 1371247 1369081 1370223 1372485 1371408 1366854 1363853 1366579 1373034 1376752 1373787 1367278 1364005 1366622 1371326
11993A371326K255n27j815k994k957Q38M794K003m534k721Q648J3375K094r401
$$ 1371326 1373581 1373054 1371239 1368245 1365288 1366126 1370920 1372923 1368389 1365668 1374316 1387691 1389785 1380384
11979A380384k447J3285J2490n522j4041l17J4728R623n862r125O07O573L983
$$ 1380384 1377937 1391222 1403712 1398190 1384149 1383832 1398560 1408183 1402321 1393196 1393803 1400376 1404359
11966A404359L539Q399P990k406j1972r920M20Q230P730L66q584j2679r138k456
$$ 1404359 1407898 1416297 1424287 1421881 1409909 1399989 1400409 1408639 1416369 1416735 1408151 1395472 1386334 1383878
11952A383878J436K992M698K755o612j5392j1717O11N253j931p073j885L630K89
$$ 1383878 1385314 1388306 1393004 1395759 1389147 1373755 1362038 1362649 1367902 1365971 1358898 1357013 1360643 1360932
11938A360932m457j442L575J857j727J025N185K184l417l016j083n518r293j709
$$ 1360932 1356475 1355033 1358608 1360465 1358738 1359763 1364948 1367132 1363715 1360699 1359616 1354098 1344805 1343096
11924A343096R188P614k075l024K774j322j2083q000J0018J3627n801j8930n832
$$ 1343096 1352284 1359898 1357823 1354799 1357573 1356251 1344168 1336168 1346186 1359813 1354012 1335082 1329250
11911A329250J0518L302j4023j3701p04J471m988l14J0982N777j3337j7753J55
$$ 1329250 1339768 1343070 1329047 1315346 1314642 1316113 1311125 1310811 1321793 1327570 1314233 1296480 1296635
11898A296635J4943R785j797m849l695l214K222R232K425j5875k0310k301J2248
$$ 1296635 1311578 1321363 1319566 1314717 1311022 1307808 1310030 1319262 1321687 1305812 1285502 1283201 1295449
11885A295449L473j1456j0243k357o451j3505m769R898O092j2458j8723n703O074
$$ 1295449 1298922 1287466 1277223 1274866 1268415 1254910 1250141 1260039 1266131 1253673 1234950 1229247 1235321
11872A235321L626l908p242q215o825L28O678J904q072q375j319j658p219j687
$$ 1235321 1238947 1235039 1227797 1219582 1212757 1213085 1219763 1221667 1213595 1205220 1203901 1202243 1195024 1193337
11858A193337J1945J1096p079j7037o230N178Q52m984K728J0329M55j5150j5035
$$ 1193337 1205282 1216378 1209299 1192262 1186032 1191210 1192062 1187078 1189806 1200135 1200590 1185440 1170405
11845A170405l669l87n693o063k486o188j2293o036P299O561r744j8632q727L341
$$ 1170405 1166736 1166349 1160656 1154593 1152107 1145919 1133626 1127590 1134889 1141450 1131706 1113074 1104347 1107688
11831A107688J837m709k196M381J411r033j2438n236j3n542j2940q560M850R780
$$ 1107688 1109525 1104816 1102620 1107001 1108412 1099379 1086941 1081705 1081692 1076150 1063210 1054650 1059500 1069280
11817A069280j565j4273j1058J792L672p989j4121o059O91m999r585l32Q742k37
$$ 1069280 1067715 1053442 1042384 1044176 1047848 1039859 1025738 1019679 1020370 1015371 1005786 1005454 1014196 1013959
11803A013959j5502j2703M337R418l852j5137j2445n439j022N967J1920K584j8540
$$ 1013959 998457 985754 990091 999509 995657 980520 968075 962636 961614 967581 979501 982085 963545
11790I63545k6304j0646O920O705k619n663n415q736p871K897J0048J746r339
$$ 963545 937241 926595 933515 940220 937601 931938 926523 917787 909916 912813 922861 924607 915268
11777I15268n905M811M150p047j3045r474l578K876R919Q048o983j7628p321R242
$$ 915268 909363 914174 918324 911277 898232 888758 885180 888056 897975 906023 899040 881412 874091 883333
11763H83333O297r971j0662O597J3106k007j3970n138P176L380o028l084N104
$$ 883333 889630 879659 868997 875594 888700 886693 872723 867585 874761 878141 872113 869029 874133
11750H74133J526r014q837J630N957k46m950k093O20k108m812k706M12k7j947
$$ 874133 875659 866645 857808 859438 865395 865149 860199 858106 858726 856618 851806 849100 849512 849485 847538
11735H47538r96K625M412N50p189j0944m720N889Q056j041q799m617M809N817
$$ 847538 846542 849167 853579 854129 846940 835996 831276 837165 845221 844180 835381 830764 835573 841390
11721H41390k448q518n651J042L701K77n874r180n444K926P128K420m455m189
$$ 841390 838942 830424 824773 825815 829516 829793 823919 814739 809295 812221 819349 821769 817314 813125
11707H13125J543L051k171n675j186N712N366k399p661l407M773N577k500q526
$$ 813125 814668 817719 815548 809873 808687 814399 819765 817366 809705 806298 811071 816648 814148 805622
11693H05622m879J157r48p401n976L183P142J720k098K010N262J180j838L227
$$ 805622 800743 801900 800952 793551 787575 790758 797900 799620 797522 799532 804794 805974 804136 807363
11679H07363P165J45r575q579l84K557R92M393J0059O778l190n831P39L526j997
$$ 807363 814528 814673 805098 796519 796135 798692 799684 804077 814136 820914 817724 811893 812632 816158 814161
11664H14161m773R90N694K015l056k090K70k459o727n905o81L916M721J75p550
$$ 814161 809388 810378 816072 818087 815031 812941 813211 810752 804025 798120 797439 801355 806076 806251 798701
11649G98701q860L177J7314J3669o852j9297q758Q695J0680o62p171k878K321
$$ 798701 789841 793018 810332 824001 817149 797852 789094 797789 808469 807807 800636 797758 800079
11636H00079Q39m697q314n725L430J1489P809n568j2715n683L858L981J53J394
$$ 800079 800918 796221 787907 782182 785612 797101 804910 799342 786627 780944 784802 788783 788936 790330
11622G90330K792k321n742J250Q207J306j0519q564L789P432Q96k07M683n66j5020
$$ 790330 793122 790801 785059 786309 794516 795822 785303 776739 780528 787960 788856 788649 793332 792766 777746
11607G77746j6186J548J3450L803q268j492J2206Q660r130j7764r491J924N816
$$ 777746 761560 763108 776558 780361 772093 770601 782807 791467 782337 764573 755082 757006 762822
11594G62822M737K621k6n44K738M466O34k449N96K080m878r258J583J5486R165
$$ 762822 767559 770180 770154 769610 772348 776814 777448 774999 775595 777675 772797 763539 765122 780608 789773
11579G89773j3407k2161n052J4123J2352r12m406J117K73p434p776K265Q945L957
$$ 789773 776366 754205 749153 763276 775628 774716 770310 771427 771700 764266 756490 758755 767700 771657
11565G71657l931m484n90j34k259m76N193P582L191k895m515k376j464l137l769
$$ 771657 767726 763242 762652 762518 760259 759783 764976 772558 775749 772854 768339 765963 764499 761362 757593
11550G57593j048K155J874j503m079l193M68M132M716J175l221l204J740N542
$$ 757593 756545 758700 760574 759071 754992 751799 752267 756399 761115 762290 759069 755865 757605 763147
11536G63147L250k214m365j457L328O957P359K530n389q364j770P113P677R69
$$ 763147 766397 764183 759818 758361 761689 768646 776005 778535 773146 764782 763012 770125 777802 778771
11522G78771k879o50J063p53q32L101N530L606J754J443k143p641m702P684J3446
$$ 778771 775892 775242 776305 775552 774720 777821 783351 786957 788711 790154 788011 780370 775668 783352 796798
11507G96798K555j0214o040P957R498l220r320L80R287K798r228r789r6O369N303
$$ 796798 799353 789139 783099 791056 800554 797334 788014 788394 797681 800479 791251 781462 781366 787735 793038
11492G93038L062K773J938P16J331J128l565q056l945O629J1237L947o392q405
$$ 793038 796100 798873 800811 801527 802858 803986 800421 792365 788420 795049 806286 810233 803841 795436
11478G95436k400K360O97k981j368O483J3486J2111L132n134o695l791j189Q87
$$ 795436 793036 795396 796093 793112 791744 798227 811713 823824 826956 821822 815127 811336 810147 811034
11464H11034L779M450p27p730p614J681J1742J3567P086k14j312L882P811K825
$$ 811034 814813 819263 818536 810806 803192 804873 816615 830182 837268 837054 835742 839624 847435 850260
11450H50260p828j0849j71J1777R475k903o911K695J0750N608m505o715k080J369
$$ 850260 842432 831583 831412 843189 852664 849761 842850 845545 856295 861903 857398 850683 848603 849972
11436H49972L307O819Q122L488l43L845R076M077o401p161L106R729N486j60Q80
$$ 849972 853279 860098 868220 871708 871365 875210 884286 888363 881962 874801 877907 887636 893122 892962 893842
11421H93842L241N04l429k686J541O772J3505J7556J0080o755j5794o984O940
$$ 893842 897083 897587 894158 891472 893013 899785 913290 930846 940926 934171 918377 911393 918333
11408I18333Q423m94m966r99K651J879J463K982K030j559j998K295O040N887L963
$$ 918333 926756 926262 921296 920297 922948 924827 926290 929272 931302 929743 927745 930040 936080 941967 945930
11393I45930K252P76R10L482N082L417L041P049P729k243j3035p816J0655K0581
$$ 945930 948182 948958 949868 953350 958432 961849 964890 971939 979668 977425 964390 956574 967229 987810
11379I87810J1806q00j331N491O885L085K586N283L976j492l455J431P766R057
$$ 987810 999616 998816 997485 1002976 1009861 1012946 1015532 1020815 1024791 1023299 1019844 1021275 1029041 1038098
11365A038098M702mJ436R422J5144J0224k52k597O115J3886J2205O757M374K346
$$ 1038098 1042800 1042796 1044232 1053654 1068798 1079022 1078770 1076173 1082288 1096174 1108379 1115136 1119510 1121856
11351A121856r34J971J3056J8519P705p127o535P273J4768Q441K55L55M778O699
$$ 1121856 1120922 1122893 1135949 1154468 1162173 1155046 1148511 1155784 1170552 1178993 1179248 1179603 1184381 1191080
11337A191080O319O097O231P082Q378O789J922R65P954J3803R137Q28J067O377
$$ 1191080 1197399 1203496 1209727 1216809 1225187 1231976 1233898 1234863 1242817 1256620 1265757 1266585 1267652 1274029
11323A274029N616K875J0042K0099J4334l101o857P720J5080L159n039P991K2200
$$ 1274029 1279645 1282520 1292562 1312661 1326995 1323894 1317037 1324757 1339837 1342996 1337957 1345948 1368148
11310A368148J4561k7N364K2060K0651K141m023R929J9242J0302O91N059J1365
$$ 1368148 1382709 1382682 1388046 1410106 1430757 1432898 1428875 1438804 1458046 1468348 1469039 1474098 1485463
11297A485463O846K513J2435K7226K8428J6861Q066Q229J1423J4522J9013K1374
$$ 1485463 1492309 1494822 1507257 1534483 1562911 1579772 1587838 1596067 1607490 1622012 1641025 1662399
11285A662399J6038P123N501J3604K2206K3025J7146J0538P656J0297J7415K4546
$$ 1662399 1678437 1685560 1691061 1704665 1726871 1749896 1767042 1777580 1785236 1795533 1812948 1837494
11273A837494K6726K3031J6829J2438J2672J7559K3581K6217K4834K2903K2472
$$ 1837494 1864220 1887251 1904080 1916518 1929190 1946749 1970330 1996547 2021381 2044284 2066756
11262B066756K1879K0057J9118K0712K3698K7072L0911L2972K9954K4533K4684
$$ 2066756 2088635 2108692 2127810 2148522 2172220 2199292 2230203 2263175 2293129 2317662 2342346
11251B342346L2173L8057L4996K8258K7810L4214M0000M1715M2219M2616M0401
$$ 2342346 2374519 2412576 2447572 2475830 2503640 2537854 2577854 2619569 2661788 2704404 2744805
11240B744805L6425L6413M2956N0890N3388M9596M4426M3140M7562N5732O3774
$$ 2744805 2781230 2817643 2860599 2911489 2964877 3014473 3058899 3102039 3149601 3205333 3269107
11229C269107O8535O8955O5771O1735O2033P0894Q5537R6309R6173Q8750Q4280
$$ 3269107 3337642 3406597 3472368 3534103 3596136 3667030 3752567 3848876 3945049 4033799 4118079
11218D118079Q8851R9828J10434J16013J16594J15820J17534J22493J28708J34854
$$ 4118079 4206930 4306758 4417192 4533205 4649799 4765619 4883153 5005646 5134354 5269208
11208E269208J41532J49085J56629J63578J69859J74866J79249J86811K00133
$$ 5269208 5410740 5559825 5716454 5880032 6049891 6224757 6404006 6590817 6790950
11199F790950K14884K24041K27819K33343K44440K58946K75804K95459L12566
$$ 6790950 7005834 7229875 7457694 7691037 7935477 8194423 8470227 8765686 9078252
11190I078252L20381L25461L44164L77941M06601M16372M20599M38556M66398
$$ 9078252 9398633 9724094 10068258 10446199 10852800 11269172 11689771 12128327 12594725
11181A2594725M86951M98546N13181N31607N42364N44498N49883N61087N67130
$$ 12594725 13081676 13580222 14093403 14625010 15167374 15711872 16261755 16822842 17389972
11172A7389972N65048N66160N75404N83358N85674N91286O02568O06892O00229
$$ 17389972 17955020 18521180 19096584 19679942 20265616 20856902 21459470 22066362 22666591
11163B2666591O00535O22082O52825O75568O97521P37496P93712Q47413Q93391
$$ 22666591 23267126 23889208 24542033 25217601 25915122 26652618 27446330 28293743 29187134
11154B9187134R43916J003046J058729J104173J148338J198586J247336J283008
$$ 29187134 30131050 31134096 32192825 33296998 34445336 35643922 36891258 38174266
11146C8174266J302686J307373J293931J257876J197823J114148J009984Q94160
$$ 38174266 39476952 40784325 42078256 43336132 44533955 45648103 46658087 47552247
11138D7552247P73483O39959M75878K74737M7143j96572m56373p28285r92593
$$ 47552247 48325730 48965689 49441567 49716304 49763447 49566875 49110502 48382217 47389624
11129D7389624j227249j424614j583896j694944j744892j739708j705193j662415
$$ 47389624 46162375 44737761 43153865 41458921 39714029 37974321 36269128 34606713
11121C4606713j611031j541126j453711j362076j276148j193933j110619j029777
$$ 34606713 32995682 31454556 30000845 28638769 27362621 26168688 25058069 24028292
11113B4028292r58833q96065q31675p64791p09423o75043o49216o12886n68862
$$ 24028292 23069459 22173394 21341719 20576928 19867505 19192462 18543246 17930360 17361498
11104A7361498n38467n28494n19344m93608m60143m36720m21672m00330l72427
$$ 17361498 16823031 16294537 15775193 15281585 14821442 14384722 13963050 13562720 13190293
11095A3190293l53203l47308l39733l18542k92564k77377k72934k65770k49316
$$ 13190293 12837090 12489782 12150049 11831507 11538943 11261566 10988632 10722862 10473546
11086A0473546k31835k23152k20755k13619j97355j80214j72211j72252j70958
$$ 10473546 10241711 10018559 9797804 9584185 9386830 9206616 9034405 8862153 8691195
11077H691195j64207j56878j52694j48536j41889j35764j31518j25226j17471
$$ 8691195 8526988 8370110 8217416 8068880 7926991 7791227 7659709 7534483 7417012
11068G417012j17285j27301j34388j27411j15807j15298j22261j20921j11220
$$ 7417012 7299727 7172426 7038038 6910627 6794820 6679522 6557261 6436340 6325120
11059F325120j07624j11237j07576r5565r2703j02472j03246q4471o8125p3159
$$ 6325120 6217496 6106259 5998683 5903118 5810415 5707943 5604697 5520226 5452101 5378942
11049E378942q2214p1297n3248n7706p9625q5191o5803m9049n1884n8492n4664
$$ 5378942 5296728 5225431 5172183 5114477 5034852 4949661 4883858 4834809 4782925 4724433 4669769
11038D669769n0869n5549n5519m2795l4845m5232n6724m9080l4210l5223m5927
$$ 4669769 4618900 4563351 4507832 4465037 4430192 4384960 4328236 4279156 4244946 4209723 4163796
11027D163796m2770k7296k3795l7866m8881m5686m0632m2488m2175l4239k8925
$$ 4163796 4121026 4093730 4069935 4032069 3983188 3937502 3896870 3854382 3812207 3777968 3749043
11016C749043l2256l4550k9804k7834l5237m1494l6749k8371k6934k9175k7713
$$ 3749043 3716787 3682237 3652433 3624599 3589362 3547868 3511119 3482748 3455814 3426639 3398926
11005C398926k5128k5511k3751j6281j1442j6093k2399k1007j6937j8725k2164
$$ 3398926 3373798 3348287 3324536 3308255 3296813 3280720 3258321 3237314 3220377 3201652 3179488
10994C179488j9442j4576j4677j5483j1267q988j5286j9856j1490p51m013j3634
$$ 3179488 3160046 3145470 3130793 3115310 3104043 3095055 3079769 3059913 3048423 3047672 3043659 3030025
10982C030025j0345Q14k669j9153k1171j555J1477j198j9624j8784p743j0258
$$ 3030025 3019680 3020494 3017825 2998672 2977501 2975946 2987423 2986225 2966601 2947817 2940074 2929816
10970B929816k4099k7182j5125o738j3561k5195k7987k2541j7619j7004j7866
$$ 2929816 2905717 2878535 2863410 2856672 2843111 2817916 2789929 2767388 2749769 2732765 2714899
10959B714899j7236j6458j9366k5579k7730k0666j1670j2344k0616k2867j5743
$$ 2714899 2697663 2681205 2661839 2636260 2608530 2587864 2576194 2563850 2543234 2520367 2504624
10948B504624j1308j5645j8454j2884r691j8429k8452k5050j4102j2753k2295
$$ 2504624 2493316 2477671 2459217 2446333 2436642 2418213 2389761 2364711 2350609 2337856 2315561
10937B315561k8143k3496j6510j4373j4526j3295j2377j4574j9578k4008k2460
$$ 2315561 2287418 2263922 2247412 2233039 2218513 2205218 2192841 2178267 2158689 2134681 2112221
10926B112221j3093m940j0471k6012l2021k0823r546j3681k3225k1407j2577j1412
$$ 2112221 2099128 2094188 2083717 2057705 2025684 2004861 1995315 1981634 1958409 1937002 1924425 1913013
10914A913013j6483j6643j3858j6540j9126j2453n796j2149k0297j1796J623o937
$$ 1913013 1896530 1879887 1866029 1849489 1830363 1817910 1812114 1799965 1779668 1767872 1769495 1762558
10902A762558l0536l4154j2499j40j3688k5907j5358j846p520j8091j2785k897
$$ 1762558 1732022 1697868 1685369 1685229 1671541 1645634 1630276 1628430 1620910 1602819 1590034 1587137
10890A587137p682j6734j0977o32o395j9135j5413j250k424j7818k0448m170O600
$$ 1587137 1579455 1562721 1551744 1551112 1544717 1525582 1510169 1508919 1506495 1488677 1468229 1464059 1470659
10877A470659j658j2665j1026m372m451q421r435q541p706n221l234o601j1898
$$ 1470659 1469001 1456336 1445310 1440938 1436487 1428066 1418631 1410090 1402384 1397163 1393929 1387328 1375430
10864A375430j1053o023n143o742l477l13p765j8724j5304M1N373m731j0573k912
$$ 1375430 1364377 1358354 1353211 1346469 1342992 1342679 1334914 1316190 1300886 1300927 1306300 1301569 1290996 1288084
10850A288084J18j3950k6561j5962P350J5116J070j3950j2449J3N790l469j7861
$$ 1288084 1288202 1274252 1247691 1231729 1239079 1254195 1255265 1241315 1228866 1228879 1234669 1231200 1213339
10837A213339j9944o225N983R15j2419j3687l001Q52p175j1334m110K098j00p40
$$ 1213339 1193395 1187170 1193153 1194068 1181649 1167962 1164961 1165813 1158638 1147304 1143194 1145292 1145192 1144452
10823A144452M586L450q439j4468n208L236l006j1304o749K62n438j4178q832
$$ 1144452 1149038 1152488 1144049 1129581 1124373 1127609 1124603 1113299 1106550 1106812 1101374 1087196 1078364
10810A078364L463M607j974m10O036J655j0362j2237l113J687l4L218R209K856
$$ 1078364 1081827 1086434 1084460 1084050 1090086 1091741 1081379 1069142 1066029 1067716 1067682 1070900 1080109 1082965
10796A082965j3172j6895j856J1754Q392k784p501o153n132m896m279l579K15
$$ 1082965 1069793 1052898 1051042 1062796 1071188 1068404 1060903 1054750 1049618 1044722 1040443 1036864 1037079
10783A037079Q154J0336j351j4326j0173L971M359r127j1428M134J2922J121j0687
$$ 1037079 1045233 1055569 1054218 1039892 1029719 1033690 1038049 1028922 1017494 1021628 1034550 1035671 1024984
10770A024984l801P274K434r051p190L415M163m269n970N80J928m855q017k309
$$ 1024984 1021183 1028457 1030891 1021840 1014650 1018065 1022228 1017959 1011989 1012569 1014497 1009642 1001625 999316
10756I99316L828L573K37j219p75l93j326l739n284l493j275l029m669J154Q932
$$ 999316 1003144 1006717 1006954 1005735 1004960 1004567 1003241 999502 994218 990725 989450 986421 981752 982906 991838
10741I91838N162p376r642K555R477O33o520K302J1759L763r859q113K605K044
$$ 991838 997000 989624 979982 982537 992014 992647 986127 988429 1000188 1003951 994092 985979 988584 990628
10727I90628o745m888O018O726m355q907j239M757K279m59l74l072n297J775J1090
$$ 990628 983883 978995 985013 991739 987384 978477 977238 981995 984274 983815 983441 980369 975072 976847 987937
10712I87937O812o283p499L798N940o537j2636j950P814L024l741R38Q458P145
$$ 987937 994749 988466 980967 984765 990705 984168 971532 969582 977396 980420 976679 977617 986075 993220
10698I93220K221Q29k433r529q805L338J0528K450o992m172J948j28k918J713
$$ 993220 995441 996270 993837 984308 975503 978841 989369 991819 984827 980655 982603 982475 979557 981270
10684I81270L586m498p467N360J5027K763j4281r725O146M098j2297j3025N270
$$ 981270 984856 980358 972891 978251 993278 996041 981760 972035 978181 982279 969982 956957 962227
10671I62227J3938K174p353p65N807r1n184J654Q022K552l626J121O908J768n698
$$ 962227 976165 978339 970986 970221 976028 975937 970753 972407 980429 982981 979355 980476 987384 989152 983454
10656I83454l207K215r24n113K239J2565Q006p067j0742J616J0238K358r133o829
$$ 983454 980247 982462 981538 976425 978664 991229 999235 992168 981426 983042 993280 995638 986505 979676
10642I79676O237J3696R007M61l288k891k592j928K214Q028R084L319l218m727
$$ 979676 985913 999609 1008616 1009077 1005789 1002898 1000306 998378 1000592 1008620 1017704 1021023 1017805 1013078
10628A013078l355l665l833N21O547O656J88n332m648M72O208R149N405m026q878
$$ 1013078 1009723 1006058 1002225 1002746 1009293 1015949 1016137 1010805 1006157 1006629 1012837 1021986 1027391 1023365 1014487
10613A014487j007J1115J1332r65r879o425J519N359O530O543J864m748l412M710
$$ 1014487 1013480 1024595 1035927 1034962 1025083 1018658 1020177 1025536 1032066 1038609 1040473 1035725 1032313 1037023
10599A037023M759o757j1693J519J6222J1759m623j0441k295M185K255J9J127
$$ 1037023 1041782 1035025 1023332 1024851 1041073 1052832 1048209 1037768 1035473 1039658 1041913 1041932 1043059
10586A043059K05k289O86P107O446j897o455k467K296L077M393P151M497m323
$$ 1043059 1043264 1040975 1041661 1048768 1055214 1053317 1046862 1044395 1046691 1049768 1054161 1061312 1065809 1061486
10572A061486r483n522J415N720Q947R792J976j1042j3844r97J1869J0029Q44
$$ 1061486 1052003 1046481 1047896 1053616 1062563 1072355 1074331 1063289 1049445 1048448 1060317 1070346 1071190
10559A071190p7O016N346m490j0686m836O226J1367Q133K131r90m73M51l39k91
$$ 1071190 1071113 1077129 1082475 1077985 1067299 1062463 1068689 1080056 1088189 1090320 1089330 1088857 1089308 1088969 1088678
10544A088678L254O365L274k260m12P670Q647j420q079j250O798J373q563m359
$$ 1088678 1091932 1098297 1101571 1099311 1098899 1106569 1115216 1113796 1105717 1104467 1111265 1112638 1104075 1099716
10530A099716R665J1212l381j2137k485R996R041L257P442J4462P151j0571j7018
$$ 1099716 1109381 1120593 1117212 1105075 1102590 1112586 1121627 1124884 1132326 1146788 1153939 1143368 1126350
10517A126350n623O191M688j559J045R281J0230J906n289m475M04K792J517l95
$$ 1126350 1120727 1126918 1131606 1130047 1131092 1140373 1150603 1152509 1147220 1142745 1143149 1145941 1147458 1147063
10503A147063L23M801R848R039O86o671l246P359J0578P81r338n728O944J1722
$$ 1147063 1147386 1152187 1162035 1171074 1171760 1165089 1161843 1169202 1179780 1180561 1171223 1165495 1172439 1184161
10489A184161L331n162k043O514O625k467p521p28R062R044J47n384j934K771
$$ 1184161 1187492 1182330 1180287 1186801 1193426 1190959 1183438 1182710 1191772 1200816 1200963 1195579 1193645 1196416
10475A196416J230j892J736R131R422J008n330k844J692L79k768L22P174Q286
$$ 1196416 1197646 1195754 1197490 1206621 1216043 1217051 1211721 1208877 1210569 1210948 1208180 1208502 1215676 1223962
10461A223962K287k474j052K456L299K187J293R83K293O336R439N426m529j0253
$$ 1223962 1226249 1223775 1222723 1225179 1228478 1230665 1231958 1232941 1235234 1241570 1251009 1256435 1251906 1241653
10447A241653m409Q115J5542J1120j412j1147r163J718P920J407p918m703R338
$$ 1241653 1237244 1245359 1260901 1272021 1270609 1259462 1250299 1252017 1259937 1261344 1253426 1248723 1258061
10434A258061J7425J2362M776L034O33p663j1819k293J1036J1634J661j820O535
$$ 1258061 1275486 1287848 1292624 1295658 1296291 1288628 1276809 1274516 1285552 1297186 1298847 1297027 1303562
10421A303562J3430Q106k978p139j701N530O540P79m486j586P290J0733L349n079
$$ 1303562 1316992 1325098 1322120 1314981 1313280 1318810 1325350 1326129 1321643 1320057 1327347 1338080 1341429 1336350
10407A336350l048N546P927K131j808J170N298N732M682M041K203Q8O64J475k066
$$ 1336350 1333302 1338848 1346775 1348906 1347098 1348268 1353566 1359298 1363980 1368021 1370224 1370312 1370976 1372451 1370385
10392A370385n401N10J1613J2339l95r720l410Q005Q931K407J737O900N765m046
$$ 1370385 1364984 1365494 1377107 1389446 1389051 1379331 1375921 1383926 1392857 1395264 1397001 1403901 1409666 1405620
10378A405620r856k634J0463J6460J2184M860J181L38j838m536j869O692J0969
$$ 1405620 1395764 1393130 1403593 1420053 1432237 1437097 1438278 1438616 1436778 1432242 1430373 1437065 1448034
10365A448034K613r826r382N162J5948J0962l10l519K93J804J147M975J1352J0905
$$ 1448034 1450647 1440821 1431439 1436601 1452549 1463511 1463201 1459682 1459975 1461779 1462926 1467901 1479253 1490158
10351A490158J734p273p828O7J0302J5052J0195J198j386L545N794J760J989J1274
$$ 1490158 1491892 1484619 1476791 1476858 1487160 1502212 1512407 1513605 1512219 1515764 1521558 1523318 1525307 1536581
10337A536581J5280K814j0942m368J5520K1677P256p254p415q04M077J0269J6438
$$ 1536581 1551861 1554675 1543733 1539365 1554885 1576562 1583818 1576564 1569149 1568345 1572422 1582691 1599129
10324A599129J1980j573o145M146J1458N188J681J4248K5438J4434n276n178J2517
$$ 1599129 1611109 1609536 1603391 1607537 1618995 1624183 1625864 1640112 1665550 1679984 1674708 1669530 1682047
10311A682047K0118J0522N109J3476J7557O019l765N580K2525K5607J5679R286
$$ 1682047 1702165 1712687 1717796 1731272 1748829 1754848 1751083 1756663 1779188 1804795 1820474 1829760
10299A829760J0560J0139O618R082J8270K2482J6356J0113J3707K1935K3301J7111
$$ 1829760 1840320 1850459 1857077 1866159 1884429 1906911 1923267 1933380 1947087 1969022 1992323 2009434
10287B009434J2940J5949K1120K2695K2302K4170K7277K7738K6681K9188L5027
$$ 2009434 2022374 2038323 2059443 2082138 2104440 2128610 2155887 2183625 2210306 2239494 2274521
10276B274521L7161L2300K6822K7384L1080L1657L1147L6229M4985M7659M1840
$$ 2274521 2311682 2343982 2370804 2398188 2429268 2460925 2492072 2528301 2573286 2620945 2662785
10265B662785L7026M0296M6399M7902M7382N1408N7648N7536N0181M4794M8174
$$ 2662785 2699811 2740107 2786506 2834408 2881790 2933198 2990846 3048382 3098563 3143357 3191531
10254C191531N6447O1414O0049N5318N1506N1631N6588O3721O7590O4767N7588
$$ 3191531 3247978 3309392 3369441 3424759 3476265 3527896 3584484 3648205 3715795 3780562 3838150
10243C838150N1672N0229N2019N4102N4746N3530N0580M6874M4358M4419M6238
$$ 3838150 3889822 3940051 3992070 4046172 4100918 4154448 4205028 4251902 4296260 4340679 4386917
10232D386917M7507M6491M2735L6445K8673K1835J8091J6935J5999J4306J2328
$$ 4386917 4434424 4480915 4523650 4560095 4588768 4610603 4628694 4645629 4661628 4675934 4688262
10221D688262Q998K559m387n439M10M308k396j6311k6172k7405k5962k8090l3402
$$ 4688262 4697260 4699819 4695432 4689993 4690403 4694711 4692315 4676004 4649832 4622427 4596465 4568375 4534973
10208D534973l9206m4406m6443m1770l3760l3206m4369n6087n5104m4684m0409
$$ 4534973 4495767 4451361 4404918 4363148 4329388 4296182 4251813 4195726 4140622 4095938 4055529
10197D055529m8436n8288n9440n5226n4451n6808n5061m7844m1575m0477m2245
$$ 4055529 4007093 3948805 3889365 3834139 3779688 3722880 3667819 3619975 3578400 3537923 3495678
10186C495678m4261m6937m8954m6068l8297l2523l3503l7322l8489l7817l7109
$$ 3495678 3451417 3404480 3355526 3309458 3271161 3238638 3205135 3167813 3129324 3091507 3054398
10175C054398l2494k2464j6907k4910l6334l1666j1785k60r612k3060k1398j1356
$$ 3054398 3021904 2999440 2982533 2957623 2921289 2889623 2877838 2877578 2867966 2844906 2823508 2812152
10163B812152j0212j5834j3878o340q234j8326j8511n150L382k527q622l393K180
$$ 2812152 2801940 2786106 2772228 2765888 2757654 2739328 2720817 2715667 2719049 2716522 2707900 2704507 2706687
10150B706687l484j0418n673K118j862j0939q106L455N466l898q090j690K108
$$ 2706687 2703203 2692785 2687112 2689230 2687368 2676429 2668323 2671778 2677244 2673346 2665256 2663566 2665674
10137B665674k840n203J651P610N289L043P272Q561r72j0712p322L384O204L58
$$ 2665674 2662834 2657631 2659282 2666892 2672181 2675224 2682496 2691057 2690085 2679373 2672051 2675435 2681639 2681997
10123B681997k134L108Q719R345O876L664J144K858Q805J0465K609m299K651J6102
$$ 2681997 2679863 2682971 2691690 2701035 2707911 2711575 2712719 2715577 2724382 2734847 2737456 2733157 2735808 2751910
10109B751910J5811m71j1387k983J1463J2976M357J867Q457J1857O573K033N890
$$ 2751910 2767721 2767250 2755863 2752880 2764343 2777319 2781676 2783543 2792000 2803857 2810430 2812463 2818353
10096B818353J1823J0500M470L722J0377J6187J5103J0912R631J0129P623L145
$$ 2818353 2830176 2840676 2845146 2848868 2859245 2875432 2890535 2901447 2911078 2921207 2928830 2931975
10084B931975K666P316J1213J0545Q416Q097P881O815Q826J5090J8541J4013Q467
$$ 2931975 2934641 2941957 2953170 2963715 2972131 2980228 2988109 2994924 3003750 3018840 3037381 3051394 3059861
10071C059861J0927J6376J2472J289l73J3826K7867K4601Q673j596J687J0460
$$ 3059861 3070788 3087164 3099636 3100925 3100552 3114378 3142245 3166846 3175519 3173923 3175610 3186070
10059C186070J5469J6305J6693J7535J6915J3565R309Q673J4099K0874K0919J3421
$$ 3186070 3201539 3217844 3234537 3252072 3268987 3282552 3291861 3300534 3314633 3335507 3356426 3369847
10047C369847O706P084J1500J4595J6233J7285J5258J0822J1512K0405K7628K3305
$$ 3369847 3376553 3383637 3395137 3409732 3425965 3443250 3458508 3469330 3480842 3501247 3528875 3552180
10035C552180J3340J0725J5659J7639J4510J4467J9081J9765J4184J1615J6851
$$ 3552180 3565520 3576245 3591904 3609543 3624053 3638520 3657601 3677366 3691550 3703165 3720016
10024C720016K1965K0500J7534J8249J8302J4233J2545J8318K4528K3272J8985
$$ 3720016 3741981 3762481 3780015 3798264 3816566 3830799 3843344 3861662 3886190 3909462 3928447
10013C928447J9226K0846J7771J4783J9274K5435K2207J3063J1783K0421K7355
$$ 3928447 3947673 3968519 3986290 4001073 4020347 4045782 4067989 4081052 4092835 4113256 4140611
10002D140611K6894K4897K4314K1465J8630K3172L0680K7254J4261J1249K4817
$$ 4140611 4167505 4192402 4216716 4238181 4256811 4279983 4310663 4337917 4352178 4363427 4388244
9991D388244L4908K6394J5012K1666L6929L6556K2309J8513L0620L6888K6412
$$ 4388244 4423152 4449546 4464558 4486224 4523153 4559709 4582018 4600531 4631151 4668039 4694451
9980D694451J7465K5730L8137L6075K6300K7191L6613L7141K7623K5558L7009
$$ 4694451 4711916 4737646 4775783 4811858 4838158 4865349 4901962 4939103 4966726 4992284 5029293
9969E029293M6183M1471L3092L4394M0814M0842L6498L7331M1404L9203L3066
$$ 5029293 5075476 5116947 5150039 5184433 5225247 5266089 5302587 5339918 5381322 5420525 5453591
9958E453591L5089M5035M8125L9661L4401M2072N0053M4856L6970M4372O0091
$$ 5453591 5488680 5533715 5581840 5621501 5655902 5697974 5748027 5792883 5829853 5874225 5934316
9947E934316O0085M2069L1565M3201N8840N6797M3797M0482M8836N4031N1012
$$ 5934316 5994401 6036470 6068035 6111236 6170076 6226873 6270670 6311152 6359988 6414019 6465031
9936F465031M8873N1400N2045M9392N0989N8048O0777N4271M7034M7708N3292
$$ 6465031 6513904 6565304 6617349 6666741 6717730 6775778 6836555 6890826 6937860 6985568 7038860
9925G038860N6579N6653N6241N6150N7654O3241P0198P0758O3497N7154N8175
$$ 7038860 7095439 7152092 7208333 7264483 7322137 7385378 7455576 7526334 7589831 7646985 7705160
9914G705160O2367O4435O6733P1216P1817O4833N9336O5595P8276Q3294P8135
$$ 7705160 7767527 7831962 7898695 7969911 8041728 8106561 8165897 8231492 8309768 8393062 8471197
9903H471197P3232P4855P8916Q1789Q5385Q9467Q9873Q7329Q8221R3247R5016
$$ 8471197 8544429 8619284 8698200 8779989 8865374 8954841 9044714 9132043 9220264 9313511 9408527
9892I408527R1132Q9538R4814R8893R4377Q9102R5563J09864J14375J02739R0737
$$ 9408527 9499659 9589197 9684011 9782904 9877281 9966383 10061946 10171810 10286185 10388924 10479661
9881A0479661R6268J15686J28440J23066J10412J08345J19200J29136J28455J24207
$$ 10479661 10575929 10691615 10820055 10943121 11053533 11161878 11281078 11410214 11538669 11662876
9871A1662876J28129J38489J42951J37758J33699J39657J49346J51662J47929
$$ 11662876 11791005 11929494 12072445 12210203 12343902 12483559 12632905 12784567 12932496
9862A2932496J48973J57333J63271J60600J56692J60876J70153J75064J75696
$$ 12932496 13081469 13238802 13402073 13562673 13719365 13880241 14050394 14225458 14401154
9853A4401154J81396J94308K03702K01478J95152J97602K09023K18343K20555
$$ 14401154 14582550 14776858 14980560 15182038 15377190 15574792 15783815 16002158 16222713
9844A6222713K22525K30049K38611K42228K44318K52497K66063K76349K79251
$$ 16222713 16445238 16675287 16913898 17156126 17400444 17652941 17919004 18195353 18474604
9835A8474604K81095K89705L03788L15144L20463L26286L39503L56250L66944
$$ 18474604 18755699 19045404 19349192 19664336 19984799 20311085 20650588 21006838 21373782
9826B1373782L72029L83044M03556M20127M23151M26682M49964M84722N03607
$$ 21373782 21745811 22128855 22532411 22952538 23375689 23802371 24252335 24737057 25240664
9817B5240664N02459N08671N38493N71845N87169N98045O28962O71213O95016
$$ 25240664 25743123 26251794 26790287 27362132 27949301 28547346 29176308 29847521 30542537
9808C0542537O98639P12647P53339Q01909Q37696Q65785Q99685R38676R76811
$$ 30542537 31241176 31953823 32707162 33509071 34346767 35212552 36112237 37050913 38027724
9799C8027724J017113J062094J104297J140357J182202J240137J304937J360807
$$ 38027724 39044837 40106931 41211228 42351585 43533787 44773924 46078861 47439668
9791D7439668J408182J460813J526438J601385J678846J753572J824327J898195
$$ 47439668 48847850 50308663 51835101 53436486 55115332 56868904 58693231 60591426
9783F0591426J984196K077391K161927K237291K325351K439416K563309K678079
$$ 60591426 62575622 64653013 66814940 69052231 71377582 73816998 76380307 79058386
9775G9058386K792956K927179L073929L209606L332205L462512L608600L756971
$$ 79058386 81851342 84778521 87852450 91062056 94394261 97856773 101465373 105222344
9767A05222344L902248M058882M234755M416248M591324M768059M955910N143006
$$ 105222344 109124592 113183474 117418229 121834477 126425801 131193860 136149770 141292776
9759A41292776N307704N445510N573675N714464N880549O069571O264873O445009
$$ 141292776 146600480 152045990 157619665 163334129 169214678 175284249 181549122 187994131
9751A87994131O597332O720721O817279O888095O934478O954265O941542O904163
$$ 187994131 194591463 201312184 208129463 215017558 221952036 228906301 235847843 242752006
9743B42752006O878221O905618O992930P105949P203706P258802P245961P141378
$$ 242752006 249630227 256535845 263528775 270634724 277838430 285097232 292343193 299484571
9735B99484571O947558O695962O409386O083309N724017N384743N134930M998432
$$ 299484571 306432129 313128091 319537477 325620786 331344803 336729546 341864476 346862908
9727C46862908M938837M893897M802819M611955M287988L835067L283335K658370
$$ 346862908 351801745 356695642 361498461 366110416 370398404 374233471 377516806 380175176
9719C80175176J977936J280213O35384J15852k43565m60154n92572p19672r16266
$$ 380175176 382153112 383433325 384068709 384184561 383940996 383480842 382888270 382168598 381252332
9710C81252332j232420j683289k248783k882746l535246m173968m775832n295776
$$ 381252332 380019912 378336623 376087840 373205094 369669848 365495880 360720048 355424272
9702C55424272n666656n851800n888930n863741n847656n877292n977606o167407
$$ 355424272 349757616 343905816 338016886 332153145 326305489 320428197 314450591 308283184
9694C08283184o435495o738230p032485p295032p505255p631756p651119p568726
$$ 308283184 301847689 295109459 288076974 280781942 273276687 265644931 257993812 250425086
9686B50425086p412306p215612p013886o839834o710165o620219o555708o501963
$$ 250425086 243012780 235797168 228783282 221943448 215233283 208613064 202057356 195555393
9678A95555393o440669o351796o226465o069116n882928n663945n414170n149074
$$ 195555393 189114724 182762928 176536463 170467347 164584419 158920474 153506304 148357230
9670A48357230m886090m634454m398874m181213l974696l768946l565227l374817
$$ 148357230 143471140 138836686 134437812 130256599 126281903 122512957 118947730 115572913
9662A15572913l200069l032077k870285k726351k602423k484609k366921k262666
$$ 115572913 112372844 109340767 106470482 103744131 101141708 98657099 96290178 94027512
9654I4027512k180735k109174k035458j964561j901526j834620j754728j675303
$$ 94027512 91846777 89737603 87702145 85737584 83836058 82001438 80246710 78571407
9646G8571407j612382j558777j499528j439684j393205j355657j313331j270778
$$ 78571407 76959025 75400248 73900720 72461036 71067831 69712174 68398843 67128065
9638F7128065j242467j222605j190331j142678j096920j061232j028046r95753
$$ 67128065 65885598 64662993 63472662 62329984 61233064 60171832 59143786 58148033
9630E8148033r70749r46999r11206q71744q53461q56515q49713q16837p81161
$$ 58148033 57177284 56230285 55319079 54447335 53593874 52737359 51887646 51070809 50289648
9621E0289648p66607p60091p35635o96721o68536o58598o49604o28044o00555
$$ 50289648 49523041 48762950 48027315 47330594 46662058 46003460 45353856 44725812 44125257
9612D4125257n81032n74158n72653n64005n42042n15469m98815m92493m82388
$$ 44125257 43544225 42970067 42397414 41833409 41291367 40775898 40277083 39784590 39302202
9603C9302202m62971m46077m38897m29614m07854l84652l75481l75124l67833
$$ 39302202 38839231 38393154 37954257 37524643 37116789 36732137 36356656 35981532 35613699
9594C5613699l53556l44624l42149l35407l22002l10123l01500k89528k74842
$$ 35613699 35260143 34915519 34573370 34237963 33915961 33605838 33304338 33014810 32739968
9585C2739968k66196k63917k58077k45679k35130k30495k25970k20001k19915
$$ 32739968 32473772 32209855 31951778 31706099 31470969 31240474 31014504 30794503 30574588
9576C0574588k26162k25886k11048j91815j82429j82514j81761j76182j70170
$$ 30574588 30348426 30122540 29911492 29719677 29537248 29354734 29172973 28996791 28826621
9567B8826621j66993j65597j64382j62427j59611j58978j64346j72016j71501
$$ 28826621 28659628 28494031 28329649 28167222 28007611 27848633 27684287 27512271 27340770
9558B7340770j59661j47233j44399j46778j44866j41184j45915j58502j66941
$$ 27340770 27181109 27033876 26889477 26742699 26597833 26456649 26310734 26152232 25985291
9549B5985291j66175j64514j68561j73616j74583j75064j77547j75036j63779
$$ 25985291 25819116 25654602 25486041 25312425 25137842 24962778 24785231 24610195 24446416
9540B4446416j55799j64407j82350j90389j85631j83527j90470j94472j89634
$$ 24446416 24290617 24126210 23943860 23753471 23567840 23384313 23193843 22999371 22809737
9531B2809737j89101k00664k08635j98880j86150j92537k09893k11682j96973
$$ 22809737 22620636 22419972 22211337 22012457 21826307 21633770 21423877 21212195 21015222
9522B1015222j91860k05532k16174k09246k00139k04257k11134k07263k01617
$$ 21015222 20823362 20617830 20401656 20192410 19992271 19788014 19576880 19369617 19168000
9513A9168000k06302k11468k03998j94712k00360k11803k08834j96672j96976
$$ 19168000 18961698 18750230 18546232 18351520 18151160 17939357 17730523 17533851 17336875
9504A7336875k08263k07620j91292j81465j88161j94908j90614j86721j90819
$$ 17336875 17128612 16920992 16729700 16548235 16360074 16165166 15974552 15787831 15597012
9495A5597012j90182j77354j68252j76349j88575j86575j75533j71516j73647
$$ 15597012 15406830 15229476 15061224 14884875 14696300 14509725 14334192 14162676 13989029
9486A3989029j70267j63032j63625j71674j74649j67452j57188j50824j50204
$$ 13989029 13818762 13655730 13492105 13320431 13145782 12978330 12821142 12670318 12520114
9477A2520114j55570j62681j61459j49043j38148j40224j47148j43981j33352
$$ 12520114 12364544 12201863 12040404 11891361 11753213 11612989 11465841 11321860 11188508
9468A1188508j30406j37489j41873j37450j31287j27508j21596j14083j14016
$$ 11188508 11058102 10920613 10778740 10641290 10510003 10382495 10260899 10146816 10032800
9459A0032800j22980j28909j22804j11309j05994j08566j12634j13369j10084
$$ 10032800 9909820 9780911 9658107 9546798 9440804 9332238 9219604 9106235 8996151
9450H996151j04631j01086j02612j06428j06407j01416r5874r2266q9453q8122
$$ 8996151 8891520 8790434 8687822 8581394 8474987 8373571 8277697 8185431 8095978 8007856
9440H007856r0688r5209r6214r2105q5933q0012p6169p8317q6145q9700q1304
$$ 8007856 7917168 7821959 7725745 7633640 7547707 7467695 7391526 7313209 7227064 7137364 7056060
9429G056060o9947p0476q0191q1990p1513o3888o9100p7560p7333p0388o3642
$$ 7056060 6986113 6915637 6835446 6753456 6681943 6618055 6548955 6471395 6394062 6323674 6260032
9418F260032n8289n6597o4145p5330p2681n3461m0821n2160p1246p1949n7136
$$ 6260032 6201743 6145146 6081001 6005671 5932990 5879529 5838708 5786548 5715302 5643353 5586217
9407E586217n0189n6363n9229n2756m9813n5767n8797n3384n0582n5319n4937
$$ 5586217 5536028 5479665 5420436 5367680 5317867 5262100 5203303 5149919 5099337 5044018 4989081
9396D989081m3183l6095m7261o2888o0889m3930l3493l7836m5656m8438m9382
$$ 4989081 4945898 4909803 4862542 4799654 4738765 4694835 4661342 4623506 4577850 4529412 4480030
9385D480030m9457m3060l2093k8676l7037m5437m3615l7317l6740m0092l9155
$$ 4480030 4430573 4387513 4355420 4326744 4289707 4244270 4200655 4163338 4126598 4086506 4047351
9374D047351l4670l4572l9679m1783l6412k9375k8455l3897l9111l7970l0667
$$ 4047351 4012681 3978109 3938430 3896647 3860235 3830860 3802405 3768508 3729397 3691427 3660760
9363C660760k4096k5322l2940l7509l3106k4848k1321k3992k9018l4298l7662
$$ 3660760 3636664 3611342 3578402 3540893 3507787 3482939 3461618 3437626 3408608 3374310 3336648
9352C336648l3617k1980j5039k3098l5543l2433j5523q871k2577l5669k7889j1214
$$ 3336648 3303031 3281051 3266012 3242914 3207371 3174938 3159415 3150544 3127967 3092298 3064409 3053195
9340C053195j0782k6357l5066k7399j7870j8720k3506k2688j8977j8764k0529
$$ 3053195 3042413 3016056 2980990 2953591 2935721 2917001 2893495 2870807 2851830 2833066 2812537
9329B812537k0273j9561k0774k1269j8482j5029j4107j5129j6995j9839k1528
$$ 2812537 2792264 2772703 2751929 2730660 2712178 2697149 2683042 2667913 2650918 2631079 2609551
9318B609551j9143j5410j5763j8082j5247r182j0187j8942k2909j6694j1591j5807
$$ 2609551 2590408 2574998 2559235 2541153 2525906 2516724 2506537 2487595 2464686 2447992 2436401 2420594
9306B420594j9278j1130k19k317j4917k1596j6865j0636r906j1053j0688j0834
$$ 2420594 2401316 2390186 2389967 2387650 2372733 2351137 2334272 2323636 2313730 2302677 2291989 2281155
9294B281155j1509r319n321m842q215j0371j0077j0615j1077o816J33J031o082
$$ 2281155 2269646 2260327 2255006 2250164 2241949 2231578 2221501 2210886 2199809 2192993 2193126 2194157 2188075
9281B188075j1680p767J065M193j683r402r608p54Q447Q082m73n479p03O343O956
$$ 2188075 2176395 2168628 2169693 2173886 2172203 2162801 2153193 2152439 2160886 2168968 2168495 2163016 2162313 2168656 2175612
9266B175612M106M595O164L498J029O809J7206K0834J5851J1022J1191J3584J6713
$$ 2175612 2179718 2184313 2190477 2193975 2195004 2201813 2219019 2239853 2255704 2266726 2277917 2291501 2308214
9253B308214K0937K2427J8797J7400K4627L1735K7444J9378K3110L4052L4224
$$ 2308214 2329151 2351578 2370375 2387775 2412402 2444137 2471581 2490959 2514069 2548121 2582345
9242B582345K5537K8559M4941N1109L8425K9440L9383N0242M3331L1836L6383
$$ 2582345 2607882 2636441 2681382 2732491 2770916 2800356 2839739 2889981 2933312 2965148 3001531
9231C001531M9637N2192M6594M7415N1042M4395L3991L7073N0047N3852M6825
$$ 3001531 3051168 3103360 3149954 3197369 3248411 3292806 3326797 3363870 3413917 3467769 3514594
9220C514594M4505M8701M4835L1499K5632L3440M0373L6331K9226K7017K6020
$$ 3514594 3559099 3607800 3652635 3684134 3709766 3743206 3783579 3819910 3849136 3876153 3902173
9209C902173K3527K3400K3392J5039J387l833M01j98r035j2018n229n652k1433
$$ 3902173 3925700 3949100 3972492 3987531 3988918 3985085 3985486 3985288 3976253 3964235 3959006 3953354 3931921
9196C931921l3746k5551j0296j2357l2256n0391n5773n3394m9936m7653m8040
$$ 3931921 3898175 3872624 3862328 3849971 3817715 3767324 3711551 3658157 3608221 3560568 3512528
9185C512528m9905m8746m5645m8241n5934n7035m9853n0597o6647p8810o9189
$$ 3512528 3462623 3413877 3368232 3319991 3264057 3207022 3157169 3106572 3039925 2961115 2891926
9174B891926n1852n2181o6718p0329n7587m8733n4090n9734n4575m7726m9143
$$ 2891926 2840074 2787893 2721175 2650846 2593259 2544526 2490436 2430702 2376127 2328401 2279258
9163B279258n2708n0374m7311n0247n2949m6365l5092l1546l8222m5412m4398
$$ 2279258 2226550 2176176 2128865 2078618 2025669 1979304 1944212 1912666 1874444 1829032 1784634
9152A784634l6076k7723k5369k8299k9652k4676j7771j7010k2578k6955k6346
$$ 1784634 1748558 1720835 1695466 1667167 1637515 1612839 1595068 1578058 1555480 1528525 1502179
9141A502179k4500k4169k2612j8219j4603j4682j6198j6171j5180j4970j5830
$$ 1502179 1477679 1453510 1430898 1412679 1398076 1383394 1367196 1351025 1335845 1320875 1305045
9130A305045j7571j9028j6853r936m239o520j3606j5634j0510o723j0070j5958
$$ 1305045 1287474 1268446 1251593 1241657 1237418 1230898 1217292 1201658 1191148 1184425 1174355 1158397
9118A158397j7786j5261j1055o368l418n771j2315j6450j4491r810o539m879m482
$$ 1158397 1140611 1125350 1114295 1107927 1104509 1098738 1086423 1069973 1055482 1045672 1039133 1034254 1029772
9105A029772o227q782r258q243p811n465J039M162n513k1057k3862j0605M93k444
$$ 1029772 1023545 1014763 1005505 997262 989451 983986 985025 989187 983674 962617 938755 928150 928643 926199
9091I26199p735k175N840J589j0182j3863q970p702j1509j0477m342l811r242
$$ 926199 918464 916289 922129 923718 913536 899673 890703 883001 871492 861015 856673 852862 843620
9078H43620p624M216J1459M228p236j0235q407j0745j3441p481K800M280m333
$$ 843620 835996 840212 851671 855899 848663 838428 830021 819276 805835 798354 801154 805434 801101
9065H01101j0584p544k514l043n279k637J899P44n137p064k131K319J0n364p070
$$ 801101 790517 782973 780459 777416 772137 769500 771399 772143 767006 759942 757811 760130 760140 754776 747706
9050G47706n572n645p012n584k170j607l426k251J412O55m750n790j76R71q379
$$ 747706 742134 736489 729477 723893 721723 720116 716690 714439 715851 716506 711756 705966 705790 706761 698382
9035F98382j5420o977P093O496p805j4268m333M656k532j5443j4777o95R894P384
$$ 698382 682962 675985 683078 689574 681769 667501 663168 667824 665292 649849 635072 634377 644271 651655
9021F51655k428j0549j2859p756K818R524L283j0818j6308o007P724Q805k447
$$ 651655 649227 638678 625819 618063 620881 630405 633688 622870 606562 600555 608279 617084 614637
9008F14637j1901j0859m836l154o756r487p108j141M152N339J584m341p653o371
$$ 614637 602736 591877 587041 583887 577131 567644 560536 559395 563547 568886 570470 566129 558476 552105
8994E52105l188q43J253K850K27o399q223k41O312j905j5899j2842P315J5821
$$ 552105 548917 548074 549327 552177 552404 546005 537782 537541 543853 541948 526049 513207 520522 536343
8980E36343k708k3561j7394N151J1111l713j2660m085L697j280m999L026Q374
$$ 536343 533635 510074 492680 497831 508942 505229 492569 488484 492181 490901 485902 488928 497302
8967D97302k048j5075j3415m176k937n032K470J2005N997j0410j4439k139O227
$$ 497302 495254 480179 466764 462588 459651 454619 457089 469094 475091 464681 450242 448103 454330
8954D54330l70r188q225l145j380Q99N699M433o126j3892r487j137N77j3M336
$$ 454330 453960 444772 436547 433402 432022 432921 438620 443053 436927 423035 413548 412411 412988 412975 417311
8939D17311O352l802j7315j6258j072R523O051j113j627K35k534o270m578o27
$$ 417311 423663 419861 402546 386288 385216 394739 400790 399677 398050 398285 395751 389481 384903 384276
8925C84276j321m921m419j31P90l210n307j826J518j079o305p285l609L97L716
$$ 384276 382955 378034 373615 373484 374274 371064 365757 363931 365449 364370 358065 350780 347171 347568 351284
8910C51284P247O946j827j2836j2933j089P350K078p002n849J940L092k306k480
$$ 351284 358531 365477 363650 350814 337881 336792 344142 346220 339218 333369 335309 338401 336095 333615
8896C33615L654L831n334j0784m169M543L784k094k745J098K025n68k676m709
$$ 333615 337269 341100 335766 324982 320813 325356 329140 327046 324301 325399 327424 326856 324180 319471
8882C19471p656o664O59N945J881m054r62O189M088n920r499k912K345q2l451
$$ 319471 311815 305151 305810 311755 313636 309582 308620 314809 318897 312977 303478 300566 302911 302829 299378
8867B99378l395m457o520k091O362M489q960j3814R80J5888Q540j0978j5213r32
$$ 299378 295983 291526 285006 282915 289277 293766 284806 270992 271972 287860 296400 285422 270209 269277
8853B69277R188L515m669l378P37q08l108k60J887k871q339o263k26K112K640
$$ 269277 278465 281980 277311 273933 274670 273862 270754 270494 272381 269510 261171 254908 254682 256794 259434
8838B59434O719R915L926p638j2110n752K115L657J381L70K15j635m217m372p84
$$ 259434 266153 276068 279994 272356 260246 254494 256609 260266 261647 262017 262232 260597 256380 252008 251224
8823B51224M770Q157N734o61l774k10L374m94p441o419L168Q978K708q682j2538
$$ 251224 255994 264151 269885 269224 265450 265240 268614 268120 260679 254260 257428 266406 269114 260432 247894
8808B47894n226O267J2393Q043l513j1558p850K933Q294M003k379m730m933l795
$$ 247894 242668 248935 261328 269371 265858 254300 246450 249383 257677 261680 259301 254571 249638 245843
8794B45843K468J0904R728l276j2176m791P518O753m117q297l348j566m822j670
$$ 245843 248311 259215 268943 265667 253491 248700 256218 262971 258854 250557 247209 245643 240821 239151
8780B39151Q112R149k074p404L178J2115J949j4125j1401O993J4313Q08j3489
$$ 239151 247263 256412 254338 246934 250112 262227 264176 250051 238650 245643 259956 260764 247275
8767B47275j0336K628P954L160j917k385j153J5K071L520K001P3K540P795Q358
$$ 247275 236939 239567 247521 250681 248764 246379 245226 245241 247312 250832 252833 252906 255446 263241 271599
8752B71599J822m425l324J273L33n764o654J517P907K640o417m504O300R644J891
$$ 271599 273421 268996 265672 266945 267278 261514 254860 256377 264284 266924 260507 256003 262303 271947 273838
8737B73838j699N550P608o415j8046n957J5238J1959j5120k6995l669K4555K1390
$$ 273838 272139 277689 285297 278882 260836 254879 270117 282076 266956 239961 236292 260847 282237
8724B82237l904j4841k033J0277O356j698o28L013r60p604p160j548J761K936
$$ 282237 278333 263492 261459 271736 278092 276394 275766 278779 277819 270215 263055 261507 263268 266204
8710B66204N252N177q58n977k134M476J226r589j2158j511Q524O936J059J718
$$ 266204 271456 276633 275775 269798 267664 272140 273366 263777 251619 250108 258632 265568 266627 268345
8696B68345M962J071o706o999L50M435J718K13L675N108K25m795m528k358j173
$$ 268345 273307 274378 267672 260673 261023 265458 267176 267389 271064 276172 276397 271602 267074 264716 263543
8681B63543K899R705R432j689j0359m060Q330Q935j966q034l191K001Q94RL711
$$ 263543 266442 276147 285579 283890 273531 269471 277801 286736 284770 276736 273545 275546 276440 276449 280160
8666B80160N777K540M72L319M478K8k905N25L103q04l353L046J0267O540l809
$$ 280160 285937 288477 288949 292268 296746 296774 293869 294394 297497 296693 293340 296386 306653 313193 309384
8651C09384p098j172M439M875K926m60n050m531M635J1326L170j0830j0124N019
$$ 309384 302286 301114 305553 310428 313354 312894 307844 303313 307948 319274 322444 311614 301490 306509
8637C06509J2119J607q653l233P200O426q78j202K836k8o241k980P167Q480q92
$$ 306509 318628 320235 311582 308349 315549 321975 321097 319895 322731 322703 316462 313482 320649 329129 328237
8622C28237m742M299J2317O531n145p513K23P155P289L203j292l278o8N940O709
$$ 328237 323495 327794 340111 346642 341497 333984 334207 341362 348651 351854 350562 347284 347216 353156 359865
8607C59865M89j966P127J6881J0844p290j6224o556P341R873M654L703P657Q356
$$ 359865 360354 358388 365515 382396 393240 385950 369726 363170 370511 380384 385038 388741 396398 404754
8593D04754L987j67k090l623l334J600Q081J0337Q722P104M326k070o340n92J0500
$$ 404754 408741 408574 406484 402861 399527 401127 409208 419545 428267 435371 439697 437627 431287 430695 441195
8578D41195J3564N943j412k163j834l211N46J1004J6457Q675l234n881O35P371
$$ 441195 454759 460702 459290 457127 455293 452082 452628 463632 480089 488764 485530 479649 480284 487655
8564D87655R807P303q93r423p070O141J3577N923k530L131J2789Q797k837l303
$$ 487655 497462 504765 503872 494449 487379 493520 507097 513020 510490 513621 526410 535207 532370 529067
8550E29067N357N045m041l714O708O159j0006j7355p60K0397K1701P427k289r65
$$ 529067 534424 539469 535428 531714 538422 544581 534575 517220 516460 536857 558558 565985 563696 562731
8536E62731M131P368N858k240r122j574J6081K1167O452o190p87P379J681m431
$$ 562731 566862 574230 580088 577848 568726 567152 583233 604400 610852 604662 603875 611254 612935 608504
8522F08504O966K1789J5852j848l153J1387J5476L600k467N146Q781R46k031P850
$$ 608504 615470 637259 653111 651263 648110 659497 674973 678573 676106 681252 690033 690979 688948 696798
8508F96798J4680P805j68K206O757N040L870Q002Q236M17l431L780J0862Q694
$$ 696798 711478 719283 719115 721321 728078 733118 736988 744990 753226 753643 750212 753992 764854 773548
8494G73548M811N609M342o96J760J1951J1305m730j2024L226J7271O967r914m611
$$ 773548 778359 783968 788310 787614 789374 801325 812630 807900 795876 799102 816373 823340 813426 808815
8480H08815J3725J5635K058j840O558O886k389j422J1174J3925K167l661M050
$$ 808815 822540 838175 840233 838393 844951 851837 849448 848026 859200 873125 875292 871631 875681
8467H75681Q395K451J476J0045J0748r45l886J0208J8085N097p315J437J5457
$$ 875681 884076 886527 888003 898048 908796 907851 903965 914173 932258 937355 930040 931477 946934
8454I46934J1631r10j193N639L471m33Q866J9183R315r239p748R508J1690l610
$$ 946934 958565 957655 956462 962101 965572 965139 974005 993188 1002503 993264 985516 995024 1006714 1003104
8440A003104n464J4256K3821O008j1194j690J5699J1360n312n002J0906J5296
$$ 1003104 997640 1011896 1035717 1041725 1030531 1028841 1044540 1055900 1050588 1045586 1056492 1071788
8428A071788K349n357L325J2083P282j030J296J0551J4308R956L950J350L519
$$ 1071788 1074137 1068780 1072105 1084188 1091470 1090440 1091736 1102287 1116595 1126551 1130501 1131851 1135370
8415A135370R264J3089R475K485K654J0724J4632Q063J047L711R864Q038P66p96
$$ 1135370 1144634 1157723 1167198 1169683 1172337 1183061 1197693 1205756 1206803 1210514 1220378 1228416 1229182 1228386
8401A228386L667M451K90O36P697J0940M648k124o91L495J747k566j006M322M569
$$ 1228386 1232053 1236504 1236794 1237430 1245127 1256067 1260715 1258591 1257900 1261395 1263142 1260576 1259570 1263892 1268461
8386A268461m62k885p68M61j27K041N475K909m030l880N453R953J030q296j866
$$ 1268461 1267999 1265114 1264346 1264807 1264680 1266721 1272196 1275105 1271075 1267195 1272648 1282601 1283631 1275335 1273469
8371A273469J3730J7665N588m981j386P738R097M915O049J2916J5555J0163M183
$$ 1273469 1287199 1304864 1310452 1305471 1304085 1311823 1320920 1325835 1331884 1344800 1360355 1370518 1374701
8358A374701L407L976J832J776Q834J5950J1662n97l500R132K0308J2768n251
$$ 1374701 1378108 1382084 1383916 1385692 1394526 1410476 1422138 1421541 1418041 1427173 1447481 1460249 1454998
8345A454998j1112M27J2663J3556R566Q870P601J569k576P31M494J923K21P661
$$ 1454998 1443886 1444313 1456976 1470532 1480098 1488968 1496569 1498138 1495562 1496293 1500787 1502710 1502931 1510592
8331A510592J5988J1980K72k773N651J3061J3352J2246J1115M299m531k334J1041
$$ 1510592 1526580 1538560 1538832 1536059 1541710 1554771 1568123 1580369 1591484 1595783 1591252 1588918 1599959
8318A599959J8436J1282K945N871J1908Q873K463N036J3010J3216N618K579Q336
$$ 1599959 1618395 1629677 1632622 1638493 1650401 1659274 1661737 1666773 1679783 1692999 1698617 1701196 1709532
8305A709532J4534J5334J3677J2280R943P346O796O481L829K744P697J3149J0454
$$ 1709532 1724066 1739400 1753077 1765357 1775300 1782646 1789442 1795923 1799752 1802496 1810193 1823342 1833796
8292A833796L492M083J2010J4196O354M87M928J0671O676k188l345M485J1075
$$ 1833796 1837288 1841371 1853381 1867577 1873931 1874418 1879346 1890017 1896693 1894505 1891160 1895645 1906720
8279A906720R562K748k977k943M279J4369J8026J0320j478m649M099J4536J4893
$$ 1906720 1916282 1919030 1916053 1913110 1917389 1931758 1949784 1960104 1958626 1953977 1958076 1972612 1987505
8266A987505N664p17N245J7356K0414J0767K670Q099J8217J6719O067L995J4584
$$ 1987505 1993169 1992452 1997697 2015053 2035467 2046234 2048904 2057003 2075220 2091939 2098006 2102001 2116585
8253B116585K1418J4317M719N313J0921J1824J1145J4232J3895L414o625l268
$$ 2116585 2138003 2152320 2157039 2162352 2173273 2185097 2196242 2210474 2224369 2227783 2221158 2217890
8241B217890N900M772l821m894j51m992j8010j9960o680K687k538r320p326o266
$$ 2217890 2223790 2228562 2224741 2219847 2219696 2214704 2196694 2176734 2170054 2172741 2170203 2160883 2153557 2147291
8227B147291j3376j6534o926J926k828r729l860N136K55j1312j0271J173N369
$$ 2147291 2133915 2117381 2110455 2112381 2109553 2099824 2095964 2101100 2101355 2090043 2079772 2080945 2086314
8214B086314J897N443J4740J3394J898r47P890R837k20k943J0210J9763J2051
$$ 2086314 2088211 2093654 2108394 2121788 2123686 2122739 2130629 2140466 2140246 2137303 2147513 2167276 2179327
8201B179327L357J0292K0001J3822R33J561J1236J0038j803n701K123N808j724
$$ 2179327 2182684 2192976 2212977 2226799 2227732 2229293 2240529 2250567 2248764 2243063 2245186 2250994 2249270
8188B249270r260r108p739j0038j0640o557l897o684j0697j2166j2383j1832r362
$$ 2249270 2240010 2230902 2223163 2213125 2202485 2195928 2192031 2185347 2174650 2162484 2150101 2138269 2128907
8175B128907p418q534q757n242n721j6429k5923j8961k898R64q895j2994n392
$$ 2128907 2121489 2112955 2104198 2098956 2093235 2076806 2050883 2031922 2029024 2029988 2021093 2008099 2002707
8162B002707l058j3441j9392r429J448j572p444j021P788Q14j5144j7209j956
$$ 2002707 1999649 1986208 1966816 1957387 1958835 1957263 1949819 1948798 1956586 1957400 1942256 1925047 1923091
8149A923091J1197R825J514l162l594l012k379k532l766l808k437l744p673p071
$$ 1923091 1934288 1944113 1945627 1942465 1938871 1935859 1933480 1930948 1927182 1923374 1920937 1917193 1909520 1902449
8135A902449o96J219n670r503k254L599m373j4838j1214k097p194k1125k0731
$$ 1902449 1901753 1902972 1897302 1887799 1885545 1889144 1884771 1869933 1858719 1856622 1849428 1828303 1807572
8122A807572n459L83j1801k2162j7342r984j2311j5520r605k543m730j1369j3786
$$ 1807572 1802113 1802496 1790695 1768533 1751191 1741207 1728896 1713376 1703771 1701228 1696498 1685129 1671343
8109A671343j3352j2860r065l553m874j1070q656J705Q05j5089k0858k187J5849
$$ 1671343 1657991 1645131 1636066 1632513 1627639 1616569 1607913 1609618 1610423 1595334 1574476 1572289 1588138
8096A588138N732j7522j9480j82R353k160j3296q835o88k569q931r531o153m490
$$ 1588138 1593870 1576348 1556868 1556686 1566039 1563879 1550583 1541748 1541060 1538491 1529560 1520029 1513876 1509386
8082A509386l240r8J486j992q804j5112j7342j2658m196j866r009j4373q713j593
$$ 1509386 1506146 1506048 1507534 1505542 1496738 1481626 1464284 1451626 1447430 1445564 1436555 1422182 1413469 1411876
8068A411876o685j7875j8679r679n634r060r473o986j1800j9474j3460L377P345
$$ 1411876 1405191 1387316 1368637 1358958 1353324 1344264 1334791 1327805 1316005 1296531 1283071 1286448 1293793
8055A293793p693j8053q665K922k316j4100j3836n753l975n294N79O566o91j3904
$$ 1293793 1286100 1268047 1259382 1262304 1259988 1245888 1232052 1226299 1222324 1217030 1217609 1224175 1223484 1209580
8041A209580j4184k045M169j368n377k99M365l89r891j4645j0994q92R253J0154
$$ 1209580 1195396 1193351 1197520 1196152 1190775 1190476 1194841 1194452 1184561 1169916 1158922 1158030 1167283 1177437
8027A177437Jr191o627Q2l550j4155j4663k422N783L44p530n993o55k415r230
$$ 1177437 1177438 1168247 1161620 1161702 1158152 1143997 1129334 1126912 1132695 1133039 1125509 1119516 1118861 1116446 1107216
8012A107216j1291o608j370J78j827o481j1234j0758l005N591O112k531j2492
$$ 1107216 1095925 1089317 1087947 1088125 1086298 1079817 1068583 1057825 1054820 1060411 1066523 1063992 1051500
7999A051500j5384r794j414K827J062l176o332p841p060k332L869M602j566o126
$$ 1051500 1036116 1026322 1024908 1027735 1028797 1025621 1019289 1011448 1004388 1002056 1005925 1010527 1008961 1002835
7985A002835k876J578j572q143p782j375J702R08L907Q939M613r107j5966o886
$$ 1002835 999959 1001537 999965 991822 984040 982665 984367 985275 989182 998121 1002734 993627 977661 970775
7971I70775N714O599j009m157j046j77l610m075J456N509P29q784j1116j218J0780
$$ 970775 976489 983088 982079 977922 976876 976699 973089 969014 970470 975979 976708 967924 956808 955590 966370
7956I66370R886m225j4368p872N447P455j746o022QL902j826p217k902M529N271
$$ 966370 976256 972031 957663 949791 955238 962693 960947 954925 954933 958835 957009 949792 946890 951419 956690
7941I56690J682K9j677n917o216J621P943K857o220n415L251O145P53k327P41
$$ 956690 958372 958401 956724 950807 944591 946212 954155 957012 950792 945377 948628 954773 955526 953199 953940
7926I53940J403m602r087n081K173L858k15l553k446P74J896J17p33K360N391
$$ 953940 955343 950741 941654 936573 938746 942604 942389 938836 936390 937164 939060 939177 938444 940804 946195
7911I46195J828n584o081K061O359l06o435n46P674J949j1988j2861K868J4923
$$ 946195 948023 942439 936358 938419 944778 944472 938037 937491 945165 947114 935126 922265 925133 940056
7897I40056R572k856p165l681o74L21J803K502Q23j101k608o231r898o839K091
$$ 940056 949628 946772 939607 935926 935252 935573 937376 939878 940701 939600 936992 930761 920863 914024 916115
7882I16115O392K065j569J348J843p435j5492p709R372J4636K385r812o551M990
$$ 916115 922507 924572 923003 924351 926194 918759 903267 895558 904930 919566 921951 912139 905588 910578
7868I10578P346k707j1552q522O77M019P49P83P343J0442K851o835o936j150j055
$$ 910578 917924 915217 903665 895143 895820 899839 900588 901371 908714 919156 922007 915172 908236 907086 906031
7853I06031n198k232O495O555m004q309J886J1009M573p163o830J742K251n447
$$ 906031 900833 898601 905096 911651 907647 899338 901224 912233 916806 909643 902813 904555 906806 901359
7839I01359o261L433R705L783n395o291j86M414M287K551J844R13k743p737p712
$$ 901359 895098 898531 908236 912019 906624 900333 900147 904561 908848 911399 913243 914156 911413 903676 895964
7824H95964N55Q924O387k926k772R235J4197J333j1296l099J5143J6524o08j1820
$$ 895964 896519 905443 911830 908904 906132 915367 929564 930897 919601 916502 931645 948169 947561 935741
7810I35741m933O143Q569P386Q437O301j159m603J81L634J10j650M167Q579M815
$$ 935741 930808 936951 945520 952906 961343 967644 966485 961882 962063 965697 965807 964157 968324 976903 981718
7795I81718J779P336J2783Q782L078N684R011J836p302k283J1724J4344K629m927
$$ 981718 983497 990833 1003616 1012398 1015476 1021160 1030171 1032007 1024705 1022422 1034146 1048490 1051119 1046192
7781A046192J202Q517N871R10M331J1228J0362K727q91L749J0035J0949O767K043
$$ 1046192 1047394 1055911 1061782 1062692 1067023 1078251 1088613 1091340 1090449 1094198 1104233 1115182 1121949 1123992
7767A123992o50k243l695l061J551O649O015L96j736K891O095J569l559p66L512
$$ 1123992 1123342 1121099 1117404 1114343 1115894 1122543 1128558 1128954 1127218 1130109 1136204 1137773 1134214 1133448 1136960
7752A136960k271j2850j1437K651R865j99j1992p330P475J1963J304r378q457
$$ 1136960 1134689 1121839 1110402 1113053 1122918 1122719 1110727 1103397 1110872 1122835 1124139 1114761 1106304
7739A106304k028j446o398p120K58P439N144l470o336M44O599L236l496l370L
$$ 1106304 1104276 1102830 1096432 1089312 1089570 1097009 1102153 1098683 1092347 1092791 1099390 1102626 1099130 1095760 1095763
7724A095763m018j1755q182O658J3132J820r928m653P271M738r623j3861j702
$$ 1095763 1091745 1079990 1071808 1078466 1091598 1093418 1083490 1078837 1086108 1090846 1081223 1067362 1065660
7711A065660R110N737k571l331K14k77j799K527P909L842p781j3314o589K919
$$ 1065660 1074770 1080507 1077936 1074605 1074819 1074542 1072743 1075270 1083179 1087021 1079240 1065926 1059337 1062256
7697A062256M171r46k291L642R310O814j201m867q84K056m078j2557r434M456
$$ 1062256 1066427 1065481 1063190 1066832 1076142 1082956 1081755 1076888 1076004 1078060 1073982 1061425 1051991 1056447
7683A056447J0616j497j6467j3117M186J1304K83j0089n765M25p118j7038q068
$$ 1056447 1067063 1065566 1049099 1035982 1040168 1051472 1051755 1041666 1035901 1036326 1029208 1012170 1004102
7670A004102J2804J6249m569k1965j5435n37k88r376r286k742n410j2700n623
$$ 1004102 1016906 1033155 1028586 1006621 991186 990649 990361 980985 971699 968957 963547 950847 945224
7657I45224J1987J3810n513j7885n730R412K226j5846j7095k139M919k904q857
$$ 945224 957211 971021 965508 947623 941893 951305 953531 937685 920590 918451 923370 920466 911609
7644I11609m366j97k516k415L657M584m532j0698l889N792M768k708l825J374
$$ 911609 907243 907046 904530 902115 905772 910356 905824 895126 891237 897029 901797 899089 895264 896638
7630H96638K044n073j1603r984j445O548O033m115j3004p206J0008J8623Q069
$$ 896638 898682 893609 882006 872022 870577 877125 883158 879043 866039 858833 868841 887464 895533
7617H95533p503j0149l091p14l225L88R039R101k166j0766p276J487O790R469
$$ 895533 888030 877881 874790 874076 870851 871239 880278 889379 887213 876447 869171 870658 877448 886917
7603H86917J0955O600l566r097l825L020N91o404n448L912R451M086n244p788
$$ 886917 897872 904472 900906 891809 887984 891004 891595 885191 879743 883655 893106 897192 891948 884160
7589H84160j741N099M789j605m859L47O416K375q713j2040l070M937J751l753
$$ 884160 882419 887518 892307 890702 885843 886190 892606 894981 886268 874228 871158 876095 877846 874093
7575H74093O37R124P236l707q190j024N859L364k283k122K307M827M846M846M368
$$ 874093 874730 883854 891090 887383 879193 878169 884028 887392 885109 882987 885294 890121 894967 899813 904181
7560I04181K721K511M899N681J239m915o305j807L850O306N496M462N556P145
$$ 904181 906902 909413 914312 919993 921232 916317 910012 908205 912055 918361 923857 928319 933875 941020
7546I41020M975j331n781l827N27J204P3K490O247N513L355P022J1486M119j1417
$$ 941020 945995 944664 938883 935056 935583 936787 936860 939350 945597 951110 954465 961487 972973 977092 965675
7531I65675j4609P45J3582O901n272p92J4598J7211L676n682m59O807N248J696
$$ 965675 951066 951811 965393 972294 967022 966230 980828 998039 1001715 996033 995574 1002381 1007629 1009325
7517A009325L827N573O92l238K823J2712J3201L094o222n964K183J0724J3014
$$ 1009325 1013152 1018725 1019417 1016179 1019002 1031714 1044915 1048009 1041787 1035823 1038006 1048730 1061744
7504A061744P891J686K354Q970J2193P865L196N053R424Q795L869P04J018K511
$$ 1061744 1069635 1071321 1073675 1082645 1094838 1102703 1105899 1110952 1120376 1129171 1133040 1133744 1134762 1137273
7490A137273N087R496J2577J0758O632N981R366J1709R509M456P24J478O782J2866
$$ 1137273 1142360 1151856 1164433 1175191 1181823 1187804 1197170 1208879 1218388 1222844 1223568 1225046 1231828 1244694
7476A244694J5281J3793J1528R673P650P679J1853J4904R729J381L226J5470K1598
$$ 1244694 1259975 1273768 1285296 1294969 1302619 1310298 1322151 1337055 1346784 1348165 1351391 1366861 1388459
7463A388459J3611N825J1802K1579J8127N519J566R242J5360J4331J3526J5667
$$ 1388459 1402070 1407895 1419697 1441276 1459403 1464922 1466488 1475730 1491090 1505421 1518947 1534614
7451A534614J4834J1539J3667J9780J8978J0995Q514J4368J5152N706J306J2951
$$ 1534614 1549448 1560987 1574654 1594434 1613412 1624407 1632921 1647289 1662441 1668147 1669453 1682404
7439A682404K6580K3000P440J887J3459K6494K5712J5020J0004J7850K8421K6100
$$ 1682404 1708984 1731984 1739424 1741311 1754770 1781264 1806976 1821996 1832000 1849850 1878271 1904371
7427A904371J0872K000J3397L1551L2502J7644J2002K4189L2305K0784P474J4602
$$ 1904371 1915243 1917243 1930640 1962191 1994693 2012337 2024339 2048528 2080833 2101617 2109091 2123693
7415B123693L1742L2885J8276J1783K1339K9053K3001J5258K0488L4050M0864
$$ 2123693 2155435 2188320 2206596 2218379 2239718 2268771 2291772 2307030 2327518 2361568 2402432
7404B402432L5211K4179J8051K1214K8173K8899K2454K0262K8730L6685L2117
$$ 2402432 2437643 2461822 2479873 2501087 2529260 2558159 2580613 2600875 2629605 2666290 2698407
7393B698407K3140K5552L5602L5554K4124J9137K7486L4462K9269K1207K1587
$$ 2698407 2721547 2747099 2782701 2818255 2842379 2861516 2889002 2923464 2952733 2973940 2995527
7382B995527K7031L0412L2900L5525L3320K7124K6612L2689L2823K3923K1987
$$ 2995527 3022558 3052970 3085870 3121395 3154715 3181839 3208451 3241140 3273963 3297886 3319873
7371C319873L5428M6962M0174K7901L1984M7012M9455L6208K8212L6450M7937
$$ 3319873 3355301 3402263 3442437 3470338 3502322 3549334 3598789 3634997 3663209 3699659 3747596
7360C747596M9171M3446L9037L6773L6106L9888M6412M7822M2473L9269M4303
$$ 3747596 3796767 3840213 3879250 3916023 3952129 3992017 4038429 4086251 4128724 4167993 4212296
7349D212296N1906N4152N1697M9983N0788N2210N2893N3181N4710N8999O3559
$$ 4212296 4264202 4318354 4370051 4420034 4470822 4523032 4575925 4629106 4683816 4742815 4806374
7338D806374O2316N5139N2642O3170P8754Q4331P8579P4024P7624Q3843Q7632
$$ 4806374 4868690 4923829 4976471 5039641 5118395 5202726 5281305 5355329 5432953 5516796 5604428
7327E604428R1563R7483J02360J05042J06954J05184R6640Q9409R5361J09385
$$ 5604428 5695991 5793474 5895834 6000876 6107830 6213014 6309654 6399063 6494424 6603809
7317F603809J12314R9109Q6780Q7087Q9358Q1138O8264O0076N0490L1429J2157
$$ 6603809 6716123 6815232 6902012 6989099 7078457 7159595 7227859 7287935 7338425 7369854 7382011
7306G382011N556M726o006k3130k8412j8431q865r014j1190p988k879J49K509
$$ 7382011 7387567 7392293 7386287 7363157 7334745 7316314 7307449 7298435 7287245 7279257 7276378 7276527 7279036
7293G279036L450P36O77J1649K5570K4282R373N544K4864M7152M9584L8600L5150
$$ 7279036 7282486 7283222 7283899 7295548 7321118 7345400 7354773 7360317 7385181 7432333 7481917 7520517 7555667
7280G555667M2262M7530M8032N1103N5405N2433M5600M7683N7857O0454N0699
$$ 7555667 7597929 7645459 7693491 7744594 7799999 7852432 7898032 7945715 8003572 8064026 8114725
7269H114725M3056M6800N0245L9837K0939P018j037j1244k4018l3425m0191m9851
$$ 8114725 8157781 8204581 8254826 8294663 8315602 8322620 8321583 8310339 8286321 8252896 8212705 8162854
7257H162854o0112o2859n8589n6846o0704o1846n4411m4179l9357l9932m1057
$$ 8162854 8102742 8039883 7981294 7924448 7863744 7801898 7747487 7703308 7663951 7624019 7582962
7246G582962m0634l8504l3684k7505k5024k8360l2509l2328k9999l0794l4918
$$ 7582962 7542328 7503824 7470140 7442635 7417611 7389251 7356742 7324414 7294415 7263621 7228703
7235G228703l8358l8972l7288l4293l2389l4442l7552l3387k1052j3141j9291
$$ 7228703 7190345 7151373 7114085 7079792 7047403 7012961 6975409 6942022 6920970 6907829 6888538
7224F888538k9225k5370r828l090j3803k5857k2729j0539n747j0791j5372j5069
$$ 6888538 6859313 6833943 6824115 6821025 6807222 6781365 6758636 6748097 6742350 6731559 6716187 6701118
7212F701118j4330j4386j2154j0684j7224k8904l2766k4514j5942j7512k3776
$$ 6701118 6686788 6672402 6660248 6649564 6632340 6603436 6570670 6546156 6530214 6512702 6488926
7201F488926k5136k5251l4103m7977n1265m0265l1710l9943n5575n8481m6938
$$ 6488926 6463790 6438539 6404436 6356459 6305194 6264929 6233219 6193276 6137701 6079220 6032282
7190F032282l9622m7524n8042n4655m1182l4080l7286l9881l7141l7306m3315
$$ 6032282 5992660 5945136 5887094 5832439 5791257 5757177 5719891 5680010 5642869 5605563 5562248
7179E562248m3872l2494k2299k7743m0432l9860k4567j4918k3102l6789l9138
$$ 5562248 5518376 5485882 5463583 5435840 5395408 5355548 5330981 5316063 5292961 5256172 5217034
7168E217034l1547k6496k7175k6278k0830j6886j9186k4356k6704k5845k5926
$$ 5217034 5185487 5158991 5131816 5105538 5084708 5067822 5048636 5024280 4997576 4971731 4945805
7157D945805k9401l3537l3389k8519k5550l1147m2677n0218m9135m5625m6953
$$ 4945805 4916404 4882867 4849478 4820959 4795409 4764262 4721585 4671367 4622232 4576607 4529654
7146D529654n1489n3278n1907n1212n1110m8345m4385m4419m7665m6780l9983
$$ 4529654 4478165 4424887 4372980 4321768 4270658 4222313 4177928 4133509 4085844 4039064 3999081
7135C999081l5761l9929m4711l9427k8075k5571l6008m5478m1334k9738k5785
$$ 3999081 3963320 3923391 3878680 3839253 3811178 3785607 3749599 3704121 3662787 3633049 3607264
7124C607264l2038l7439l5539l2454l4467l7900l6830l3119l1795l2287l1680
$$ 3607264 3575226 3537787 3502248 3469794 3435327 3397427 3360597 3327478 3295683 3263396 3231716
7113C231716l1977l5486l6591k8499j7126j6868k9857m0034l3835j8700j2737
$$ 3231716 3199739 3164253 3127662 3099163 3082037 3065169 3035312 2995278 2961443 2942743 2930006
7102B930006k0811l0066k8379j8978j3955j8596k6750k9965k6551k0625j5998
$$ 2930006 2909195 2879129 2850750 2831772 2817817 2799221 2772471 2742506 2715955 2695330 2679332
7091B679332j4579j8260k6349l1271k4489r712k238r328j9185j8331j2252j5409
$$ 2679332 2664753 2646493 2620144 2588873 2564384 2554672 2552434 2543106 2523921 2505590 2493338 2477929
7079B477929k5742k6545j4212n669j2034k1816k0751j3818j3421j6912j2978m138
$$ 2477929 2452187 2425642 2411430 2405761 2393727 2371911 2351160 2337342 2323921 2307009 2294031 2289893
7067B289893m807j7571k7502k3392j2053o517r625j5032j7475j6291j2999j0198
$$ 2289893 2285086 2267515 2240013 2216621 2204568 2198051 2188426 2173394 2155919 2139628 2126629 2116431
7055B116431j0726j4772j8955j9606j6152j1258q628r671j1515j0321p241p316
$$ 2116431 2105705 2090933 2071978 2052372 2036220 2024962 2016334 2006663 1995148 1984827 1977586 1970270
7043A970270j1093j2776r629o794q231r935q464q608j3772j6236q872l88m239
$$ 1970270 1959177 1946401 1936772 1929978 1921747 1911812 1903348 1894740 1880968 1864732 1855860 1855472 1851233
7030A851233j5739j7151n957j07r799k0822j6200j487M594l213j2741j3822r631
$$ 1851233 1835494 1818343 1812386 1812279 1802480 1781658 1765458 1763971 1768565 1765352 1752611 1738789 1729158
7017A729158p872r609j0504q506o367p045r048q195l592J157L521M683M737Q98
$$ 1729158 1721286 1711677 1701173 1692667 1686300 1679255 1670207 1662012 1658420 1659577 1663098 1667781 1672518 1673416
7003A673416n851r190p711q500j3191j1189J443Q305m160j9890j3723P308J2231
$$ 1673416 1667565 1658375 1650664 1642164 1628973 1617784 1619227 1627532 1623372 1603482 1589759 1597067 1609298
6990A609298m296j3276l03J0452j626j8070j2887M898R478Q56k040J993r85q102
$$ 1609298 1605002 1591726 1591423 1601875 1600249 1582179 1569292 1574190 1583668 1584524 1582484 1584477 1583492 1575390
6976A575390k901J1354J2702k521j2398m926N282M296p39P96N066N036L142K381
$$ 1575390 1572489 1583843 1596545 1594024 1581626 1576700 1581982 1586278 1585539 1586335 1591401 1596437 1599579 1601960
6962A601960q18n851m381M316Q659L315k256j760k566q951j1415m436R44m191
$$ 1601960 1601142 1595291 1590910 1595226 1603885 1607200 1604944 1603184 1600618 1591667 1580252 1575816 1576760 1572569
6948A572569j0125n791J065k141j0511j1444p050p792j1336p770p41k741j1368
$$ 1572569 1562444 1556653 1557718 1555577 1545066 1533622 1526572 1518780 1507444 1499674 1498933 1496192 1484824
6935A484824j0960N07N754n054j8340j6430j206J0507Q189l049j0989r488l812
$$ 1484824 1473864 1474371 1480125 1475071 1456731 1440301 1439095 1449602 1457791 1454742 1443753 1434265 1430453
6922A430453l060p413p845j394J814n476j3243q248L553M057r655k0909j7728
$$ 1430453 1427393 1419980 1412135 1410741 1412555 1407079 1393836 1385588 1389141 1393198 1383543 1362634 1344906
6909A344906o995q92k010o571j1393j3073r746p039j2395k1214k0390r024k051
$$ 1344906 1337911 1337019 1335009 1328438 1317045 1303972 1294226 1287187 1274792 1253578 1233188 1224164 1222113
6896A222113p460j3990j0645m903q639j6697j5212n055o73p278j4098j2104n959
$$ 1222113 1214653 1200663 1190018 1185115 1176476 1159779 1144567 1139512 1138839 1131561 1117463 1105359 1099400
6883A099400m180p007r411r536q643o776l437o12j299n502r967j1844j1138r522
$$ 1099400 1095220 1088213 1078802 1069266 1060623 1053847 1050410 1049798 1048499 1042997 1033030 1021186 1010048 1000526
6869A000526p967o511n648o296p886q384p188o085o200o679p665j0313j1622n795
$$ 1000526 992559 986048 980400 974104 966218 957834 950646 944561 938361 931682 924017 913704 902082 896287
6855H96287M330N331q147k0462j4584J056L492q800j3258q16Q171k049j5553j1440
$$ 896287 900617 905948 897801 877339 862755 863811 867303 858503 845245 844429 852600 850551 834998 823558
6841H23558R52p91j2487j0806M461P529r939k2745j1583O984P621o177j2451n645
$$ 823558 824510 823719 811232 800426 804887 812416 802477 779732 768149 775133 782754 776577 764126 758481
6827G58481P29n93l209k826k838l770k085m31n217j2531j0547Q91P127K89r210
$$ 758481 759210 758617 755408 752582 749744 745974 743889 743458 738241 725710 715163 716054 723181 723470 714260
6812G14260r988n895n220n107L25N019n53j0673j0520k26L804m955j1763l770
$$ 714260 704272 698377 693157 688050 688375 693394 692841 682168 671648 671422 675226 670271 658508 654738
6798F54738Q796P373p247j6566j0943m74K440q50k518k316n226r506p397J301
$$ 654738 663534 670907 663660 647094 636151 635677 638117 637267 634749 632433 627207 617701 610304 611605
6784F11605N190l750j6513j6633k489R081M932o979j0086k870J410l476q614o495
$$ 611605 616795 613045 596532 579899 577410 586491 591423 584444 574358 571488 572898 569422 560808 554313
6770E54313k998n654j0066p686k29L671J693j486l240m094l206j024k572r340
$$ 554313 551315 545661 535595 527909 527680 531351 533044 531558 528318 524224 521018 519994 517422 508082
6756E08082j2606n412L677J780o915o655L895Q479q61j1592j1069m280k322n217
$$ 508082 495476 490064 493741 495521 488606 481951 485846 494325 493464 481872 470803 466523 464201 458984
6742D58984o119l500k30K187J730l969j0221p653K325N666l394j1721p099L152
$$ 458984 452865 449365 449135 451322 453052 449083 438862 431209 433534 439200 435806 424085 416986 420138
6728D20138M924j776p247q176o475p70P550Q228l632j5001j1643QL537j833l927
$$ 420138 425062 423286 416039 407863 401388 400618 408168 416396 412764 397763 386120 386128 389665 387832 383905
6713C83905n41p87o316r031o425l136M77N637N270n400j3509m728R718O689j0482
$$ 383905 383364 382577 376261 367230 360805 357669 358146 363783 369053 363653 350144 345416 355134 361823 351341
6698C51341j5201j124P905j203j0297l765N387J182p790o878j136j401k314L809
$$ 351341 336140 335016 342921 341718 331421 327656 333043 334225 326435 319557 318421 317020 314706 318515
6684C18515O898l822j5816j0821L474M491q635j4544m042P979P253k063q387p434
$$ 318515 325413 321591 305775 294954 298428 302919 294284 279740 275698 283677 290930 288867 280480 273046
6670B73046k370J015j728p545o946J738O210k011j2385j0598p14L045m30p24L927
$$ 273046 270676 271691 269963 262418 255472 257210 263420 261409 249024 238426 237712 240757 240327 239603 243530
6655B43530M921n36o320q736q472m492K364M693j032o237l913p66k859k415M887
$$ 243530 248451 247915 241595 232859 224387 219895 222259 226952 225920 219683 215770 215004 212145 209730 214617
6640B14617N424q313j6487k125J4202M210j7615j4731Q892J4074o324j5969N56
$$ 214617 220041 211728 195241 193116 207318 211528 193913 179182 188074 202148 195824 179855 180411
6627A80411J2638L80j1769l018O614k488j1479j152Q493l901j6378j035K1271
$$ 180411 193049 193429 181660 178642 185256 182768 171289 170137 178630 174729 158351 157316 178587
6614A78587J2564j5894k0676J722J2364k895j4302k941J0572N552p606j1397p149
$$ 178587 191151 175257 154581 156303 168667 165772 151470 148529 159101 164653 157047 145650 138501
6601A38501k877R50K639k428p704j372R570N639j0790j5295j785O963r51p337
$$ 138501 135624 136574 139213 136785 129081 127709 137279 142918 132128 116833 115048 122011 121060 113723
6587A13723O68O504m117j4527n155J1259R892o109j2846l346O935P097J635l339
$$ 113723 114391 120895 116778 102251 97096 108355 118247 112138 99292 95946 102881 109978 111613 108274
6573A08274o979p709l977K18N26m61P53J179j693l128m2J720j942m583p39L643
$$ 108274 101295 93586 89609 89827 90353 89892 90645 91824 90131 87003 86961 88681 86739 82156 81417 85060
6557H5060K264o69j158m598j2099j1647J616J0513P81j2262n679J2454J4154l336
$$ 85060 87324 86655 85497 80899 68800 57153 58769 69282 70063 57801 52122 64576 78730 75394
6543G5394j3339l030P975J594j1099j0834j41M549r41o368n090r24R24K33q25
$$ 75394 62055 59025 67000 68594 57495 46661 46520 51069 50128 43760 38670 37746 38670 38903 38078
6528C8078q73L99K249L196K102j272n488o743k658J964n49p715p024M645J2132
$$ 38078 37205 37604 39853 43049 45151 43879 38391 31648 28990 30954 30405 22690 15666 20311 32443
6513C2443L079j1764j3573l038L908K269P85J540k156o946o70J3019J3273n520
$$ 32443 35522 23758 10185 7147 11055 13324 14109 15649 13493 6547 5877 18896 32169 26649
6499B6649k0291j1570P762J2175o94j1455q644J66M339K874J30j127j68K301L783
$$ 26649 6358 -5212 2550 14725 14031 2576 -6068 -5902 -1563 1311 1441 314 146 2447 6230
6484F230J982k647p116p709l031K076l04q608q792N827J8573R769j1227j5962
$$ 6230 8212 5565 -1551 -9260 -12291 -10215 -10519 -19127 -27919 -22092 -3519 6250 -4977 -20939
6470b0939N47J2143L268q122l400N932J198j0180r657p37K9n167r31R832Q677
$$ -20939 -20392 -8249 -4981 -13103 -16503 -10571 -9373 -19553 -29210 -29947 -29918 -35085 -36016 -26184 -17507
6455a7507n080j1399k801M987J463l395p02K284q37k833J304L018k950o467l11
$$ -17507 -22587 -33986 -36787 -31800 -30337 -33732 -34434 -32150 -32987 -35820 -34516 -31498 -34448 -40915 -41226
6440d1226M407l107j2306o970P460J1401Q48q917p765j818J117K001K753P33l738
$$ -41226 -36819 -39926 -52232 -59202 -51742 -40341 -39493 -48410 -56175 -57993 -56876 -54875 -52122 -51389 -55127
6425e5127m418Q45N163K936j980l766l658m987m993J47N823M007l101m344L258
$$ -55127 -59545 -58700 -53537 -50601 -52581 -56347 -60005 -64992 -69985 -69838 -64015 -60008 -63109 -67453 -64195
6410f4195Q433K441o569n339M100P773J630l274J61M038M1o210n080J137L160
$$ -64195 -55762 -53321 -59890 -65229 -61129 -53356 -51726 -55000 -54839 -50801 -50760 -56970 -62050 -60913 -57753
6395e7753r7k295j921l005n707n988l216Q6L591O249K721p514j3140n611M894
$$ -57753 -57850 -60145 -62066 -65071 -70778 -76766 -79982 -79896 -76305 -70056 -67335 -74849 -87989 -93600 -88706
6380h8706L421m868k741Q828J0895j121r122k873M450J506k876L0J603m723p003
$$ -88706 -85285 -90153 -92894 -84066 -73171 -74292 -83414 -86287 -81837 -80331 -83207 -83177 -81574 -86297 -93300
6365i3300K966R811o17j3694q923M473M027n807l047R419P313r705j3808L066
$$ -93300 -90334 -80523 -81140 -94834 -103757 -99284 -95257 -101064 -104111 -94692 -87379 -97084 -110892 -107826
$$ [...]
##END NTUPLES=NMR SPECTRUM
##END=
