##TITLE=1H ikalashn
K-546-2
18.12.2024
##JCAMPDX= 6.0         $$ Bruker NMR JCAMP-DX V2.0
##DATA TYPE= NMR SPECTRUM
##DATA CLASS= NTUPLES
##ORIGIN= UXNMR, Bruker Analytische Messtechnik GmbH
##OWNER= root
$$ TOPSPIN		Version 1.3
$$ 2024-12-18 11:22:29.406 +0400  Irina@DPX200
$$ Compression mode = diff/dup
##.OBSERVE FREQUENCY= 200.131300845
##.OBSERVE NUCLEUS= ^1H
##.ACQUISITION MODE= SIMULTANEOUS
##.ACQUISITION SCHEME= undefined
##.AVERAGES= 64
##.DIGITISER RES= 18
##SPECTROMETER/DATA SYSTEM= spect
##.PULSE SEQUENCE= zg
##.SOLVENT NAME= CDCl3
##.SHIFT REFERENCE= INTERNAL, CDCl3, 1, 17.49637
##AUDIT TRAIL= $$ (NUMBER, WHEN, WHO, WHERE, WHAT)
$$ ##TITLE= Audit trail, TOPSPIN		Version 1.3
$$ ##JCAMPDX= 5.01
$$ ##ORIGIN= Bruker BioSpin GmbH
$$ ##OWNER= Irina
$$ $$ F:/spectra/data/iren/nmr/1H/4/pdata/1/auditp.txt
$$ ##AUDIT TRAIL=  $$ (NUMBER, WHEN, WHO, WHERE, VERSION, WHAT)
(   1,<2024-12-18 11:21:39.218 +0400>,<Irina>,<DPX200>,<TOPSPIN 1.3>,
      <created by zg
	started at 2024-12-18 11:17:26.593 +0400,
	POWCHK disabled, PULCHK disabled
       configuration hash MD5:
       BE 6D 3F 07 2A EA 11 49 91 17 2B D3 AF B3 58 0D
       data hash MD5: 16K
       69 AA 1F 43 2F 16 52 C7 9D 80 B6 F1 CA 43 5E A5>)
(   2,<2024-12-18 11:21:41.890 +0400>,<Irina>,<DPX200>,<TOPSPIN 1.3>,
      <Start of raw data processing
       efp BC_mod = 2 LB = 0.02 FT_mod = 6 PKNL = 1 PHC0 = 85.86363 PHC1 = 12.23222 SI = 32K 
       data hash MD5: 32K
       53 EB 93 87 29 6D 46 84 E9 84 FD FF D4 E4 D3 52>)
(   3,<2024-12-18 11:21:45.062 +0400>,<Irina>,<DPX200>,<TOPSPIN 1.3>,
      <apk 
       data hash MD5: 32K
       75 2D DC F1 A0 7B FA 21 0B 0E E0 6F 61 5A 91 17>)
(   4,<2024-12-18 11:22:03.984 +0400>,<Irina>,<DPX200>,<TOPSPIN 1.3>,
      <pk fgphup PHC0 = 9.090137 PHC1 = -15.2 
       data hash MD5: 32K
       DB 6D DE 12 D9 43 BD 4A 63 14 73 EF AE F3 01 62>)
(   5,<2024-12-18 11:22:05.437 +0400>,<Irina>,<DPX200>,<TOPSPIN 1.3>,
      <abs n ABSG = 5 
       data hash MD5: 32K
       00 C1 94 17 68 21 D7 9E 3F 9E 29 47 9F F0 C4 BB>)
(   6,<2024-12-18 11:22:18.593 +0400>,<Irina>,<DPX200>,<TOPSPIN 1.3>,
      <pk fgphup PHC0 = 2.302148 PHC1 = -4.8 
       data hash MD5: 32K
       54 E9 84 3C ED 41 22 CA 68 CA BD 9D E2 EA 73 00>)
(   7,<2024-12-18 11:22:21.078 +0400>,<Irina>,<DPX200>,<TOPSPIN 1.3>,
      <abs n ABSG = 5 
       data hash MD5: 32K
       FF 24 AC 93 F9 3F 75 6C 57 C6 8E A7 03 A6 3B 3A>)
$$ ##END=
$$ 
$$ $$ hash MD5
$$ $$ BF EF 58 D3 54 84 BA F7 38 C4 8D 7F 74 46 6D 95
##$RELAX= 
##$RELAX= 
##$RELAX= 
##$RELAX= 
##$RELAX= 
##$RELAX= 
##$RELAX= 
##$RELAX= 
##$RELAX= 
$$ Bruker specific parameters
$$ --------------------------
##$DU= <F:/spectra>
##$EXPNO= 4
##$NAME= <1H>
##$PROCNO= 1
##$TYPE= <nmr>
##$USER= <iren>
##$AMP= (0..31)
100 100 100 100 100 100 100 100 100 100 100 100 100 100 100 100 100 100 
100 100 100 100 100 100 100 100 100 100 100 100 100 100 
##$ANAVPT= -1
##$AQSEQ= 0
##$AQ_mod= 1
##$AUNM= <au_zg>
##$AUTOPOS= <>
##$BF1= 200.13
##$BF2= 200.13
$$ [...]
##$SW_h= 4401.40845070422
##$TD= 16384
##$TD0= 1
##$TE= 300
##$TE2= 300
##$TE3= 300
##$TEG= 300
##$TL= (0..7)
0 120 120 120 120 120 120 120 
##$TP= (0..7)
150 150 150 150 150 150 150 150 
##$TP07= 0
##$TPNAME0= <>
##$TPNAME1= <>
##$TPNAME2= <>
##$TPNAME3= <>
##$TPNAME4= <>
##$TPNAME5= <>
##$TPNAME6= <>
##$TPNAME7= <>
##$TPOAL= (0..7)
0.5 0.5 0.5 0.5 0.5 0.5 0.5 0.5 
##$TPOFFS= (0..7)
0 0 0 0 0 0 0 0 
##$TUNHIN= 0
##$TUNHOUT= 0
##$TUNXOUT= 0
##$USERA1= <user>
##$USERA2= <user>
##$USERA3= <user>
##$USERA4= <user>
##$USERA5= <user>
##$V9= 5
##$VALIST= <valist>
##$VCLIST= <CCCCCCCCCCCCCCC>
##$VD= 0
##$VDLIST= <DDDDDDDDDDDDDDD>
##$VPLIST= <PPPPPPPPPPPPPPP>
##$VTLIST= <TTTTTTTTTTTTTTT>
##$WBST= 1024
##$WBSW= 25
##$XGAIN= (0..3)
0 0 0 0 
##$XL= 0
##$YL= 0
##$YMAX_a= 1383437
##$YMIN_a= -908725
##$ZGOPTNS= <>
##$ZL1= 120
##$ZL2= 120
##$ZL3= 120
##$ZL4= 120
##$ABSF1= 17.49637
##$ABSF2= -4.496376
##$ABSG= 5
##$ABSL= 3
##$ALPHA= 0
##$AQORDER= 0
##$ASSFAC= 0
##$ASSFACI= 0
##$ASSFACX= 0
##$ASSWID= 0
##$AUNMP= <proc_1d>
##$AXLEFT= 0
##$AXRIGHT= 0
##$AXTYPE= 0
##$AXUNIT= <>
##$AZFE= 0.1
##$AZFW= 0.1
##$BCFW= 0
##$BC_mod= 2
##$BYTORDP= 0
##$COROFFS= 0
##$CY= 7568.61572265625
##$DATMOD= 1
##$DC= 0
##$DFILT= <>
##$DTYPP= 0
##$F1P= 17.9538593292236
##$F2P= -4.03888763876832
##$FCOR= 0.5
##$FTSIZE= 32768
##$FT_mod= 6
##$GAMMA= 0
##$GB= 0
##$INTBC= 0
##$INTSCL= 5.656564e-011
##$ISEN= 128
##$LB= 0.02
##$LEV0= 0
##$LPBIN= 0
##$MAXI= 945.577
##$MC2= 0
##$MEAN= 0
##$ME_mod= 0
##$MI= -402.1523
##$NCOEF= 0
##$NC_proc= -5
##$NLEV= 6
##$NOISF1= 8.587773
##$NOISF2= 6.764455
##$NSP= 0
##$NTH_PI= 0
##$NZP= 0
##$OFFSET= 17.49637
##$PC= 1
##$PHC0= 88.06794
##$PHC1= 15.85622
##$PH_mod= 1
##$PKNL= yes
##$PPARMOD= 0
##$PPDIAG= 0
##$PPIPTYP= 0
##$PPMPNUM= 100
##$PPRESOL= 1
##$PSCAL= 0
##$PSIGN= 0
##$REVERSE= no
##$SF= 200.13
##$SI= 32768
##$SIGF1= 16.12182
##$SIGF2= -4.496377
##$SINO= 3.521527
##$SIOLD= 32768
##$SREGLST= <1H.CDCl3>
##$SSB= 0
##$STSI= 32768
##$STSR= 0
##$SW_p= 4401.40845070422
##$SYMM= 0
##$S_DEV= 0
##$TDeff= 16384
##$TDoff= 0
##$TI= <>
##$TILT= no
##$TM1= 0
##$TM2= 0
##$TOPLEV= 0
##$USERP1= <user>
##$USERP2= <user>
##$USERP3= <user>
##$USERP4= <user>
##$USERP5= <user>
##$WDW= 1
##$XDIM= 32768
##$YMAX_p= 281121476
##$YMIN_p= -391838
$$ End of Bruker specific parameters
$$ ---------------------------------
##NTUPLES= NMR SPECTRUM
##VAR_NAME=  FREQUENCY,     SPECTRUM/REAL,   SPECTRUM/IMAG
##SYMBOL=    X,             R,               I
##VAR_TYPE=  INDEPENDENT,   DEPENDENT,       DEPENDENT
##VAR_FORM=  AFFN,          ASDF,            ASDF
##VAR_DIM=   32768,         32768,           32768
##UNITS=     HZ,            ARBITRARY UNITS, ARBITRARY UNITS
##FACTOR=    0.134324425510551, 1,           1
##FIRST=     4401.40845070422, -65018,       -887461
##LAST=      0,             -213525,         -1238908
##MIN=       0,             -391838,         0
##MAX=       4401.40845070422, 281121476,    0
$$ Real data points
##PAGE= N=1
##DATA TABLE= (X++(R..R)), XYDATA
$$ [...]
$$ plain form
11849 3543915 3467191 3416382 3446983 3510918 3524459 3471369 3406823 3378973 3381935 3386903 3387987 3396471
11837 3396471 3405618 3390486 3347634 3313688 3326604 3372105 3385645 3322410 3223089 3185502 3252207
11826 3252207 3350668 3384857 3366732 3388661 3463602 3486171 3397414 3295963 3300271 3372765 3391668
11815 3391668 3347927 3340053 3393652 3426071 3401881 3388606 3423268 3447613 3423944 3401682 3415345
11804 3415345 3425147 3413441 3426166 3458276 3424584 3322747 3288457 3381052 3450423 3358650 3210999
11793 3210999 3192591 3273089 3274017 3167895 3096181 3110665 3109958 3050397 3022476 3072671 3123101 3123404
11781 3123404 3125094 3147431 3121979 3037982 2998400 3054747 3118422 3111715 3077403 3063983 3040956 3013776
11769 3013776 3074280 3225880 3304315 3209373 3082355 3094949 3182848 3175014 3089911 3088800 3188356
$$ packed form
11849C543915p6724n0809L0601O3935J3541n3090o4546k7850K962M968J084Q484
11837C396471R147j5132m2852l3946J2916M5501J3540o3235r9321l7587O6705
11826C252207R8461L4189j8125K1929P4941K2569q8757j01451M308P2494J8903
11815C391668m3741p874N3599L2419k4190j3275L4662K4345k3669k2262J3663
11804C415345R802j1706J2725L2110l3692j01837l4290R2595O9371r1773j47651
11793C210999j8408Q0498R28j06122p1714J4484p07n9561k7921N0195N0430L03
11781C123404J690K2337k5452q3997l9582N6347O3675o707l4312j3420k3027k7180
11769C013776O0504J51600P8435r4942j27018J2594Q7899p834q5103j111R9556
$$ plain form
11758 3188356 3241294 3193710 3150845 3163258 3145485 3061616 3013134 3060621 3108178 3062094 2983399
11747 2983399 2978588 3032270 3053548 3021917 2989170 2981365 2983349 2989833 3003607 3008455 2996904 2995442
11735 2995442 3017407 3029200 3010927 3006542 3054596 3108510 3095776 3030639 2994055 3012672 3031664
11724 3031664 3013340 2993564 3016453 3067595 3105849 3122924 3134018 3136256 3118484 3098343 3103494 3115985
11712 3115985 3087462 3030753 3041290 3173001 3330595 3365532 3271427 3193609 3225108 3290838 3287225
11701 3287225 3242479 3248508 3305319 3344659 3363281 3411381 3470443 3468306 3414899 3397943 3429269 3422421
11689 3422421 3353892 3316806 3361795 3409375 3390977 3358080 3364757 3358637 3299994 3282835 3397408
11678 3397408 3551846 3587312 3519347 3497744 3550120 3547292 3447187 3396313 3509950 3686179 3742781
$$ packed form
11758C188356N2938m7584m2865J2413j7773q3869m8482M7487M7557m6084p8695
11747B983399m811N3682K1278l1631l2747p805J984O484J3774M848j1551j462
11735B995442K1965J1793j8273m385M8054N3914j2734o5137l6584J8617J8992
11724C031664j8324j9776K2889N1142L8254J7075J1094K238j7772k0141N151J2491
11712C115985k8523n6709J0537J31711J57594L4937r4105p7818L1499O5730l613
11701C287225m4746O029N6811L9340J8622M8100N9062k137n3407j6956L1326o848
11689C422421o8529l7086M4989M7580j8398l2897O677o120n8643j7159J14573
11678C397408J54438L5466o7965k1603N2376k828j00105n0874J13637J76229N6602
$$ plain form
11667 3742781 3652848 3543038 3512477 3548047 3590848 3603207 3575118 3526069 3503348 3536377 3594925
11656 3594925 3629584 3648461 3709701 3827886 3928716 3929325 3847023 3789064 3825459 3906245 3934342
11645 3934342 3893812 3854401 3858744 3875168 3879720 3907518 3973850 4014597 3978942 3925486 3935254 3972268
11633 3972268 3941431 3861580 3849429 3919597 3940054 3843410 3758109 3831795 4010890 4113086 4076679
11622 4076679 4022548 4071534 4197950 4291510 4297563 4255690 4233411 4259197 4314136 4364609 4388951
11611 4388951 4376196 4323101 4252576 4213378 4224218 4234777 4194143 4145320 4176251 4269923 4297757
11600 4297757 4206440 4119971 4174199 4316748 4377518 4307502 4234419 4270271 4362359 4381426 4294312
11589 4294312 4189672 4155640 4183445 4202582 4182437 4163766 4180022 4185794 4114262 3991168 3919389
$$ packed form
11667C742781q9933j09810l0561L5570M2801J2359k8089m9049k2721L3029N8548
11656C594925L4659J8877O1240J18185J00830O09q2302n7959L6395Q0786K8097
11645C934342m0530l9411M343J6424M552K7798O6332M0747l5655n3456R768L7014
11633C972268l0837p9851j2151P0168K0457r6644q5301P3686J79095J02196l6407
11622D076679n4131M8986J26416R3560O053m1873k2279K5786N4939N0473K4342
11611D388951j2755n3095p0525l9198J0840J0559m0634m8823L0931R3672K7834
11600D297757r1317q6469N4228J42549O0770p0016p3083L5852R2088J9067q7114
11589D294312j04640l4032K7805J9137k0145j8671J6256N772p1532j23094p1779
$$ plain form
11578 3919389 3936189 3964530 3943777 3925700 3972981 4037664 4037669 4002571 4029684 4118215 4163795 4122251
11566 4122251 4071589 4090191 4168180 4266284 4370238 4447722 4437609 4337424 4236383 4208158 4223592
11555 4223592 4215797 4178123 4146434 4130793 4118641 4111315 4111268 4103098 4084093 4078968 4091359 4084250 4046037
11542 4046037 4024918 4047302 4053712 3984033 3888370 3873670 3955781 4039139 4043948 3989589 3942774 3936318
11530 3936318 3955110 3963404 3931186 3860346 3792799 3772517 3798389 3830784 3836519 3808367 3752579 3681462
11518 3681462 3612179 3557388 3525670 3532473 3580591 3625395 3609309 3550603 3537214 3594818 3628811
11507 3628811 3558435 3443576 3394512 3410600 3412686 3395115 3418892 3465485 3435695 3320003 3240170
11496 3240170 3266175 3306996 3264187 3200366 3249176 3410204 3540254 3536996 3447847 3387439 3405289
$$ packed form
11578C919389J6800K8341k0753j8077M7281O4683Nl5098K7113Q8531M5580m1544
11566D122251n0662J8602P7989R8104J03954P7484j0113j00185j01041k8225J5434
11555D223592p795l7674l1689j5641j2152p326m7q170j9005n125J2391p109l8213
11542D046037k1119K2384O410o9679r5663j4700Q2111Q3358M809n4359m6815o456
11530C936318J8792Q294l2218p0840o7547k0282K5872L2395N735k8152n5788p1117
11518C681462o9283n4791l1718O803M8118M4804j6086n8706j3389N7604L3993
11507C628811p0376j14859m9064J6088K086j7571K3777M6593k9790j15692p9833
11496C240170K6005M0821m2809o3821M8810J61028J30050l258q9149o0408J7850
$$ plain form
11485 3405289 3454830 3464037 3419596 3381419 3409218 3486991 3550766 3582256 3623785 3694939 3754984
11474 3754984 3769149 3753162 3724260 3669274 3596857 3556834 3559265 3534178 3427592 3283002 3170986
11463 3170986 3096933 3042914 3033583 3073384 3079476 2986244 2873277 2868048 2947036 2966344 2885348 2816316
11451 2816316 2825799 2832104 2763725 2689936 2697378 2736427 2706106 2627420 2609880 2674154 2725848 2710934
11439 2710934 2694825 2751124 2845240 2882114 2834055 2770806 2767661 2819829 2864105 2869161 2873926 2925146
11427 2925146 3005878 3062337 3088180 3132601 3217526 3295234 3311898 3276750 3241164 3236394 3254673
11416 3254673 3265957 3232651 3134670 3001647 2896024 2846868 2826061 2800428 2769580 2737484 2694066
11405 2694066 2650720 2645368 2678353 2691794 2652643 2606168 2598391 2597575 2556661 2508590 2521561 2587327
$$ packed form
11485C405289M9541R207m4441l8177K7799P7773O3775L1490M1529P1154O0045
11474C754984J4165j5987k8902n4986p2417m0023K431k5087j06586j44590j12016
11463C170986p4053n4019r331L9801O092r3232j12967n229P8988J9308q0996o9032
11451B816316R483O305o8379p3789P442L9049l0321p8686j7540O4274N1694j4914
11439B710934j6109N6299R4116L6874m8059o3249l145N2168M4276N056M765N1220
11427B925146Q0732N6459K5843M4421Q4925P7708J6664l5148l5586m770J8279
11416C254673J1284l3306r7981j33023j05623m9156k0807k5633l0848l2096m3418
11405B694066m3346n352L2985J3441l9151m6475p777q16m0914m8071J2971O5766
$$ plain form
11393 2587327 2632608 2626847 2605881 2599528 2606481 2632635 2684227 2729271 2733351 2720875 2726088 2703672
11381 2703672 2587772 2433570 2380765 2453102 2515010 2475491 2415713 2436615 2488185 2462415 2382526
11370 2382526 2371635 2462062 2552784 2558085 2501737 2444999 2399425 2345725 2289320 2259588 2269943
11359 2269943 2294967 2285771 2217242 2124912 2071404 2068284 2069010 2053395 2062020 2110644 2133924 2077487
11347 2077487 1993452 1964470 1971743 1931616 1841880 1789982 1812827 1845213 1829394 1791469 1778231
11336 1778231 1791532 1818789 1861185 1895464 1873247 1801354 1760474 1790816 1815253 1744031 1617969
11325 1617969 1569988 1652065 1767991 1793715 1717456 1631984 1612546 1640305 1654570 1647915 1664600
11314 1664600 1707610 1712261 1649763 1594601 1616676 1656221 1609886 1515906 1521932 1651147 1739088
$$ packed form
11393B587327M5281n761k0966o353O953K6154N1592M5044M080j2476N213k2416
11381B703672j15900j54202n2805P2337O1908l9519n9778K0902N1570k5770p9889
11370B382526j0891R0427R0722N301n6348n6738m5574n3700n6405k9732J0355
11359B269943K5024r196o8529r2330n3508l120P26j5615Q625M8624K3280n6437
11347B077487q4035k8982P273m0127q9736n1898K2845L2386j5819l7925j3238
11336A778231J3301K7257M2396L4279k2217p1893m0880L0342K4437p1222j26062
11325A617969m7981Q2077J15926K5724p6259q5472j9438K7759J4265o655J6685
11314A664600M3010M651o2498n5162K2075L9545m6335r3980O026J29215Q7941
$$ plain form
11303 1739088 1668678 1547893 1551466 1671572 1746608 1693929 1597317 1570262 1624649 1686505 1682657
11292 1682657 1605473 1525908 1526982 1598141 1636608 1587685 1520147 1505621 1499641 1434332 1361612 1381011
11280 1381011 1464454 1487322 1422425 1371692 1398080 1451407 1478538 1484986 1463313 1387255 1313404
11269 1313404 1356635 1506057 1591686 1511063 1373683 1331114 1372839 1398601 1396740 1420267 1451965
11258 1451965 1428340 1362877 1325062 1319904 1299424 1275264 1307233 1384000 1422162 1393262 1357167
11247 1357167 1355754 1360779 1345394 1326553 1312301 1278116 1222995 1190067 1206525 1250455 1291597 1318431
11235 1318431 1317764 1278926 1228821 1217106 1259177 1330254 1404435 1453390 1430551 1324990 1214457
11224 1214457 1188019 1227745 1248451 1237479 1252082 1286583 1268357 1204543 1199676 1281528 1339408
$$ packed form
11303A739088p0410j20785L573J20106P5036n2679r6612k7055N4387O1856l848
11292A682657p7184p9565J074P1159L8467m8923o7538j4526n980o5309p2720J9399
11280A381011Q3443K2868o4897n0733K6388N3327K7131O448k1673p6058p3851
11269A313404M3231J49422Q5629q0623j37380m2569M1725K5762j861K3527L1698
11258A451965k3625o5463l7815n158k0480k4160L1969P6767L8162k8900l6095
11247A357167j413N025j5385j8841j4252l4185n5121l2928J6458M3930M1142K6834
11235A318431o67l8838n0105j1715M2071P1077P4181M8955k2839j05561j10533
11224A214457k6438L9726K0706j0972J4603L4501j8226o3814m867Q1852N7880
$$ plain form
11213 1339408 1304805 1269232 1327744 1414350 1410980 1338313 1309616 1346022 1363026 1317145 1257888
11202 1257888 1242327 1281077 1354561 1413740 1394941 1305149 1249887 1295256 1355636 1321128 1242274
11191 1242274 1254377 1351886 1394327 1338459 1304886 1376548 1478022 1518044 1523326 1550167 1571021
11180 1571021 1541270 1496611 1494220 1522123 1548266 1597253 1692715 1776702 1776609 1715787 1676084 1682486
11168 1682486 1702923 1730742 1782465 1833319 1838388 1808771 1790773 1778021 1723677 1638559 1591349
11157 1591349 1593089 1561360 1438378 1284646 1206145 1223811 1261906 1250619 1200132 1167481 1173853
11146 1173853 1178244 1140749 1090830 1094790 1155188 1194740 1165793 1122632 1136210 1181322 1175876 1105664
11134 1105664 1035638 1006308 993200 974440 968721 987563 1007632 1012537 1016404 1030176 1046993 1069341
$$ packed form
11213A339408l4603l5573N8512Q6606l370p2667k8697L6406J7004m5881n9257
11202A257888j5561L8750P3484N9179j8799q9792n5262M5369O0380l4508p8854
11191A242274J2103R7509M2441n5868l3573P1662J01474M0022N282K6841K0854
11180A571021k9751m4659k391K7903K6143M8987R5462Q3987r3o0822l9703O402
11168A682486K0437K7819N1723N0854N069k9617j7998j2752n4344q5118m7210
11157A591349J740l1729j22982j53732p8501J7666L8095j1287n0487l2651O372
11146A173853M391l7495m9919L960O0398L9552k8947m3161J3578M5112n446p0212
11134A105664p0026k9330j3108j8760n719J8842K0069M905L867J3772J6817K2348
$$ plain form
11122 1069341 1103816 1125200 1102801 1068025 1085696 1142115 1143118 1060176 995216 1038118 1130800
11111 1130800 1154944 1104906 1080214 1129265 1192213 1201095 1158559 1101340 1050105 1020650 1034916
11100 1034916 1088273 1133925 1125769 1065803 1000865 982191 1022749 1077598 1076347 997689 900539 856039
11088 856039 864886 876237 871142 877840 908060 931606 927869 920010 938467 979359 1011734 1003519 941832
11075 941832 859710 834136 906414 1004511 1009939 918990 863709 931642 1038120 1049128 975768
11064 975768 950021 1027749 1118392 1127929 1082680 1066114 1098409 1139669 1173001 1216370 1262365 1268509
11052 1268509 1223165 1178598 1191494 1252969 1304114 1310475 1295050 1297370 1325206 1359874 1391281 1425083
11040 1425083 1461040 1489032 1511373 1546802 1600490 1648761 1669987 1674574 1683076 1688429 1668812 1631299
$$ packed form
11122A069341L4475K1384k2399l4776J7671N6419J003q2942o4960M2902R2682
11111A130800K4144n0038k4692M9051O2948Q882m2536n7219n1235k9455J4266
11100A034916N3357M5652q156n9966o4938j8674M0558N4849j251p8658r7150m4500
11088H56039Q847J1351n095O698L0220K3546l737p859J8457M0892L2375q215o1687
11075I41832q2122k5574P2278R8097N428r0949n5281O7933J06478J1008p3360
11064I75768k5747P7728R0643R537m5249j6566L2295M1260L3332M3369M5995O144
11052A268509m5344m4567J2896O1475N1145O361j5425K320K7836L4668L1407L3802
11040A425083L5957K7992K2341L5429N3688M8271K1226M587Q502N353j9617l7513
$$ plain form
11028 1631299 1607758 1602281 1578607 1518193 1459738 1449909 1473331 1468205 1407496 1330613 1288713 1288245
11016 1288245 1301159 1306128 1301208 1293357 1293877 1309830 1322442 1292036 1209906 1130008 1115198 1159439
11004 1159439 1200772 1208622 1212528 1235549 1250836 1232180 1203647 1200637 1216617 1229478 1246111 1271758
10992 1271758 1270314 1219686 1178144 1214648 1287961 1290329 1216742 1185379 1258651 1351071 1372068 1356704
10980 1356704 1370598 1380734 1335442 1297914 1359306 1461751 1461495 1358303 1304715 1367420 1437833
10969 1437833 1430114 1411248 1447332 1464456 1386661 1298109 1319826 1404112 1409751 1332728 1297824 1340095
10957 1340095 1362491 1325143 1314932 1379198 1434110 1409613 1364659 1375661 1413601 1423347 1435789
10946 1435789 1497824 1560374 1544973 1474466 1434258 1439887 1442558 1434460 1445300 1458318 1437332 1420320
$$ packed form
11028A631299k3541n477k3674o0414n8455r829K3422n126o0709p6883m1900m68
11016A288245J2914M969m920p851N20J5953J2612l0406q2130p9898j4810M4241
11004A159439M1333P850L906K3021J5287j8656k8533l010J5980J2861J6633K5647
10992A271758j444n0628m1542L6504P3313K368p3587l1363P3272R2420K0997j5364
10980A356704J3894J0136m5292l7528O1392J02445k56j03192n3588O2705P0413
10969A437833p719j8866L6084J7124p7795q8552K1717Q4286N639p7023l4904M2271
10957A340095K2396l7348j0211O4266N4912k4497m4954J1002L7940R746J2442
10946A435789O2035O2550j5401p0507m0208N629K671q098J0840J3018k0986j7012
$$ plain form
10934 1420320 1469777 1536829 1506367 1394226 1358070 1460610 1559155 1518679 1414779 1403052 1475979
10923 1475979 1497546 1433730 1390064 1416452 1424267 1348813 1274552 1313628 1433521 1498040 1448714
10912 1448714 1366026 1353903 1422552 1496947 1504492 1441599 1372162 1363587 1414075 1454749 1440896 1420152
10900 1420152 1472522 1592689 1683375 1679804 1633994 1642544 1724627 1814200 1851682 1835222 1792566
10889 1792566 1756492 1767784 1840687 1909838 1878119 1751611 1658262 1674550 1702004 1608833 1444444
10878 1444444 1384661 1470459 1543755 1486519 1389077 1391036 1464196 1480313 1425945 1403678 1441430
10867 1441430 1446870 1374867 1312519 1340952 1409997 1422920 1378760 1354061 1382860 1425128 1436315
10856 1436315 1412848 1377143 1358821 1383306 1445411 1500570 1508738 1479885 1456124 1460093 1478501 1483297
$$ packed form
10934A420320M9457O7052l0462j12141l6156J02540R8545m0476j03900j1727P2927
10923A475979K1567o3816m3666K6388P815p5454p4261L9076J19893O4519m9326
10912A448714q2688j2123O8649P4395P545o2893o9437q575N0488M0674j3853k0744
10900A420152N2370J20167R0686l571m5810Q550Q2083Q9573L7482j6460m2656
10889A792566l6074J1292P2903O9151l1719j26508r3349J6288K7454r3171j64389
10878A444444n9783Q5798P3296n7236r7442J959P3160J6117n4368k2267L7752
10867A441430N440p2003o2348K8433O9045J2923m4160k4699K8799M2268J1187
10856A436315k3467l5705j8322K4485O2105N5159Q168k8853k3761L969J8408M796
$$ plain form
10844 1483297 1454718 1400517 1362736 1379594 1428535 1442187 1399808 1360650 1375861 1412903 1414476
10833 1414476 1392411 1400590 1439585 1457045 1435400 1414430 1422803 1444608 1461455 1474445 1475262 1449779
10821 1449779 1424744 1455971 1546665 1627257 1644493 1625046 1619793 1632097 1644033 1671828 1736685
10810 1736685 1802273 1803538 1739511 1686468 1703478 1761852 1790134 1764249 1725964 1721293 1748460 1775950
10798 1775950 1793759 1824176 1882848 1952226 2004631 2033712 2050512 2068656 2108394 2184769 2263428
10787 2263428 2266337 2174545 2093485 2138088 2265618 2319539 2253665 2201059 2264301 2346382 2297334
10776 2297334 2155836 2105602 2210162 2331527 2342181 2293569 2302277 2360342 2361651 2278358 2208074
10765 2208074 2234974 2319720 2363754 2338180 2302821 2314083 2361069 2403599 2435400 2475936 2519089
$$ packed form
10844A483297k8579n4201l7781J6858M8941J3652m2379l9158J5211L7042J573
10833A414476k2065Q179L8995J7460k1645k0970Q373K1805J6847J2990Q17k5483
10821A449779k5035L1227R0694Q0592J7236j9447n253J2304J1936K7795O4857
10810A736685O5588J265o4027n3043J7010N8374K8282k5885l8285m671K7167K7490
10798A775950J7809L0417N8672O9378N2405K9081J6800J8144L9738P6375P8659
10787B263428K909r1792q1060M4603J27530N3921o5874n2606O3242Q2081m9048
10776B297334j41498n0234J04560J21365J0654m8612Q708N8065J309q3293p0284
10765B208074K6900Q4746M4034k5574l5359J1262M6986M2530L1801M0536M3153
$$ plain form
10754 2519089 2537645 2543555 2593978 2709139 2824138 2866181 2853816 2869169 2945731 3037935 3098757
10743 3098757 3129497 3141308 3122783 3071086 3010529 2951966 2875345 2785976 2744937 2791389 2862259
10732 2862259 2853106 2757467 2685672 2723782 2820860 2857291 2801729 2748983 2792290 2900057 2958084
10721 2958084 2918571 2856088 2860335 2921705 2967663 2980232 3009412 3070977 3104398 3066379 3010372
10710 3010372 3019585 3093383 3158960 3182214 3205744 3268613 3343709 3384247 3394894 3416524 3458380
10699 3458380 3490000 3503385 3540696 3633399 3740930 3791964 3782064 3785225 3852841 3942787 3982751
10688 3982751 3974052 3987226 4068673 4197020 4326949 4432799 4509848 4575846 4673194 4827070 5002387
10677 5002387 5149926 5289017 5479138 5709326 5902895 6055029 6266760 6587413 6918868
$$ packed form
10754B519089J8556N910N0423J15161J14999M2043j2365J5353P6562R2204O0822
10743C098757L0740J1811j8525n1697o0557n8563p6621q9369m1039M6452P0870
10732B862259r153r5639p1795L8110R7078L6431n5562n2746M3307J07767N8027
10721B958084l9513o2483M247O1370M5958J2569K9180O1565L3421l8019n6007
10710C010372R213P3798O5577K3254K3530O2869P5096M0538J0647K1630M1856
10699C458380L1620J3385L7311R2703J07531N1034r900L161O7616Q9946L9964
10688C982751q699J3174Q1447J28347J29929J05850P7049O5998R7348J53876J75317
10677E002387J47539J39091J90121K30188J93569J52134K11731L20653L31455
$$ plain form
10668 6918868 7160771 7368545 7658333 8019191 8352031 8659267 9047336 9538363 10026759
10659 10026759 10460226 10929058 11511695 12150139 12765632 13402218 14153117 15013290 15909871
10650 15909871 16827576 17793056 18765120 19653754 20441069 21174395 21826740 22268972 22418290
10641 22418290 22325791 22062838 21594666 20842653 19830288 18687603 17520094 16340391 15138115
10632 15138115 13956798 12866799 11896208 11030927 10271218 9643917 9147876 8725336 8319268
10623 8319268 7938611 7628233 7383903 7146119 6888324 6660981 6515631 6422452 6308020 6154791
10613 6154791 6015891 5935059 5892313 5835087 5734884 5607906 5499879 5448640 5441122 5414904 5327545
10602 5327545 5213208 5135523 5093608 5024167 4902922 4789450 4742399 4733090 4687127 4588784 4497040
$$ packed form
10668F918868K41903K07774K89788L60858L32840L07236L88069M91027M88396
10659A0026759M33467M68832N82637O38444O15493O36586P50899Q60173Q96581
10650A5909871R17705R65480R72064Q88634P87315P33326O52345M42232J49318
10641B2418290r2499k62953m68172p52013j012365j142685j167509j179703j202276
10632A5138115j181317j089999r70591q65281p59709o27301m96041m22540m06068
10623H319268l80657l10378k44330k37784k57795k27343j45350r3179j14432j53229
10613F154791j38900q0832m2746n7226j00203j26978j08027n1239p518k6218q7359
10602E327545j14337p7685m1915o9441j21245j13472m7051r309m5963r8343r1744
$$ plain form
10591 4497040 4460920 4459789 4442336 4398865 4369519 4384068 4415603 4410160 4354648 4289677 4246944 4204541
10579 4204541 4133912 4065809 4057510 4096822 4098490 4020587 3932708 3923610 3976326 3992022 3923012 3821182
10567 3821182 3748815 3700938 3646010 3597175 3591043 3611212 3585543 3473241 3322953 3224692 3220957
10556 3220957 3279571 3335644 3339296 3277632 3181637 3111150 3105039 3139096 3154321 3129658 3099978 3096551
10544 3096551 3105536 3104234 3102944 3117912 3129016 3104704 3055620 3025912 3037872 3075993 3116257 3140234
10532 3140234 3133427 3105641 3099344 3136698 3173115 3153114 3099145 3082426 3109053 3107874 3045771 2981782
10520 2981782 2974654 2999004 2993132 2940248 2866828 2807779 2803747 2877780 2979457 3011945 2955554 2900352
10508 2900352 2911124 2938292 2926420 2922038 2975270 3012851 2938445 2807831 2760585 2804098 2817965
$$ packed form
10591D497040l6120j131j7453m3471k9346J4549L1535n443n5512o4971m2733m2403
10579D204541p0629o8103q299L9312J668p7903q7879r098N2716J5696o9010j01830
10567C821182p2367m7877n4928m8835o132K0169k5669j12302j50288r8261l735
10556C220957N8614N6073L652o1664r5995p0487o111L4057J5225k4663k9680l427
10544C096551Q985j302j290J4968J1104k4312m9084k9708J1960L8121M0264K3977
10532C140234o807k7786o297L7354L6417k0001n3969j6719K6627j179o2103o3989
10520B981782p128K4350n872n2884p3420n9049m032P4033J01677L2488n6391n5202
10508B900352J0772K7168j1872m382N3232L7581p4406j30614m7246M3513J3867
$$ plain form
10497 2817965 2768712 2755481 2813497 2838163 2770466 2706576 2731179 2776154 2756793 2727328 2763279
10486 2763279 2789130 2689724 2533943 2508300 2638791 2746969 2708812 2608334 2579784 2622718
10476 2622718 2651947 2640149 2624174 2623564 2626787 2626771 2616063 2575877 2515487 2492206 2543879 2623675
10464 2623675 2650207 2612557 2582810 2621663 2702266 2741848 2701933 2645725 2676388 2806870 2921745
10453 2921745 2910013 2812769 2773155 2844702 2933159 2952187 2947047 3003108 3103669 3163601 3160473
10442 3160473 3141059 3119816 3067070 3001985 3003980 3096314 3187055 3174626 3071683 2979778 2964428
10431 2964428 2993354 2990376 2924135 2839108 2801352 2813339 2803571 2726025 2643024 2650950 2731729 2759651
10419 2759651 2683651 2618438 2685696 2828314 2883040 2813278 2757475 2826311 2954508 3013153 2992803
$$ packed form
10497B817965m9253j3231N8016K4666o7697o3890K4603M4975j9361k9465L5951
10486B763279K5851r9406j55781k5643J30491J08178l8157j00478k8550M2934
10476B622718K9229j1798j5975o10L223j6j0708m0186o0390k3281N1673P9796
10464B623675K6532l7650k9747L8853Q0603L9582l9915n6208L0663J30482J14875
10453B921745j1732r7244l9614P1547Q8457J9028n140N6061J00561N9932l128
10442C160473j9414k1243n2746o5085J995R2334R0741j2429j02943r1905j5350
10431B964428K8926k978o6241q5027l7756J1987r768p7546q3001P926Q0779K7922
10419B759651p6000o5213O7258J42618N4726o9762n5803O8836J28197N8645k0350
$$ plain form
10408 2992803 2989074 3044997 3102938 3115250 3117117 3153042 3191063 3166593 3086992 3038990 3088164 3204831
10396 3204831 3302676 3333631 3329686 3351811 3407877 3439725 3405347 3353904 3375745 3473751 3537272
10385 3537272 3476106 3335401 3227740 3187088 3156756 3100402 3041477 2987804 2903273 2786448 2703538
10374 2703538 2696941 2721747 2723312 2719244 2741905 2752901 2695253 2598166 2547829 2570262 2617383 2653947
10362 2653947 2681179 2688349 2667856 2671656 2755314 2860619 2862177 2756263 2689474 2749606 2840179
10351 2840179 2839611 2782947 2779986 2830255 2842120 2791266 2738923 2714199 2692721 2684021 2727466 2793630
10339 2793630 2796565 2725743 2668701 2675368 2694822 2684355 2687426 2745325 2808431 2804457 2742978 2690538
10327 2690538 2679939 2692441 2692237 2639128 2512928 2367043 2305391 2354392 2408860 2365145 2259988
$$ packed form
10408B992803l729N5923N7941J2312J867L5925L8021k4470p9601m8002M9174J16667
10396C204831R7845L0955l945K2125N6066L1848l4378n1443K1841R8006O3521
10385C537272o1166j40705j07661m0652l0332n6354n8925n3673q4531j16825q2910
10374B703538o597K4806J565m068K2661J0996n7648r7087n0337K2433M7121L6564
10362B653947K7232P170k0493L800Q3658J05305J558j05914o6789O0132R0573
10351B840179n68n6664k961N0269J1865n0854n2343k4724k1478q700M3445O6164
10339B793630K935p0822n7042O667J9454j0467L071N7899O3106l974o1479n2440
10327B690538j0599J2502k04n3109j26200j45885o1652M9001N4468m3715j05157
$$ plain form
10316 2259988 2206878 2235052 2272334 2262971 2219927 2168983 2116963 2078258 2068966 2070031 2049804 2022186
10304 2022186 2030542 2078688 2129672 2163343 2179550 2159971 2095730 2042720 2071350 2160517 2218883
10293 2218883 2213440 2193152 2181850 2148881 2106927 2127456 2211025 2247968 2176558 2085666 2077920 2117316
10281 2117316 2111808 2073034 2074900 2102627 2071902 1980507 1919903 1932411 1965164 1979439 2003143 2048227
10269 2048227 2070477 2051260 2039817 2069642 2101036 2094573 2082320 2112569 2168657 2195775 2178315
10258 2178315 2145296 2120927 2106509 2094428 2073437 2036824 2001608 1995852 2014868 2022011 2004983 1990652
10246 1990652 1987338 1961363 1899720 1848027 1848266 1881734 1913783 1949122 1992228 1998714 1935437 1859455
10234 1859455 1859810 1929744 1971578 1935693 1885370 1899332 1964826 2003955 1975182 1915867 1895080 1941076
$$ packed form
10316B259988n3110K8174L7282r363m3044n0944n2020l8705r292J065k0227k7618
10304B022186Q356M8146N0984L3671J6207j9579o4241n3010K8630Q9167N8366
10293B218883n443k0288j1302l2969m1954K0529Q3569L6943p1410r0892p746L9396
10281B117316n508l8774J866K7727l0725r1395o0604J2508L2753J4275K3704M5084
10269B048227K2250j9217j1443K9825L1394o463j2253L0249N6088K7118j7460
10258B178315l3019k4369j4418j2081k0991l6613l5216n756J9016P143j7028j4331
10246A990652l314k5975o1643n1693K39L3468L2049L5339M3106O486o3277p5982
10234A859455L55O9934M1834l5885n0323J3962O5494L9129k8773n9315k0787M5996
$$ plain form
10222 1941076 2012606 2043039 2017557 1987619 1990598 1985754 1915174 1808567 1763967 1817867 1894358
10211 1894358 1907243 1864442 1837494 1862713 1911137 1939228 1937824 1934333 1959492 2005479 2019022 1959140
10199 1959140 1861538 1810468 1837236 1885918 1897994 1887868 1901364 1937128 1956316 1948879 1941899 1949812
10187 1949812 1957668 1950915 1926710 1881852 1828802 1818163 1893533 2012350 2063544 1995748 1889213
10176 1889213 1859035 1914796 1968154 1966817 1955162 1982202 2009831 1967821 1870770 1812897 1843295
10165 1843295 1908736 1944121 1960613 1996548 2030548 2017755 1988549 2021618 2109999 2145118 2076196
10154 2076196 2005341 2051376 2174518 2228843 2166624 2093193 2108287 2182961 2234760 2254195 2292391
10143 2292391 2360749 2410379 2405942 2369550 2342801 2337849 2336842 2320139 2288172 2267317 2291725 2362684
$$ packed form
10222A941076P1530L0433k5482k9938K979m844p0580j06607m4600N3900P6491
10211A894358J2885m2801k6948K5219M8424K8091j404l491K5159M5987J3543n9882
10199A959140r7602n1070K6768M8682J2076j0126J3496L5764J9188p437o980P913
10187A949812P856o753k4205m4858n3050j0639P5370J18817N1194o7796j06535
10176A889213l0178N5761N3358j337j1655K7040K7629m2010r7051n7873L0398
10165A843295O5441L5385J6492L5935L4000j2793k9206L3069Q8381L5119o8922
10154B076196p0855M6035J23142N4325o2219p3431J5094P4674N1799J9435L8196
10143B292391O8358M9630m437l6392k6749m952j007j6703l1967k0855K4408P0959
$$ plain form
10131 2362684 2428435 2425599 2345316 2243018 2181244 2180791 2227936 2299641 2364748 2385940 2352438 2304294
10119 2304294 2296847 2339401 2390456 2414879 2420168 2426629 2427919 2404725 2364372 2340293 2352177 2386767
10107 2386767 2423131 2460692 2511412 2572908 2623220 2645468 2649503 2659151 2679201 2691151 2691658 2715392
10095 2715392 2791081 2885882 2936689 2942104 2972288 3061669 3144101 3145546 3102227 3117741 3219507
10084 3219507 3330799 3386662 3405136 3426004 3446696 3451378 3448572 3444526 3425409 3396195 3386653 3386627
10072 3386627 3336542 3229301 3156123 3180431 3222541 3162750 3025126 2954293 3016253 3125103 3183230
10061 3183230 3197174 3217426 3249038 3281347 3346330 3479299 3648638 3778149 3830196 3836038 3853813
10050 3853813 3912629 3981459 3985576 3880001 3711453 3572468 3492570 3425452 3349611 3307805 3312989
$$ packed form
10131B362684O5751k836q0283j02298o1774m53M7145P1705O5107K1192l3502m8144
10119B304294p447M2554N1055K4423N289O461J290k3194m0353k4079J1884L4590
10107B386767L6364L7561N0720O1496N0312K2248M035R648K0050J1950N07K3734
10095B715392P5689R4801N0807N415L0184Q9381Q2432J445m3319J5514J01766
10084C219507J11292N5863J8474K0868K0692M682k806m046j9117k9214r542k6
10072C386627n0085j07241p3178K4308M2110n9791j37624p0833O1960J08850N8127
10061C183230J3944K0252L1612L2309O4983J32969J69339J29511N2047N842J7775
10050C853813N8816O8830M117j05575j68548j38985p9898o7118p5841m1806N184
$$ plain form
10039 3312989 3292961 3195532 3091103 3087011 3173647 3243355 3247519 3244788 3286799 3343489 3373204 3395364
10027 3395364 3445316 3505353 3533171 3532073 3546188 3599385 3677879 3765323 3856980 3937996 3985211
10016 3985211 4006979 4053571 4159770 4289063 4367889 4380669 4400385 4504874 4685359 4867181
10006 4867181 5006712 5131168 5286253 5484200 5711486 5952420 6191402 6421134 6659548
9997 6659548 6929802 7219559 7500530 7793200 8153652 8574554 8967947 9294718 9648481 10138814
9987 10138814 10735412 11313642 11832483 12376262 13016654 13719060 14415645 15108705 15861009
9978 15861009 16715858 17656093 18628126 19597117 20587487 21657271 22816968 24005326 25181640
9969 25181640 26401977 27734231 29110944 30335574 31235788 31753687 31892189 31641371 30966715
$$ packed form
10039C312989k0028r7429j04429m092Q6636O9708M164k731M2011N6690K9715K2160
10027C395364M9952O0037K7818j098J4115N3197P8494Q7444R1657Q1016M7215
10016C985211K1768M6592J06199J29293P8826J2780J9716J04489J80485J81822
10006D867181J39531J24456J55085J97947K27286K40934K38982K29732K38414
9997F659548K70254K89757K80971K92670L60452M20902L93393L26771L53763M90333
9987A0138814N96598N78230N18841N43779O40392P02406O96585O93060P52304
9978A5861009Q54849R40235R72033R68991R90370J069784J159697J188358J176314
9969B5181640J220337J332254J376713J224630R00214N17899J38502k50818o74656
$$ plain form
9960 30966715 29822511 28194783 26196400 24089159 22109363 20277264 18483263 16751209
9952 16751209 15271794 14145530 13245085 12405655 11620113 10956102 10402948 9913372 9496155
9943 9496155 9150332 8797398 8399225 8053876 7840493 7656929 7368976 7043860 6849180 6769225
9933 6769225 6628840 6387531 6193863 6115675 6024884 5823635 5601602 5470442 5396798 5307406
9923 5307406 5223966 5175968 5096532 4930795 4753619 4657610 4606968 4522444 4430470 4395397 4371254
9912 4371254 4265493 4107120 4009329 3989968 3965387 3908349 3873946 3863865 3798986 3656172 3520087
9901 3520087 3460935 3449613 3425261 3368696 3286039 3195059 3143729 3165096 3203194 3168375 3074731
9890 3074731 3025073 3045058 3044966 2978127 2916605 2914017 2912021 2860339 2816519 2826868 2812053 2698205
$$ packed form
9960C0966715j144204j627728j998383k107241j979796j832099j794001j732054
9952A6751209j479415j126264r00445q39430p85542o64011n53154m89576m17217
9943I496155l45823l52934l98173l45349k13383j83564k87953l25116j94680p9955
9933F769225j40385k41309j93668p8188r0791k01249k22033j31160p3644q9392
9923E307406q3440m7998p9436j65737j77176r6009n0642q4524r1974l5073k4143
9912D371254j05761j58373r7791j9361k4581n7038l4403j0081o4879j42814j36085
9901C520087n9152j1322k4352n6565q2657r0980n1330K1367L8098l4819r3644
9890C074731m9658J9985r2o6839o1522k588j996n1682m3820J0349j4815j13848
$$ plain form
9878 2698205 2580702 2607081 2740766 2797607 2710594 2608693 2607633 2659079 2663644 2623535 2606927
9867 2606927 2635357 2681239 2727919 2766188 2765624 2709328 2638270 2615094 2655323 2722656 2772584 2776833
9855 2776833 2733247 2680456 2672441 2705626 2703932 2618324 2510997 2486448 2556120 2628592 2628367 2567145
9843 2567145 2493302 2430209 2386494 2377118 2398190 2411251 2386850 2346467 2335180 2366840 2416945 2454808
9831 2454808 2462384 2436131 2391348 2352249 2320832 2273902 2210961 2179247 2215885 2283632 2306932 2262683
9819 2262683 2191321 2126062 2067647 2033149 2061116 2136516 2171518 2113891 2030885 2021692 2075391 2091528
9807 2091528 2036136 1994537 2038740 2109228 2090003 1974375 1890368 1944742 2081863 2138420 2038035
9796 2038035 1893077 1877655 2013582 2135954 2089447 1908154 1758851 1746650 1836026 1936405
$$ packed form
9878B698205j17503K6379J33685N6841q7013j01901j060N1446M565m0109j6608
9867B606927K8430M5882M6680L8269n64n6296p1058k3176M0229O7333M9928M249
9855B776833m3586n2791q015L3185j694q5608j07327k4549O9672P2472k25o1222
9843B567145p3843o3093m3715r376K1072J3061k4401m0383j1287L1660N0105L7863
9831B454808P576k6253m4783l9099l1417m6930o2941l1714L6638O7747K3300m4249
9819B262683p1362o5259n8415l4498K7967P5400L5002n7627q3006r193N3699J6137
9807B091528n5392m1599M4203P0488j9225j15628q4007N4374J37121N6557j00385
9796B038035j44958j5422J35927J22372m6507j81293j49303j2201Q9376J00379
$$ plain form
9786 1936405 1990142 1979610 1924114 1887426 1924559 2000996 2024168 1972049 1921653 1926628 1947813 1946620
9774 1946620 1960193 2017187 2058749 2030389 1985452 1996319 2019031 1964267 1863946 1835203 1893675
9763 1893675 1937773 1921374 1903295 1906985 1879141 1830201 1862030 1982082 2039362 1949763 1846898
9752 1846898 1875843 1962157 1952876 1885508 1913039 2018365 2029618 1921399 1877419 1995922 2130880
9741 2130880 2123131 2025248 1976894 1989377 1990486 1985220 2028327 2097138 2121985 2105266 2100456 2111146
9729 2111146 2115357 2145834 2229748 2287942 2226988 2108807 2084190 2158656 2178585 2078672 1986610
9718 1986610 2016377 2101262 2130794 2132196 2187908 2260054 2244969 2161052 2134771 2198874 2237696 2169226
9706 2169226 2072499 2070365 2160121 2236747 2245930 2237240 2268658 2323629 2351958 2354411 2379710 2444343
$$ packed form
9786A936405N3737j0532n5496l6688L7133P6437K3172n2119n0396M975K1185j193
9774A946620J3573N6994M1562k8360m4937J0867K2712n4764j00321k8743N8472
9763A893675M4098j6399j8079L690k7844m8940L1829J20052N7280q9599j02865
9752A846898K8945Q6314r281o7368K7531J05326J1253j08219m3980J18503J34958
9741B130880p749r7883m8354J2483J109n266M3107O8811K4847j6719m810J0690
9729B111146M211L0477Q3914N8194o0954j18181k4617P4466J9929r9913r2062
9718A986610K9767Q4885K9532J402N5712P2146j5085q3917k6281O4103L8822o8470
9706B169226r6727k134Q9756P6626R183q690L1418N4971K8329K453K5299O4633
$$ plain form
9694 2444343 2506863 2545680 2615453 2769174 2948271 3028955 2989074 2951638 3025861 3175054 3299520
9683 3299520 3388372 3504289 3652201 3762573 3812256 3878677 4039789 4271244 4478093 4603011
9673 4603011 4682623 4812276 5060469 5402670 5745735 6036742 6329941 6714629 7197123 7698858
9663 7698858 8155862 8566067 8944390 9288873 9593824 9838498 9953194 9854965 9538159 9084854
9653 9084854 8571965 8014672 7412933 6799426 6218818 5702751 5278514 4953741 4682361 4403721
9643 4403721 4129542 3928998 3812786 3708493 3577188 3468306 3413340 3351176 3224462 3076329
9633 3076329 2978247 2926273 2883454 2860177 2867553 2851325 2766860 2668123 2623993 2597604 2518963 2429181
9621 2429181 2422933 2479617 2492985 2453625 2449017 2475585 2416185 2249366 2124803 2152420 2246236
$$ packed form
9694B444343O2520L8817O9773J53721J79097Q0684l9881l7436P4223J49193J24466
9683C299520Q8852J15917J47912J10372M9683O6421J61112K31455K06849J24918
9673D603011P9612J29653K48193L42201L43065K91007K93199L84688M82494N01735
9663G698858M57004M10205L78323L44483L04951K44674J14696r8229l16806m53305
9653I084854n12889n57293o01739o13507n80608n16067m24237l24773k71380k78640
9643D403721k74179k00544j16212j04293j31305j08882n4966o2164j26714j48133
9633C076329r8082n1974m2819k3277P376j6228q4465r8737m4130k6389p8641q9782
9621B429181o248N6684J3368l9360m608K6568n9400j66819j24563K7617R3816
$$ plain form
9610 2246236 2267867 2213090 2155169 2100375 2017583 1944748 1947523 2006191 2039927 2018317 1971923 1925479
9598 1925479 1896725 1925314 2019447 2101097 2086657 2002001 1940315 1927506 1912750 1877932 1866468
9587 1866468 1897792 1931020 1929565 1903474 1878495 1873063 1905680 1973665 2027891 2020610 1972350 1938705
9575 1938705 1923258 1886412 1832096 1815249 1859368 1928693 1982566 1996567 1940447 1815222 1711157
9564 1711157 1735702 1864525 1954425 1933829 1888224 1911516 1966626 1967789 1928684 1937309 2020413 2113859
9552 2113859 2151131 2118823 2040128 1961757 1945875 2017378 2117929 2158572 2124109 2089888 2127450
9541 2127450 2220118 2282967 2254896 2165035 2106511 2139103 2226598 2287164 2289611 2264770 2238250 2210782
9529 2210782 2203488 2247996 2310383 2302531 2211690 2145490 2188053 2277008 2299773 2256849 2235000 2252264
$$ packed form
9610B246236K1631n4777n7921n4794q2792p2835K775N8668L3736k1610m6394m6444
9598A925479k8754K8589R4133Q1650j4440q4656o1686j2809j4756l4818j1464
9587A866468L1324L3228j455k6091k4979n432L2617O7985N4226p281m8260l3645
9575A938705j5447l6846n4316j6847M4119O9325N3873J4001n6120j25225j04065
9564A711157K4545J28823Q9900k0596m5605K3292N5110J163l9105Q625Q3104R3446
9552B113859L7272l2308p8695p8371j5882P1503J00551M0643l4463l4221L7562
9541B127450R2668O2849k8071q9861n8524L2592Q7495O0566K447k4841k6520k7468
9529B210782p294M4508O2387p852r0841o6200M2563Q8955K2765m2924k1849J7264
$$ plain form
9517 2252264 2235732 2151258 2058413 2016604 2015456 2025247 2047315 2078606 2082766 2039525 1984205 1959019
9505 1959019 1954763 1939753 1926025 1963175 2063966 2166117 2187035 2112914 2020091 1998120 2058936
9494 2058936 2138783 2182068 2191087 2191825 2195779 2213602 2260285 2317958 2339514 2323814 2334848 2400265
9482 2400265 2450811 2427108 2386355 2411774 2467512 2460013 2411883 2437146 2544359 2610325 2581645
9471 2581645 2558581 2616266 2677369 2653793 2597086 2592654 2599590 2530088 2421666 2385197 2416607 2405817
9459 2405817 2326429 2275442 2304036 2339425 2319052 2287159 2293934 2296040 2240271 2174610 2181874 2243638
9447 2243638 2264196 2217981 2187061 2237098 2324700 2364235 2344831 2336193 2390245 2475143 2518209 2494249
9435 2494249 2450611 2446424 2486120 2524284 2524750 2497778 2480694 2496907 2538101 2578377 2601950 2618678
$$ packed form
9517B252264j6532q4474r2845m1809j148R791K2068L1291M160m3241n5320k5186
9505A959019m256j5010j3728L7150J00791J02151K0918p4121r2823k1971O0816
9494B058936P9847M3285R019P38L954J7823M6683N7673K1556j5700J1034O5417
9482B400265N0546k3703m0753K5419N5738p499m8130K5263J07213O5966k8680
9471B581645k3064N7685O1103k3576n6707m432O936o9502j08422l6469L1410j0790
9459B405817p9388n0987K8594L5389k0373l1893O775K106n5769o5661P264O1764
9447B243638K0558m6215l0920N0037Q7602L9535j9404q638N4052Q4898M3066k3960
9435B494249m3638m187L9696L8164M66k6972j7084J6213M1194M0276K3573J6728
$$ plain form
9423 2618678 2649699 2696644 2734525 2741539 2726215 2716351 2729795 2763185 2797568 2808166 2786053 2760399
9411 2760399 2775835 2829541 2856733 2808420 2723556 2688027 2733486 2811255 2856725 2845032 2794141
9400 2794141 2753063 2778479 2877912 2980722 3013566 2999906 3025856 3106729 3163028 3151171 3136548
9389 3136548 3186672 3265478 3307990 3340348 3425682 3521868 3511310 3385466 3288428 3324684 3412415
9378 3412415 3407542 3312484 3258265 3297398 3324581 3238186 3097080 3047598 3134251 3256196 3306172
9367 3306172 3288709 3281242 3325706 3394792 3443661 3460399 3466298 3484778 3514804 3535948 3545946 3580272
9355 3580272 3664107 3750859 3761022 3700311 3678528 3763789 3873881 3889908 3840576 3868750 4014533
9344 4014533 4144828 4143829 4078050 4094579 4219600 4349781 4412775 4444541 4507126 4605564 4704967
$$ packed form
9423B618678L1021M6945L7881P014j5324r864J3444L3390L4383J0598k2113k5654
9411B760399J5436N3706K7192m8313q4864l5529M5459P7769M5470j1693n0891
9400B794141m1078K5416R9433J02810L2844j3660K5950Q0873N6299j1857j4623
9389C136548N0124P8806M2512L2358Q5334R6186j0558j25844r7038L6256Q7731
9378C412415m873r5058n4219L9133K7183q6395j41106m9482Q6653J21945M9976
9367C306172j7463p467M4464O9086M8869J6738N899J8480L0026K1144R998L4326
9355C580272Q3835Q6752J0163o0711k1783Q5261J10092J6027m9332K8174J45783
9344D014533J30295r99o5779J6529J25021J30181O2994L1766O2585R8438R9403
$$ plain form
9333 4704967 4777072 4810573 4813930 4821227 4860883 4908466 4904150 4826969 4719391 4629362 4562905 4506873
9321 4506873 4462701 4436082 4419867 4407720 4404883 4412306 4422083 4437767 4471086 4509050 4520384 4510332
9309 4510332 4526697 4584898 4631671 4623709 4601180 4628751 4696225 4744162 4767673 4816563 4892593 4928602
9297 4928602 4894881 4856195 4883664 4964688 5041689 5091081 5117952 5118839 5106110 5132849 5230933 5348734
9285 5348734 5411843 5426091 5456494 5520531 5574867 5601523 5628505 5656935 5647238 5600202 5577561 5609652
9273 5609652 5649815 5656200 5652803 5668036 5679237 5667551 5662461 5675470 5656903 5586273 5537234 5569681
9261 5569681 5623796 5622276 5614293 5689304 5795133 5799168 5717729 5713213 5836519 5945409 5944714 5939565
9249 5939565 6038095 6146982 6119513 6010205 6004710 6136689 6247152 6233297 6184644 6223448 6329016
$$ packed form
9333D704967P2105L3501L357P297L9656M7583m316p7181j07578r0029o6457n6032
9321D506873m4172k6619j6215j2147k837P423R777J5684L3319L7964J1334j0052
9309D510332J6365N8201M6773p962k2529K7571O7474M7937K3511M8890P6030L6009
9297D928602l3721l8686K7469Q1024P7001M9392K6871Q87j2729K6739R8084J17801
9285E348734O3109J4248L0403O4037N4336K6656K6982K8430r697m7036k2641L2091
9273E609652M0163O385l397J5233J1201j1686n090J3009j8567p0630m9039L2447
9261E569681N4115j520p983P5011J05829M035q1439m516J23306J08890o95n149
9249E939565R8530J08887k7469j09308n495J31979J10463j3855m8653L8804J05568
$$ plain form
9238 6329016 6396624 6398614 6405745 6472488 6562887 6602664 6580921 6573785 6648526 6761855 6809047 6783803
9226 6783803 6809515 6958663 7120814 7147067 7071167 7061783 7173802 7285513 7305179 7303737 7375449
9215 7375449 7477562 7507533 7471207 7468448 7541791 7636673 7710178 7794705 7929341 8090035 8228762
9204 8228762 8346460 8478644 8618441 8708182 8733987 8785399 8957699 9204919 9371774 9402091
9194 9402091 9433649 9616865 9906246 10133348 10247307 10359781 10553712 10777637 10969281 11167988
9184 11167988 11430849 11720421 11961300 12156599 12367626 12609398 12842770 13060276 13314388
9175 13314388 13646871 14025311 14368136 14630279 14861013 15158159 15546286 15931845 16225810
9166 16225810 16477610 16809288 17235421 17648847 17988627 18308947 18652107 18968121 19213663
$$ packed form
9238F329016O7608J990P131O6743R0399L9777k1743p136P4741J13329M7192k5244
9226F783803K5712J49148J62151K6253p5900r384J12019J11711J9666j442P1712
9215G375449J02113K9971l6326k759P3343R4882P3505Q4527J34636J60694J38727
9204H228762J17698J32184J39797Q9741K5805N1412J72300K47220J66855L0317
9194I402091L1558J83216K89381K27102J13959J12474J93931K23925J91644J98707
9184A1167988K62861K89572K40879J95299K11027K41772K33372K17506K54112
9175A3314388L32483L78440L42825K62143K30734K97146L88127L85559K93965
9166A6225810K51800L31678M26133M13426L39780L20320L43160L16014K45542
$$ plain form
9157 19213663 19426821 19642304 19831390 19988312 20167361 20359406 20451350 20407679 20371507 20458816
9147 20458816 20566895 20542148 20438389 20425838 20517909 20591532 20635582 20761870 20972558 21131995
9137 21131995 21204929 21326999 21581644 21881807 22139389 22390852 22681674 22977751 23271557 23635594
9127 23635594 24088499 24541166 24954314 25412045 25957510 26504411 27010353 27584381 28299090
9118 28299090 29042628 29700414 30346275 31091268 31872423 32580768 33290166 34144885 35093123
9109 35093123 35952731 36697704 37457078 38248304 38939293 39490089 40010946 40533992 40934066
9100 40934066 41147857 41282683 41417244 41468893 41374070 41252676 41260118 41386696 41533272 41698042
9090 41698042 41958714 42330536 42763021 43242501 43800759 44448763 45178283 46001426 46929685
$$ packed form
9157A9213663K13158K15483J89086J56922J79049J92045R1944m3671l6172Q7309
9147B0458816J08079k4747j03759j2551R2071P3623M4050J26288K10688J59437
9137B1131995P2934J22070K54645L00163K57582K51463K90822K96077K93806L64037
9127B3635594M52905M52667M13148M57731N45465N46901N05942N74028P14709
9118B8299090P43538O57786O45861P44993P81155P08345P09398Q54719R48238
9109C5093123Q59608P44973P59374P91226O90989N50796N20857N23046M00074
9100D0934066K13791J34826J34561N1649r4823j21394P442J26578J46576J64770
9090D1698042K60672L71822M32485M79480N58258O48004P29520Q23143R28259
$$ plain form
9081 46929685 47951299 49075922 50342281 51728230 53130224 54507484 55968809 57621822
9073 57621822 59410323 61217295 63064687 65066937 67221747 69407795 71595488 73902209
9065 73902209 76396437 78992665 81619898 84376764 87411610 90722096 94185076 97747842
9057 97747842 101482210 105449195 109594716 113797507 117956230 121998090 125841125 129380724
9049 129380724 132495903 135049601 136900271 137938581 138115488 137434514 135940218 133741510
9041 133741510 131037983 128082164 125085397 122162979 119376351 116805077 114548052 112663138
9033 112663138 111142067 109954821 109092959 108557460 108330286 108383272 108705897 109304166 110172483
9024 110172483 111279175 112586105 114084460 115808632 117801645 120060052 122531175 125177486
$$ packed form
9081D6929685J021614J124623J266359J385949J401994J377260J461325J653013
9073E7621822J788501J806972J847392K002250K154810K186048K187693K306721
9065G3902209K494228K596228K627233K756866L034846L310486L462980L562766
9057I7747842L734368L966985M145521M202791M158723M041860L843035L539599
9049A29380724L115179K553698J850670J038310J76907o80974j494296k198708
9041A33741510k703527k955819k996767k922418k786628k571274k257025j884914
9033A12663138j521071j187246q61862n35499k27174N2986L22625N98269Q68317
9024A10172483J106692J306930J498355J724172J993013K258407K471123K646311
$$ plain form
9016 125177486 128012953 131044394 134213940 137462711 140832136 144422023 148250113 152253590
9008 152253590 156462669 161067951 166238658 171951091 178086039 184624472 191619717 199004360
9000 199004360 206558246 214074304 221420616 228388459 234595625 239625028 243178468 245004154
8992 245004154 244756734 242100098 237001618 229855598 221289270 211906674 202229452 192753010
8984 192753010 183895238 175854284 168599680 162055911 156248453 151223720 146886591 143028057
8976 143028057 139532572 136473726 133955476 131921418 130195997 128686615 127461205 126611402
8968 126611402 126103266 125804427 125629020 125613477 125849448 126367811 127101573 127954759 128892117
8959 128892117 129955078 131203714 132661846 134312542 136122154 138067221 140163087 142468625
$$ packed form
9016A25177486K835467L031441L169546L248771L369425L589887L828090M003477
9008A52253590M209079M605282N170707N712433O134948O538433O995245P384643
9000A99004360P553886P516058P346312O967843O207166N029403L553440J825686
8992B45004154k47420k656636n098480p146020q566328r382596r677222r476442
8984A92753010q857772q040954p254604o543769n807458n024733m337129l858534
8976A43028057l495485l058846k518250k034058j725421j509382j225410q49803
8968A26611402n08136k98839j75407j5543K35971N18363P33762Q53186R37358
8959A28892117J062961J248636J458132J650696J809612J945067K095866K305538
$$ plain form
8951 142468625 145031957 147822231 150743778 153723518 156747795 159804892 162838403 165774917
8943 165774917 168545282 171051536 173169993 174825127 176001664 176640152 176600400 175817659 174446391
8934 174446391 172757397 170934966 169081998 167387426 166137083 165525366 165569533 166250087 167623171
8925 167623171 169720894 172424649 175529610 178894883 182450007 186062866 189453401 192232072
8917 192232072 193986375 194339550 192982320 189723057 184591709 177946048 170435519 162768604
8909 162768604 155465921 148812641 142954710 137933866 133665827 130025527 126987636 124589465
8901 124589465 122748466 121250406 119971730 118992865 118414159 118165842 118096269 118162065 118422115
8892 118422115 118903610 119584217 120475065 121627248 123069569 124802119 126826735 129135398
$$ packed form
8951A42468625K563332K790274K921547K979740L024277L057097L033511K936514
8943A65774917K770365K506254K118457J655134J176537O38488l9752p82741j371268
8934A74446391j688994j822431j852968j694572j250343o11717M4167O80554J373084
8925A67623171K097723K703755L104961L365273L555124L612859L390535K778671
8917A92232072J754303L53175j357230l259263n131348o645661p510529p666915
8909A62768604p302683o653280n857931n020844m268039l640300l037891k398171
8901A24589465j840999j498060j278676r78865n78706k48317o9573O5796K60050
8892A18422115M81495O80607Q90848J152183J442321J732550K024616K308663
$$ plain form
8884 129135398 131705720 134544349 137674065 141042950 144543249 148189509 152182441 156715968
8876 156715968 161828946 167545497 174028534 181437235 189734662 198801210 208620728 219129589
8868 219129589 229970375 240671155 251030122 260993781 270077386 277184305 281121476 281088209
8860 281088209 276639769 267618906 254519534 238770337 222274910 206552907 192350420
8853 192350420 179868725 169063000 159744641 151686845 144762253 138895464 133901870 129530060
8845 129530060 125668827 122351660 119535226 117040773 114765181 112787212 111176965 109835594
8837 109835594 108634496 107608310 106879999 106454533 106213199 106089471 106136057 106406912 106864315
8828 106864315 107438620 108121281 108955385 109966650 111152021 112534330 114187356 116181812
$$ packed form
8884A29135398K570322K838629L129716L368885L500299L646260L992932M533527
8876A56715968N112978N716551O483037P408701Q297427R066548R819518J0508861
8868B19129589J0840786J0700780J0358967R963659R083605P106919L937171l3267
8860B81088209m448440r020863j3099372j5749197j6495427j5722003j4202487
8853A92350420j2481695j0805725r318359q057796o924592n866789m993594m371810
8845A29530060l861233l317167k816434k494453k275592j977969j610247j341371
8837A09835594j201098j026186p28311m25466k41334j23728M6586K70855M57403
8828A06864315N74305O82661Q34104J011265J185371J382309J653026J994456
$$ plain form
8820 116181812 118526924 121201312 124234273 127700129 131598004 135771929 139996259 144127026
8812 144127026 148127742 151945731 155385860 158092557 159629593 159603009 157769911 154077417
8804 154077417 148647840 141800977 134105870 126292430 118962336 112353638 106426340 101132021
8796 101132021 96500121 92492935 88945280 85728084 82870125 80425776 78296994 76300220
8788 76300220 74376209 72615367 71067687 69640377 68236099 66902949 65750357 64752559
8780 64752559 63747132 62650130 61574263 60666116 59896099 59109265 58248951 57408261 56652602
8771 56652602 55922112 55167479 54465891 53900705 53404725 52842252 52209161 51640214 51231203
8762 51231203 50948106 50702817 50429974 50095367 49714866 49364048 49094378 48854629 48574807
$$ packed form
8820A16181812K345112K674388L032961L465856L897875M173925M224330M130767
8812A44127026M000716L817989L440129K706697J537036k6584j833098l692494
8804A54077417n429577o846863p695107p813440p330094o608698n927298n294319
8796A01132021m631900m007186l547655l217196k857959k444349k128782j996774
8788G6300220j924011j760842j547680j427310j404278j333150j152592r97798
8780F4752559j005427j097002j075867r08147p70017p86834q60314q40690p55659
8771E6652602p30490p54633p01588n65186m95980n62473o33091n68947m09011
8762E1231203k83097k45289k72843l34607l80501l50818k69670k39749k79822
$$ plain form
8753 48574807 48295223 48102124 47959409 47741550 47436918 47174484 47022707 46904862 46753831
8744 46753831 46602984 46464927 46272408 46024091 45842950 45784533 45725452 45565714 45406611 45374769
8734 45374769 45390647 45299118 45144686 45110718 45224850 45325420 45314413 45255464 45202641 45108398 44945536
8723 44945536 44771584 44622637 44469757 44317521 44215780 44135757 43973819 43732129 43555746 43516415
8713 43516415 43491048 43347359 43133991 42980007 42901905 42824725 42722878 42630924 42567986 42544603
8703 42544603 42590336 42687898 42742280 42710266 42696519 42812760 43001707 43126783 43189039 43309636
8693 43309636 43517323 43706777 43820705 43927271 44078320 44225569 44339674 44494496 44750113
8684 44750113 45043814 45286867 45497951 45747793 46029347 46286364 46535509 46850733 47231534
$$ packed form
8753D8574807k79584j93099j42715k17859l04632k62434j51777j17845j51031
8744D6753831j50847j38057j92519k48317j81141n8417n9081j59738j59103l1842
8734D5374769J5878r1529j54432l3968J14132J00570j1007n8949n2823r4243j62862
8723D4945536j73952j48947j52880j52236j01741q0023j61938k41690j76383l9331
8713D3516415k5367j43689k13368j53984p8102p7180j01847r1954o2938k3383
8703D2544603M5733R7562N4382l2014j3747J16241J88947J25076O2256J20597
8693D3309636K07687J89454J13928J06566J51049J47249J14105J54822K55617
8684D4750113K93701K43053K11084K49842K81554K57017K49145L15224L80801
$$ plain form
8675 47231534 47587937 47874764 48154001 48490124 48858565 49207296 49548037 49920167 50302107
8666 50302107 50633483 50915639 51222282 51603234 52037234 52494398 52981117 53487920 53952387
8657 53952387 54334123 54690069 55109237 55594950 56084108 56572016 57130101 57781251 58444525
8648 58444525 59054294 59667413 60383627 61202639 62036667 62847200 63694109 64641212 65674946
8639 65674946 66743867 67840649 69009780 70279708 71606421 72899493 74118951 75339542
8631 75339542 76683311 78178325 79731276 81270988 82865827 84637274 86596370 88651318
8623 88651318 90765195 93010662 95447679 98036097 100717820 103514334 106475943 109582719
8615 109582719 112773237 116052279 119499243 123170453 127052968 131123580 135398874 139905445
$$ packed form
8675D7231534L56403K86827K79237L36123L68441L48731L40741L72130L81940
8666E0302107L31376K82156L06643L80952M34000M57164M86719N06803M64467
8657E3952387L81736L55946M19168M85713M89158M87908N58085O51150O63274
8648E8444525O09769O13119P16214Q19012Q34028Q10533Q46909R47103J033734
8639F5674946J068921J096782J169131J269928J326713J293072J219458J220591
8631G5339542J343769J495014J552951J539712J594839J771447J959096K054948
8623H8651318K113877K245467K437017K588418K681723K796514K961609L106776
8615A09582719L190518L279042L446964L671210L882515M070612M275294M506571
$$ plain form
8607 139905445 144641177 149588074 154727846 160021628 165414007 170898228 176551793 182458326
8599 182458326 188603281 194894751 201284099 207805159 214468745 221165109 227703994 233905918
8591 233905918 239602024 244577779 248590765 251444166 252976370 252959521 251069512 247010172
8583 247010172 240674383 232210166 222001586 210621019 198747418 187050362 176092879
8576 176092879 166265300 157709948 150289057 143721874 137832369 132632011 128130752 124154875
8568 124154875 120448481 116908239 113610475 110624452 107905735 105375177 102993067 100723972
8560 100723972 98521852 96397389 94427886 92652097 91012651 89440811 87933107 86497189
8552 86497189 85091516 83688634 82344684 81124143 79988923 78847627 77698597 76632791
$$ packed form
8607A39905445M735732M946897N139772N293782N392379N484221N653565N906533
8599A82458326O144955O291470O389348O521060O663586O696364O538885O201924
8591B33905918N696106M975755M012986K853401J532204j6849j890009m059340
8583B47010172o335789q464217j0208580j1380567j1873601j1697056j0957483
8576A76092879r827579q555352p420891o567183n889505n200358m501259l975877
8568A24154875l706394l540242l297764k986023k718717k530558k382110k269095
8560A00723972k202120k124463j969503j775789j639446j571840j507704j435918
8552H6497189j405673j402882j343950j220541j135220j141296j149030j065806
$$ plain form
8544 76632791 75684022 74762825 73781936 72786483 71897499 71150669 70451793 69699063 68902081
8535 68902081 68147291 67468692 66800586 66069660 65293381 64550339 63874303 63226499 62573753
8526 62573753 61943351 61373818 60844615 60294121 59701352 59117863 58602633 58135537 57622058
8517 57622058 57005565 56357758 55808100 55375013 54930031 54366866 53738886 53160482 52635634
8508 52635634 52089154 51525213 51019589 50561292 50050876 49487669 49008676 48672783 48345901
8499 48345901 47902277 47420254 47050843 46784694 46493244 46140248 45806062 45534288 45290944
8490 45290944 45059632 44852226 44636948 44376917 44128471 43973846 43861611 43652155 43333927
8481 43333927 43053574 42899514 42791733 42633857 42444961 42278669 42130443 41995888 41911973 41865441
$$ packed form
8544G6632791r48769r21197r80889r95453q88984p46830o98876p52730p96982
8535F8902081p54790o78599o68106p30926p76279p43042o76036o47804o52746
8526F2573753o30402n69533n29203n50494n92769n83489n15230m67096n13479
8517E7622058o16493o47807n49658m33087m44982n63165o27980n78404n24848
8508E2635634n46480n63941n05624m58297n10416n63207m78993l35893l26882
8499D8345901m43624m82023l69411k66149k91450l52996l34186k71774k43344
8490D5290944k31312k07406k15278k60031k48446j54625j12235k09456l18228
8481D3333927k80353j54060j07781j57876j88896j66292j48226j34555q3915m6532
$$ plain form
8471 41865441 41764070 41577555 41402925 41303642 41193821 40992438 40788927 40715730 40731109 40679740
8461 40679740 40523457 40362309 40253116 40158617 40071789 40037797 40026661 39920659 39674291 39374033
8451 39374033 39093764 38800093 38458185 38126179 37863171 37623482 37332165 37011606 36746587
8442 36746587 36559241 36400793 36246527 36119589 36022735 35916293 35779705 35645183 35549393 35483686
8432 35483686 35410885 35312713 35208262 35135857 35118861 35137161 35133454 35063105 34938789 34810332 34699108
8421 34699108 34573107 34398275 34195345 34020993 33899514 33804651 33716645 33660752 33658689 33670444
8411 33670444 33635818 33566999 33543074 33601389 33691205 33759730 33825474 33923089 34028519 34098711 34143109
8400 34143109 34182290 34164050 34005845 33715148 33385612 33066084 32713909 32299362 31878849 31527353
$$ packed form
8471D1865441j01371j86515j74630r9283j09821k01383k03511p3197J5379n1369
8461D0679740j56283j61148j09193r4499q6828l3992j1136j06002k46368l00258
8451C9374033k80269k93671l41908l32006k63008k39689k91317l20559k65019
8442C6746587j87346j58448j54266j26938r6854j06442j36588j34522r5790o5707
8432C5483686p2801r8172j04451p2405j6996J8300l707p0349j24316j28457j11224
8421C4699108j26001j74832k02930j74352j21479r4863q8006n5893k063J1755
8411C3670444l4626o8819k3925N8315Q9816O8525O5744R7615J05430P0192M4398
8400C4143109L9181j8240j58205k90697l29536l19528l52175m14547m20513l51496
$$ plain form
8390 31527353 31260729 31060465 30911150 30769712 30563397 30280490 30011378 29832527 29695073
8381 29695073 29504254 29268157 29072884 28933248 28778356 28588960 28429506 28306058 28114633
8372 28114633 27815081 27553835 27483942 27520229 27426560 27140259 26850119 26708467 26625081 26452394
8362 26452394 26241797 26150747 26168550 26127491 25979869 25872902 25899200 25947737 25897889 25811856 25801471
8351 25801471 25821302 25758825 25656969 25663674 25778379 25823845 25697745 25502948 25371885 25281366
8341 25281366 25116078 24834786 24504420 24220396 24039370 23945729 23852453 23677590 23436791 23214274
8331 23214274 23045013 22895037 22754300 22653457 22573107 22440969 22254674 22106135 22037988 21975429
8321 21975429 21855193 21723296 21640013 21582791 21513951 21451701 21399880 21303404 21154501 21042867
$$ packed form
8390C1527353k66624k00264j49315j41438k06315k82907k69112j78851j37454
8381B9695073j90819k36097j95273j39636j54892j89396j59454j23448j91425
8372B8114633k99552k61246o9893L6287r3669k86301k90140j41652q3386j72687
8362B6452394k10597r1050J7803m1059j47622j06967K6298M8537m9848q6033j0385
8351B5801471J9831o2477j01856O705J14705M5466j26100j94797j31063r0519
8341B5281366j65288k81292l30366k84024j81026r3641r3276j74863k40799k22517
8331B3214274j69261j49976j40737j00843q0350j32138j86295j48539o8147o2559
8321B1975429j20236j31897q3283n7222o8840o2250n1821r6476j48903j11634
$$ plain form
8311 21042867 21010196 20961596 20825415 20685963 20630180 20580977 20443712 20310946 20327296 20430324
8301 20430324 20437878 20338244 20268018 20236489 20122391 19948005 19892060 19977142 20001095 19871361 19761182
8290 19761182 19802434 19853410 19746491 19571110 19505010 19515454 19448095 19305364 19214849 19187890 19121360
8279 19121360 19005045 18933614 18926571 18910276 18870260 18854665 18831422 18715949 18555576 18510552 18607204
8268 18607204 18673363 18589990 18463059 18448636 18518708 18515716 18376756 18198244 18099951 18100796 18128115
8257 18128115 18105526 18024507 17938586 17884574 17829572 17727446 17602667 17520665 17487820 17449887 17390035
8246 17390035 17354417 17364539 17374790 17346868 17308128 17299036 17304594 17273881 17184599 17066267 16972220
8235 16972220 16931936 16919067 16880662 16812300 16768228 16768575 16750199 16663251 16559235 16508460 16487157
$$ packed form
8311B1042867l2671m8600j36181j39452n5783m9203j37265j32766J6350J03028
8301B0430324P554r9634p0226l1529j14098j74386n5945Q5082K3953j29734j10179
8290A9761182M1252N0976j06919j75381o6100J0444o7359j42731r0515k6959o6530
8279A9121360j16315p1431p043j6295m0016j5595k3243j15473j60373m5024R6652
8268A8607204O6159q3373j26931j4423P0072k992j38960j78512r8293Q45K7319
8257A8128115k2589q1019q5921n4012n5002j02126j24779q2002l2845l7933n9852
8246A7390035l5618J0122J0251k7922l8740r092N558l0713q9282j18332r4047
8235A6972220m0284j2869l8405o8362m4072L47j8376q6948j04016n0775k1303
$$ plain form
8224 16487157 16440879 16402435 16426323 16455456 16400951 16322704 16359013 16483366 16522557 16442614 16412601
8213 16412601 16517678 16613036 16572006 16489990 16497377 16535523 16490962 16416801 16430773 16494963 16490450
8202 16490450 16434034 16426219 16441411 16368540 16225271 16134144 16101170 16013754 15860826 15760507 15747282
8191 15747282 15721743 15651075 15632664 15698666 15737462 15691774 15667988 15745962 15828434 15798721 15704908
8180 15704908 15661561 15669036 15657149 15627374 15625655 15633786 15604255 15558503 15549320 15566205 15566702 15557284 15561508
8167 15561508 15562515 15561748 15627739 15782986 15908304 15885632 15786043 15777210 15877667 15955019 15957241 15981032
8155 15981032 16083115 16181752 16209541 16229382 16311685 16404340 16426332 16410834 16445026 16516905 16531907
8144 16531907 16462967 16384075 16349488 16325533 16267072 16193181 16146530 16124756 16100408 16082215 16103050
$$ packed form
8224A6487157m6278l8444K3888K9133n4505p8247L6309J24353L9191p9943l0013
8213A6412601J05077R5358m1030q2016P387L8146m4561p4161J3972O4190m513
8202A6490450n6416p815J5192p2871j43269r1127l2974q7416j52928j00319j3225
8191A5747282k5539p0668j8411O6002L8796m5688k3786P7974Q2472k9713r3813
8180A5704908m3347P475j1887k9775j719Q131k9531m5752r183J6885M97r418M224
8167A5561508J007p67O5991J55247J25318k2672r9589q833J00457P7352K222K3791
8155A5981032J02083R8637K7789J9841Q2303R2655K1992j5498L4192P1879J5002
8144A6531907o8940p8892l4587k3955n8461p3891m6651k1774k4348j8193K0835
$$ plain form
8133 16103050 16152181 16173881 16152406 16151874 16233013 16363958 16466102 16525774 16592753 16674944 16718051
8122 16718051 16710284 16722103 16796977 16881622 16927640 16987784 17127143 17301726 17427413 17522268 17664237
8111 17664237 17837763 17951639 18001512 18078578 18202232 18285841 18310812 18392778 18598884 18825924
8101 18825924 18961774 19062014 19243565 19483301 19660871 19753751 19847348 19968292 20047857 20066232
8091 20066232 20106502 20222666 20356833 20442992 20508557 20604174 20696852 20717251 20685235 20706761 20837240
8080 20837240 21006518 21107574 21125484 21140358 21213817 21319001 21402360 21471420 21567523 21673043
8070 21673043 21723477 21724693 21775319 21928161 22105692 22221833 22317806 22479957 22676139 22801352
8060 22801352 22868585 23013197 23281919 23551742 23719102 23851368 24061711 24331801 24573803 24798803
$$ packed form
8133A6103050M9131K1700k1475n32Q1139J30945J02144N9672O6979Q2191M3107
8122A6718051p767J1819P4874Q4645M6018O0144J39359J74583J25687R4855J41969
8111A7664237J73526J13876M9873P7066J23654Q3609K4971Q1966K06106K27040
8101A8825924J35850J00240J81551K39736J77570R2880R3597J20944P9565J8375
8091B0066232M0270J16164J34167Q6159O5565R5617R2678K0399l2016K1526J30479
8080B0837240J69278J01056J7910J4874P3459J05184Q3359O9060R6103J05520
8070B1673043N0434J216N0626J52842J77531J16141R5973J62151J96182J25213
8060B2801352O7233J44612K68722K69823J67360J32266K10343K70090K42002K25000
$$ plain form
8050 24798803 25085613 25407844 25635463 25734166 25842379 26088875 26420660 26690945 26863507 27038808
8040 27038808 27291679 27569934 27780902 27918601 28054829 28228412 28395364 28492731 28509913 28476027
8030 28476027 28406373 28290573 28115302 27868748 27539797 27150533 26776694 26487260 26264863 26037190
8020 26037190 25791391 25595165 25484533 25399707 25278270 25154535 25104304 25130510 25168670 25177805
8010 25177805 25163551 25138280 25126907 25185908 25334287 25482359 25524090 25497079 25543090 25693118 25813978
7999 25813978 25820213 25814440 25918012 26063112 26093176 26017383 26008026 26139274 26271916 26249485 26099330
7988 26099330 25963746 25906198 25870653 25791498 25659689 25488999 25284521 25056728 24824607 24592667
7978 24592667 24350783 24099867 23850967 23595393 23305355 22979441 22667043 22425473 22256537
$$ packed form
8050B4798803K86810L22231K27619R8703J08213K46496L31785K70285J72562J75301
8040B7038808K52871K78255K10968J37699J36228J73583J66952R7367J7182l3886
8030B8476027o9654j15800j75271k46554l28951l89264l73839k89434k22397k27673
8020B6037190k45799j96226j10632q4826j21437j23735n0231K6206L8160R135
8010B5177805j4254k5271j1373N9001J48379J48072M1731k7011M6011J50028J20860
7999B5813978O235n773J03572J45100L0064p5793r357J31248J32642k2431j50155
7988B6099330j35584n7548l5545p9155j31809j70690k04478k27793k32121k31940
7978B4592667k41884k50916k48900k55574k90038l25914l12398k41570j68936
$$ plain form
7969 22256537 22101456 21903719 21669630 21458849 21317021 21228066 21137303 21009545 20851817 20688390
7959 20688390 20533850 20389980 20250407 20105595 19957799 19826847 19718552 19592061 19394602
7950 19394602 19137354 18897855 18725059 18576213 18378140 18120932 17852649 17605529 17374274
7941 17374274 17153863 16948307 16743385 16518299 16288274 16086662 15894071 15640358 15307717
7932 15307717 14985043 14771503 14651825 14519543 14316609 14096977 13935916 13819503 13665271
7923 13665271 13440947 13217681 13082802 13026631 12957732 12827413 12687650 12599710 12532974 12409514
7913 12409514 12224283 12054579 11951559 11886739 11818304 11746566 11677026 11588273 11476522 11381524
7903 11381524 11321628 11247197 11112224 10954815 10844642 10776378 10682571 10541840 10409489 10335063
$$ packed form
7969B2256537j55081j97737k34089k10781j41828q8955r0763j27758j57728j63427
7959B0688390j54540j43870j39573j44812j47796j30952j08295j26491j97459
7950A9394602k57248k39499j72796j48846j98073k57208k68283k47120k31255
7941A7374274k20411k05556k04922k25086k30025k01612j92591k53713l32641
7932A5307717l22674k13540j19678j32282k02934k19632j61061j16413j54232
7923A3665271k24324k23266j34879n6171o8899j30319j39763q7940o6736j23460
7913A2409514j85231j69704j03020o4820o8435p1738o9540q8753j11751r4998
7903A1381524n9896p4431j34973j57409j10173o8264r3807j40731j32351p4426
$$ plain form
7893 10335063 10300045 10246898 10136278 9977266 9829446 9757469 9747675 9698964 9548555 9373582
7883 9373582 9294701 9305943 9294289 9216439 9143445 9114154 9064857 8955125 8854848 8829476 8824575
7872 8824575 8751785 8624569 8520329 8459497 8410018 8368631 8347770 8314807 8231877 8129328 8057051
7861 8057051 7994917 7901716 7818088 7811708 7843682 7812597 7724385 7683957 7705488 7677569 7561051
7850 7561051 7473834 7497785 7533717 7460396 7330839 7276973 7295872 7277516 7200325 7146435 7132718
7839 7132718 7076888 6957600 6874416 6893997 6944907 6934083 6880996 6855342 6846377 6786333 6671119
7828 6671119 6571205 6528748 6512285 6476410 6410612 6324655 6237752 6189257 6205755 6242809 6217266
7817 6217266 6125750 6069039 6105751 6138972 6037237 5842170 5743705 5825707 5943262 5920142 5785002
$$ packed form
7893A0335063l5018n3147j10620j59012j47820p1977r794m8711j50409j74973
7883I373582p8881J1242j1654p7850p2994k9291m9297j09732j00277k5372m901
7872H824575p2790j27216j04240o0832m9479m1387k0861l2963q2930j02549p2277
7861H057051o2134r3201q3628o380L1974l1085q8212m0428K1531k7919j16518
7850G561051q7217K3951L5932p3321j29557n3866J8899j8356p7191n3890j3717
7839G132718n5830j19288q3184J9581N0910j0824n3087k5654q965o0044j15214
7828F671119r9914m2457j6463l5875o5798q5957q6903m8495J6498L7054k5543
7817F217266r1516n6711L6712L3221j01735j95067r8465Q2002J17555k3120j35140
$$ plain form
7806 5785002 5711744 5771001 5854776 5845191 5754665 5670917 5641836 5651076 5650060 5586320 5452617 5325880
7794 5325880 5296567 5344501 5361394 5317787 5307395 5375442 5412438 5311711 5143530 5053968 5052365
7783 5052365 5030099 4953163 4895692 4888751 4872064 4816221 4771872 4763898 4743637 4685228 4631906 4606495
7771 4606495 4571204 4518931 4505327 4537515 4533559 4461660 4417215 4467759 4511733 4412389 4214119
7760 4214119 4095428 4128093 4203467 4203512 4139849 4093369 4094401 4106625 4089798 4044953 4007525 4002394
7748 4002394 4007765 3986536 3953560 3960218 3995496 3973538 3863124 3755439 3738736 3777704 3796473
7737 3796473 3804447 3833724 3823983 3709485 3574450 3563702 3654602 3681160 3591571 3510990 3515184 3519346
7725 3519346 3461947 3427743 3478528 3509787 3416435 3288779 3286731 3391853 3441087 3368724 3269003
$$ packed form
7806E785002p3258N9257Q3775r585r0526q3748k9081R240j016o3740j33703j26737
7794E325880k9313M7934J6893m3607j0392O8047L6996j00727j68181q9562j603
7783E052365k2266p6936n7471o941j6687n5843m4349p974k0261n8409n3322k5411
7771D606495l5291n2273j3604L2188l956p1899m4445N0544M3974r9344j98270
7760D214119j18691L2665P5374M5o3663m6480J032J2224j6827m4845l7428n131
7748D002394N371k1229l2976O658L5278k1958j10414j07685j6703L8968J8769
7737C796473P974K9277r741j14498j35035j0748R0900K6558q9589q0581M194M162
7725C519346n7399l4204N0785L1259r3352j27656k048J05122M9234p2363r9721
$$ plain form
7714 3269003 3229738 3233560 3234667 3227897 3219461 3203510 3182411 3159902 3121829 3067462 3029455 3013519
7702 3013519 2970173 2893200 2878840 2988171 3112623 3101755 2979409 2893599 2886897 2876574 2844422
7691 2844422 2860883 2904275 2853901 2720829 2689546 2830689 2954145 2884813 2726871 2685415 2751590
7680 2751590 2759905 2675140 2614761 2620940 2610085 2554264 2533080 2574311 2601120 2582685 2593057 2660292
7668 2660292 2688703 2611495 2512235 2501158 2550942 2551833 2476947 2400774 2379892 2393359 2397293 2384871
7656 2384871 2384130 2416460 2457530 2449243 2378333 2322101 2354569 2420712 2395092 2274884 2203590 2260315
7644 2260315 2341314 2328975 2269940 2271693 2308698 2275356 2183531 2151157 2201385 2224024 2164074 2110659
7632 2110659 2141650 2196267 2182030 2122051 2105667 2146309 2174327 2144583 2081765 2031760 2019232
$$ packed form
7714C269003l9265L822J107o770q436j5951k1099k2509l8073n4367l8007j5936
7702C013519m3346p6973j4360J09331J24452j0868j22346q5810o702j0323l2152
7691B844422J6461M3392n0374j33072l1283J41143J23456o9332j57942m1456O6175
7680B751590Q315q4765o0379O179j0855n5821k1184M1231K6809j8435J0372O7235
7668B660292K8411p7208r9260j1077M9784Q91p4886p6173k0882J3467L934j2422
7656B384871p41L2330M1070q287p0910n6232L2468O6143k5620j20208p1294N6725
7644B260315Q0999j2339n9035J753L7005l3342r1825l2374N0228K2639n9950n3415
7632B110659L0991N4617j4237n9979j6384M0642K8018k9744o2818n0005j2528
$$ plain form
7621 2019232 2042336 2072025 2072369 2049635 2052255 2091341 2103535 2041631 1960594 1945247 1981131 1979289
7609 1979289 1919575 1878074 1897173 1921097 1904721 1901752 1968479 2040408 2006550 1885048 1816436
7598 1816436 1865746 1935654 1927735 1893241 1928517 1990414 1952725 1829495 1787718 1892968 1988335
7587 1988335 1926858 1803860 1808950 1924975 1960902 1865771 1808355 1895315 1996590 1957152 1832041
7576 1832041 1771436 1785104 1780770 1757124 1782457 1823450 1779066 1680467 1674439 1777206 1821801 1716633
7564 1716633 1593398 1597980 1674126 1681887 1621831 1596386 1622119 1631230 1619857 1649307 1712199 1730786
7552 1730786 1693808 1673327 1689384 1674292 1602516 1548719 1570501 1623569 1642987 1630348 1611969
7541 1611969 1585458 1559012 1570967 1614657 1616568 1552306 1508990 1553344 1611230 1581322 1508934 1518511
$$ packed form
7621B019232K3104K9689L44k2734K620L9086J2194o1904q1037j5347L5884j842
7609A979289n9714m1501J9099K3924j6376k969O6727P1929l3858j21502o8612
7598A816436M9310O9908p919l4494L5276O1897l7689j23230m1777J05250R5367
7587A988335o1477j22998N090J16025L5927r5131n7416Q6960J01275l9438j25111
7576A832041o0605J3668m334k3646K5333M0993m4384r8599o028J02767M4595j05168
7564A716633j23235M582P6146P761o0056k5445K5733R111j1373K9450O2892J8587
7552A730786l6978k0481J6057j5092p1776n3797K1782N3068J9418j2639j8379
7541A611969k6511k6446J1955M3690J911o4262m3316M4354N7886k9908p2388R577
$$ plain form
7529 1518511 1602961 1623756 1532172 1450418 1481315 1557080 1558706 1495350 1466232 1501596 1544590 1562526
7517 1562526 1575218 1576110 1520544 1415903 1345699 1364095 1422922 1447385 1438399 1445691 1469762 1456654
7505 1456654 1390154 1330267 1333732 1373326 1374270 1318826 1276841 1319702 1426078 1497838 1467700 1369075
7493 1369075 1289922 1277667 1310795 1347838 1366370 1353515 1304751 1255239 1268807 1351873 1411412
7482 1411412 1362009 1260633 1254669 1377352 1476547 1403827 1215085 1101703 1148753 1251050 1276877
7471 1276877 1229726 1203062 1232680 1260571 1231405 1169791 1144581 1180056 1224511 1212441 1149789
7460 1149789 1114485 1156333 1221161 1216358 1142448 1100562 1150694 1220602 1202260 1100758 1027069
7449 1027069 1053643 1132569 1166450 1120455 1045510 1011252 1030950 1048733 1004202 913185 862414
$$ packed form
7529A518511Q4450K0795r1584q1754L0897P5765J626o3356k9118L5364M2994J7936
7517A562526J2692Q92n5566j04641p0204J8396N8827K4463q986P292K4071j3108
7505A456654o6500n9887L465L9594R44n5444m1985M2861J06376P1760l0138r8625
7493A369075p9153j2255L3128L7043J8532j2855m8764m9512J3568Q3066N9539
7482A411412m9403j01376n964J22683R9195p2720j88742j13382M7050J02297K5827
7471A276877m7151k6664K9618K7891k9166o1614k5210L5475M4455j2070o2652
7460A149789l5304M1848O4828m803p3910m1886N0132O9908j8342j01502p3689
7449A027069K6574P8926L3881m5995p4945l4258J9698J7783m4531r1017n0771
$$ plain form
7438 862414 903808 980291 996612 946766 916098 954670 1008572 1004124 951817 921818 943583 978654
7426 978654 985985 969655 952374 936488 913755 894292 897603 918158 927480 920352 931055 974813
7414 974813 993568 912626 758367 661427 706248 824435 890865 885956 886735 918758 915879 844799
7402 844799 774122 768577 791400 781614 768346 819489 909408 934382 859397 764856 730983 749971
7390 749971 778870 808397 835105 824247 760286 697487 698351 742291 755844 723717 706191 739148
7378 739148 778427 770342 729154 706516 716860 734431 743505 749927 753540 747796 741386 744035 735987
7365 735987 691983 634627 619029 657753 706336 731593 741232 731701 674835 592169 570589 642498
7353 642498 713839 691947 629924 641267 711790 724817 661903 633922 685633 715322 654337 591857
$$ packed form
7438H62414M1394P6483J6321m9846l0668L8572N3902m448n2307k9999K1765L5071
7426I78654P331j6330j7281j5886k2733j9463L311K0555R322p128J0703M3758
7414I74813J8755q0942j54259r6940M4821J18187O6430m909P79L2023k879p1080
7402H44799p0677n545K2823r786j3268N1143Q9919K4974p4985r4541l3873J8988
7390G49971K8899K9527K6708j0858o3961o2799Q64M3940J3553l2127j7526L2957
7378G39148L9279q085m1188k2638J0344J7571R074O422L613n744o410K649q048
7365G35987m4004n7356j5598L8724M8583K5257R639r531n6866q2666k1580P1909
7353F42498P1341k1892o2023J1343P0523J3027o2914k7981N1711K9689o0985o2480
$$ plain form
7341 591857 621103 674502 638915 551002 533733 590201 611697 570177 551430 587527 599801 544580
7329 544580 488971 490891 515902 532145 579842 669614 709100 629008 510482 481601 536364 563546
7317 563546 524763 492493 515181 549396 548281 532118 534396 541321 526317 500654 490347 491058 479295
7304 479295 451210 426088 423044 448406 491570 521957 507983 454205 404387 391616 399668 394484
7292 394484 382326 404056 464669 501864 457190 364301 321124 364283 418341 402910 346171 332037
7280 332037 363379 362619 309910 284790 331945 375909 341909 290196 329020 433494 467443 385803
7268 385803 302337 320522 393881 417148 382747 363709 383088 391413 366316 349981 366955 374654
7256 374654 337070 295379 308176 353869 361988 331809 339549 405485 434691 351095 231017 215630
$$ packed form
7341E91857K9246N3399l5587q7913j7269N6468K1496m1520j8747L6097J2274n5221
7329E44580n5609J920K5011J6243M7697Q9772L9486q0092j18526k8881N4763K7182
7317E63546l8783l2270K2688L4215j115j6163K278O925j5004k5663j0307P11j1763
7304D79295k8085k5122l044K5362M3164L0387j3974n3778m9818j2771Q052n184
7292C94484j2158K1730O0613L7195m4674r2889m3177M3159N4058j5431n6739j4134
7280C32037L1342p60n2709k5120M7155M3964l4000n1713L8824J04474L3949q1640
7268C85803q3466J8185P3359K3267l4401j9038J9379Q325k5097j6335J6974P699
7256C74654l7584m1691J2797M5693Q119l0179P740O5936K9206q3596j20078j5387
$$ plain form
7244 215630 318154 414434 423463 394536 387499 370402 303260 242926 270985 358529 394838 339000
7232 339000 264760 250225 286566 312170 293576 253424 237750 262339 290218 280404 256227 277946
7220 277946 337310 348965 280949 215319 221881 254019 249552 249604 307591 357848 314139 238779 251706
7207 251706 312789 282215 183001 188808 319332 374336 258822 159430 255350 431820 458050
7196 458050 319645 187181 145558 142119 147693 189470 245749 259905 246627 258883 276464 252179
7184 252179 230840 282975 354821 337758 262958 260619 333897 351848 283265 253493 321520 376770
7172 376770 333322 270047 283533 334946 345108 330093 340118 358490 357943 371112 413105 419685
7160 419685 357510 311849 360350 435421 424879 346818 306878 328218 341349 313714 279585 256319
$$ packed form
7244B15630J02524R6280R029k8927p037j7097o7142o0334K8059Q7544L6309n5838
7232C39000p4240j4535L6341K5604j8594m0152j5674K4589K7879r814k4177K1719
7220B77946N9364J1655o8016o5630O562L2138m467N2N7987N0257m3709p5360J2927
7207B51706O1083l0574r9214N807J30524N5004j15514r9392R5920J76470K6230
7196D58050j38405j32464m1623l439N574M1777N6279J4156j3278J2256J7581k4285
7184B52179k1339N2135P1846j7063p4800k339P3278J7951o8583k9772O8027N5250
7172C76770m3448o3275J3486N1413J0162j5015J0025J8372n47J3169M1993O580
7160D19685o2175m5661M8501P5071j0542p8061l9940K1340J3131k7635l4129k3266
$$ plain form
7148 256319 226724 196152 188315 196165 200537 209954 221697 191521 116718 90488 176085 281391
7136 281391 274814 181962 136774 169111 186931 157739 150580 182197 177806 123936 109715 158583
7124 158583 167548 95173 65440 168016 278068 224730 59173 -7800 97072 229597 251887
7113 251887 199230 181722 223665 263583 252159 193479 123460 88779 121819 200982 251987 219141
7101 219141 128228 56114 43882 64713 80343 99950 155673 231218 257473 199333 114185 85454
7089 85454 115239 130158 91191 45734 53374 103588 136853 120151 73797 40946 50891 96288
7077 96288 131638 114135 60146 36188 74369 123684 115312 57183 26202 69782 148629 188225
7065 188225 165683 126402 120768 145856 162273 153088 137328 126764 106730 73496 51213 47220
$$ packed form
7148B56319k9595l0572p837P850M372R417J1743l0176p4803k6230Q5597J05306
7136B81391o577r2852m5188L2337J7820k9192p159L1617m391n3870j4221M8868
7124A58583Q965p2375k9733J02576J10052n3338j65557o6973J04872J32525K2290
7113B51887n2657j7508M1943L9918j1424n8680p0019l4681L3040P9163N1005l2846
7101B19141r0913p2114j2232K0831J5630J9607N5723P5545K6255n8140q5148k8731
7089H5454K9785J4919l8967m5457P640N0214L3265j6702m6354l2851R945M5397
7077I6288L5350j7503n3989k3958L8181M9315q372n8129l0981M3580P8847L9596
7065A88225k2542l9281n634K5088J6417r185j5760j0564k0034l3234k2283l993
$$ plain form
7053 47220 32489 1097 551 50469 81708 33036 -33131 -9681 84593 126341 76754 27658
7041 27658 39189 57821 41060 39477 83242 99040 32437 -39565 -20822 52829 79688 49696
7029 49696 29616 37195 33505 6697 -27446 -70744 -104776 -63527 57732 131313 60471 -44097
7017 -44097 -3802 150545 216356 126302 29593 36826 72791 54352 39209 87771 122683 61808
7005 61808 -15911 16684 124579 154956 58387 -60656 -104215 -82996 -50510 -25040 -2416
6994 -2416 12598 14940 11228 10924 16604 19853 7521 -8760 17663 102756 167936 118711 -5471
6981 -5471 -54072 29424 124764 112098 31233 -15662 -25894 -54532 -85214 -65704 -26674 -41369
6969 -41369 -90191 -82688 -8025 43545 16421 -42494 -60499 -12584 78347 149936 128196 17866
$$ packed form
7053D7220j4731l1392n46M9918L1239m8672o6167K3450R4274M1748m9587m9096
7041B7658J1531J8632j6761j583M3765J5798o6603p2002J8743P3651K6859k9992
7029D9696k0080P579l690k6808l4143m3298l4032M1249J21259P3581p0842j04568
7017d4097M0295J54347O5811r0054r6709P233L5965j8439j5143M8562L4912o0875
7005F1808p7719L2595J07895L0377r6569j19043m3559K1219L2486K5470K2624
6994b416J5014K342l712l04N680L249j2332j6281K6423Q5093O5180m9225j24182
6981e471m8601Q3496R5340j2666q0865m6895j0232k8638l0682J9510L9030j4695
6969d1369m8822P503P4663N1570k7124n8915j8005M7915R0931P1589k1740j10330
$$ plain form
6957 17866 -64673 -30024 51017 51176 -19743 -49888 -19621 -9191 -23335 22414 119146 140978
6945 140978 54785 -12720 11255 29108 -33921 -80038 -11960 82709 73376 3212 594 59745
6933 59745 80229 60293 72475 88808 15937 -108960 -141060 -59707 -3390 -42100 -83815 -58846
6921 -58846 -31836 -51940 -43893 46904 128491 101125 20707 507 34150 44306 34667 51848
6909 51848 51407 -38714 -145352 -109492 64510 179119 115754 -4626 -13580 71993 115539 70779
6897 70779 3759 -42118 -77605 -84095 -18453 88359 139394 103446 52649 40829 31746 -8529
6885 -8529 -33921 -584 42782 30856 -1342 28501 108134 142465 102909 64698 76439 88135
6873 88135 51542 8939 19325 59471 72515 72141 116639 197485 234101 186701 108393 64580
$$ packed form
6957A7866q2539L4649Q1041J59p0919l0145L0267J0430j4144M5749R6732K1832
6945A40978q6193o7505K3975J7853o3029m6117O8078R4669r333p0164k618N9151
6933E9745K0484j9936J2182J6333p2871j24897l2100Q1353N6317l8710m1715K4969
6921e8846K7010k0104Q047R0797Q1587k7366q0418k0200L3643J0156r639J7181
6909E1848m41r0121j06638L5860J74002J14609o3365j20380q954Q5573M3546m4760
6897G0779o7020m5877l5487o490O5642J06812N1035l5948n0797j1820r083m0275
6885h529k5392L3337M3366j1926l2198K9843P9633L4331l9556l8211J1741J1696
6873H8135l6593m2603J0386M0146J3044l74M4498Q0846L6616m7400p8308m3813
$$ plain form
6861 64580 53325 37012 15092 23598 74325 129344 144021 118410 93200 98619 121278 128763
6849 128763 114600 100764 101648 109911 120252 141907 179269 222369 264542 306478 335691 329470
6837 329470 288667 241417 205544 180316 181242 234642 317814 356262 314366 245258 217483 238727
6825 238727 285552 348759 400768 384587 305020 268456 345018 448215 457024 407905 434096 541030
6813 541030 593205 533280 462424 462801 483423 467118 459772 507362 557949 564802 588094 683567
6801 683567 774705 760148 686331 683102 765884 829260 818197 784463 776502 785936 812481 880470
6789 880470 973134 1036562 1063271 1094089 1133509 1149872 1163831 1237437 1357075 1429467 1427288 1439600
6777 1439600 1532703 1657061 1749166 1831511 1936484 2015765 2019905 2006404 2069980 2208262 2351485
$$ packed form
6861F4580j1255j6313k1920Q506N0727N5019J4677k5611k5210N419K2659P485
6849A28763j4163j3836Q84Q263J0341K1655L7362M3100M2173M1936K9213o221
6837C29470m0803m7250l5873k5228R26N3400Q3172L8448m1896o9108k7775K1244
6825B38727M6825O3207N2009j6181p9567l6564P6562J03197Q809m9119K6191J06934
6813E41030N2175n9925p0856L77K0622j6305p346M7590N0587O853K3292R5473
6801F83567R1138j4557p3817l229Q2782O3376j1063l3734p961R434K6545O7989
6789H80470R2664O3428K6709L0818L9420J6363J3959P3606J19638P2392k179J2312
6777A439600R3103J24358R2105Q2345J04973P9281M140j3501O3576J38282J43223
$$ plain form
6766 2351485 2486258 2642544 2783569 2835328 2837055 2938905 3201490 3499669 3696065 3828748
6756 3828748 4035327 4345918 4661602 4921629 5177375 5475773 5774382 6036294 6329128 6735104
6746 6735104 7206098 7615723 7948704 8330434 8844117 9420028 9954873 10446707 10940022 11424869
6736 11424869 11892439 12425736 13114508 13919619 14749391 15646733 16757812 18115423 19608130
6727 19608130 21189359 22944498 24878898 26812218 28611095 30379664 32236907 33985255
6719 33985255 35182747 35505246 34870862 33260477 30676173 27373540 23945427 20990622
6711 20990622 18718417 16941905 15398303 13996994 12802645 11880081 11184272 10578863 9961445
6702 9961445 9365489 8901216 8591727 8326536 8003192 7651989 7369046 7173165 6993617 6775977
$$ packed form
6766B351485J34773J56286J41025N1759J727J01850K62585K98179J96396J32683
6756C828748K06579L10591L15684K60027K55746K98398K98609K61912K92834M05976
6746F735104M70994M09625L32981L81730N13683N75911N34845M91834M93315M84847
6736A1424869M67570N33297O88772Q05111Q29772Q97342J111079J357611J492707
6727A9608130J581229J755139J934400J933320J798877J768569J857243J748348
6719C3985255J197492L22499o34384j610385k584304l302633l428113k954805
6711B0990622k272205j776512j543602j401309j194349r22564o95809o05409o17418
6702I961445n95956m64273l09489k65191l23344l51203k82943j95881j79548k17640
$$ plain form
6692 6775977 6536315 6311538 6105021 5893467 5660411 5412883 5175617 4969638 4794472 4639209
6682 4639209 4503678 4384261 4247266 4062320 3869511 3757691 3748108 3750737 3676468 3546271
6672 3546271 3437517 3363245 3273148 3151854 3041039 2962296 2884202 2782255 2678558 2600383
6662 2600383 2542407 2493594 2463406 2452143 2425803 2356196 2268618 2213853 2199025 2181301 2134748
6651 2134748 2087424 2068603 2046916 1965963 1838922 1756284 1774507 1840192 1866944 1850773 1847004
6640 1847004 1855655 1812625 1702412 1597483 1554047 1539217 1503271 1459140 1437968 1424162 1396248
6629 1396248 1382656 1409885 1437010 1411209 1351217 1304548 1261010 1191076 1135013 1156814 1228700
6618 1228700 1260250 1232469 1203087 1186695 1143025 1089960 1102777 1170400 1176499 1077609 987205 1013416
$$ packed form
6692F775977k39662k24777k06517k11554k33056k47528k37266k05979j75166j55263
6682D639209j35531j19417j36995j84946j92809j11820r583K629p4269j30197
6672C546271j08754p4272r0097j21294j10815p8743p8094j01947j03697p8175
6662B600383n7976m8813l0188j1263k6340o9607q7578n4765j4828j7724m6553
6651B134748m7324j8821k1687q0953j27041q2638J8223O5685K6752j6171l769
6640A847004Q651m3030j10213j04929m3436j4830l5946m4131k1172j3806k7914
6629A396248j3592K7229K7125k5801n9992m6669m3538o9934n6063K1801P1886
6618A228700L1550k7781k9382j6392m3670n3065J2817O7623O099r8890r0404K6211
$$ plain form
6606 1013416 1112789 1181447 1198508 1193061 1155368 1081777 1038240 1074349 1129625 1125924 1096535 1112327
6594 1112327 1133119 1066381 944696 900516 960707 1002835 945032 857644 837487 872040 889433
6583 889433 869549 846347 847737 873421 895027 864296 772339 702583 748159 863584 891471 773443
6571 773443 640552 633961 720430 768141 741407 720793 758597 808781 806152 748529 682160 643433
6559 643433 631860 627700 628133 652318 690984 676763 564933 435858 431275 564453 681724 660582
6547 660582 561488 515153 538325 554234 536640 524938 524776 497852 445269 414072 419807 434462
6535 434462 445941 458714 444925 373207 284158 258209 302652 344810 344181 336067 352160 372965
6523 372965 378649 379129 373981 346608 315212 322735 356989 349951 282491 224063 237281 299503 345127
$$ packed form
6606A013416R9373O8658J7061n447l7693p3591m3537L6109N5276l701k9389J5792
6594A112327K0792o6738j21685m4180O0191M2128n7803q7388k0157L4553J7393
6583H89433j9884k3202J390K5684K1606l0731r1957o9756M5576J15425K7887j18028
6571G73443j32891o591Q6469M7711k6734k0614L7804N0184k629n7623o6369l8727
6559F43433j1573m160M33K4185L8666j4221j11830j29075m583J33178J17271k1142
6547F60582r9094m6335K3172J5909j7594j1702j62k6924n2583l1197N735J4655
6535D34462J1479J2773j3789p1718q9049k5949M4443M2158o29q114J6093K0805
6523C72965N684M80n148k7373l1396P523L4254p038o7460n8428J3218O2222M5624
$$ plain form
6510 345127 333886 263386 174038 147956 226594 321624 302339 188276 139009 214026 277215
6499 277215 218202 134433 168329 270378 282272 192159 138782 182350 233704 226847 215978 255793
6487 255793 304271 305252 278249 264723 254292 222752 187504 167695 134427 61894 -730 26407
6475 26407 138005 225173 199402 108584 86652 180355 275326 244567 133342 102429 188039
6464 188039 241171 158944 50202 62764 149615 157111 79039 47284 93857 108078 50809 31318
6452 31318 111380 192059 179464 126909 115049 108906 43792 -41765 -69819 -43600 -4714 52731
6440 52731 123137 126039 21139 -83807 -70264 5378 3562 -70098 -86586 -18738 23856 -7833
6428 -7833 -35631 -19257 -29935 -96956 -124159 -46915 46815 54050 18238 39850 99602 96889
$$ packed form
6510C45127j1241p0500q9348k6082P8638R5030j9285j14063m9267P5017O3189
6499B77215n9013q3769L3896J02049J1894r0113n3377M3568N1354o857j0869L9815
6487B55793M8478R81k7003j3526j0431l1540l5248j9809l3268p2533o2624K7137
6475B6407J11598Q7168k5771r0818k1932R3703R4971l0759j11225l0913Q5610
6464A88039N3132q2227j08742J2562Q6851P496p8072l1755M6573J4221n7269j9491
6452C1318Q0062Q0679j2595n2555j1860o143o5114q5557k8054K6219L8886N7445
6440E2731P0406K902j04900j04946J3543P5642j816p3660j6488O7848M2594l1689
6428g833k7798J6374j0678o7021k7203P7244R3730P235l5812K1612N9752k713
$$ plain form
6416 96889 24627 -19687 7612 37402 7713 -46524 -61506 -38010 -21622 -29878 -42780 -43838
6404 -43838 -32227 -4857 38266 71651 61818 19469 3101 43804 89999 68834 -6841 -45486
6392 -45486 -663 66759 78374 39160 4626 -9146 -23818 -36104 -22631 2516 -6098 -60880
6380 -60880 -125508 -156274 -123398 -18141 109825 155009 68683 -53800 -78868 -9211 39228
6369 39228 18318 -8916 -9833 -36388 -100867 -124170 -72159 -31384 -70159 -124045 -108330 -54126
6357 -54126 -35147 -42732 -41603 -70168 -158236 -211604 -127839 12109 27551 -94890 -178306 -122801
6345 -122801 -40895 -67141 -165853 -215459 -185951 -135823 -97843 -62251 -37354 -45047 -71659 -84301
6333 -84301 -83345 -87891 -83542 -39405 24185 37636 -28801 -113411 -132913 -90894 -76395 -138322 -199730
$$ packed form
6416I6889p2262m4314K7299K9790k9689n4237j4982K3496J6388q256j2902j058
6404d3838J1611K7370M3123L3385r833m2349j6368M0703M6195k1165p5675l8645
6392d5486M4823O7422J1615l9214l4534j3772j4672j2286J3473K5147q614n4782
6380f0880o4628l0766L2876J05257J27966M5184q6326j22483k5068O9657M8439
6369C9228k0910k7234r17k6555o4479k3303N2011M0775l8775n3886J5715N4204
6357e4126J8979p585J129k8565q8068n3368Q3765J39948J5442j22441q3416N5505
6345a22801Q1906k6246r8712m9606K9508N0128L7980L5592K4897p693k6612j2642
6333h4301R56m546M349M4137O3590J3451o6437q4610j9502M2019J4499o1927o1408
$$ plain form
6320 -199730 -150355 -10845 73110 24143 -63242 -72278 -36744 -63430 -138781 -147830 -73537 -33508
6308 -33508 -86386 -135152 -91239 -23581 -47993 -144009 -188157 -131615 -48231 -17082 -36518 -61141
6296 -61141 -66365 -60142 -60398 -70624 -71387 -46481 -16479 -15820 -34956 -30039 2676 18706 5099 -868
6282 -868 3946 -29000 -87636 -64987 82043 223752 216456 109692 69893 133974 177629 125371
6270 125371 49934 26523 13839 -50346 -127204 -134256 -71987 -17760 -20037 -58372 -95503 -121010
6258 -121010 -141399 -155263 -147449 -106943 -54049 -35709 -70445 -110654 -94675 -28973 21197 18242
6246 18242 -14297 -41076 -48058 -26113 22627 54476 19091 -59412 -94279 -51084 5455 5505 -42440
6233 -42440 -93865 -135029 -164169 -158663 -113597 -74244 -81084 -115047 -138236 -149619 -157551 -144984
$$ packed form
6320a99730M9375J39510Q3955m8967q7385r036L5534k6686p5351r049P4293M0029
6308c3508n2878m8766M3913O7658k4412r6016m4148N6542Q3384L1149j9436k4623
6296f1141n224O223k56j0226p63K4906L0002O59j9136M917L2715J6030j3607n967
6282h68M814l2946n8636K2649J47030J41709p296j06764l9799O4081M3655n2258
6270A25371p5437k3411j2684o4185p6858p052O2269N4227k277l8335l7131k5507
6258a21010k0389j3864P814M0506N2894J8340l4736m0209J5979O5702N0170k955
6246A8242l2539k6779o982K1945M8740L1849l5385p8503l4867M3195N6539N0m7945
6233d2440n1425m1164k9140N506M5066L9353o840l3963k3189j1383p932J2567
$$ plain form
6221 -144984 -116034 -125332 -190436 -225836 -158770 -73314 -118026 -273773 -347331 -238890 -94153
6210 -94153 -105006 -248229 -335086 -276395 -178404 -170848 -241730 -283681 -239069 -149046 -90692 -103634
6198 -103634 -161737 -195513 -162096 -106268 -119039 -214094 -288224 -247062 -132526 -63521 -73720
6187 -73720 -86001 -47337 -4159 -15048 -62752 -100104 -125155 -157078 -183644 -187584 -186836 -196977
6175 -196977 -193866 -166069 -155843 -184367 -190953 -129954 -75097 -120687 -219765 -245791 -189664 -153057
6163 -153057 -155433 -114313 -40211 -66295 -211018 -288896 -176745 -17415 -9772 -119708 -172541
6152 -172541 -139165 -135469 -187319 -196645 -138332 -108262 -148753 -185433 -177428 -184935 -234368 -248754
6140 -248754 -180455 -100783 -83761 -95944 -78012 -54866 -84531 -157142 -215632 -231988 -210302 -161457
$$ packed form
6221a44984K8950r298o5104l5400O7066Q5456m4712j55747p3558J08441J44737
6210i4153j0853j43223q6857N8691R7991P556p0882m1951M4612R0023N8354j2942
6198a03634n8103l3776L3417N5828j2771r5055p4130M1162J14536O9005j0199
6187g3720j2281L8664M3178j0889m7704l7352k5051l1923k6566l940P48j0141
6175a96977L111K7797J0226k8524o586O0999N4857m5590r9078k6026N6127L6607
6163a53057k376M1120P4102k6084j44723p7878J12151J59330P643j09936n2833
6152a72541L3376L696n1850r326N8313L0070m0491l6680Q005p507m9433j4386
6140b48754O8299P9672J7022j2183J7932K3146k9665p2611n8490j6356K1686M8845
$$ plain form
6128 -161457 -118840 -126691 -171557 -181964 -134746 -95473 -110469 -134669 -123249 -116049 -157080 -202077
6116 -202077 -192873 -162540 -171832 -194045 -168969 -131484 -168036 -260672 -294422 -230238 -160559 -162500
6104 -162500 -192807 -177739 -130894 -118511 -153439 -184881 -176485 -149191 -145612 -176453 -210760 -216049
6092 -216049 -200336 -197753 -210966 -200033 -147997 -101948 -111575 -153990 -164978 -128281 -89120 -88715
6080 -88715 -124319 -164877 -174505 -138049 -94580 -115427 -207663 -276540 -240542 -147792 -107827 -139678
6068 -139678 -172519 -174436 -180899 -200039 -194713 -172032 -187048 -231615 -224220 -150669 -109297 -156794
6056 -156794 -210226 -183530 -131017 -150455 -211291 -202905 -121164 -80904 -138000 -210197 -207340 -152310
6044 -152310 -123175 -138189 -157644 -164058 -177605 -197406 -183824 -124499 -82786 -132328 -246362 -306266
$$ packed form
6128a61457M2617p851m4866j0407M7218L9273j4996k4200J1420P200m1031m4997
6116b02077R204L0333r292k2213K5076L7485l6552r2636l3750O4184O9679j941
6104a62500l0307J5068M6845J2383l4928l1442Q396K7294L579l0841l4307n289
6092b16049J5713K583j3213J0933N2036M6049r627m2415j0988L6697L9161M05
6080h8715l5604m0558r628L6456M3469k0847r2236o8877L5998R2750L9965l1851
6068a39678l2841j917o463j9140N326K2681j5016m4567P395P3551M1372m7497
6056a56794n3432K6696N2513j9438o0836Q386Q1741M0260n7096p2197K857N5030
6044a52310K9135j5014j9455o414j3547j9801J3582N9325M1713m9542j14034n9904
$$ plain form
6032 -306266 -247844 -149766 -123762 -159727 -162284 -118180 -116926 -188008 -232873 -177568 -97018 -105254
6020 -105254 -193803 -268452 -290360 -286216 -261944 -207324 -160134 -168142 -203416 -204498 -183867 -195872
6008 -195872 -217956 -179382 -102693 -88434 -144052 -163367 -114348 -105680 -195793 -271983 -226094 -135858
5996 -135858 -137935 -207760 -219282 -168755 -169464 -237273 -254117 -176811 -123631 -182596 -267096 -260835
5984 -260835 -200916 -194356 -224295 -182160 -69764 -26657 -127529 -266737 -301414 -226462 -140207
5973 -140207 -99985 -94057 -118413 -186808 -264494 -276303 -208447 -139823 -135880 -163580 -158408 -130966
5961 -130966 -139128 -175018 -160535 -72812 -4390 -49581 -171920 -245126 -212505 -144085 -124906 -146780
5949 -146780 -152165 -142501 -174201 -251236 -291428 -231325 -116158 -41812 -40565 -73478 -109165 -147305
$$ packed form
6032c06266N8422R8078K6004l5965k557M4104J254p1082m4865N5305Q0550q236
6020a05254q8549p4649k1908M144K4272N4620M7190q008l5274j082K0631j2005
6008a95872k2084L8574P6689J4259n5618j9315M9019Q668r0113p6190M5889R0236
5996a35858k077o9825j1522N0527p09o7809j6844P7306N3180n8965q4500O261
5984b60835N9919O560k9939M2135J12396M3107j00872j39208l4677P4952Q6255
5973a40207M0222N928k4356o8395p7686j1809O7856O8624L943k7700N172K7442
5961a30966q162l5890J4483Q7723O8422m5191j22339p3206L2621O8420J9179k1874
5949a46780n385R664l1700p7035m0192O0103J15167P4346J247l2913l5687l8140
$$ plain form
5937 -147305 -175030 -169935 -153647 -173737 -213492 -191913 -89828 -5435 -26767 -106942 -138199 -107000
5925 -107000 -92527 -133479 -182252 -192705 -179124 -173396 -180497 -190531 -190614 -160593 -101122 -63633 -101976
5912 -101976 -194614 -264646 -273212 -241072 -189714 -127996 -89389 -105141 -139794 -132576 -100415 -106919
5900 -106919 -132216 -94864 -19949 -39075 -167016 -230743 -121716 18718 1964 -131972 -202156
5889 -202156 -167136 -137743 -156845 -154058 -112460 -102746 -132538 -124542 -75643 -79541 -147266 -165055
5877 -165055 -96102 -65838 -151791 -235208 -187778 -86672 -95085 -209886 -281690 -241737 -165697
5866 -165697 -130088 -132984 -155880 -193304 -213475 -183631 -140455 -149492 -193436 -190422 -129444 -94032
5854 -94032 -131905 -189292 -204578 -188553 -176229 -168420 -158863 -158823 -159909 -130210 -79791 -68789 -113543
$$ packed form
5937a47305k7725N095J6288k0090l9755K1579J02085Q4393k1332q0175l1257L1199
5925a07000J4473m0952m8773j0453J3581N728p101j0034q3L0021N9471L7489l8343
5912a01976r2638p0032q566L2140N1358O1718L8607j5752l4653P218L2161o504
5900a06919k5297L7352P4915j9126j27941o3727J09027J40434j6754j33936p0184
5889b02156L5020K9393j9102K787M1598R714k9792P996M8899l898o7725j7789
5877a65055O8953L0264q5953q3417M7430J01106q413j14801p1804L9953P6040
5866a65697L5609k896k2896l7424k0171K9844M3176r037m3944L014O0978L5412
5854i4032l7873n7387j5286J6025J2324P809R557M0j086K9699N0419J1002m4754
$$ [...]
##END NTUPLES=NMR SPECTRUM
##END=
