##TITLE=1H ikalashn
K-546-1_1
27.11.2024
##JCAMPDX= 6.0         $$ Bruker NMR JCAMP-DX V2.0
##DATA TYPE= NMR SPECTRUM
##DATA CLASS= NTUPLES
##ORIGIN= UXNMR, Bruker Analytische Messtechnik GmbH
##OWNER= root
$$ TOPSPIN		Version 1.3
$$ 2024-11-27 10:26:41.843 +0400  Irina@DPX200
$$ Compression mode = diff/dup
##.OBSERVE FREQUENCY= 200.131300845
##.OBSERVE NUCLEUS= ^1H
##.ACQUISITION MODE= SIMULTANEOUS
##.ACQUISITION SCHEME= undefined
##.AVERAGES= 32
##.DIGITISER RES= 18
##SPECTROMETER/DATA SYSTEM= spect
##.PULSE SEQUENCE= zg
##.SOLVENT NAME= CDCl3
##.SHIFT REFERENCE= INTERNAL, CDCl3, 1, 17.49637
##AUDIT TRAIL= $$ (NUMBER, WHEN, WHO, WHERE, WHAT)
$$ ##TITLE= Audit trail, TOPSPIN		Version 1.3
$$ ##JCAMPDX= 5.01
$$ ##ORIGIN= Bruker BioSpin GmbH
$$ ##OWNER= Irina
$$ $$ F:/spectra/data/iren/nmr/1H/4/pdata/1/auditp.txt
$$ ##AUDIT TRAIL=  $$ (NUMBER, WHEN, WHO, WHERE, VERSION, WHAT)
(   1,<2024-11-27 10:23:59.937 +0400>,<Irina>,<DPX200>,<TOPSPIN 1.3>,
      <acquisition in progress>)
(   2,<2024-11-27 10:26:10.109 +0400>,<Irina>,<DPX200>,<TOPSPIN 1.3>,
      <Start of raw data processing
       efp BC_mod = 2 LB = 0.02 FT_mod = 6 PKNL = 1 PHC0 = 113.9091 PHC1 = 9.38271 SI = 32K 
       data hash MD5: 32K
       07 80 B5 AB A4 E3 8E 72 BD 89 5D FF AD 10 42 AB>)
(   3,<2024-11-27 10:26:12.765 +0400>,<Irina>,<DPX200>,<TOPSPIN 1.3>,
      <apk 
       data hash MD5: 32K
       15 B9 93 7E BF 1F 44 99 53 05 D0 5E 76 CE 35 75>)
(   4,<2024-11-27 10:26:25.500 +0400>,<Irina>,<DPX200>,<TOPSPIN 1.3>,
      <pk fgphup PHC0 = 24.99575 PHC1 = -59.2 
       data hash MD5: 32K
       8F 60 27 16 E2 DD F8 A6 4C 1E B2 F0 E0 9F A9 D2>)
(   5,<2024-11-27 10:26:27.343 +0400>,<Irina>,<DPX200>,<TOPSPIN 1.3>,
      <abs n ABSG = 5 
       data hash MD5: 32K
       69 73 E0 20 90 7D 24 47 93 F3 71 80 8E FA B5 DD>)
$$ ##END=
$$ 
$$ $$ hash MD5
$$ $$ D8 41 D9 A9 8C F6 FF 84 9D 3E 7F DE FA 02 FB AC
##$RELAX= 
##$RELAX= 
##$RELAX= 
##$RELAX= 
##$RELAX= 
##$RELAX= 
##$RELAX= 
##$RELAX= 
##$RELAX= 
$$ Bruker specific parameters
$$ --------------------------
##$DU= <F:/spectra>
##$EXPNO= 4
##$NAME= <1H>
##$PROCNO= 1
##$TYPE= <nmr>
##$USER= <iren>
##$AMP= (0..31)
100 100 100 100 100 100 100 100 100 100 100 100 100 100 100 100 100 100 
100 100 100 100 100 100 100 100 100 100 100 100 100 100 
##$ANAVPT= -1
##$AQSEQ= 0
##$AQ_mod= 1
##$AUNM= <au_zg>
##$AUTOPOS= <>
##$BF1= 200.13
##$BF2= 200.13
##$BF3= 200.13
##$BF4= 200.13
##$BF5= 200.13
##$BF6= 200.13
##$BF7= 200.13
##$BF8= 200.13
##$BYTORDA= 1
##$CFDGTYP= 0
##$CFRGTYP= 5
##$CHEMSTR= <none>
##$CNST= (0..63)
1 1 145 1 1 1 1 1 1 1 1 1 1 1 1 1 1 1 1 1 1 1 1 1 1 1 1 1 1 1 1 1 1 1 
1 1 1 1 1 1 1 1 1 1 1 1 1 1 1 1 1 1 1 1 1 1 1 1 1 1 1 1 1 1 
##$CPDPRG= <>
##$CPDPRG1= <>
##$CPDPRG2= <>
##$CPDPRG3= <>
##$CPDPRG4= <mlev>
##$CPDPRG5= <mlev>
##$CPDPRG6= <mlev>
##$CPDPRG7= <mlev>
##$CPDPRG8= <mlev>
##$CPDPRGB= <>
##$CPDPRGT= <>
##$D= (0..63)
0 2 0 0 0 0 0 0 0 0.06 0 0.03 0 0 0 0 0.0002 0 0 0 0 0 0 0 0 0 0 0 0 0 
$$ [...]
##$SW_h= 4401.40845070422
##$TD= 16384
##$TD0= 1
##$TE= 300
##$TE2= 300
##$TE3= 300
##$TEG= 300
##$TL= (0..7)
0 120 120 120 120 120 120 120 
##$TP= (0..7)
150 150 150 150 150 150 150 150 
##$TP07= 0
##$TPNAME0= <>
##$TPNAME1= <>
##$TPNAME2= <>
##$TPNAME3= <>
##$TPNAME4= <>
##$TPNAME5= <>
##$TPNAME6= <>
##$TPNAME7= <>
##$TPOAL= (0..7)
0.5 0.5 0.5 0.5 0.5 0.5 0.5 0.5 
##$TPOFFS= (0..7)
0 0 0 0 0 0 0 0 
##$TUNHIN= 0
##$TUNHOUT= 0
##$TUNXOUT= 0
##$USERA1= <user>
##$USERA2= <user>
##$USERA3= <user>
##$USERA4= <user>
##$USERA5= <user>
##$V9= 5
##$VALIST= <valist>
##$VCLIST= <CCCCCCCCCCCCCCC>
##$VD= 0
##$VDLIST= <DDDDDDDDDDDDDDD>
##$VPLIST= <PPPPPPPPPPPPPPP>
##$VTLIST= <TTTTTTTTTTTTTTT>
##$WBST= 1024
##$WBSW= 25
##$XGAIN= (0..3)
0 0 0 0 
##$XL= 0
##$YL= 0
##$YMAX_a= 1498481
##$YMIN_a= -1637434
##$ZGOPTNS= <>
##$ZL1= 120
##$ZL2= 120
##$ZL3= 120
##$ZL4= 120
##$ABSF1= 17.49637
##$ABSF2= -4.496376
##$ABSG= 5
##$ABSL= 3
##$ALPHA= 0
##$AQORDER= 0
##$ASSFAC= 0
##$ASSFACI= 0
##$ASSFACX= 0
##$ASSWID= 0
##$AUNMP= <proc_1d>
##$AXLEFT= 0
##$AXRIGHT= 0
##$AXTYPE= 0
##$AXUNIT= <>
##$AZFE= 0.1
##$AZFW= 0.1
##$BCFW= 0
##$BC_mod= 2
##$BYTORDP= 0
##$COROFFS= 0
##$CY= 7568.61572265625
##$DATMOD= 1
##$DC= 0
##$DFILT= <>
##$DTYPP= 0
##$F1P= 17.9538593292236
##$F2P= -4.03888763876832
##$FCOR= 0.5
##$FTSIZE= 32768
##$FT_mod= 6
##$GAMMA= 0
##$GB= 0
##$INTBC= 0
##$INTSCL= 5.656564e-011
##$ISEN= 128
##$LB= 0.02
##$LEV0= 0
##$LPBIN= 0
##$MAXI= 945.577
##$MC2= 0
##$MEAN= 0
##$ME_mod= 0
##$MI= -402.1523
##$NCOEF= 0
##$NC_proc= -3
##$NLEV= 6
##$NOISF1= 8.587773
##$NOISF2= 6.764455
##$NSP= 0
##$NTH_PI= 0
##$NZP= 0
##$OFFSET= 17.49637
##$PC= 1
##$PHC0= 105.4564
##$PHC1= 5.746067
##$PH_mod= 1
##$PKNL= yes
##$PPARMOD= 0
##$PPDIAG= 0
##$PPIPTYP= 0
##$PPMPNUM= 100
##$PPRESOL= 1
##$PSCAL= 0
##$PSIGN= 0
##$REVERSE= no
##$SF= 200.13
##$SI= 32768
##$SIGF1= 16.12182
##$SIGF2= -4.496377
##$SINO= 3.521527
##$SIOLD= 32768
##$SREGLST= <1H.CDCl3>
##$SSB= 0
##$STSI= 32768
##$STSR= 0
##$SW_p= 4401.40845070422
##$SYMM= 0
##$S_DEV= 0
##$TDeff= 16384
##$TDoff= 0
##$TI= <>
##$TILT= no
##$TM1= 0
##$TM2= 0
##$TOPLEV= 0
##$USERP1= <user>
##$USERP2= <user>
##$USERP3= <user>
##$USERP4= <user>
##$USERP5= <user>
##$WDW= 1
##$XDIM= 32768
##$YMAX_p= 394245743
##$YMIN_p= -1360725
$$ End of Bruker specific parameters
$$ ---------------------------------
##NTUPLES= NMR SPECTRUM
##VAR_NAME=  FREQUENCY,     SPECTRUM/REAL,   SPECTRUM/IMAG
##SYMBOL=    X,             R,               I
##VAR_TYPE=  INDEPENDENT,   DEPENDENT,       DEPENDENT
##VAR_FORM=  AFFN,          ASDF,            ASDF
##VAR_DIM=   32768,         32768,           32768
##UNITS=     HZ,            ARBITRARY UNITS, ARBITRARY UNITS
##FACTOR=    0.134324425510551, 1,           1
##FIRST=     4401.40845070422, 328,          64354
##LAST=      0,             -63467,          56577
##MIN=       0,             -1360725,        0
##MAX=       4401.40845070422, 394245743,    0
$$ Real data points
##PAGE= N=1
##DATA TABLE= (X++(R..R)), XYDATA
$$ [...]
21731a9008J2092M285j718j4748k5472r109L3128O2024M3882p155m3807l8355
21719c961r196O979p65j1528o626N878P378l131j0425o420J884O516Q607J2911
21705a899K0501K7317K4561M586k5621m2766l0941k614J6910K0508J8337J2448
21693D1327l072j7655j0429J0514P518k8724n1859k1722L0874M2745Q256j7085
21681i312k484J9243J2917o559j0838o780j1496j1427R310K5137M994k4930j3522
21668b5747K6971L2602l953j2459L4912N8181j1733j06107r8991R857Q8190N4686
21656D6409k1605m0288q238L718j3101n557L3810M3170q588o3380n2360Q817M7219
21643b9974L2899N381L014J0508m418l2121l1574P036M0865K7800j6457l5874
$$ y = [-19008, -6916, -2631, -4349, -19097, -44569, -53678, -20550, 41474, 85356, 78201, 34394, -3961, -13157, -6178, -6943, -18471, -25097, -19219, -11841, -14972, -25397, -31817, -29933, -23417, -14810, -1899, 18602, 45919, 70480, 75066, 49445, 6679, -24262, -26876, -9966, 10542, 28879, 41327, 38255, 20600, 10171, 20685, 28203, -521, -52380, -74102, -43228, -483, 7773, -9312, -11796, 7447, 20364, 13805, 2967, -3813, -15309, -26736, -17426, 7711, 12705, -12225, -25747, 1224, 33826, 29873, 17414, 52326, 110507, 98774, -7333, -106324, -96467, -8277, 46409, 24804, -15484, -23722, -20004, -33105, -38662, -4852, 38318, 29730, -33650, -86010, -77193, -29974, 2925, 8306, 11320, 21828, 17410, -14711, -46285, -39249, 1616, 29416, 12959, -22915]
21631b2915o170L2559K8681j0042k5505P243L5970j158p9265j00383j5800R9592
21619e7193J25822L5796p6208j02057l0485N4751O9436J2258m1219k5864L5957
21608I94O1721J5565m5395n3238j9559O76K918K3540N1393L1407l1681n7353j3190
21595c2202K3255j5740p2088m4406N4355J09182O2491j6901l6883M420L3958K400
21583G1841n5786o1164R729P7127N0027m1205p3234p452N0206J6082m1514k5074
21571c0417K8948K7286j0741j673L3751Q316n2438l9523L3768L6831m4333o7672
21559g7897J7273P4200J8538l6733P296N4957j049p3288l6430M0966K2921l9914
21547b9160m098R0676P6791m0683p9935Q556O2198j1396q6522m3642M0766M2302
$$ y = [-22915, -29085, 3474, 32155, 22113, -3392, 3851, 39821, 38663, -40602, -140985, -156785, -57193, 68629, 104425, 28217, -73840, -104325, -49574, 19862, 32120, -9099, -34963, 994, 62715, 78280, 32885, -20353, -39912, -39236, -36318, -12778, 38615, 70022, 38341, -19012, -32202, -8947, -24687, -96775, -141181, -86826, 22356, 84847, 67946, 31063, 35483, 69441, 71841, 16055, -45109, -35380, 41747, 91774, 50569, -22665, -30117, 20089, 36171, -5343, -30417, -1469, 25817, 15076, 13403, 47154, 55470, 3032, -36491, -2723, 34108, -10225, -77897, -60624, 13576, 32114, -4619, 2677, 57634, 56585, -16703, -53133, -12167, 10754, -29160, -33258, 57418, 134209, 93526, 13591, 22147, 84345, 72949, -13573, -57215, -16449, 25853]
21535B5853j6016l7287j3572j22k337J0758L1869L1886J1274j4203l4856k8137
21523c4890J9957N9303K4195m7996n0563J7657L7080l0775o7813K23O9728L2780
21511B8886m1364l0421L5812M0233k1533n0593j2481L3002M2381K2303j7450n3058
21499b4283l1801M3181P1824j359p5597m0005M3648M4948j6324k1213K7788K0947
21487D1754m5122n7717L130L1935k572q118M0566M4126k7529n9703O980O5512
21475C3242K9188k3548l817K8038j2492o8997m5614K0415K8775j4304l1043j6143
21463g6300j6497j8878J5670M9409K3558k2025p425M3493M3153m371j8696N507
21451A6598p06l3502j2470O0017P6048j400o7575l9740K0603K1301j9496l0410
$$ y = [25853, 9837, -27450, -41022, -41144, -43481, -32723, -854, 31032, 42306, 28103, -6753, -34890, -14933, 44370, 68565, 20569, -29994, -12337, 24743, -6032, -73845, -73622, -3894, 28886, -12478, -42899, -7087, 33146, 11613, -38980, -51461, -18459, 23922, 46225, 28775, -24283, -56084, -12903, 58921, 57562, -18035, -58040, -14392, 30556, 14232, -6981, 20807, 41754, -3368, -61085, -57955, -26020, -28592, -36710, 3856, 47982, 20453, -39250, -32270, 33242, 62430, 38882, 35065, 63103, 50611, -18386, -64000, -43585, -14810, -29114, -60157, -76300, -92797, -111675, -96005, -46596, -23038, -45063, -52488, -8995, 34158, 29787, 11091, 16598, 15892, -17610, -30080, 29937, 105985, 104585, 37010, -2730, 17873, 39174, 19678, -10732]
21439a0732j2500j5915l5483j9420L4058O4397L6929j1385k7987j0442L050q166
21427a3596k0002r78L5364M0447l68l9975l4073k521J0577Q912K4167M4440K6679
21414G9073k2821m5923k1557L823m818j8045J050L3164L5165N915j7675j4579
21402A2772l52K3j7165k9494j2136K7927N0074K6704k0039m6804l8760q953K8115
21389b8088N0889K7868l4966p1527l5723K2159K5438q446k157M2826M5230j1579
21377B1924m4926j3293J6881m420k3152J1615M7024K1824j7036L156M3977J7751
21365H1325n3152o2490O090N2198J9160k8416k2128R026O273k2096l0505j4112
21353e8827r03K836R945J6174R090o58N967J9497J3283j2973l1305k6254r214
$$ y = [-10732, -23232, -39147, -74630, -94050, -59992, 4405, 41334, 29949, 1962, -8480, -5430, -13596, -33598, -34576, 788, 41235, 40867, 892, -33181, -35702, -25125, -16213, 7954, 52394, 79073, 56252, 10329, -11228, -7405, -12223, -30268, -29218, 3946, 39111, 45026, 27351, 12772, 12420, 12443, -4722, -34216, -46352, -18425, 31649, 58353, 38314, -8490, -47250, -56203, -28088, 22801, 50669, 15703, -55824, -91547, -69388, -43950, -52396, -54553, -11727, 33503, 21924, -23002, -36295, -19414, -23834, -46986, -35371, 11653, 33477, 16441, 19597, 63574, 81325, 28173, -34317, -28227, 23971, 43131, 14715, -7413, 1613, 7886, -14210, -44715, -58827, -59730, -56894, -46949, -30775, -21685, -22343, -16376, 3121, 16404, 3431, -27874, -54128, -63342]
21340f3342R496L1799M5743K2824l2515n9590j1585O3622O8142j1747p5288m2719
21328e5160L4184N1024k404m5368l2729O37J6972J9526J1588j3701k9422L684
21316d1169N4314M1808l2755o7421j4560L9518J4771l4550j9841L2778L9562N938
21304A8393l00J7016k851m7638l9932K2087M7613j285n0101l1791K0557M0711
21292g521J9646q484j6723L994L7398L6349k0956p1415l5647N3656P9566J0490
21280H0353n4550l9627P556J6551J911N289J0102j1603l1136j6190K220j1998
21268d1122k5153P290N0805M0911r917l3433j2179R429P076R15M153O759P105
21255A2639J1351Q819r973k5036j6602j547K92N268K4144K0656k5481n4190n169
$$ y = [-63342, -53846, -22047, 23696, 46520, 14005, -45585, -57170, 6452, 74594, 62847, -12441, -55160, -20976, 30048, 27644, -17724, -50453, -49816, -32844, -13318, -1730, -15431, -44853, -41169, 13145, 54953, 22198, -45223, -59783, -20265, -5494, -40044, -59885, -27107, 12455, 18393, 18093, 35109, 32258, -15380, -55312, -33225, 14388, 13103, -36998, -68789, -48232, -7521, 12125, 3641, -13082, -9088, 28310, 64659, 43703, -27712, -63359, -9703, 69863, 80353, 25803, -13824, -6268, 10283, 12194, 17483, 27585, 15982, -15154, -31344, -29124, -41122, -66275, -58985, -8180, 32731, 22814, -10619, -22798, -13369, -6293, -5378, -1225, 5534, 12639, 23990, 32809, 22836, -2200, -18802, -20349, -20057, -14789, 9355, 30011, 4530, -49660, -54829]
21242e4829O6706N3573l6940q0019j6570O2844N7484o328l7286j5137N548o462
21230g416k3712j6300N028J0999n455k0626p587K8541M8737K4270k3614m5523
21218c2658k2466J4695K3146p605m5296m1813J5627P4245O4168r990o3721m2152
21206g3820J0318K6580J2444J0315J4429m855k6993j2166J8109J4230q604q1K1932
21193A838K53m0493j8936N1483O3584m959m6543n346K9763j1713n4178j3373M9490
21180H70L4805k1915k0378K4709J9747l0153k9267L2350N4427l655n7250l7584
21168c3294J1100K2790O331k041p130k1156k1606N375K7197J5635o524r051l089
21155a5463p567p955Q781J5936q462l0460o748L8973M3517Q67k6552l557K3919
$$ y = [-54829, 11877, 65450, 28510, -51509, -68079, -5235, 52249, 45921, 8635, -6502, -954, -7416, -31128, -47428, -42400, -31401, -36856, -57482, -65069, -36528, 12209, 36479, 12865, -32658, -55124, -40429, -17283, -24888, -70184, -111997, -96370, -22125, 42043, 32053, -31668, -73820, -63502, -36922, -24478, -14163, 266, -4589, -31582, -43748, -25639, -11409, -20013, -20094, 1838, 2091, -38402, -57338, -5855, 57729, 52770, 6227, 881, 30644, 18931, -35247, -48620, 870, 35675, 13760, -6618, 18091, 37838, 7685, -21582, 10768, 65195, 61540, 4290, -33294, -22194, 596, 6927, 4886, -2244, -23400, -45006, -39631, -12434, 3201, -3323, -12374, -15463, -23030, -30985, -22204, -6268, -14730, -45190, -51938, -12965, 30552, 31419, 4867, 1310, 25229]
21142B5229J892m2804l7160K4523N9393J2071n6159m7189L1441P5657L6649j7697
21130F5846k1175n765k1511l5460K328M8352K7886k6656j8829M2460M7220k6872
21118G7824o6507j1546M0631J092n7641k6656N1791N5516j5330m9629j5139N439
21106a0155k4433l4331J4755N1561J6696l3688k2421K5705L8396J5966Q005J0305
21094E6361j9291o1180m8314J5326M3413o21m4132j9958L2518L8899M144j4084
21082a6919n084k271o304J0347L3914K3179r842j4067K772j7785o2936m1418N7473
21069d8941J08525L2351o7789n8244J9401K9858k7383l1557L6938N9495r217n7345
21057a3908q562M6887R917n8003m2519L2514N1537n289m7174k4703J5773K9040
$$ y = [25229, 27121, -15683, -52843, -28320, 31073, 43144, -13015, -60204, -28763, 46894, 83543, 65846, 44671, 38906, 17395, -18065, -15737, 32615, 60501, 33845, 15016, 57476, 104696, 77824, 11317, -229, 40402, 41494, -16147, -42803, 8988, 64504, 49174, -455, -15594, -10155, -34588, -68919, -54164, -2603, 14093, -19595, -42016, -16311, 22085, 38051, 46056, 56361, 37070, -24110, -72424, -57098, -13685, -14306, -58438, -78396, -45878, -6979, -2835, -16919, -22003, -24274, -30578, -20231, 13683, 36862, 27020, 12953, 15725, -2060, -64996, -106414, -48941, 59584, 91935, 24146, -34098, -14697, 15161, -12222, -43779, -6841, 52654, 43437, -13908, -22470, 24417, 34334, -23669, -66188, -33674, 17863, 12574, -34600, -59303, -43530, -14490]
21045a4490K6583K3730R398j4905k6248k2343k2455k2944j856L0227L4224L186
21033B107k4693j8738J3420M4596M6279L170n4832o0469M367O0738L2500l6241
21021A2204m2347J8869N1834J4011l0101k7665j2132j9946k0893J3192M1112J7108
21009A5246k8226l3126M704L5781L1725O469j6346k3805j6296p999p889J54K6554
20996a3054L7143R16l4583J668P1458N6890m8254r8724j5688P6992M0146o1151
20984A3759o5930K5948O8229J1014l7988r477K4843l427m2078k0327K9323L5185
20972B9074L937q891L19p868l1634k6481J5645M5257K5138j9344l8281k2091m815
20959d0035p893p042K4151N5053K8482m1977o3443Q555Q7885O8053k4829p1353
$$ y = [-14490, 12093, 35823, 45221, 30316, 4068, -18275, -40730, -63674, -65530, -35303, -1079, 2107, -22586, -41324, -27904, 16692, 62971, 66141, 11309, -49160, -44793, 15945, 48445, 12204, -30143, -11274, 40560, 54571, 24470, -3195, -15327, -35273, -56166, -42974, -1862, 15246, -12980, -46106, -41402, -5621, 26104, 32573, 16227, -7578, -23874, -31873, -39762, -39608, -13054, 24089, 25005, -9578, -7910, 63548, 120438, 72184, -26540, -42228, 34764, 74910, 13759, -52171, -26223, 42006, 53020, 15032, 5555, 30398, 26971, -15107, -35434, -6111, 29074, 33011, 24120, 24439, 16571, -15063, -41544, -25899, 19358, 44496, 25152, -13129, -35220, -40035, -47928, -54970, -30819, 24234, 52716, 10739, -52704, -44149, 43736, 111789, 86960, 15607]
20947A5607k9839K4901L2736J9862J7133J564l6095m6247j130M2865K5351k4687
20935D2021l6603o24L5064L8781J4587k4173n2063l3113K4892N0513m79o5918
20923g115n5295J6990N3032J7624j9279o34L3809K0403k7629m4923j2005K2171
20911b851J3518j9350k6016O201L6875K7922p483k8333k2820j3463j1835m312
20899e1947J2021J6685K885o583K459J3534J3106J3075K0426J8529l16j7038j9401
20886A7435j7277j0147J3968L2948O013m2715l3414L7470O3793p766p4687l2265
20874d6644N4228N3691j9085m0380J0599L2791r474l5239m830J6045r206k2425
20862a9929Q096K3713o658k0092K1130N3145K7249k598R691R878m3348p4443j4823
$$ y = [15607, -14232, 10669, 43405, 63267, 80400, 81964, 45869, -378, -1508, 41357, 66708, 42021, 5418, 4794, 39858, 78639, 93226, 69053, 16990, -16123, 8769, 59282, 58803, -7115, -62410, -45420, 7612, 25236, 5957, 5323, 39132, 59535, 31906, -13017, -25022, -2851, 10667, -8683, -34699, -28498, 8377, 36299, 28816, 483, -22337, -35800, -47635, -51947, -39926, -23241, -20356, -26939, -24480, -10946, 2160, 15235, 35661, 54190, 53874, 36836, 17435, 158, -9989, 3979, 36927, 42940, 225, -33189, 4281, 68074, 60308, -14379, -46644, 7584, 61275, 42190, 1810, 12409, 45200, 35726, 487, -4343, 11702, 2496, -19929, -11833, 11880, 5222, -14870, 6260, 59405, 86654, 84056, 93747, 103625, 60277, -14166, -28989]
20849b8989N7485L1560n1063o3214K730L8781O546k1012j637K1212J9747K3672
20837C5818L7480J8837l1057m7442o486L0673J3985k5576l7425k1485k364J4179
20825b0863K6660K1899n02k0330k6043k1165l277K5456L6692J1323j7203q324
20813D323J5672Q096j6316j1453O523j0495l4441M688P7347P2656k0644q0638
20801A5318m1177J4458R338n447L0398O2238K2119l9317l7831J330J700k3536
20789I591q607L2223K9435j2578k4501N652K2900P162r679j7467k9083k3207K2606
20776D447N8569K0963m9481n3312R556L9989K488k9360r986J2664L959K859K7109
20763D0464K3656k6007m8464J533N1143K3380l3259k4711L4087M8037l859m4101
$$ y = [-28989, 28496, 60056, 8993, -54221, -51491, -12710, -6164, -27176, -28813, -7601, 12146, 35818, 73298, 92135, 61078, 13636, 7150, 37823, 51808, 26232, -11193, -32678, -35042, -20863, 5797, 27696, 27194, 6864, -19179, -40344, -43621, -18165, 18527, 29850, 12647, 4323, 19995, 28091, 11775, 322, 6845, -3650, -38091, -33403, 43944, 116600, 95956, 15318, -25859, -11401, -2063, -7510, 22888, 85126, 107245, 67928, 30097, 31427, 33127, 9591, 984, 33207, 62642, 50064, 25563, 31215, 54115, 61277, 51598, 34131, 5048, -18159, 4447, 63016, 83979, 34498, -18814, -9258, 30731, 33219, 3859, -6127, 6537, 10496, 13355, 40464, 64120, 38113, -10351, -8818, 42325, 65705, 32446, 7735, 41822, 89859, 86000, 41899]
20751D1899k3743J4296J6423n417r297R475K0787Q999q141q328M069O498n760
20738F1760j0915K021J0204n371k2621j3710M992L963q06K0193L8115K635n6331
20725C4129n3818J3092N0434J7538j0047K2571N1433Q581n3076m6045O875J9719
20713F1386j0837j6891R288O567l5034m8578k410M7199M3214R23l3699m4138l4859
20700e7869p530K6457M1451K7931P047K943J6531L0345K6388K592k0128k1377
20688G4781j5857l2829n4029k5717M3721O6801O723m8153j4656M8284L5507k5830
20676E8746k2282M6810O0822j9994q5548n4011P794J1560j2304Q647N2004M1780
20664I4024j8138m6894q089M6806N6922J9967k4510m4388l8072k3495j0286R325
$$ y = [41899, 18156, 32452, 48875, 43458, 34161, 43636, 64423, 73422, 65281, 56953, 61022, 67520, 61760, 50845, 52866, 63070, 57699, 35078, 21368, 26360, 30323, 29517, 49710, 87825, 90460, 34129, -19689, -6597, 43837, 61375, 51328, 73899, 125332, 133913, 80837, 34792, 41667, 61386, 50549, 33658, 42946, 49513, 14479, -34099, -36509, 10690, 53904, 54827, 21128, -23010, -57869, -65399, -38942, 2509, 30440, 37487, 40430, 56961, 87306, 113694, 116286, 96158, 74781, 58924, 26095, -27934, -53651, -9930, 56871, 63594, 15441, 785, 49069, 84576, 58746, 36464, 83274, 144096, 124102, 38554, -15457, -7663, 3897, -8407, 240, 52244, 94024, 75886, 28992, 20903, 67709, 124631, 144598, 120088, 75700, 37628, 14133, 3847, 13172]
20652A3172L2232K9765o396k9409j228L2757O789m5499l2300L5776M5648k7861
20640E3446o1225J8931R8978M8471o8473q7031R812P9653M0893k9981l9191j586
20628F2697J6545O56j5736j1781K952R186k333j8333j1669K0838M3170K5787j2623
20615A09356l5703l7019k6612j789K9501L0739q518l2964N234O1830N5554j0854
20603A38755n3924k6589L1440N8874L3246k9484q4608p7653n910N3907L5533k0155
20591E3432k5334J9505L4845j951k5031J716K5762o11m2257m0494K214L7164L4377
20578G3337M878j8419j1348J1404Q125k3898k9170J5449M1520o568o0698k6729
20566b2117M9915M8502k1391l4535K6345L6056m3160p6960J1700R5579M6084n6885
$$ y = [13172, 45404, 75169, 68773, 39364, 38136, 70893, 77682, 32183, -117, 35659, 81307, 53446, -7779, 11152, 110130, 158601, 90128, 3097, 12909, 92562, 133455, 103474, 64283, 62697, 79242, 79898, 64162, 52381, 55333, 64519, 62186, 43853, 32184, 53022, 96192, 121979, 109356, 73653, 36634, 10022, 8233, 37734, 68473, 59955, 26991, 32225, 94055, 149609, 138755, 84831, 58242, 89682, 148556, 181802, 152318, 67710, -9943, -15853, 38054, 73587, 53432, 28098, 47603, 82448, 80497, 55466, 57182, 82944, 82333, 40076, -418, 1796, 38960, 73337, 78215, 59796, 48448, 59852, 67977, 44079, 14909, 30358, 71878, 65310, 4612, -22117, 27798, 76300, 54909, 20374, 46719, 82775, 39615, -37345, -25645, 69934, 116018, 59133]
20554E9133o1984J6397N3208K4333M673Q421j3313m5397k5232K7110K8907j9465
20542E6791l4147N115K8223N183j1762M262J1924p810j5499M115J2676o32M892
20529F3331L4264L1515k0663n6419k7700K0519K5743n72r483L645N917j3175l0759
20516B6163k5124J805K5531J9236r866j7317J5631L9951Q444l9024k8702K6896
20504D3624M5693P772k1314q031L913j0622j2172J6178K5159r614l5587j5430
20492B9569O915q774k3155N629L7589J9883j7572j5469J3842K0125R275J9148
20480I7005L2983M995m5662n2615r070K2358J0219q031k9J5753J7280J4973J5639
20467A15798k172m4845o9939l3339M2453P9731L3809m6913p0208j1470N2426M4056
$$ y = [59133, -2851, 13546, 66754, 91087, 95760, 104181, 90868, 45471, 20239, 47349, 76256, 56791, 22644, 27759, 55982, 61165, 49403, 53665, 65589, 57779, 42280, 46395, 59071, 58439, 63331, 97595, 129110, 108447, 52028, 24328, 44847, 70590, 70018, 60535, 64180, 70097, 56922, 26163, 1039, 2844, 28375, 47611, 37745, 20428, 36059, 76010, 84454, 45430, 16728, 43624, 89317, 97089, 75775, 67744, 71657, 61035, 48863, 65041, 90200, 80586, 44999, 29569, 36484, 27710, 4555, 10184, 47773, 67656, 50084, 34615, 48457, 68582, 77857, 97005, 129988, 134983, 89321, 36706, 27636, 49994, 60213, 52182, 52153, 67906, 85186, 100159, 115798, 113626, 68781, -1158, -34497, 7956, 87687, 121496, 74583, 4375, -7095, 45331, 89387]
20455H9387j0106k5817R311K6637j390j8399O729J8523k0162m5557K389O1175
20443I2720L4664m4019n4895J8860O2268P445o6656n9485R259M6573K2053j1456
20431E7331j1318K681k599j5548n30L7823M8911R823k9352j4004K5183J3000m6455
20418G4946o5487r439M6788L7978J379o702n896k8149l4114J3553N6023K2481
20406A03361m1291m1155Q166J5676k2981k5538K2576M4989J4271r362K407O391
20394G7510r356k44L0297J8726l3582m2945R978L8715K934k4768j263R160k8695
20381D6467l9483J7963N5122R557l1055J3749N9418O496o3925k4477N8168K3830
20369A31830r3451j02349K7389J07591L3919o2419m5861K1820K3310j7197j1094
$$ y = [89387, 79281, 53464, 62775, 89412, 88022, 69623, 76352, 94875, 74713, 29156, 31545, 92720, 127384, 83365, 28470, 47330, 109598, 117043, 50387, -9098, 161, 46734, 68787, 57331, 46013, 48694, 46095, 30547, 30017, 67840, 116751, 126574, 97222, 83218, 108401, 121401, 74946, 9459, 20, 46808, 84786, 86165, 79463, 73567, 45418, 11304, 24857, 80880, 103361, 62070, 20915, 29081, 44757, 21776, -3762, 18814, 63803, 78074, 68712, 71119, 77510, 68154, 67910, 98207, 116933, 83351, 40406, 50384, 89099, 92033, 67265, 66002, 75162, 46467, 6984, 24947, 80069, 89626, 58571, 72320, 131738, 138234, 74309, 49832, 108000, 131830, 38379, -63970, -36581, 71010, 104929, 42510, -3351, 18469, 41779, 24582, 13488]
20358A3488K6151K0722j4194q498L0504L3090m475j5423J5837K5816j8096o1212
20346D3710m5489J0176M7620M4934K0829o301k9536l9185k7598m796J0743J5628
20334D0735J9213J9514K963k4318k8002J0074N3734M9103l168m4514l3877M463
20322F5920K2188P078j7803l0962k5747m820J8229K5723J7775J0793P789l377
20310I2786j6050o553J8698K2698J858k529J8073J3366l3386n4911l973N4386
20298A04463L4971l2068m9146j164L8478L3201J9004J9981J6792K161r747k7139
20286A49787n9255o4629o468N5951L3498m3174n5597J5862O3189L0751q183J243
20274A12975M593l6989n3850R718Q1600O9074p26m1801l9211k6573k473L6149
$$ y = [13488, 39639, 60361, 46167, 37669, 68173, 101263, 96788, 81365, 97202, 123018, 104922, 43710, -1779, 8397, 56017, 100951, 121780, 115479, 85943, 46758, 19160, 14364, 25107, 40735, 59948, 79462, 82425, 58107, 30105, 40179, 93913, 143016, 139848, 95334, 61457, 65920, 88108, 95186, 77383, 46421, 20674, 15854, 34083, 59806, 77581, 88374, 96163, 92786, 76736, 70183, 88881, 111579, 113437, 110908, 128981, 142347, 108961, 54050, 50077, 104463, 139434, 107366, 58220, 57056, 95534, 128735, 147739, 167720, 184512, 186673, 176926, 149787, 90532, 25903, 19435, 75386, 108884, 65710, 10113, 25975, 89164, 119915, 111732, 112975, 117568, 80579, 26729, 36447, 118047, 187121, 186395, 144594, 105383, 78810, 76337, 112486]
20262A12486M0819j1210m6581l167N1339J9397n9797o7886L461N0798L0955N992
20250A26606J2261O940l0659n0372k0010K0038K5814Q429k140J736J5013K4827
20238A38483P538l2415m1069P986M7882J0060n3735m4506J7844K8097j7703j6309
20226E2153M8754O5806o695n7235j1882L9826R663l4571l621M2483N866o1115
20214H9432m2914L0380L4947k4752k7195M0901N4878k3837p1553j3786M7816J4222
20202A08539m3189j4909N4077M5771k5789m0954K2458N7293O444n3660m4659K675
20190G4097K0665Q357M514J3798J5763Q485j549j8810l3032j5111K5804L0082
20178A33063k2204o1243k6502L5037M2609P132o170j473l0083o6340l0652N9183
$$ y = [112486, 153305, 142095, 95514, 92347, 143686, 163083, 103286, 35400, 38861, 89659, 120614, 126606, 138867, 145807, 115148, 64776, 44766, 64804, 90618, 99047, 96907, 98643, 113656, 138483, 146021, 113606, 72537, 80523, 128405, 138465, 84730, 40224, 58068, 86165, 68462, 52153, 100907, 166713, 160018, 102783, 90901, 130727, 140390, 105819, 102198, 144681, 150547, 89432, 46518, 76898, 111845, 87093, 59898, 100799, 155677, 131840, 60287, 46501, 94317, 108539, 65350, 50441, 104518, 150289, 124500, 83546, 106004, 163297, 169741, 116081, 71422, 74097, 94762, 103119, 107633, 121431, 137194, 145679, 144130, 125320, 92288, 77177, 102981, 133063, 110859, 49616, 23114, 58151, 100760, 107892, 101722, 100249, 70166, 3826, -26826, 32357]
20166C2357Q8987K7866k1415K599K5692j2605m4894p356L3592N075k7446K0592
20154A23044P9124L2075o6600o7149K1884M6287k9972p0064p132M7896J0884l3836
20142H6441N371O6957N1123j5705m6639l7111l1732k1911J6352M3282J6418k0879
20130A11967q764K0967M731l0058q391N5644P2256J6162m1297m2594q184J5891
20118A58330J1901j2732l4595k3928J7019M1827K0957j3403k0392j0049p654l688
20106A23593J2027J4741m876q895J5341J6386k4737l7426J7634N6428O191n2115
20094A34292q379Q1320P8174j2539o4408m5197l3332l8300O631P0363M1247n4604
20082A55268n6248N7270J02043j4016j29876q7582L0478O5470K6307Q929O087
$$ y = [32357, 121344, 149210, 127795, 130394, 156086, 143481, 98587, 91231, 124823, 129898, 102452, 123044, 202168, 234243, 167643, 100494, 122378, 168665, 138693, 68629, 61497, 109393, 120277, 86441, 91812, 158769, 209892, 194187, 147548, 110437, 78705, 56794, 73146, 116428, 132846, 111967, 103203, 124170, 128901, 98843, 90452, 146096, 218352, 234514, 193217, 150623, 142439, 158330, 170231, 157499, 122904, 98976, 115995, 157822, 178779, 165376, 144984, 134935, 127281, 123593, 135620, 150361, 145485, 136590, 151931, 168317, 143580, 106154, 123788, 180216, 186407, 134292, 125913, 207233, 285407, 272868, 208460, 163263, 129931, 91631, 98262, 168625, 209872, 155268, 99020, 156290, 258333, 244317, 114441, 26859, 57337, 122807, 149114, 158043, 164130]
20071A64130k8954m0888K6073P9780J7925o9961l7391N3063K3512r9201j05784
20060a7696M1202J27485L1349q5103m9993N1606M7958l2434l5501M6751P5973
20049B01597Q134m5934j6151K5071O218k3394N970N4321L7197k9469m9070M479
20037A78969M8556K2440k5902k7656j319n723l0043j5465L1354L8787p075l1653
20025A75270M779L9451J4367k7173k1195O280n107l4611j8693K6545K5843k2685
20013A63071m0279j124K8425R538p174J6654L1616r526n6719l6176K7125M4983
20001A70414K840k3561O442L4714R57n4748m5813K7008O3868N760p0896n2450
19989F4535M8354J00475L5020n7272n4153K9756P4122K5377m2266m5295j96K0445
$$ y = [164130, 135176, 94288, 120361, 200141, 218066, 148105, 110714, 163777, 187289, 88088, -17696, 23506, 150991, 182340, 97237, 47244, 98850, 146808, 114374, 78873, 125624, 201597, 209731, 163797, 147646, 172717, 178935, 155541, 161511, 215832, 253029, 223560, 174490, 178969, 227525, 249965, 224063, 196407, 195088, 189365, 159322, 143857, 175211, 213998, 206923, 175270, 180049, 219500, 233867, 206694, 185499, 191779, 186672, 152061, 133368, 159913, 185756, 163071, 122792, 121668, 150093, 159631, 152457, 169111, 200727, 191201, 134482, 98306, 125431, 170414, 173254, 149693, 156135, 190849, 191806, 137058, 91245, 118253, 182121, 187881, 116985, 64535, 112889, 213364, 248384, 191112, 136959, 166715, 240837, 266214, 223948, 178653, 178457, 198902]
19977A98902l394k2224J665L6600K4739l2300o4569k6150L4994M1444q6j3857
19965A75764J8962L1329r180l9192j0394K1816n365m9919l9423L130J0117m247
19953A03398J8064N2608K9237k7430k6304K8042L7963j4225l6317M784K6209j2785
19941A83244l3925J3259N4865K3443k7229k5633n05n582j8236m255L759j5866
19929A47339p754N0540O7540j6512r4497m2747O8725P5363k2370o9122o762N2987
19917B02730K4350l5816m6685j4282K1135M6601M6697K683m8076l8807J6635L1053
19905B08218j6322m6014j3940K2590J6471N657K1388J9833k5903n3566j1055M5608
19893A72965L7427j4828l7396k2458j3893j3737Q621L8367L0313r084k7668q952
$$ y = [198902, 195508, 173284, 174949, 211549, 236288, 203988, 139419, 113269, 148263, 189707, 189621, 175764, 194726, 226055, 216875, 177683, 167289, 189105, 183740, 133821, 94398, 97528, 107645, 103398, 121462, 174070, 203307, 175877, 149573, 177615, 215578, 201353, 165036, 169820, 196029, 183244, 149319, 162578, 217443, 240886, 213657, 188024, 187519, 181937, 163701, 159446, 163205, 147339, 139585, 190125, 257665, 241153, 146656, 103909, 172634, 247997, 225627, 156505, 149743, 202730, 227080, 191264, 144579, 130297, 151432, 198033, 244730, 247413, 199337, 160530, 177165, 208218, 191896, 145882, 131942, 154532, 171003, 176660, 198048, 217881, 191978, 138412, 127357, 172965, 210392, 195564, 158168, 135710, 121817, 108080, 116701, 155068, 185381, 176297, 148629, 139677]
19881A39677J6420L2534M8216N0925J6035l4435m4419p173J8604o671m9541n5625
19869A24547j8586K4938M2015K7092l98j0609O732K3920R217k2579k6185M453
19857A84557K3334M608j5020L244L3136K1416k7700n6767l9159q506M487J4759
19845A42389L8159M8399J9686j8038j6762J1690R993l1748n2762j0680N2062O3633
19833B56021J5693l3018l1510J1911M7106L5058j3126m7003l5387n542j624j7742
19821A80837j3120J4642K6255J2390N967J2951J588k1967r022L1745K3621m2062
19809B23825o3051R594P2097L1382l7065k2520K6203r86o0107k6622O2070N0470
19797B65290n5909p9340K7421R1694J2353p2547k8845N3033L3480l6718k7807
$$ y = [139677, 156097, 188631, 236847, 287772, 303807, 269372, 224953, 217780, 236384, 229713, 180172, 124547, 105961, 130899, 172914, 200006, 199608, 188999, 195731, 219651, 228868, 206289, 180104, 184557, 207891, 212499, 197479, 200723, 233859, 255275, 227575, 170808, 131649, 123143, 127630, 142389, 180548, 228947, 248633, 230595, 213833, 225523, 235516, 203768, 151006, 140326, 192388, 256021, 271714, 238696, 207186, 219097, 266203, 301261, 288135, 241132, 205745, 200203, 198579, 180837, 167717, 182359, 208614, 221004, 226971, 239922, 241510, 219543, 210521, 242266, 265887, 223825, 160774, 170368, 242465, 273847, 236782, 214262, 240465, 239479, 179372, 152750, 214820, 265290, 209381, 130041, 157462, 249156, 261509, 188962, 160117, 213150, 246630, 209912, 182105]
19786A82105L6078L9661r384j1144L2236K7018l1934n2430j1886J2582r877j9276
19774A83749J2966L3241Q027k0055j2889M400j301j7402j5642O101K8858L2706
19762B42759J2879p221j803O851k4699o6008k9637P3483J03994J424r2561m0984
19750A78477O4215M7376o2965q6376J0915P8248M0980n668M537R981k1364j5926
19738B42430M6024N9400k3239q6243l4383M8842M3393j8132k8190J6505L7998
19727C04405J6276o959j6402k0041k966L2888L2146l0253q0140m2490L8559O2621
19715B87644J6049k9780l0334k702K4544L2100P901k4584j3838L8450N6412R98
19703C62860o0154n3947p179J7199K0614K8414J8338k3118l9721L761L6668n646
$$ y = [182105, 218183, 257844, 248460, 237316, 269552, 296570, 264636, 212206, 200320, 212902, 203025, 183749, 196715, 229956, 237983, 217928, 205039, 209439, 208138, 190736, 175094, 181195, 210053, 242759, 255638, 248417, 246614, 253465, 228766, 162758, 133121, 206604, 310598, 312022, 219461, 178477, 242692, 290068, 227103, 140727, 151642, 229890, 270870, 265202, 269739, 279720, 258356, 242430, 288454, 347854, 324615, 238372, 203989, 252831, 296224, 278092, 249902, 266407, 304405, 320681, 313722, 297320, 277279, 274313, 307201, 339347, 309094, 228954, 186464, 225023, 287644, 303693, 273913, 243579, 240877, 265421, 297521, 305422, 280838, 267000, 305450, 361862, 362860, 302706, 248759, 241580, 258779, 279393, 307807, 326145, 303027, 263306, 267067, 303735, 298089]
19691B98089n2661p627P2700N5907m2307p3893L316O4401K6331l0748j4642L0181
19679C29047J3291m6873n5014J3368P7623O1758j2020n4747j8432M7445O0560
19668D16006J1138l7553m8124m3376l1665J4316O9669N1059l8212o7144K4869
19657C20983J01604L2131q4588o7254N2638Q3113j6942q9102m3156K9657M6235
19646C65319M4380N0126R838p1592q5941J178P3112M6523n670k742J0936j9190
19634D16277m1083m087L4444K0782R114M2318M6933k6420p5661q443P5437L2417
19622E22028p8912q6651J4202O4836P111m4137r930M1280L4334l81j0856r415
19610D43509j8773j7627J0059L5550L1226N520k4522m5783l2668K3722P2760N5040
$$ y = [298089, 245428, 237801, 310501, 366408, 324101, 250208, 253524, 317925, 344256, 313508, 298866, 329047, 342338, 295465, 240451, 253819, 331442, 393200, 381180, 326433, 308001, 355446, 416006, 427144, 389591, 341467, 298091, 266426, 280742, 350411, 401470, 363258, 296114, 320983, 422587, 454718, 370130, 302876, 355514, 438627, 421685, 332583, 289427, 319084, 365319, 409699, 459825, 469663, 398071, 312130, 313308, 386420, 432943, 427273, 424531, 435467, 416277, 375194, 371107, 405551, 426333, 435447, 477765, 524698, 498278, 422617, 414174, 489611, 522028, 443116, 356465, 370667, 435503, 442614, 398477, 388547, 429827, 464161, 463780, 452924, 443509, 424736, 407109, 417168, 452718, 483944, 489464, 464942, 419159, 386491, 410213, 482973, 538013]
19598E38013o258l1359J639L7319L5489J1242j7382m8772o1984l2711J1714K0871
19586D57821J639p63R424n492k3937Q463N8895L2153o1408q7938P599R9946O4795
19573E61197l8446o7217o523L6493J0726k1686n701K6928K5091l718k0897j9596
19561D76651k0353k4693j1891J7820K9382J168l4718l2876m493j104k6245k3533
19549C45115K2856M3497p908o3471l6454L8331N4464n82l4501m026K4780m905
19537C77196n2065m8995M870N8531P0074K8081m0919p4069l2665L4198M5888Q137
19525C78262j712L1297L6696j0040l7846n936K1284j0615m6071j5281M2957M4866
19513D27861l639k7496n710J1778m153k6416k5750n099J9244L2013K1170n083
$$ y = [538013, 531755, 500396, 502035, 539354, 574843, 586085, 568703, 519931, 457947, 425236, 436950, 457821, 459460, 458697, 468121, 462629, 438692, 447155, 506050, 538203, 476795, 388857, 396456, 496402, 561197, 522751, 455534, 449011, 485504, 496230, 474544, 468843, 495771, 520862, 517144, 496247, 476651, 456298, 431605, 419714, 437534, 466916, 468084, 433366, 400490, 395997, 394893, 368648, 345115, 367971, 411468, 403560, 340089, 303635, 341966, 396430, 395848, 361347, 357321, 382101, 377196, 325131, 276136, 281006, 339537, 409611, 437692, 396773, 322704, 290039, 324237, 370125, 378262, 376550, 407847, 444543, 434503, 396657, 390721, 412005, 401390, 355319, 340038, 382995, 427861, 424222, 396726, 391016, 402794, 398641, 372225, 346475, 341376, 360620, 392633, 413803, 408720]
19501D08720j7548n578M974n070j7131j0873J726M079L506P943Q270L775O764
19488C93557P342j7629m6810k8174K8703M6804L19l8754j6917J8088Q858j4834
19476C40553k305K2346R427k6056l8591k8290j4634J3542N4490N7711L889l9524
19464C52558j8315J7989Q094j0570J8292M9931J4445m6052m0969J3828L1489O577
19452C97297K867K0676Q018k1841j6392j729l6194p3074k3065O5093N6214m0757
19440C37113p4415k656M4477j085l5500J7348O9377L0970l7695m6055j8368j3635
19428B69876j2220J4472K3914r128k2842J7980L9859r828n5158k0100L7381L4723
19416C08929Q347K2179K9988k8482q0212k6397O9000O5130k5885o3988j2665K3564
$$ y = [408720, 391172, 385594, 390568, 385498, 368367, 357494, 359220, 363299, 366805, 374748, 383018, 386793, 393557, 400899, 383270, 336460, 308286, 336989, 383793, 384112, 345358, 328441, 346529, 355387, 340553, 338248, 360594, 370021, 343965, 305374, 277084, 262450, 275992, 330482, 388193, 392082, 352558, 334243, 352232, 360326, 349756, 368048, 417979, 432424, 386372, 345403, 359231, 390720, 397297, 400164, 420840, 428858, 407017, 390625, 388896, 352702, 279628, 256563, 321656, 377870, 337113, 262698, 260042, 304519, 303434, 267934, 285282, 354659, 385629, 347934, 301879, 283511, 269876, 257656, 272128, 296042, 286914, 264072, 282052, 321911, 312083, 256925, 236825, 274206, 308929, 317276, 339455, 369443, 340961, 260749, 234352, 303352, 368482, 342597, 278609, 265944, 289508]
19404B89508o431k9666K295L5708K4946K795J96m453j9846j4373J4450K3073p99
19391C17403j9312j9483k8962m2834j9109L2627M3665l606l7656n923M8448N6299
19379C21557J2233l8133n4133k2239L2519M8070r700p9786o6700K4728Q5479M9956
19367C03851k2786m2749k160L8522L2081j5418n5455l9908J8594M5136K899l9064
19355B23543n481N7104M8754j7015l6052O675J7869k8835m3845J0870M9165J9245
19343C01997m212K9766M0362l4224r7844m0712P0524Q9549J1098m6485l2925k126
19331B84768J2997K8388K8080j7955o2995l1840M2710N2439j2676m8146j0069
19320B65701K0460j2960m8277k1965K2513J8708j0063l079K9747L1708m184l1821
$$ y = [289508, 283077, 253411, 255706, 291414, 316360, 319155, 319351, 314898, 295052, 280679, 295129, 318202, 317403, 298091, 278608, 249646, 206812, 187703, 220330, 263995, 260389, 222733, 216810, 265258, 321557, 333790, 295657, 241524, 219285, 251804, 299874, 290174, 210388, 143688, 168416, 253895, 303851, 281065, 238316, 236156, 274678, 306759, 291341, 235886, 195978, 214572, 259708, 262607, 223543, 218062, 275166, 323920, 306905, 270853, 277528, 295397, 266562, 222717, 233587, 282752, 301997, 297785, 327551, 367913, 333689, 235845, 195133, 265657, 355206, 366304, 319819, 286894, 284768, 297765, 326153, 354233, 336278, 273283, 241443, 284153, 336592, 323916, 275770, 265701, 286161, 273201, 224924, 202959, 225472, 244180, 234117, 231038, 260785, 292493, 288309, 256488]
19308B56488k4400M113L3105M6905K9411j3192l9436j8008K6366M2662J7186j8543
19296C42657l1252j4225J6158L3517K2510j779j1913r714j9485l3350j0507M5728
19284C28345O3917L613o7289n8298J1221M0834j376m0506j8398K3793K3626o546
19272C02936j4560M426J4330O313L803J1354J0765M456J3153K7790J3215k8366
19260C69615m5129r658L4661L2043j0089l6794j8006K4752N1664L9822m305m6708
19248C81868n0513j5480K0108K9267K5604K6788K0048o842k9165j8454R263J8321
19236D10813Q333L465M462m308j5638j3695j1511k4387k4288J8782O5056M6788
19224D63872k2002n4891k0056K0882J8930K958Q832J9585J6613K0880L7007K1759
$$ y = [256488, 232088, 236201, 269306, 316211, 345622, 332430, 292994, 274986, 301352, 344014, 361200, 342657, 311405, 297180, 313338, 346855, 369365, 367586, 355673, 345959, 326474, 293124, 282617, 328345, 392262, 395875, 328586, 270288, 281509, 322343, 320967, 280461, 262063, 285856, 309482, 302936, 288376, 292802, 307132, 313445, 317248, 328602, 339367, 343823, 356976, 384766, 397981, 369615, 324486, 314828, 349489, 381532, 371443, 334649, 316643, 341395, 393059, 432881, 428576, 381868, 331355, 315875, 335983, 365250, 390854, 417642, 437690, 430848, 401683, 383229, 392492, 410813, 419146, 422611, 427073, 422765, 407127, 393432, 381921, 357534, 333246, 352028, 417084, 463872, 441870, 386979, 366923, 387805, 406735, 409693, 418525, 438110, 454723, 475603, 512610, 534369]
19212E34369l8667p9802m7651J3979K8296l048j7860O871L4935L3419N898k4162
19200D46577k9592J420L9498L8977O370l799J8479J6904k6610m4304N280N5781
19188E24981L6735j2990k0387l94n912j5358J9950O2865M2306j5456k6959K817
19176E92198K20k9163q466N3861N7400j5155n3246K975O2747L1364m4849n9889
19164E89997j675N3051N1748J1415k2323k1196L142J0701j0709j6722K2785N5116
19152G25330J9603l8873k9231L1851M2304j1984l6611J791K3326r343k1347K7972
19140G24788O0340J8287k8791o476M1874M6015K6298K5818J5804l1561n8090j0664
19128H23642N4211N6976J9853R164J9596J3666J1177L9137N4584J6975k4091j1539
$$ y = [534369, 495702, 415900, 368249, 382228, 410524, 407476, 389616, 396487, 431422, 464841, 470739, 446577, 416985, 418405, 457903, 496880, 503250, 499451, 517930, 534834, 508224, 463920, 469200, 524981, 561716, 548726, 528339, 527945, 522033, 506675, 526625, 589490, 631796, 616340, 589381, 592198, 592418, 563255, 554789, 608650, 666050, 650895, 597649, 600624, 663371, 694735, 649886, 589997, 588322, 641373, 693121, 704536, 682213, 661017, 664159, 674860, 664151, 647429, 670214, 725330, 744933, 706060, 676829, 708680, 750984, 739000, 702389, 704180, 727506, 718163, 696816, 724788, 785128, 803415, 774624, 768148, 810022, 856037, 882335, 908153, 923957, 892396, 834306, 823642, 877853, 934829, 954682, 963846, 983442, 997108, 1008285, 1047422, 1102006, 1118981, 1094890, 1083351]
19116A083351J5561K628r938K9801O7089L4180q451L2239J05458R1246P150k0496
19104A429818L6020Q5153Q5140P8430O8744J8748l4856j7298L6765K6571k9885
19093A783350k1897M3190M0264m3172p1278J592N0311L411l9838l502L2774K70
19081A775475k6644J5635M6377p858o4930l0210L3552K4201k0307r372K9262J9868
19069A785049k498L8894J02431R5118M4437M6450Q7677P8311K9056L0268P2126
19058B407319N2380l3036p0334k3710L675m8973r7899o1803N352J1604k8329l2608
19046B083638J5859N6859N0469K6043L1261O5482Q0573M8877J3657L6305R4257
19035B603280R4041J1822n4813l0155K3176J3341k9427k0873J6863m421p2975
$$ y = [1083351, 1098912, 1101540, 1091602, 1121403, 1188492, 1222672, 1214221, 1246460, 1351918, 1443164, 1450314, 1429818, 1465838, 1550991, 1636131, 1714561, 1783305, 1802053, 1767197, 1749899, 1786664, 1813235, 1783350, 1761453, 1804643, 1844907, 1801735, 1730457, 1732049, 1782360, 1785771, 1745933, 1742431, 1775205, 1775475, 1748831, 1764466, 1810843, 1802985, 1738055, 1707845, 1741397, 1765598, 1745291, 1735919, 1765181, 1785049, 1782551, 1821445, 1923876, 2018994, 2063431, 2109881, 2197558, 2275869, 2304925, 2335193, 2407319, 2459699, 2426663, 2356329, 2332619, 2336294, 2287321, 2189422, 2127619, 2132971, 2144575, 2116246, 2083638, 2099497, 2156356, 2206825, 2232868, 2264129, 2329611, 2410184, 2459061, 2472718, 2509023, 2603280, 2697321, 2709143, 2654330, 2624175, 2647351, 2660692, 2631265, 2610392, 2627255, 2622834, 2549859]
19024B549859r4265o1674o3130j10375j12724m9846j9407o0383p5311m650N7395
19013A955489J9998m8666l8832K2021L3154p267k2255L42R544M209K2947M2329
19001A993013P161m6800k6839N1852O5879j8185p3920p970R2040R7373L5858L0000
18989B199462R2437J18216O9177L1424N9338Q3334L8799j1866J8560Q4694O8785
18978B852360k9045q1631k7467L9924K1631m0838m3271J9326N4513J1355n9365
18967B717492q5296n7014k0448j9007n3831q5894p8265m1537k0149k8842l5853
18956B191356k2210j2972k2635j8835J6177L4735o281n9823m3216L8121R0111
18945B184528N4012k5673o6164l7365K1585M9827K5294j0792l018M1078N9842
$$ y = [2549859, 2455594, 2393920, 2330790, 2220415, 2107691, 2057845, 2038438, 1978055, 1902744, 1898094, 1955489, 1975487, 1926821, 1887989, 1910010, 1943164, 1935897, 1913642, 1913984, 1923528, 1927737, 1950684, 1993013, 2000174, 1953374, 1926535, 1978387, 2044266, 2026081, 1952161, 1944191, 2036231, 2133604, 2169462, 2199462, 2291899, 2410115, 2479292, 2510716, 2570054, 2653388, 2692187, 2680321, 2698881, 2783575, 2852360, 2823315, 2741684, 2714217, 2754141, 2775772, 2734934, 2691663, 2710989, 2765502, 2776857, 2717492, 2632196, 2575182, 2554734, 2535727, 2481896, 2396002, 2317737, 2276200, 2256051, 2227209, 2191356, 2169146, 2156174, 2133539, 2114704, 2130881, 2165616, 2159335, 2099512, 2056296, 2094417, 2184528, 2238540, 2212867, 2146703, 2109338, 2130923, 2180750, 2206044, 2195252, 2192234, 2233312, 2293154]
18934B293154L2311O689J1526J2005m212J6920Q8256J19398N4498j2446K2680
18923B640779R3998O7800l1188n9569O069M3960L851k3284J5981M9077J9678k2382
18911B804770l1374l9165o2164n6138j9393k0165o4890o4056Q618N2379P318m3657
18899B472083k4545R698n996k5734R14J8700k1073m8334J362N3611J9321m2853
18887B407154k9203K9042L5620M015J0190L5895J5151j8533Q804N3402K0155n1762
18875B519930m3390K9285L7767k7422l6204M7918R7736L7213l8560l0950J5058
18864B608381J5883j2205r277J7722K3779P500j260N768J8708L0648L1583J6566
18852B753796O249J8988L1339J5369n516J606J2622k937l726N3980J05965N9059
$$ y = [2293154, 2325465, 2332154, 2343680, 2355685, 2351473, 2368393, 2456649, 2576047, 2630545, 2618099, 2640779, 2734777, 2802577, 2771389, 2711820, 2717889, 2761849, 2765700, 2742416, 2758397, 2807474, 2827152, 2804770, 2773396, 2734231, 2672067, 2615929, 2596536, 2576371, 2511481, 2447425, 2456043, 2508422, 2515740, 2472083, 2447538, 2457236, 2451240, 2425506, 2426420, 2445120, 2424047, 2375713, 2377075, 2430686, 2450007, 2407154, 2377951, 2406993, 2442613, 2446628, 2456818, 2492713, 2507864, 2489331, 2498135, 2551537, 2571692, 2519930, 2476540, 2505825, 2543592, 2516170, 2479966, 2527884, 2625620, 2662833, 2624273, 2593323, 2608381, 2624264, 2612059, 2602782, 2620504, 2644283, 2651783, 2650523, 2656291, 2674999, 2705647, 2737230, 2753796, 2760045, 2779033, 2810372, 2825741, 2820225, 2821831, 2834453, 2831516, 2827790, 2881770, 2987735, 3046794]
18840C046794m2759o4880J1267O6538L8111m778k071J6540K5463M7561O9080L7136
18828C244002k3492k2169L5548M1112k1453l3661M2388P7187m557p9721k7837
18817C227347O8695P0471O941k150M0913M1993l435j6195J4333K5605J0209K1908
18805C506635O0976O5639K1383j3857j627L1893M7877L8435J9342J4423L3087
18794C824206M3946P339n0490n4341P612O1499O3923N2986N1148K3413k0250j557
18782D009434P7940R3023q439r2869m1184O0530O9244J2958J0370N3898M8760
18771D293665M665J0075N4980N0397O87n163M0103N6297K6598J0598J7063K966
18759D562931j3403K1272O9912M9539j2599j6080L3372M0384O830K9053J00947
$$ y = [3046794, 3004035, 2939155, 2950422, 3016960, 3055071, 3050293, 3048222, 3064762, 3090225, 3137786, 3206866, 3244002, 3220510, 3198341, 3233889, 3275001, 3253548, 3219887, 3262275, 3339462, 3334905, 3255184, 3227347, 3296042, 3366513, 3373454, 3371304, 3412217, 3454210, 3450775, 3434580, 3448913, 3474518, 3484727, 3506635, 3567611, 3633250, 3654633, 3640776, 3639149, 3671042, 3718919, 3757354, 3776696, 3791119, 3824206, 3868152, 3875491, 3825001, 3770660, 3778272, 3839771, 3903694, 3956680, 4007828, 4031241, 4010991, 4009434, 4087374, 4180397, 4171958, 4079089, 4037905, 4098435, 4167679, 4180637, 4191007, 4244905, 4293665, 4298330, 4308405, 4363385, 4413782, 4414469, 4409306, 4449409, 4505706, 4532304, 4542902, 4559965, 4562931, 4549528, 4570800, 4640712, 4690251, 4677652, 4661572, 4694944, 4735328, 4742158, 4771211, 4872158]
18748D872158J01340Q777m7661j694N1722L2823k732Q644L0696K2848J9434M2119
18736E138474M6833K0417J8310N1844N5927J9701K0238O9997P2090j297l3280
18725E479254M2366J13898P4022j722P526O4546N7583K233K665O1902Q0382K4813
18713F009468k8993k1940K0375N1374N8001M5338K3369J1596K0687L7859N1245
18702F278379O3921O9162N1083K3863K2125M0400L9467K1488K9413O1860O9258
18691F770419M7635M6286O6639N4025J0453M282M0520M3197K603O700P5333J03692
18679G271784L9797k0511K424M8510M8121M1107O6929P0406K4501J2442P2484
18668G677994J00528L4534j1325N4411J17290N1628m0821L896J22741J32257M0696
$$ y = [4872158, 4973498, 4982275, 4934614, 4932920, 4984642, 5017465, 5014733, 5023377, 5054073, 5076921, 5096355, 5138474, 5185307, 5205724, 5224034, 5275878, 5331805, 5351506, 5371744, 5441741, 5513831, 5512534, 5479254, 5521620, 5635518, 5709540, 5707818, 5715344, 5779890, 5837473, 5839706, 5842371, 5904273, 5984655, 6009468, 5980475, 5958535, 5978910, 6030284, 6088285, 6133623, 6156992, 6168588, 6189275, 6227134, 6278379, 6342300, 6411462, 6462545, 6486408, 6508533, 6548933, 6588400, 6609888, 6639301, 6701161, 6770419, 6818054, 6864340, 6930979, 6985004, 6995457, 6999739, 7040259, 7083456, 7086059, 7092759, 7168092, 7271784, 7311581, 7291070, 7293494, 7342004, 7390125, 7431232, 7498161, 7568567, 7593068, 7605510, 7677994, 7778522, 7813056, 7801731, 7856142, 7973432, 8025060, 7984239, 7988135, 8110876, 8243133, 8283829]
18657H283829J1954O8323P4731N006j3748N7923J02547N9057J6143M0608P7197
18646H783570P4742O9097Q6798Q8829N7484L4954M2872N5304O3950P8895P1556
18635I508051J7868k0249K9097J12629J19165N9613M1416Q1643R5392O2241M9067
18624A0155933O5942N5267L0928O9006J47405J57502R5748P7697J31945J49837
18614A1137210Q4688L3856O2360J00602Q7292P1481R8079J20592J02149Q8671
18604A1986980J12949J30165J08413Q6180R1573R8836J00336J24096J54938J42394
18594A3136860J04048J09258J50291J52133J16097J18534J60688J66548J37879
18585A4352336J53722K04287J94133J28505J19341J81719K08557J76120J79855
$$ y = [8283829, 8295783, 8364106, 8438837, 8443843, 8430095, 8488018, 8590565, 8649622, 8665765, 8706373, 8783570, 8858312, 8927409, 9014207, 9103036, 9160520, 9195474, 9238346, 9293650, 9357600, 9436495, 9508051, 9525919, 9505670, 9534767, 9647396, 9766561, 9826174, 9867590, 9949233, 10044625, 10106866, 10155933, 10221875, 10277142, 10308070, 10377076, 10524481, 10681983, 10777731, 10855428, 10987373, 11137210, 11221898, 11255754, 11318114, 11418716, 11506008, 11577489, 11675568, 11796160, 11898309, 11986980, 12099929, 12230094, 12338507, 12424687, 12516260, 12615096, 12715432, 12839528, 12994466, 13136860, 13240908, 13350166, 13500457, 13652590, 13768687, 13887221, 14047909, 14214457, 14352336, 14506058, 14710345, 14904478, 15032983, 15152324, 15334043, 15542600, 15718720, 15898575]
18576A5898575K29580K14953J25537R6920J76081K45917K43942K44411K64431
18567A7740347K19356J39716J82859L39499L89062K58511J59422K34970L40404
18558B0004146L31217K99073L38859L46846K57797K27745L52517M46538L48425
18549B2953163K19137K71683M11987M26296L43355L29841L83297L98764L98154
18540B6135677M41899M57220L91390L75222M97659N97543N28067M33725M96473
18531C0354875O10286N99289N51082O17082O90682O27322N77839P29119R10318
18522C6267894Q60612P07292P48202R22382R51599Q66469R15120J062725J069604
18513D4371899R75273J013485J131039J094708R88823J071964J225247J126615
$$ y = [15898575, 16128155, 16343108, 16468645, 16565565, 16741646, 16987563, 17231505, 17475916, 17740347, 17959703, 18099419, 18282278, 18621777, 19010839, 19269350, 19428772, 19663742, 20004146, 20335363, 20634436, 20973295, 21320141, 21577938, 21805683, 22158200, 22604738, 22953163, 23172300, 23443983, 23855970, 24282266, 24625621, 24955462, 25338759, 25737523, 26135677, 26577576, 27034796, 27426186, 27801408, 28299067, 28896610, 29424677, 29858402, 30354875, 30965161, 31564450, 32115532, 32732614, 33423296, 34050618, 34628457, 35357576, 36267894, 37128506, 37835798, 38584000, 39506382, 40457981, 41324450, 42239570, 43302295, 44371899, 45347172, 46360657, 47491696, 48586404, 49575227, 50647191, 51872438, 52999053]
18505E2999053R04420R75456J264316J286158J034584J031485J385001J592052
18497F2472525J477808J511115J885277K124324K019849K112307K689110L152981
18489G9445296L122009L341601M494451N720341N549192M035723K691818K245654
18481A10646085J732370K42689j529212k283152j929319j453838j319408r98807
18473A03107408j39312P35234J091139J255509J798767K526818K872761L012019
18465A16260343L616794M503438M633982L811109L221049L579406L869626L062748
18457A46558495K114018K658409M303419N079584M472691M048387M682468N073264
18449A78990735L891397J835468M05858j75455o50114j240976j588659j504217
$$ y = [52999053, 53903473, 54878929, 56143245, 57429403, 58463987, 59495472, 60880473, 62472525, 63950333, 65461448, 67346725, 69471049, 71490898, 73603205, 76292315, 79445296, 82567305, 85908906, 90403357, 96123698, 101672890, 105708613, 108400431, 110646085, 112378455, 112621144, 111091932, 108808780, 106879461, 105425623, 104106215, 103107408, 102968096, 103703330, 104794469, 106049978, 107848745, 110375563, 113248324, 116260343, 119877137, 124380575, 129014557, 132825666, 136046715, 139626121, 143495747, 146558495, 148672513, 151330922, 155634341, 160713925, 165186616, 169235003, 173917471, 178990735, 182882132, 184717600, 185123458, 184948003, 184297889, 183056913, 181468254, 179964037]
18441A79964037r28365K11505J507992K325667L049480M810453P272295Q291136
18433B06504200O913004N043055M590619M603349L237610J113354K94985J011631
18425B33311807J943926K948472M839273P132726Q828198J0838886J4496578J8074496
18417C02414362J8476079J6410233J5704653J6683643J4803188P875334L11619
18410C92679111k963826l265384n029949q715890j1109271j1030509j0404254
18403C40160028j0314405r884983q986812q638522q517454p066022m361570k181814
18395B80208446r45287Q43138L790274O681114Q607907R732272R895981Q978258
18387C27792103Q547234J0202731J2188189J1072948P307922N207070O097614
$$ y = [179964037, 179035672, 179247177, 180755169, 183080836, 186130316, 190940769, 198213064, 206504200, 213417204, 218460259, 223050878, 227654227, 230891837, 232005191, 232300176, 233311807, 235255733, 238204205, 243043478, 250176204, 259004402, 269843288, 284339866, 302414362, 320890441, 337300674, 353005327, 369688970, 384492158, 392367492, 392679111, 389715285, 386449901, 381419952, 372704062, 361594791, 350564282, 340160028, 329845623, 319960640, 310973828, 302335306, 293817852, 286751830, 282390260, 280208446, 279263159, 280106297, 283896571, 290577685, 299185592, 308917864, 318813845, 327792103, 336339337, 346542068, 358730257, 369803205, 377111127, 382318197, 388415811]
18380C88415811N609195K20737p199737j1734894j3331593j5406809j8561381
18373C28011329k0029636j8628130j6238911j4269286j2035526r145656o564112
18366B31100072m607787k401333q9464P05815m73041j898823k300670k658541
18358B17376228m179084o091638o837018o288434n463896m818194l976097k672347
18350A77049520j094331L73739J275916J423280J344953J678989J937448R10174
18342A84899688j353711l202394l669158l823758m839247n911509n539282m054152
18334A52506477l204759l538756l848332l338353k824714l229708m087164m368749
18326A24065942m005444l682308l567078l168669k357944j676974j428407j153618
$$ y = [388415811, 394025006, 394245743, 387046006, 375311112, 361979519, 346572710, 328011329, 307981693, 289353563, 273114652, 258845366, 246809840, 237664184, 231100072, 226492285, 224090952, 224001488, 224707303, 224234262, 222335439, 220034769, 217376228, 213197144, 207105506, 200268488, 193980054, 188516158, 183697964, 179721867, 177049520, 175955189, 176328928, 177604844, 179028124, 180373077, 182052066, 183989514, 184899688, 183545977, 180343583, 176674425, 172850667, 168011420, 162099911, 156560629, 152506477, 149301718, 145762962, 141914630, 138576277, 135751563, 132521855, 128434691, 124065942, 120060498, 116378190, 112811112, 109642443, 107284499, 105607525, 104179118, 103025500]
18318A03025500m41464K99968N36597P01464J663721L109611L519171K211711
18310A14626279M34560m05971p68561k051599m177347n569438n492947m938341
18302I1656635m823565m691809l893031k898692k488250k462322k164085j681611
18294F6553270j542167j638320j435981r92809q50923j049647j093939q63282
18286E7086202p67979r61448j106783j032884j000035j163812j303873j249138
18278D8500250j135497j097144j070089j011091r88996r87580r07889p91114p61365
18269C9749485p70728o91060n97846o43138p26672o48394n04217n37468o70547
18260C3959415o15736m08383l70342n41212o12052m71636l63275m15973m55394
$$ y = [103025500, 102584036, 102884004, 103420601, 104122065, 105785786, 108895397, 112414568, 114626279, 115060839, 114654868, 113886307, 111834708, 107657361, 102087923, 96594976, 91656635, 86833070, 82141261, 78248230, 75349538, 72861288, 70398966, 68234881, 66553270, 65011103, 63372783, 61936802, 60943993, 60093070, 59043423, 57949484, 57086202, 56318223, 55356775, 54249992, 53217108, 52217073, 51053261, 49749388, 48500250, 47364753, 46267609, 45197520, 44186429, 43197433, 42209853, 41301964, 40510850, 39749485, 38978757, 38287697, 37689851, 37046713, 36320041, 35671647, 35167430, 34629962, 33959415, 33343679, 32935296, 32564954, 32023742, 31411690, 30940054, 30576779, 30160806, 29705412]
18251B9705412l88732l65809m36926m39306l43869l36688m39545m32749k78767
18242B6243021k30640l76119m66929l66079k75395l32257l65571k64723k15800
18233B3349508l32179m06712k90355j81430k64140l76427l25522k35165k76650
18224B0660928l33795k51976j63478k36714l35023k62552j39738j86341l13418
18215A8437893k87926j54699j37877k35708k59815j93485j80746k22138j96171
18206A6569328j36174j83114k93319k82299j47272p7266j42705k20278k28444
18197A4858457k11479j89862j38578j08828j71305k52787k24860j30783j22008
18188A3307967j94450k00822j14088o5541j13532j71451j80712j78017j79185
$$ y = [29705412, 29316680, 28950871, 28513945, 28074639, 27730770, 27394082, 26954537, 26521788, 26243021, 26012381, 25636262, 25169333, 24803254, 24527859, 24195602, 23830031, 23565308, 23349508, 23017329, 22610617, 22320262, 22138832, 21874692, 21498265, 21172743, 20937578, 20660928, 20327133, 20075157, 19911679, 19674965, 19339942, 19077390, 18937652, 18751311, 18437893, 18149967, 17995268, 17857391, 17621683, 17361868, 17168383, 16987637, 16765499, 16569328, 16433154, 16250040, 15956721, 15674422, 15527150, 15449884, 15307179, 15086901, 14858457, 14646978, 14457116, 14318538, 14209710, 14038405, 13785618, 13560758, 13429975, 13307967, 13113517, 12912695, 12798607, 12733066, 12619534, 12448083, 12267371, 12089354, 11910169]
18179A1910169j56395j31113j43270j50604j04769p7340j43187k02958j20657
18170A0679876J9545J7719j19512j96453j47196r5576j00903r0037n8044r2068
18160I817351j64332j40020l1908j0855j13589j77379j25656p9858j12110j24776
18150H736868o8806m9960j09725j24029m0302Q00q6149j68912j29901o3399q0880
18139G815605j06881m7930L707o7953j74427j57332m6390P179k7652o3177o9070
18128G065679q3425r9337q2603n6857n5081m5573r437j0573p9116j20417o4020
18117F359240k151l8459j00096o5011J2989p145j04109j28800n4606j943k2868
18106E847041m2764k5504k6071n4094m2323J1518J5368n6815j04593n9737N716
$$ y = [11910169, 11753774, 11622661, 11479391, 11328787, 11224018, 11146678, 11003491, 10800533, 10679876, 10699421, 10717140, 10597628, 10401175, 10253979, 10158403, 10057500, 9967463, 9909419, 9817351, 9653019, 9512999, 9481091, 9470236, 9356647, 9179268, 9053612, 8973754, 8861644, 8736868, 8668062, 8618102, 8508377, 8384348, 8344046, 8344846, 8258697, 8089785, 7959884, 7896485, 7815605, 7708724, 7660794, 7664501, 7596548, 7422121, 7264789, 7218399, 7225578, 7197926, 7134749, 7065679, 6982254, 6882917, 6800314, 6743457, 6688376, 6642803, 6633366, 6622793, 6543677, 6423260, 6359240, 6357089, 6318630, 6218534, 6153523, 6166512, 6159367, 6055258, 5926458, 5871852, 5869909, 5847041, 5804277, 5778773, 5752702, 5698608, 5656285, 5667803, 5683171, 5626356, 5521763, 5462026, 5467742]
18095E467742k269o1610q5842n2943j5799j6322l8963m1798j3014O630k8181r2879
18083E024752j08740n5695j0682k9411n7116k5725K5257J5604m0151o5656n2528
18072D619909n1741o4418m8951j6858j4712k6617k694L0134R95o8970q4082l0651
18060D241344N898q486j3778J3896J6294k4964m2932j1634j017m4852o6232j1711
18048D051826M1530N220p3929q7519k8270J7671N697k7575m0797l1601j2961j81
18036C819111j1570m2164n4991l3048j2971k8868n3385m0309l76J5023r711m0828
18024C505913n0651m6290m3837m4506l8959j8212J5973M1727L0893j6327o4363
18013C271361p9224n7909j8499J6088K2135p149m1775m4074k1719j3955k2567
$$ y = [5467742, 5465473, 5403863, 5318021, 5265078, 5249279, 5232957, 5193994, 5152196, 5139182, 5145812, 5117631, 5024752, 4916012, 4860317, 4849635, 4820224, 4763108, 4737383, 4762640, 4778244, 4738093, 4672437, 4619909, 4568168, 4503750, 4454799, 4437941, 4423229, 4396612, 4393918, 4424052, 4425047, 4356077, 4271995, 4241344, 4247242, 4238756, 4224978, 4238874, 4255168, 4230204, 4187272, 4175638, 4174621, 4129769, 4063537, 4051826, 4093356, 4098576, 4024647, 3937128, 3908858, 3926529, 3932226, 3904651, 3863854, 3832253, 3819292, 3819111, 3807541, 3765377, 3710386, 3677338, 3664367, 3635499, 3582114, 3541805, 3541429, 3556452, 3546741, 3505913, 3455262, 3408972, 3365135, 3320629, 3281670, 3263458, 3279431, 3321158, 3352051, 3335724, 3271361, 3192137, 3134228, 3115729, 3131817, 3153952, 3146803, 3105028, 3060954, 3039235, 3025280, 3002713]
18002C002713r336K4535K0950l8054p8577l7646L1004K6784m9379r5176n2012
17991B745806K3271M7678J2352l3781n2934l7338M539M3161L5961k0022o3005
17980B705688l8401J7146J8072m3152p5912k3594M7580M3313k4893p0160o1376
17969B494311m1861l2550q686K1185P774m1488m8946Q401M8379J2377l9828l2753
17957B346315N288P541j4467j2365k773k8549o2049m7525n395M388r232K207K0176
17944B203560q667n7234m8951R571L8221J5054j1606k7536n1323m7064K7049R5158
17932B136232M1792q2864j03457Q614Q0636J1347p8149n5443K0640K5067l2281
17921A972134n4610j6668L2288N3170K6149m8953j04803n6936M8194O1540l3997
$$ y = [3002713, 2993377, 3017912, 3038862, 3000808, 2922231, 2884585, 2915589, 2942373, 2892994, 2797818, 2745806, 2769077, 2816755, 2829107, 2795326, 2742392, 2705054, 2709593, 2752754, 2788715, 2768693, 2705688, 2667287, 2684433, 2702505, 2659353, 2583441, 2559847, 2607427, 2650740, 2625847, 2555687, 2494311, 2452450, 2419900, 2411214, 2432399, 2440173, 2398685, 2349739, 2358140, 2406519, 2418896, 2379068, 2346315, 2351603, 2359144, 2344677, 2332312, 2329539, 2300990, 2238941, 2191416, 2186021, 2190409, 2181177, 2183384, 2203560, 2194893, 2137659, 2088708, 2098279, 2136500, 2151554, 2139948, 2112412, 2061089, 2014025, 2041074, 2136232, 2178024, 2095160, 1991703, 2000317, 2080953, 2092300, 2014151, 1958708, 1979348, 2004415, 1972134, 1917524, 1900856, 1933144, 1986314, 2012463, 1963510, 1858707, 1801771, 1849965, 1911505, 1877508]
17910A877508p4048J5924P9229p895j08264m5287R5492J06662n219n8409n994
17899A869699K7535p787k8311n710j0867m9179l6713L0001M8717r767n0899j9988
17887A756731K3621K8475J7377O293j8811k8783J8429O8203K7739o1189n9733
17876A778352M4123J09062O3098q930l3534l9969m3347m240M6343J3196p6116
17865A848038p0261N1714J15073K8480o4844l2387L9105K4927k0405M335M6148
17854A969923J1518m1487r710N8114N2613K603K562K5393m807k8701N7176J80022
17842B275219J72113M5121k3928K4849O8170L1723p505P443J7189j9029m3945
17831B547420k2888j2851m6852o5956l0248N912q332l7601l1891j834K4724M7185
$$ y = [1877508, 1803460, 1819384, 1898613, 1890718, 1782454, 1737167, 1832659, 1939321, 1934102, 1875693, 1869699, 1897234, 1889447, 1861136, 1855426, 1844559, 1795380, 1758667, 1788668, 1837385, 1827618, 1776719, 1756731, 1780352, 1808827, 1826204, 1832497, 1813686, 1784903, 1803332, 1871535, 1899274, 1838085, 1778352, 1822475, 1931537, 1994635, 1985705, 1952171, 1912202, 1868855, 1864615, 1910958, 1924154, 1848038, 1777777, 1829491, 1944564, 1973044, 1908200, 1875813, 1914918, 1939845, 1919440, 1923775, 1969923, 1981441, 1939954, 1930244, 1988358, 2040971, 2043574, 2046136, 2071529, 2066722, 2038021, 2095197, 2275219, 2447332, 2492453, 2468525, 2493374, 2561544, 2593267, 2585762, 2593205, 2610394, 2591365, 2547420, 2524532, 2511681, 2464829, 2398873, 2368625, 2374537, 2366205, 2328604, 2296713, 2294879, 2319603, 2366788]
17819B366788N5254K3040k5971k5167L0967O6134L8449o98J297K4117L0564K6080
17807B610854K4758J8521R643J4562J8720o013l2409q043M0206L0485l1734m8280
17795B641270P539M3191Q128k3482M299K8280o609l6018M161N0283K0706l4831
17783B706917k3073K6842K0645l0651l6463J1041L7655L1170M7716P7643M3661
17772B913103m8049q7214l1623J8290k2743r3356r0067k7838n715n2857r7042
17761B374889q0920l8788l6097p3818q8015l8395L2755N2941J7815m469K2297
17750B140195M4477N072n4995m6622L5674J02423R2118M0039Q196O131J0821J6746
17738B400275K6545K3726m148l1630k1458J9787M1847J2627l9824o0346l3923
$$ y = [2366788, 2422042, 2445082, 2419111, 2393944, 2424911, 2491045, 2529494, 2528796, 2530093, 2554210, 2584774, 2610854, 2635612, 2654133, 2663776, 2678338, 2697058, 2691045, 2658636, 2650593, 2690799, 2721284, 2689550, 2641270, 2648809, 2692000, 2700128, 2676646, 2680945, 2709225, 2702616, 2666598, 2670759, 2721042, 2741748, 2706917, 2683844, 2710686, 2731331, 2700680, 2664217, 2675258, 2712913, 2744083, 2791799, 2869442, 2913103, 2865054, 2777840, 2746217, 2764507, 2741764, 2648408, 2558341, 2530503, 2524788, 2471931, 2374889, 2293969, 2255181, 2219084, 2145266, 2057251, 2018856, 2051611, 2104552, 2122367, 2117898, 2140195, 2184672, 2189744, 2134749, 2088127, 2123801, 2226224, 2318342, 2358381, 2366577, 2372708, 2383529, 2400275, 2426820, 2450546, 2446398, 2414768, 2393310, 2413097, 2454944, 2467571, 2427747, 2367401, 2333478]
17727B333478j834l668k2102j2051K3735L0352j5478o1186n0504n874N439l3306
17715B187001p4718q1039o6028n9773o7106o9018m5114L346L8554J3815n9502
17704A720418j00251n2484L2674O0215J6067l0420l4400j6761j0K2608M1494K5537
17692A684687j5579k9348l612J5234J0917K5915O5226O0080j1070n2392R251Q6918
17680A846227M9855p0562j20113m9860K8106K5755j0000j2837m348j8584j9080
17669A644559K4155N3516J3408m0192k1912L4936K4135n9334j05404n6658J4985
17658A526194K7016q521l7742m5760l8634q901L1782L9182K824k3647l998J9939
17646A479734R69l1486k4682O517J2868k28O904K4577J1066k1266j9738J2860
$$ y = [2333478, 2331644, 2327976, 2305874, 2293823, 2317558, 2347910, 2332432, 2271246, 2220742, 2214868, 2220307, 2187001, 2112283, 2031244, 1965216, 1905443, 1838337, 1769319, 1724205, 1727551, 1766105, 1779920, 1720418, 1620167, 1567683, 1600357, 1660572, 1676639, 1646219, 1611819, 1595058, 1595048, 1617656, 1659150, 1684687, 1669108, 1639760, 1636148, 1651382, 1662299, 1688214, 1753440, 1813520, 1802450, 1750058, 1759309, 1846227, 1896082, 1825520, 1705407, 1655547, 1683653, 1709408, 1699408, 1686571, 1682223, 1663639, 1644559, 1668714, 1722230, 1735638, 1695446, 1673534, 1708470, 1732605, 1673271, 1567867, 1511209, 1526194, 1553210, 1544689, 1506947, 1461187, 1422553, 1413652, 1445434, 1484616, 1487440, 1463793, 1459795, 1479734, 1480703, 1449217, 1424535, 1431052, 1443920, 1443692, 1450596, 1475173, 1486239, 1464973, 1445235, 1458095]
17634A458095J9005j0703j8032K0709N1571L3162J32k722J0748R993P019K2876
17622A601853L4543J0212k6222j9782L2446O8079M0005j8939l4499J2981N9702
17611A760379M6076P134K1776P9129P8728o901o5215p582R0148J11097P9797R2230
17599B286796J32763J19382Q2920J18560J84629J54300O6908R9522K54918L24841
17589C825539K37996J86203K87057L90278L89709M51901O87789Q46688O58835
17580G961995K95098J21029J18248m9167m39798p23653p11118o05603o12189o35140
17570D719702n29550l69453k78796k23935j52098j34670k01337k19976j15423
17561B494464l0490r0402j77426j33625l1121k8827r2680q2238j4417j6268q4552
$$ y = [1458095, 1477100, 1466397, 1448365, 1469074, 1520645, 1553807, 1553939, 1551217, 1561965, 1571958, 1578977, 1601853, 1636396, 1646608, 1620386, 1600604, 1633050, 1701129, 1741134, 1722195, 1687696, 1700677, 1760379, 1806455, 1813589, 1835365, 1914494, 1993222, 1986321, 1921106, 1913524, 2003672, 2114769, 2194566, 2286796, 2419559, 2538941, 2621861, 2740421, 2925050, 3079350, 3146258, 3245780, 3500698, 3825539, 4063535, 4249738, 4536795, 4927073, 5316782, 5768683, 6456472, 7303160, 7961995, 8257093, 8378122, 8496370, 8447203, 8007405, 7283752, 6572634, 5967031, 5354842, 4719702, 4190152, 3820699, 3541903, 3317968, 3165870, 3031200, 2829863, 2609887, 2494464, 2463974, 2373572, 2196146, 2062521, 2031400, 2002573, 1909893, 1827655, 1813238, 1796970, 1712418]
17550A712418j03970n7509k7561k8293j2513k115m2743p7039l1918K3423j5136
17539A337044q2292m5002M5509K6410q3885j05367p692M3876j5757n3488K248
17528A061604L8534j3457m5574J4161N3349k1156j03753o8299J8551K4247k6899
17517I31308k3966K7582L6862j725k1882k3298n2303p8755l2942N0632O0128j9333
17505H52308p7777m5344J8423L0651m914l3854l3260j5159J0186L4630L8631J0519
17493G85040k7124l3435J819L6914K2090l4576o8440l8273K2307N5613M8490J6972
17481G87397l4494q5294p5722J1098Q1752M2146n1795o3873J5404N8757O856n3326
17469F38906m8144k0787k0125j2543K3708L0888j9932n5851k2551J8085q95l5094
$$ y = [1712418, 1608448, 1550939, 1523378, 1495085, 1482572, 1480457, 1437714, 1360675, 1328757, 1352180, 1337044, 1254752, 1209750, 1255259, 1281669, 1197784, 1092417, 1084725, 1128601, 1112844, 1059356, 1061604, 1100138, 1086681, 1041107, 1055268, 1108617, 1087461, 983708, 915409, 933960, 958207, 931308, 907342, 934924, 971786, 970061, 948179, 924881, 872578, 793823, 760881, 811513, 871641, 852308, 774531, 729187, 747610, 778261, 773347, 739493, 706233, 691074, 701260, 735890, 774521, 785040, 757916, 724481, 726300, 763214, 785304, 750728, 682288, 644015, 666322, 721935, 770425, 787397, 752903, 667609, 591887, 602985, 684737, 726883, 675088, 611215, 626619, 685376, 692232, 638906, 590762, 569975, 549850, 537307, 561015, 591903, 571971, 516120, 493569, 511654, 510759, 475665]
17457D75665j8284J8062J5574Q32K2074M4612J5298l0595l0297m126o793k5548
17445D76474k1745j2675j8849p61N4141O4636j2319p3148k2453N5926L6105l0928
17433D94404j6457M4664K1316n6850m1014N5363N9826n2543r9304M79Q9028M0083
17421E38995m1979k0865M9886M8316j1374l9896l1507l0621k8285o622m318l7820
17409C83910m4121M917L0866j0325k9158L6579Q0006m545j13443p8280N3814Q5079
17397C95299j9544q9058k7931N3406M1530j5490k8595j6465l2836m4827O008Q1146
17385C02643Q7440J6024m6760m1350k8J6943k608k8666l5403j8774J2081L8054
17373B99596L5588K654k4651r220L0502L5353r069m3078j9490K3654K6056J168
$$ y = [475665, 457381, 475443, 491017, 491849, 513923, 558535, 573833, 543238, 512941, 508815, 502022, 476474, 454729, 442054, 423205, 422444, 476585, 541221, 528902, 455754, 433301, 489227, 525332, 494404, 477947, 522611, 543927, 487077, 446063, 501426, 561252, 508709, 409405, 409884, 498912, 538995, 497016, 476151, 526037, 574353, 562979, 523083, 491576, 460955, 432670, 426048, 421730, 383910, 339789, 344706, 375572, 365247, 336089, 372668, 452674, 448129, 334686, 256406, 310220, 395299, 375755, 286697, 258766, 312172, 353702, 338212, 309617, 293152, 260316, 215489, 221497, 302643, 390083, 406107, 359347, 317997, 317969, 334912, 332304, 303638, 268235, 249461, 261542, 299596, 335184, 337838, 313187, 303967, 334469, 369822, 360753, 317675, 298185, 321839, 347895, 349063]
17361C49063J710J9516L227l8759m4196n623J9167J2153J4498K9562J2017k5926
17349C46409j3722L9232L1921n0424q3189m379O7774K5022n2094l8477K4525J8284
17337C10882l8992l6508K6036M6573J263l7541m2633m6106l4011K5907P0916J3682
17325B59468q5246p9526K7207P9261K0396l0753K376L9440J2035j8685L1O779
17313B32783m2384p1267k0853L1761P248l2844j680N1549L3111k1025r516M8745
17301B05628M3550l5159p7012k7664L7469L9845q14k4584j5327P716K7863L1002
17289B12513O056l2276m7752k4583J0928J7937j5740n4665m3795K5117Q2860N7105
17277A93705k5834o7997l4335Q758R550M753L2735N2307J7198l0489k1749K6449
$$ y = [349063, 350773, 370289, 373516, 334757, 290561, 284938, 304105, 316258, 330756, 360318, 372335, 346409, 332687, 371919, 403840, 353416, 270227, 265848, 333622, 358644, 306550, 268073, 292598, 310882, 271890, 235382, 261418, 307991, 309254, 271713, 229080, 182974, 148963, 174870, 245786, 259468, 174222, 94696, 121903, 201164, 221560, 190807, 193183, 232623, 244658, 225973, 226004, 232783, 190399, 119132, 98279, 130040, 137288, 104444, 102764, 154313, 187424, 166399, 156883, 205628, 249178, 214019, 137007, 109343, 146812, 186657, 185843, 161259, 145932, 153648, 181511, 212513, 218569, 186293, 138541, 113958, 124886, 142823, 127083, 72418, 28623, 53740, 136600, 193705, 167871, 99874, 65539, 74297, 83847, 88600, 121335, 173642, 190840, 160351, 138602, 165051]
17265A65051L9337j295m3099m6060j7381K0660M3913K5954k6319n8914l8132j979
17253F1736K741m647J5137M0679K6945q789j5322O57q791l7477k8193K7652O7936
17240A40264M9499N43k9268k4787l702N532j3820l9084k2668L5145O4332K1039
17228A83025l7764l6415N207J5087r542j2125J5619K7372J0981m098j7533m8135
17216I1679o4533k1638M0823L9289j4552k6848J7771L1093j5769l3179K7488P4992
17204A46616K1428p1904q7753k3018L1151L3162K1338K4238K3703N492j3368j4481
17192I6604o11J2363Q431j3535k9736j6742J0995J9854J0799J0492J1358j9083
17180A01189o1645m9306K8171R2027Q1253K8701p747k7102n0444o0076l0885J4725
$$ y = [165051, 204388, 203093, 159994, 113934, 96553, 117213, 161126, 187080, 160761, 101847, 63715, 61736, 64477, 59830, 74967, 115646, 142591, 133802, 118480, 119137, 110346, 72869, 44676, 72328, 140264, 189763, 190306, 161038, 136251, 132549, 138081, 124261, 85177, 62509, 97654, 161986, 183025, 145261, 108846, 114053, 129140, 119598, 107473, 123092, 150464, 161445, 157347, 139814, 91679, 27146, 5508, 46331, 85620, 71068, 44220, 61991, 93084, 77315, 44136, 71624, 146616, 168044, 96140, 8387, -14631, 16520, 49682, 71020, 95258, 118961, 124453, 111085, 96604, 95993, 108356, 116787, 103252, 73516, 56774, 67769, 87623, 98422, 108914, 120272, 101189, 39544, -9762, 18409, 110436, 191689, 220390, 212643, 185541, 135097, 75021, 44136, 58861]
17168E8861L3520J8262n615j4494K357L3511L8452n175m6999k1437L9236L7346
17156A67825l1165n8064l4M4103K33n3073k0386M7008M2769j4424k3426K3345
17144A24711L6904j3153n6268l6430J8798N0175K5883m1157q7700m6058N6123
17133C1828R8849L3226l4394o726M3878J242q6052p8979J5678N5601k274m7865
17121B4012j5375K5438J4031p244N632K4928K6237K8034K0524l1537q3842l8303
17109g465Q3368J27744L2664p1528o1182R139K8358K036p206r145l4588l8842
17097E3353J8967O8674K6464n5243o1131M859L6861J490k8339p593K4719L1189
17085A14270K3519J2536j0446l2619k7219n955l799j6295j2172K709r20j0997
$$ y = [58861, 92381, 110643, 105028, 90534, 92891, 126402, 164854, 159679, 112680, 91243, 130479, 167825, 136660, 78596, 78562, 122665, 122898, 69825, 49439, 96447, 139216, 124792, 101366, 124711, 161615, 148462, 92194, 55764, 74562, 124737, 150620, 109463, 21763, -24295, 31828, 130677, 163903, 129509, 122783, 166661, 167903, 81851, 2872, 18550, 74151, 71877, 24012, 8637, 34075, 48106, 40862, 46494, 71422, 97659, 125693, 146217, 114680, 30838, -7465, 75903, 203647, 236311, 164783, 103601, 112740, 141098, 143134, 135928, 126783, 92195, 53353, 72320, 140994, 167458, 112215, 51084, 55943, 92804, 94294, 65955, 58362, 83081, 114270, 137789, 150325, 139879, 107260, 80041, 74086, 70287, 53992, 41820, 44529, 43609, 32612]
17073C2612N411K7749O460m1591m5257N086L6891J1204j9927n725K3666J7189
17061E3768j1175j2660J0963Q971l5356o7241k6339O5480J11510N2370m9435p8272
17049B2584j4814M2042K1218k3244j1835K8408J4344m9217p1554j5547N2244O4131
17037E8760L0957k654k2000l2763l2168j7692J874J8742K9495K5994O412j0773
17025E4184q919J882O409R773J3352l466m0225n1253j1582L2724L3307J1692J237
17012D9115k2062o6785n4860N6521J44278O9170q1760r1980M6773J08234p627
17001A49017j13015m4992O9341L6025q1862q2729L4039Q3747J1766l8061J2573
16990C5849N3710o059q1899n9273K6414O3362L3000L045K335j954k3277l0615
$$ y = [32612, 38023, 65772, 72232, 30641, -14616, -9530, 27361, 38565, 18638, 12913, 36579, 53768, 42593, 29933, 40896, 49867, 14511, -52730, -79069, -13589, 97921, 150291, 100856, 22584, 7770, 49812, 71030, 47786, 35951, 64359, 78703, 29486, -42068, -57615, -5371, 58760, 89717, 87063, 65063, 32300, 132, -17560, -15686, 3056, 32551, 58545, 64957, 54184, 45265, 47147, 53556, 63329, 76681, 73215, 32990, -18263, -29845, 2879, 36186, 47878, 49115, 27053, -39732, -94592, -38071, 106207, 175377, 93617, 1637, 48410, 156644, 149017, 36002, -8990, 60351, 96376, 14514, -68215, -34176, 49571, 61337, 23276, 35849, 89559, 83500, 1601, -57672, -31258, 32104, 65104, 68149, 70484, 68530, 45253, 14638]
16978A4638o818K0629J8242j1611l5004k1939K1266N2618L6953j2064m6290l8371
16966g751n577J9689K2620Q227r640j7519j2816m711J551R750J5048L882j5087
16953G666j0829J6996K2585j4569m4717k2970J3198P341j4076J0976N7254M1294
16941G0149l0547n7469q855K3584j4755m5510K100N8799K9719l8449l2072L7218
16929f088N4009l785l2268J5315M9592K463n5616l7040J8018J8431k2353k0661
16917a9983K3508K6420k7613m9504Q094O5894L7090m0708o3657q444N0507N0859
16905E2463O748l2781l9499j5855J4547K2313K554j4937o458J0994J2084N945
16893A8118J0092Q795j3778k6083K111K7182j1393p3203n4718M3229R2316K2032
$$ y = [14638, 7820, 28449, 46691, 35080, 76, -21863, -597, 52021, 88974, 76910, 30620, -7751, -13328, 6361, 28981, 37208, 27568, 10049, -2767, -7478, -5927, 3823, 18871, 22753, 7666, -3163, 13833, 36418, 21849, -22868, -45838, -32640, -25299, -39375, -28399, 28855, 70149, 39602, -17867, -26722, -3138, -17893, -63403, -61303, -2504, 27215, -11234, -43306, -6088, 47921, 44136, 11868, 27183, 76775, 79238, 23622, -13418, 4600, 23031, 678, -19983, 3525, 29945, 2332, -47172, -39078, 26816, 63906, 23198, -40459, -48903, 1604, 52463, 59211, 26430, -13069, -28924, -14377, 7936, 10490, -4447, -10905, 89, 12173, 18118, 28210, 37005, 23227, -2856, -745, 26437, 15044, -58159, -112877, -69648, 22668, 44700]
16881D4700p2568p3576l961L4470J8142J960Q299J1168O389J2706J8588R14k0310
16868a3079j3406J687r385k3657l534K0028l513m0068j8378L8274M2933r23l613
16855b6634M3498M2389l5524q4365l4626L6670M2421J6792K0802K2966k0401n6890
16843c2902k6320J7755l620m8315k4719M0992M9251N294L897M7345L4749m8872
16831A4535q6431k1106M4807J8661l5021j3652N0643N2135j3049n0213k0800J3508
16819d5983L530k1765k2824r677l343O691K9095L7441J2721j1185O776L9879K0932
16806D2288n0783q8138l2902N3945P0852J4405k7377r792J7756J0109l365J2348
16794I346K7876Q066j4678K909K7996L161m4854l9918J2114K4928k5467n6522
$$ y = [44700, -27868, -101444, -105405, -70935, -52793, -50833, -42534, -31366, -24977, -12271, 6317, 7231, -13079, -26485, -24798, -34183, -57840, -61374, -41346, -44859, -84927, -103305, -65031, -22098, -23021, -26634, 16864, 59253, 23729, -60636, -95262, -58592, -16171, 621, 21423, 44389, 23988, -32902, -59222, -41467, -45087, -93402, -118121, -77129, -27878, -22584, -18687, 28658, 63407, 14535, -71896, -93002, -48195, -29534, -64555, -78207, -27564, 24571, 11522, -38691, -59491, -45983, -42453, -64218, -87042, -96719, -100062, -93371, -64276, -26835, -14114, -25299, -18523, 21356, 42288, -8495, -96633, -129535, -75590, -4738, 9667, -17710, -27502, -9746, 363, -3002, 9346, 37222, 45288, 30610, 33519, 61515, 64676, 19822, -20096, -7982, 16946, -8521, -65043]
16782f5043j0717N3920N5037J276l8995l4145j819L3893M8371J6762m3316o5288
16770e0064j9778K9986J6127k6702j4803M7713P1003J8646m0423m1327q451O993
16758a1080P684J5033Q340l1851n7108r583O7785O8539j8566p7653l1199M6184
16746b3475M5857j3159l4031n900k388l3172k5018L1128M4301j4706m2711K1853
16734e1421P3194O088q9716n7764O6503J03073J1865n6627j6871K9675o635n1524
16722d0160j7599L2106K024n8814m1004L3828N1964r14k8812N830L4039J2164
16710a5348j3912m993P272r465k9868k2716l497R14l422K490J8279K9841K3011
16697b1414r116m5438l8816K0130O4281L3789k4485k0126L3100L3784l4757o4227
$$ y = [-65043, -75760, -21840, 33197, 34473, -4522, -38667, -40486, -6593, 41778, 58540, 15224, -50064, -69842, -39856, -23729, -50431, -65234, -17521, 53482, 72128, 31705, -9622, -18073, -11080, -3396, 11637, 19977, -11874, -68982, -78565, -10780, 57759, 39193, -38460, -69659, -23475, 22382, 9223, -24808, -30708, -33096, -66268, -91286, -60158, -15857, -30563, -73274, -51421, 21773, 27861, -61855, -119619, -53116, 49957, 61822, 5195, -11676, 17999, 11364, -40160, -57759, -25653, -23629, -82443, -123447, -89619, -37655, -38569, -67381, -61551, -27512, -15348, -29260, -34253, -26981, -36446, -66314, -89030, -92527, -91613, -95035, -92545, -74266, -44425, -21414, -30530, -75968, -114784, -94654, -30373, 3416, -21069, -41195, -8095, 25689, -9068, -73295]
16685g3295K855O8745L0808n4479o2314O362L9963l63l3331l775L3827K0128r550
16672c4419M583L8139K2983l3913n4915j4867J8684m398l5531r856M1900M0821
16660b0789p449j9822K1007L0793l0672p5536k3229O0371O1062j943j5270L3185
16648A1708L5872m2310q9887k4297P1271P1519r978n7616k3108L2851M5066J2571
16636C3662k9654m7871k2304L1921O3676M1660l609k6482k9289l7967m3181j9317
16624h8755J6178J9503r146k2454N821M9080O4493L3092k6071n8067j6046O4475
16612C2103P7554j4109r9463n9495N0246O7574l4854j04039l6689O8834O8041
16601A5703j8751n8027r149L9156K5065m528O602L1567J9063j4197j5309Q504
$$ y = [-73295, -70440, -1695, 29113, -25366, -87680, -81318, -41355, -41718, -75049, -78824, -44997, -24869, -34419, -29836, 8303, 31286, -2627, -57542, -72409, -53725, -58123, -93654, -103510, -61610, -20789, -28238, -48060, -27053, 3740, -26932, -102468, -125697, -65326, -4264, -6207, -21477, 11708, 47580, 5270, -84617, -108914, -37643, 33876, 23898, -33718, -56826, -23975, 21091, 33662, 4008, -43863, -66167, -34246, 29430, 71090, 67481, 40999, 11710, -26257, -69438, -88755, -72577, -53074, -62220, -84674, -78853, -29773, 34720, 67812, 41741, -16326, -32372, 32103, 109657, 95548, -3915, -63410, -13164, 54410, 19556, -84483, -121172, -52338, 15703, -3048, -61075, -70224, -31068, -6003, -10531, -3929, 27638, 46701, 32504, 17195, 25699]
16589B5699l893o0536q2610j5538P5126Q2718J1261l1955j626K0045l1090p9939
16577i2338k7473P4553Q5684o871o4707j0581O1833M6208j8094l1528L986J2283
16565C2955j7417k4828N896K2617R55j9442j1657n403k6629m6642k5492K6307
16553h8780N9405M3231n006m0146l2686J331J9552P739m970K293P377r600k1333
16540f1593J022K6510P052l6792l9336N637L2685O415k9842k7644J296J9660J7043
16527g7887K632j4665j9287o67J7642N686j2242J3215N9004M3998l2484o1809
16515g6864Q720P6616L6177n2216n8147J1087L2082k7975o4976j3761N4874N6630
16503a7753J1534j6969k0662k2703j5999J2338L6171K3595j2596l5572k9315J468
$$ y = [25699, 21806, -38730, -121340, -136878, -61752, 20966, 32227, 272, -1354, 18691, -12399, -92338, -119811, -45258, 40426, 33555, -31152, -41733, 20100, 66308, 48214, 16686, 20672, 32955, 15538, -9290, -3394, 19223, 20178, 736, -10921, -16324, -42953, -89595, -115087, -88780, -29375, 13856, 8850, -31296, -63982, -62651, -43099, -35360, -40330, -38037, -30660, -40260, -61593, -60571, -34061, -27009, -63801, -103137, -97500, -64815, -58400, -88242, -115886, -114590, -94930, -77887, -75255, -89920, -109207, -109874, -92232, -86546, -98788, -85573, -26569, 17429, -15055, -76864, -68144, 8472, 44649, -7567, -65714, -54627, -22545, -50520, -115496, -129257, -74383, -17753, -6219, -23188, -43850, -66553, -82552, -70214, -34043, -10448, -23044, -58616, -87931, -86463]
16491h6463M1569N5705J3469n3621p0945k2392K4353K3918J5371L3838L6310j5450
16479d338o5194m2066K0371L8075J0772L524K2189J3898k0103k1074J3296J7933
16467a2717j9562l1647O313K6403j3002n0269k1798L5769N0322K0666o600j6776
16455c2898k0931j1699J4839K7611N660j8276j0164N245q141k6543o758K9843
16443e2212K4548k0070l8632l672L3059J8134k8860m4322l729M6525M3386j2737
16431c8582n0916k1609K8084J8605l6993m4958K2818P7802M6678k3927m9562k7098
16419i9658o075L045J9758L3307K0188n985j6024r242J731J2471P266k6955m9916
16406a16089j0892M4124K2037m1393j3581Q4260O5763r0260j44868O695J17031
$$ y = [-86463, -44894, 10811, 24280, -29341, -100286, -122678, -98325, -74407, -59036, -25198, 11112, -4338, -69532, -111598, -91227, -53152, -42380, -38856, -16667, -2769, -22872, -43946, -30650, -12717, -32279, -63926, -57613, -31210, -44212, -94481, -116279, -80510, -30188, -9522, -16122, -32898, -53829, -65528, -50689, -23078, -17418, -35694, -45858, -40613, -48754, -75297, -82055, -52212, -27664, -47734, -86366, -90038, -56979, -38845, -67705, -112027, -115756, -69231, -25845, -38582, -89498, -111107, -83023, -64418, -101411, -146369, -123551, -45749, 929, -22998, -72560, -99658, -105733, -102688, -82930, -49623, -29435, -35420, -51444, -60686, -58955, -46484, -39218, -66173, -116089, -126981, -82857, -60820, -102213, -115794, -31534, 34229, -56031, -200899, -194204, -77173]
16395g7173K484j07702K2408J59145o326k24053n6573K49417K4392o24251p22493
16384a360725J14972R35417P49249o2067m05336q2706J60029k9196j81004K0055
16374a41312K04347M7977j62757q5324R7135O7020o7872l3835R7789P7121o3146
16363C7143r7696j0209L4564Q627J1348L3239m331n4429k7275J8237j3194m9772
16351a13748J3188Q5084K9628o3645k3797P7880M0269r6116j02246L8370J00064
16340a5069O852n8137L046M6444k3843p8216r734O9777L3612m8365n3400m022
16328a31055J8843K3496L7077J5461n0658o2782K5890R6392M1677n2663m6807
16317h5129L1724N4783N401k8890k1405k0934l3623j8953J5389K3193P347O105
$$ y = [-77173, -74689, -182391, -159983, -838, -7164, -231217, -287790, -38373, -13981, -638232, -1360725, -1245753, -310336, 438913, 376846, -28490, -111196, 48833, 19637, -161367, -141312, 63035, 111012, -51745, -137069, -39934, 27086, -40786, -74621, 23168, 100289, 37143, -60553, -70762, -36198, -27571, -16223, 17016, 12685, -41744, -69019, -50782, -63976, -113748, -100560, -15476, 14152, -49493, -73290, 4590, 44859, -51257, -153503, -115133, -15069, -8217, -66354, -63308, -16864, -40707, -118923, -128657, -58880, -25268, -73633, -127033, -131055, -112212, -88716, -51639, -36178, -86836, -149618, -123728, -27336, 14341, -38322, -85129, -53405, 1378, 6779, -22111, -43516, -64450, -98073, -117026, -101637, -78444, -71097, -64992]
16305f4992J4556K662j6783j4936n924p520Q175M8951N0074k0750p3671k3213
16293a03371N8580M6299l3602n1168O219K5957k1228l4993K3589N7328Q013l8768
16281e7145n177M5026K1860l7781l9238J4244L9964J0594k3474k6492j3777m083
16269g5479K431L290k554M86J7362J8689j2634l4031J757N8239M8715l4534r0727
16256i8990m2268N5476Q6097K4770m1228m1560r574j1224l7537k5402L3827P1471
16244c6142L8573k7239n7522l5873L389K6124J8305j5137m1266j8240M5735Q3599
16232a5694N2942o034l3734l2203l3374k7876P370M0760K1885k9885m8578k3974
16220a28395l652Q87K3813N5867L8643k8809o6385l2440J4883J9706J1622K9456
$$ y = [-64992, -50436, -47774, -64557, -79493, -85417, -92937, -84762, -35811, 14263, -6487, -80158, -103371, -44791, 1508, -32094, -83262, -77043, -51086, -72314, -107307, -83718, -26390, -18377, -57145, -62322, -17296, 4564, -33217, -72455, -58211, -18247, -7653, -31127, -57619, -71396, -75479, -73048, -69758, -72312, -71826, -54464, -35775, -48409, -82440, -80683, -22444, 26271, -8263, -98990, -141258, -85782, 315, 25085, -16143, -57703, -67277, -78501, -116038, -141440, -107613, -36142, 2431, -24808, -82330, -118203, -114814, -88690, -70385, -85522, -126788, -145028, -99293, -15694, 37248, 31214, -2520, -34723, -68097, -95973, -88603, -47843, -25958, -55843, -104421, -128395, -132047, -131160, -107347, -51480, -12837, -41646, -108031, -140471, -125588, -105882, -94260, -64804]
16208f4804L7373o295n4127l2075L5482N1675j0161o8758n0849J7427N8666M1563
16196d4883K092j2493L258J7080P030q716k924J3717P952j8261k6929p318O432
16183f3963k859n763J4009J9766j7195n7927m6631P171M5344L9881J1338j3594
16171g0423k1363m270K6319L4286L734k7462j8177J1309J1017j8080k7983l150
16159a04243J8030R437k784J3407M2514L9554j0682o8827p7922k6465L1490L6579
16147i9912O38r963K7609N7753L1907j9922m1143k8276j1694L346K1248J7096
16135e1313k2959n0100j2023N4849O6065J2772l0716k2888k254o639j7259p113
16123h9578J3725K6262K8235J4155k2658n4073l4559K7822O7219M5421n308m0223
$$ y = [-64804, -27431, -33726, -87853, -119928, -84446, -32771, -42932, -111690, -162539, -145112, -86446, -44883, -42791, -55284, -52026, -34946, -27916, -36632, -39556, -25839, -17887, -36148, -63077, -70395, -63963, -66822, -72585, -58576, -38810, -56005, -113932, -160563, -153392, -108048, -68167, -56829, -70423, -91786, -96056, -69737, -35451, -31717, -59179, -77356, -66047, -55030, -73110, -101093, -104243, -86213, -76776, -79560, -66153, -23639, 15915, 5233, -63594, -141516, -167981, -136491, -99912, -99274, -109237, -81628, -23875, 8032, -11890, -53033, -81309, -93003, -89657, -68409, -51313, -74272, -124372, -136395, -81546, -15481, -2709, -33425, -56313, -58567, -65206, -82465, -89578, -75853, -49591, -21356, -7201, -29859, -83932, -118491, -90669, -23450, 21971, 16663, -23560]
16111b3560n2343m6683j7217K4778M5026L2370J0031j1933m4469o7321l3576M6188
16099a38709Q8174M3379l2975o0605l2694N571K7733L0992J4156o665k54K6314
16087c5583K2764k2068m9480k3032J1576R123k67J7997K6192j2099m5189j4270
16075a14336L2679J4137m0105l4952K4968M1879q407m1474j0761K8464K9460J9508
16063e8940J9374P82l3122k4607L0866N0658j832m4736j0094M1962K8509j7441
16051a8621j6348J4122j7m6696m6022P614L7039J5566J23J7153J8149k0815m6986
16038h5739k1076J7247K1324R109J2770J5084p862k8637j2644J5729R872k3052
16026g7875l8315k4429n081J0386K5916K6388J061j7765K003K7755Q700k9242
$$ y = [-23560, -75903, -122586, -139803, -115025, -69999, -37629, -27598, -39531, -84000, -151321, -184897, -138709, -50535, -7156, -40131, -100736, -133430, -127859, -100126, -69134, -54978, -61643, -61897, -35583, -12819, -34887, -84367, -107399, -95823, -86700, -86967, -68970, -42778, -54877, -100066, -114336, -81657, -67520, -107625, -142577, -117609, -75730, -84137, -125611, -136372, -107908, -78448, -58940, -39566, -38784, -71906, -96513, -65647, -14989, -16821, -61557, -71651, -29689, -1180, -18621, -34969, -20847, -20864, -67560, -113582, -105968, -68929, -53363, -53240, -36087, -17938, -38753, -85739, -106815, -89568, -68244, -59135, -46365, -31281, -39143, -67780, -80424, -64695, -54823, -77875, -116190, -140619, -145700, -135314, -109398, -83010, -81949, -99714, -97711, -69956, -61256, -90498]
16014i0498j9306K0943L910o9880q3671J1397R6127N6227l9776n2443J1069L2097
16002a23804q682j3775L9335N0157k1127o9541j7037N7399N1540p36j0725R511
15990e7485o749m0559k1956L0057L0974j7815k6280K6812N3522M978m7593l1216
15978a03310J7624K4489o051j6059M197J1247j0119k1556M005L3565J5779m1556
15966h7745o6310j3159O1003N8901j9277o4043j2268N6037L8579l3539n1113K491
15954a30443M0981K0930p923m180J0442J4219J6494R830k5307n6146k6614L7608
15942a00109N0200M621j4865J6551K5409j2539j9715L0038M3268k5032o9485q287
15930g9945O4790L2317n0200n6889l243M335l3724k9031J8113K5134q924l354
$$ y = [-90498, -109804, -88861, -84951, -154831, -238502, -227105, -130978, -74751, -114527, -166970, -155901, -123804, -132486, -146261, -106926, -56769, -77896, -147437, -164474, -107075, -55535, -56271, -66996, -57485, -64234, -104793, -126749, -96692, -65718, -83533, -109813, -83001, -29479, -24501, -72094, -103310, -85686, -61197, -67248, -83307, -79110, -67863, -77982, -99538, -95533, -61968, -46189, -87745, -154055, -167214, -106211, -47310, -66587, -130630, -142898, -86861, -48282, -81821, -132934, -130443, -89462, -68532, -76455, -80635, -70193, -55974, -39480, -29650, -54957, -111103, -137717, -100109, -49909, -45288, -60153, -43602, -18193, -30732, -50447, -20409, 22859, -2173, -71658, -79945, -15155, 17162, -33038, -89927, -93170, -88835, -122559, -151590, -133477, -108343, -117267, -120621]
15918a20621M4423M8627o369l6887o829K3460J4645l200j5171l9488n0626l708
15906a51744N5898L5177m3020n7413J1212M6486j403l6857M87L1342p147m4332
15894a61314j1157L5152K4426k654J0374K3040j0476l6506j685L5850J1661j9522
15882a02811J1439M5703r68o8840m2443M5089N6946k4914p7711l4838L5368N9101
15870i8879M3637J7296j3397l0192j3234R816J682j0366J7826M8927J4089n6825
15858f9620o5706q37M9024L6214K739j5990k9350k8075J0599M7516J8640m6200
15846i1046n2878K973L1162N350m914K0156J4064l1008k8249M0056O6311k085
15834c0108o3544l2040K2832R978k6469m842L8324K1310k8625k5710K1622L2254
$$ y = [-120621, -76198, -27571, -33940, -70827, -77656, -54196, -39551, -42751, -57922, -97410, -148036, -151744, -95846, -60669, -103689, -161102, -149890, -103404, -104807, -141664, -141177, -109835, -116982, -161314, -172471, -137319, -112893, -115547, -105173, -82133, -92609, -129115, -130800, -94950, -83289, -102811, -91372, -45669, -46637, -115477, -157920, -112831, -55885, -80799, -158510, -193348, -157980, -98879, -55242, -37946, -51343, -81535, -94769, -84953, -83271, -93637, -75811, -26884, -12795, -69620, -135326, -136163, -87139, -50925, -48186, -64176, -93526, -121601, -111002, -63486, -44846, -91046, -143924, -140951, -109789, -104439, -109353, -89197, -75133, -106141, -134390, -94334, -28023, -30108, -93652, -125692, -102860, -92882, -119351, -124193, -85869, -64559, -93184, -118894, -97272, -65018]
15822f5018q022l8773l1819j0347J4725M2293M2099k094m0298k2710J6977J9787
15810h3200P32P997K6490J3028j0963J692K5618L935l8833k9677K2820L6527r430
15797c3264m6825l1331M843K2891K2954J1568r375j8578M64J9131M064k1952j9616
15784i5026l574n962p415J9094L8785J5457q021J3013K5230k8413p6805k7140
15772a40777N3455L3683m8126m3651L6594L9910l7939l0427Q1975R8727n0884
15761g460j47900l5983J06983O2471o8064n2615P4759R2541k2236p7192o606M3602
15749c7700m926m4075J139M3491O167m5956l6241j74N002Q98K0506L5656J9739
15736c6474P92j759j3632l6169k5317J8863L1487n353k3862P960K4768j5770m9050
$$ y = [-65018, -73040, -111813, -143632, -153979, -139254, -96961, -54862, -56956, -97254, -119964, -102987, -83200, -82468, -74471, -47981, -34953, -45916, -44224, -18606, -14671, -53504, -83181, -60361, -23834, -33264, -80089, -111420, -106577, -83686, -60732, -49164, -58539, -77117, -76653, -57522, -53458, -75410, -95026, -98600, -104562, -111977, -92883, -54098, -38641, -46662, -33649, -8419, -36832, -113637, -140777, -87322, -53639, -101765, -145416, -108822, -68912, -106851, -137278, -55303, 43424, -7460, -155360, -191343, -84360, -21889, -89953, -142568, -67809, 24732, 2496, -74696, -81302, -37700, -42626, -86701, -85562, -42071, -35904, -81860, -118101, -118275, -113273, -112375, -91869, -56213, -36474, -35682, -37441, -51073, -87242, -112559, -93696, -62209, -67562, -91424, -83464, -58696, -74466, -123516]
15723a23516j5563L2178K2493j1884M48M0141L4924j3518l8603k1577o226j2498
15711a13201j4181L26J1381J2058J3963J2343n438k2770j2874J0744R305j8505
15699a16849l1830o659L5269N7152M1332k11k8867j0385L4679L9344j9605p3975
15687h0605n2933J1897L1735p431k9654J0987O3181N5520q270o1867n5051K887
15675a19604N8666O0038L558n4387n3126J251M2703K8427j1254k0104R470L2076
15663b2286J2408k9147m3418j7083Q168o645l7169k5467L0398O0901K1126l9170
15651h7384m3255M262L1672J0650r183J2827M4304L6117K564k151K8798M1269
15639G0490K094m7366m7691n040K2192J0486l984L015J209l2101n5666k4186K9244
$$ y = [-123516, -139079, -106901, -84408, -96292, -95844, -55703, -20779, -34297, -72900, -94477, -100703, -113201, -127382, -127056, -115675, -103617, -89654, -77311, -82749, -105519, -118393, -107649, -98344, -116849, -148679, -155338, -120069, -62917, -21585, -21796, -50663, -61048, -26369, 12975, -6630, -80605, -133538, -121641, -89906, -97337, -126991, -116004, -52823, 2697, -5573, -67440, -122491, -119604, -60938, -900, 2658, -51729, -104855, -103604, -60901, -32474, -43728, -63832, -54362, -22286, -9878, -39025, -82443, -99526, -91358, -98003, -135172, -160639, -130241, -69340, -48214, -87384, -130639, -126377, -94705, -84055, -93238, -80411, -36107, 10, 2574, 423, 29221, 70490, 72584, 25218, -22473, -27513, -5321, 5165, 1181, 4196, 5405, -26696, -82362, -106548, -77304]
15626g7304L6057k591k4407q477Q088J2713L0256M5414P564o3005p3659m222M7820
15613f5753K1315j3708J1187L9835O7n7291m5587N936J3511j0066J475K6790J688
15600g0601l7093n731N8312M3835l3667n0568O054J9331l8136n5354M017L3135
15588a26466o981m505P9645J01607j9766j28863p0474N5385O4980j2485j9858
15577h7781M2995M4494k3331l8854J6659L0738k6168n1523m812K5543p793l3263
15565a13096m026K3575R075m776L760j0946n1226m3594K4125N5843N301l7185
15553a43170N331O9358O2573O896k2229j7963j3546l978J7709J2321l4752n9110
15541a20560j4444M0312L3054o603j0972R658O840p621J259Q817j7038l1532J4606
$$ y = [-77304, -41247, -43838, -68245, -76722, -68634, -55921, -25665, 19749, 27313, -35692, -109351, -113573, -65753, -44438, -58146, -46959, -7124, -7057, -64348, -109935, -103999, -90488, -100554, -99079, -72289, -70601, -107694, -113425, -55113, -11278, -44945, -95513, -89459, -70128, -108264, -163618, -159601, -126466, -133447, -137952, -58307, 43300, 23534, -105329, -175803, -120418, -55438, -67923, -87781, -44786, -292, -23623, -62477, -45818, -15080, -41248, -92771, -97583, -72040, -79833, -113096, -117122, -93547, -84472, -89248, -85488, -96434, -147660, -191254, -167129, -111286, -105985, -143170, -137839, -68481, -5908, 988, -21241, -39204, -52750, -56728, -39019, -26698, -61450, -120560, -135004, -94692, -61638, -68241, -79213, -69555, -62715, -70336, -69077, -60260, -77298, -108830, -94224]
15528i4224O5083L4399m1414n0923J6693O2422L7837j935j1543j2697k1651j5432
15516c3385R834K7171L4469M5846L3722l1408r2785o4780K1774M7744r315m3243
15504e4356o2M0323J4554j8095N712L8680J4902l2796l8230j2234j594j411J0512
15491c4095J2561r045r501L3927N6116O761m7920k7205K3163Q807m6359m3766
15479g6556J1608K0178l1166m1987K4803P3536L0843m3431o0539k6325K786J3547
15467a02703K2805K6731J6894L546j2545m2230n8623j3918O3660P2681j1218p4074
15455a08994k6022N5985M6581l0945m8261J9694O2345J6499m2343l2842R880R226
15443f9197k8002l6827l248K3159J0367j9723l3603k1432J0817M7905O0339K6552
$$ y = [-94224, -29141, 5258, -36156, -87079, -70386, -7964, 29873, 27938, 16395, 3698, -17953, -33385, -23551, 3620, 38089, 83935, 117657, 86249, -6536, -71316, -49542, -1798, -11113, -54356, -54418, -14095, 459, -17636, -11924, 26756, 41658, 8862, -29368, -41602, -43196, -44607, -34095, -21534, -30579, -40080, -6153, 49963, 56724, 8804, -18401, 4762, 13569, -32790, -76556, -64948, -44770, -75936, -117923, -93120, -19584, 11259, -32172, -92711, -119036, -116250, -102703, -79898, -53167, -36273, -32727, -45272, -87502, -146125, -160043, -96383, -23702, -34920, -108994, -135016, -79031, -32450, -63395, -111656, -91962, -29617, -13118, -55461, -88303, -78423, -69197, -97199, -134026, -137274, -114115, -103748, -123471, -157074, -178506, -167689, -119784, -59445, -32893]
15431c2893k9911n3910k4033J9028K7352P230r60J1416J3473p163j9470l95K2930
15418f7306J3072j9113l2166j6152J526N271O003Q240L791J172J8234L9268K6635
15405a1525j3243k8084l441J0058j4720k7529J3366N7896L6539k5858m8526k0577
15393g5644k484j3360p981K5976L7094L617k1682K05K8502J2495k7469m0481k3809
15380a05021r354l756Q559K5706L4298L5550L0969N802l8625o2903l8306O395
15368a10686K4457J2392o050k6654m9193m4447P088O3794O7842K7176l346p508
15356d5135j2671k1744j0039J2987J0381j0516o338J5500M03m5133m0348L5441
15344a17212Q5772L7069m2849m7764O843K2590k0646m6077j4110K2628J6136m890
$$ y = [-32893, -62804, -116714, -140747, -121719, -94367, -87137, -88097, -76681, -63208, -70371, -89841, -90236, -67306, -54234, -73347, -105513, -121665, -120139, -114868, -108865, -100625, -96834, -95662, -77428, -38160, -11525, -24768, -52852, -56293, -46235, -60955, -88484, -75118, -17222, 19317, -6541, -55067, -75644, -78128, -91488, -99469, -73493, -36399, -32782, -54464, -54259, -25757, -13262, -40731, -81212, -105021, -114375, -118131, -109572, -83866, -49568, -14018, 16951, 22753, -15872, -78775, -117081, -110686, -86229, -73837, -79887, -106541, -155734, -200181, -193093, -129299, -61457, -34281, -37627, -45135, -57806, -79550, -89589, -76602, -66221, -76737, -83075, -67575, -67172, -112305, -152653, -117212, -31440, 5629, -37220, -84984, -78141, -55551, -76197, -122274, -136384, -113756, -97620, -102510]
15332a02510O071L8704M7916J7235k8107n0905l0519J8013M7511K5618j9054k6801
15320e6828J3159M6427K8142j8680l8984j6415J3735J2089j8934l6432o594M4377
15308c4938M8913j3036p0009m5129L1911N7889J295n2858k8395L4658M7015N18
15296b2166l2001j0960J8538J463m5895n8792j1182M8367N5420R606k6290j1071
15284h4963J9668R446l1301m0170J36L4882K1748j0261j5032K675J1294P671M998
15271f9209m603k8489l8186p114L2919K8385j0574k0441J6245M3060K0555j3106
15259e0558r499R301q775n1148n0479R676N9743M1827n691r871K0858J1263n0413
15246h3766p5699q066P6871P3880L389k7793L144J4482k2908l0005L0374O3969
$$ y = [-102510, -96439, -57735, -9819, 7416, -20691, -71596, -102115, -84102, -36591, -10973, -30027, -56828, -43669, 2758, 30900, 12220, -26764, -43179, -29444, -17355, -36289, -72721, -79315, -34938, 13975, 939, -69070, -114199, -82288, -24399, -23104, -75962, -104357, -69699, -22684, -22166, -54167, -65127, -46589, -45126, -91021, -149813, -160995, -112628, -57208, -47602, -73892, -84963, -65295, -55849, -87150, -127320, -127184, -92302, -70554, -80815, -95847, -93172, -81878, -74207, -69209, -73812, -102301, -140487, -147601, -114682, -86297, -96871, -117312, -101067, -58007, -37452, -50558, -60057, -50756, -59531, -110679, -161158, -151482, -91739, -49912, -55603, -65474, -44616, -33353, -83766, -159465, -167531, -90660, -16780, -13391, -41184, -38040, -23558, -46466, -76471, -46097, 17872]
15234A7872o501r5868p5484K3565N8408j975m0678Q889O2357L1919l4450l7747
15222h9693J9578M8843Q122n0895o0766j4787L7756M8741J9421o933m899o18k0563
15209f6693l4770m348L5580J6832m1007m2028L1749P3976J2986p0570o2685J4334
15197a36644M5967J457l4645k759M8506M4490j0208m5932k1428K7853L6703o462
15185e3102m2513k1748K4017L0299Q65n787J5086N350m0103m5213J6403N9558
15173e6888K2082l0836k1240R470j1673m5572j2151N0810M0736k9133m6949R311
15161a22033M4064J4004j3401L462J7294K234K296K5249R946m7382n4944K0282
15149i8929P5622K9975m7808n7436j8105k145l273K0137L9522P005l9057k7615
$$ y = [17872, 11371, -84497, -159981, -136416, -78008, -79983, -120661, -111772, -49415, -17496, -51946, -89693, -70115, -21272, -13150, -64045, -124811, -139598, -101842, -53101, -33680, -40613, -45512, -46130, -66693, -101463, -105811, -70231, -53399, -94406, -136434, -104685, -30709, -17723, -88293, -150978, -136644, -90677, -89220, -123865, -126624, -78118, -33628, -43836, -89768, -111196, -83343, -46640, -53102, -95615, -117363, -93346, -63047, -62182, -67969, -52883, -47533, -87636, -132849, -116446, -56888, -34806, -65642, -86882, -77412, -89085, -134657, -146808, -95998, -55262, -84395, -131344, -122033, -77969, -63965, -77366, -73904, -56610, -54376, -52080, -26831, -16885, -64267, -119211, -98929, -23307, 6668, -41140, -98576, -116681, -118826, -122099, -101962, -62440, -55435, -94492, -122107]
15137a22107K4840M6979K9352J2646l371l9081n7266j2886M4449K8126m0199n5351
15125a43869M800N0900L1870K994J5026L2914R340l5079n0470k6311R395K3250
$$ y = [-122107, -97267, -50288, -20936, -8290, -11661, -50742, -108008, -120894, -76445, -48319, -88518, -143869, -139069, -88169, -56299, -53305, -38279, -5365, 3975, -31104, -81574, -107885, -98490, -75240]
$$ [...]
##END NTUPLES=NMR SPECTRUM
##END=
