##TITLE=1H ikalashn
K-546-1
18.12.2024
##JCAMPDX= 6.0         $$ Bruker NMR JCAMP-DX V2.0
##DATA TYPE= NMR SPECTRUM
##DATA CLASS= NTUPLES
##ORIGIN= UXNMR, Bruker Analytische Messtechnik GmbH
##OWNER= root
$$ TOPSPIN		Version 1.3
$$ 2024-12-18 15:31:12.359 +0400  Irina@DPX200
$$ Compression mode = diff/dup
##.OBSERVE FREQUENCY= 200.131300845
##.OBSERVE NUCLEUS= ^1H
##.ACQUISITION MODE= SIMULTANEOUS
##.ACQUISITION SCHEME= undefined
##.AVERAGES= 128
##.DIGITISER RES= 18
##SPECTROMETER/DATA SYSTEM= spect
##.PULSE SEQUENCE= zg
##.SOLVENT NAME= DMSO
##.SHIFT REFERENCE= INTERNAL, DMSO, 1, 17.49637
##AUDIT TRAIL= $$ (NUMBER, WHEN, WHO, WHERE, WHAT)
$$ ##TITLE= Audit trail, TOPSPIN		Version 1.3
$$ ##JCAMPDX= 5.01
$$ ##ORIGIN= Bruker BioSpin GmbH
$$ ##OWNER= Irina
$$ $$ F:/spectra/data/iren/nmr/1H/4/pdata/1/auditp.txt
$$ ##AUDIT TRAIL=  $$ (NUMBER, WHEN, WHO, WHERE, VERSION, WHAT)
(   1,<2024-12-18 15:30:45.203 +0400>,<Irina>,<DPX200>,<TOPSPIN 1.3>,
      <created by zg
	started at 2024-12-18 15:22:22.062 +0400,
	POWCHK disabled, PULCHK disabled
       configuration hash MD5:
       BE 6D 3F 07 2A EA 11 49 91 17 2B D3 AF B3 58 0D
       data hash MD5: 16K
       40 1B 30 13 CA 25 42 92 5D E2 58 94 12 39 FE 58>)
(   2,<2024-12-18 15:30:48.453 +0400>,<Irina>,<DPX200>,<TOPSPIN 1.3>,
      <Start of raw data processing
       efp BC_mod = 2 LB = 0.02 FT_mod = 6 PKNL = 1 PHC0 = 259.4884 PHC1 = -14.20579 SI = 32K 
       data hash MD5: 32K
       9E EE BA E7 7C 71 C3 79 EE 4F 04 8F 29 F3 6F 2A>)
(   3,<2024-12-18 15:30:50.562 +0400>,<Irina>,<DPX200>,<TOPSPIN 1.3>,
      <apk 
       data hash MD5: 32K
       C7 8F 32 44 E2 27 E2 DE F8 9B A3 3C 04 E6 F1 53>)
(   4,<2024-12-18 15:30:56.765 +0400>,<Irina>,<DPX200>,<TOPSPIN 1.3>,
      <abs n ABSG = 5 
       data hash MD5: 32K
       FE 95 5F 07 CF C6 EE F8 90 13 74 A5 FD 5C 2F 02>)
$$ ##END=
$$ 
$$ $$ hash MD5
$$ $$ 6F 92 EC FB 41 E0 85 1E 7D 52 7D B7 29 CD CF 87
##$RELAX= 
##$RELAX= 
##$RELAX= 
##$RELAX= 
##$RELAX= 
##$RELAX= 
##$RELAX= 
##$RELAX= 
##$RELAX= 
$$ Bruker specific parameters
$$ --------------------------
##$DU= <F:/spectra>
##$EXPNO= 4
##$NAME= <1H>
##$PROCNO= 1
##$TYPE= <nmr>
##$USER= <iren>
##$AMP= (0..31)
100 100 100 100 100 100 100 100 100 100 100 100 100 100 100 100 100 100 
100 100 100 100 100 100 100 100 100 100 100 100 100 100 
##$ANAVPT= -1
##$AQSEQ= 0
##$AQ_mod= 1
##$AUNM= <au_zg>
##$AUTOPOS= <>
##$BF1= 200.13
##$BF2= 200.13
##$BF3= 200.13
##$BF4= 200.13
##$BF5= 200.13
##$BF6= 200.13
##$BF7= 200.13
##$BF8= 200.13
##$BYTORDA= 1
##$CFDGTYP= 0
##$CFRGTYP= 5
##$CHEMSTR= <none>
##$CNST= (0..63)
1 1 145 1 1 1 1 1 1 1 1 1 1 1 1 1 1 1 1 1 1 1 1 1 1 1 1 1 1 1 1 1 1 1 
1 1 1 1 1 1 1 1 1 1 1 1 1 1 1 1 1 1 1 1 1 1 1 1 1 1 1 1 1 1 
##$CPDPRG= <>
##$CPDPRG1= <>
##$CPDPRG2= <>
##$CPDPRG3= <>
##$CPDPRG4= <mlev>
##$CPDPRG5= <mlev>
##$CPDPRG6= <mlev>
##$CPDPRG7= <mlev>
##$CPDPRG8= <mlev>
##$CPDPRGB= <>
##$CPDPRGT= <>
##$D= (0..63)
0 2 0 0 0 0 0 0 0 0.06 0 0.03 0 0 0 0 0.0002 0 0 0 0 0 0 0 0 0 0 0 0 0 
$$ [...]
##$SW_h= 4401.40845070422
##$TD= 16384
##$TD0= 1
##$TE= 300
##$TE2= 300
##$TE3= 300
##$TEG= 300
##$TL= (0..7)
0 120 120 120 120 120 120 120 
##$TP= (0..7)
150 150 150 150 150 150 150 150 
##$TP07= 0
##$TPNAME0= <>
##$TPNAME1= <>
##$TPNAME2= <>
##$TPNAME3= <>
##$TPNAME4= <>
##$TPNAME5= <>
##$TPNAME6= <>
##$TPNAME7= <>
##$TPOAL= (0..7)
0.5 0.5 0.5 0.5 0.5 0.5 0.5 0.5 
##$TPOFFS= (0..7)
0 0 0 0 0 0 0 0 
##$TUNHIN= 0
##$TUNHOUT= 0
##$TUNXOUT= 0
##$USERA1= <user>
##$USERA2= <user>
##$USERA3= <user>
##$USERA4= <user>
##$USERA5= <user>
##$V9= 5
##$VALIST= <valist>
##$VCLIST= <CCCCCCCCCCCCCCC>
##$VD= 0
##$VDLIST= <DDDDDDDDDDDDDDD>
##$VPLIST= <PPPPPPPPPPPPPPP>
##$VTLIST= <TTTTTTTTTTTTTTT>
##$WBST= 1024
##$WBSW= 25
##$XGAIN= (0..3)
0 0 0 0 
##$XL= 0
##$YL= 0
##$YMAX_a= 5153737
##$YMIN_a= -5123922
##$ZGOPTNS= <>
##$ZL1= 120
##$ZL2= 120
##$ZL3= 120
##$ZL4= 120
##$ABSF1= 17.49637
##$ABSF2= -4.496376
##$ABSG= 5
##$ABSL= 3
##$ALPHA= 0
##$AQORDER= 0
##$ASSFAC= 0
##$ASSFACI= 0
##$ASSFACX= 0
##$ASSWID= 0
##$AUNMP= <proc_1d>
##$AXLEFT= 0
##$AXRIGHT= 0
##$AXTYPE= 0
##$AXUNIT= <>
##$AZFE= 0.1
##$AZFW= 0.1
##$BCFW= 0
##$BC_mod= 2
##$BYTORDP= 0
##$COROFFS= 0
##$CY= 7568.61572265625
##$DATMOD= 1
##$DC= 0
##$DFILT= <>
##$DTYPP= 0
##$F1P= 17.9538593292236
##$F2P= -4.03888763876832
##$FCOR= 0.5
##$FTSIZE= 32768
##$FT_mod= 6
##$GAMMA= 0
##$GB= 0
##$INTBC= 0
##$INTSCL= 5.656564e-011
##$ISEN= 128
##$LB= 0.02
##$LEV0= 0
##$LPBIN= 0
##$MAXI= 945.577
##$MC2= 0
##$MEAN= 0
##$ME_mod= 0
##$MI= -402.1523
##$NCOEF= 0
##$NC_proc= -1
##$NLEV= 6
##$NOISF1= 8.587773
##$NOISF2= 6.764455
##$NSP= 0
##$NTH_PI= 0
##$NZP= 0
##$OFFSET= 17.49637
##$PC= 1
##$PHC0= 94.4859
##$PHC1= 2.106936
##$PH_mod= 1
##$PKNL= yes
##$PPARMOD= 0
##$PPDIAG= 0
##$PPIPTYP= 0
##$PPMPNUM= 100
##$PPRESOL= 1
##$PSCAL= 0
##$PSIGN= 0
##$REVERSE= no
##$SF= 200.13
##$SI= 32768
##$SIGF1= 16.12182
##$SIGF2= -4.496377
##$SINO= 3.521527
##$SIOLD= 32768
##$SREGLST= <1H.CDCl3>
##$SSB= 0
##$STSI= 32768
##$STSR= 0
##$SW_p= 4401.40845070422
##$SYMM= 0
##$S_DEV= 0
##$TDeff= 16384
##$TDoff= 0
##$TI= <>
##$TILT= no
##$TM1= 0
##$TM2= 0
##$TOPLEV= 0
##$USERP1= <user>
##$USERP2= <user>
##$USERP3= <user>
##$USERP4= <user>
##$USERP5= <user>
##$WDW= 1
##$XDIM= 32768
##$YMAX_p= 388039861
##$YMIN_p= -209814
$$ End of Bruker specific parameters
$$ ---------------------------------
##NTUPLES= NMR SPECTRUM
##VAR_NAME=  FREQUENCY,     SPECTRUM/REAL,   SPECTRUM/IMAG
##SYMBOL=    X,             R,               I
##VAR_TYPE=  INDEPENDENT,   DEPENDENT,       DEPENDENT
##VAR_FORM=  AFFN,          ASDF,            ASDF
##VAR_DIM=   32768,         32768,           32768
##UNITS=     HZ,            ARBITRARY UNITS, ARBITRARY UNITS
##FACTOR=    0.134324425510551, 1,           1
##FIRST=     4401.40845070422, -49099,       -369012
##LAST=      0,             -19431,          -393639
##MIN=       0,             -209814,         0
##MAX=       4401.40845070422, 388039861,    0
$$ Real data points
##PAGE= N=1
##DATA TABLE= (X++(R..R)), XYDATA
$$ [...]
13694G385406Q8423N8116Q0512J13812R7781N8490O9806J30713J58428J14235
$$ 7385406 7473829 7531945 7612457 7726269 7824050 7882540 7952346 8083059 8241487 8355722
13684H355722O6705R2807J65883J95363J53746J06588J15023J60104J86251J81602
$$ 8355722 8422427 8515234 8681117 8876480 9030226 9136814 9251837 9411941 9598192 9779794
13674I779794J77619J88412J94760J88960J93024K15371K25951K04257J83142
$$ 9779794 9957413 10145825 10340585 10529545 10722569 10937940 11163891 11368148 11551290
13665A1551290K03203K42042K40775J97170J74268K02469K31942K14360J77562
$$ 11551290 11754493 11996535 12237310 12434480 12608748 12811217 13043159 13257519 13435081
13656A3435081J69199J70890J34913P8802O6128R8585J05652N6422P664Q046K0764
$$ 13435081 13604280 13775170 13910083 13988885 14055013 14153598 14259250 14315672 14323336 14331382 14352146
13645A4352146r033o1680p9349o2096o1749r2926j12766r4061o6343o8034r5390
$$ 14352146 14343113 14281433 14202084 14139988 14078239 13985313 13872547 13778486 13712143 13644109 13548719
13634A3548719j17415j15126r0230n5201k8978k7599m6666o1742n2356j9702J8197
$$ 13548719 13431304 13316178 13225948 13170747 13141769 13114170 13067504 13005762 12953406 12933704 12951901
13623A2951901M0359L7360K3782K8322N7338Q0782P4885O2826Q0678J15397J20761
$$ 12951901 12992260 13029620 13053402 13081724 13139062 13219844 13294729 13357555 13438233 13553630 13674391
13612A3674391R3620Q3314J11504J33882J11320P4574P5072J03063J05790P0895
$$ 13674391 13768011 13851325 13962829 14096711 14208031 14282605 14357677 14460740 14566530 14637425
13602A4637425L9441L7054M0002K0903j1401l6533n6540q1577j03060j08112j09758
$$ 14637425 14676866 14713920 14753922 14774825 14763424 14726891 14670351 14588774 14485714 14377602 14267844
13591A4267844j34804j80800k09649j96570j69301j77495k26969k68825k63278
$$ 14267844 14133040 13952240 13742591 13546021 13376720 13199225 12972256 12703431 12440153
13582A2440153k30484k15328k20961k14755j93263j92737k21711k31848j89688
$$ 12440153 12209669 11994341 11773380 11558625 11365362 11172625 10950914 10719066 10529378
13573A0529378j38718j42095j87514k04013j65397j20489j12998j24381j18545
$$ 10529378 10390660 10248565 10061051 9857038 9691641 9571152 9458154 9333773 9215228
13564I215228r9948r4620j02011j00266q4457p0737o9565p6217q2878q4802q0072
$$ 9215228 9115280 9020660 8918649 8818383 8733926 8663189 8593624 8517407 8434529 8349727 8269655
13553H269655p3971p5263q0242p4233n7966n3743p1251q7948q3989p6572r1528
$$ 8269655 8195684 8120421 8040179 7965946 7907980 7854237 7782986 7695038 7611049 7534477 7442949
13542G442949j16877j19558j00549r4638j13010j24827j09534r3210j08343j41419
$$ 7442949 7326072 7206514 7105965 7011327 6898317 6773490 6663956 6570746 6462403 6320984
13532F320984j50815j26282j01146j04515j25869j36783j30678j24398j26784
$$ 6320984 6170169 6043887 5942741 5838226 5712357 5575574 5444896 5320498 5193714
13523E193714j24717j06841q6993q8118j08061j20262j10914r5528q9835q5646
$$ 5193714 5068997 4962156 4875163 4787045 4678984 4558722 4447808 4352280 4262445 4176799
13513D176799p3069o6845q3181j03364r4475o2793m9888o9916q8032p6299n5184
$$ 4176799 4103730 4036885 3953704 3850340 3755865 3693072 3643184 3573268 3485236 3408937 3353753
13502C353753n4424o4020n8662m7200n5623p3493o4127k8736j4421m4550q1202
$$ 3353753 3299329 3235309 3176647 3129447 3073824 3000331 2936204 2907468 2893047 2848497 2767295
13491B767295p9683m8061k4436k0944k3312k7604m0526n2519m6994l3720l7514
$$ 2767295 2687612 2639551 2615115 2594171 2570859 2543255 2502729 2450210 2403216 2369496 2331982
13480B331982n2739m7109j8367o584l1813n8218m8875k2478j8213l1380k9527
$$ 2331982 2279243 2232134 2213767 2207183 2175370 2117152 2068277 2045799 2027586 1996206 1966679
13469A966679j4749j8274l9263m2811k3466j6758l3004l3913j798J9209r088n2409
$$ 1966679 1951930 1933656 1894393 1851582 1828116 1811358 1778354 1744441 1742643 1761852 1752764 1700355
13457A700355n3962j9367J437n324j1640r524j9236l7780l6699j7490j4600l1986
$$ 1700355 1646393 1627026 1628463 1623139 1611499 1601975 1582739 1544959 1508260 1490770 1476170 1444184
13445A444184l1593k953J1239j3467l9046k8542n888q055k0384j2326j494k0325
$$ 1444184 1412591 1409638 1420877 1407410 1368364 1339822 1333934 1325879 1305495 1293169 1291675 1271350
13433A271350m4787k6113J8120J8987l2230o1345k4475K3040J3423l0873l8354
$$ 1271350 1226563 1200450 1218570 1237557 1205327 1143982 1119507 1142547 1155970 1125097 1086743
13422A086743o02K0558q070m3369l4035N471K0092p277l6426k9197J13J0040q765
$$ 1086743 1086141 1106699 1098629 1055260 1021225 1026696 1046788 1039511 1003085 973888 974001 984041 975276
13409I75276k5253j7183r34q79j3128j9541j8783j8487j1953P444J9612j60l6808
$$ 975276 950023 932840 931906 931027 917899 898358 879575 861088 849135 856579 876191 876031 839223
13396H39223m8599k5041L135J3674J4376J0056q847l1630k5940P434K1136r258
$$ 839223 790624 765583 768718 782392 796768 806824 797977 766347 740407 747841 768977 759719
13384G59719m2914l5408m665N813m226o912j680m265l750J4118K0799j5915o0269
$$ 759719 716805 681397 676732 682545 678319 671407 669727 665462 661712 675830 696629 680714 620445
13371F20445m6114J5834M2456J979m0905k9589N651J3025O4k014k061j8591k7394
$$ 620445 574331 590165 632621 634600 593695 564106 569757 582782 582846 580832 578771 560180 532786
13358E32786k764K1037k505m5154l7843J6635M0781J404m1079k9051R652J6917
$$ 532786 530022 551059 548554 503400 465557 482192 522973 524377 483298 454247 463899 480816
13346D80816o015j5628l339m92j5441j7010R359K9015O135l8200m7090m198L9785
$$ 480816 474801 459173 455834 455342 439901 422891 432250 461265 467400 429200 382110 377912 417697
13333D17697L1671j3977l7188j7009M910n207k0831m132K5929K2023j2637k8059
$$ 417697 449368 435391 398203 381194 386104 380897 360066 355934 381863 403886 391249 363190
13321C63190q168P811l798j3071N178K2966O681k3852k7305o489L042o024q450
$$ 363190 355022 362833 359035 345964 351142 374108 380789 356937 329632 323143 326185 320161 311711
13308C11711L401P926n041j8087j7208r858n418j952K325M799P211R777J314k1266
$$ 311711 315112 323038 317997 299910 282702 272844 267426 265474 267799 272598 279809 289586 290900 269634
13294B69634l2279q927K3100J7751j7477k5912Q411L0587K506l2992k1110J5858
$$ 269634 237355 228428 251528 269279 251802 225890 234301 264888 267394 234402 213292 229150
13282B29150J8090j1921j7533J3972L1562P821j8500j1586M845m374k4693k1368
$$ 229150 247240 235319 217786 231758 263320 271141 252641 241055 245900 241526 216833 195465
13270A95465P94J1654Q557J0144J1758n778k8676k0580J4626K8276L53k7428j6906
$$ 195465 196259 207913 216470 226614 238372 232594 203918 183338 197964 226240 226593 199165 182259
13257A82259Q946R379o891m013J3157P299k1831l1113n447J6365O400r813m608
$$ 182259 191205 200584 193693 189680 202837 210136 188305 157192 151745 168110 174510 164697 160089
13244A60089K903r854j6431J3009M2920J7336l8908m1631K0221N4036J498o5981
$$ 160089 162992 153138 136707 149716 192636 209972 171064 129433 149654 203690 205188 139207
13232A39207n1280K3405N4825J3304k7697j5384J2940Q782j0583p562N856k999
$$ 139207 87927 111332 166157 179461 151764 136380 149320 158102 147519 139957 145813 142814
13220A42814k1556j0921K4034L5619M844l1105l2485n628J5083J0732r529k3718
$$ 142814 121258 110337 134371 169990 174834 143729 111244 105616 120699 131431 121902 98184
13208I8184j5431J1194L0043J8916j0755k4931j0492J0283J4470P639O037P692
$$ 98184 82753 93947 123990 142906 132151 107220 96728 107011 121481 129120 135157 142849
13196A42849J70j3556j7245o236O236P508k115j4491j9839r990J1442K3949J1329
$$ 142849 143019 129463 112218 105982 112218 119726 117611 103120 83281 73291 84733 108682 120011
13183A20011j1400j1910J2945K7121O345k2938k0923M993J2191r033k0448J8K0079
$$ 120011 108611 96701 109646 136767 143112 120174 99251 104244 116435 107402 86954 86972 107051
13170A07051O101j9344j3501J4298J5799j6247l3215o847K7117K5446j258j5593
$$ 107051 113152 93808 80307 94605 110404 94157 60942 54095 81212 106658 105400 89807
13158H9807j1295p321n536N792J8475J3114m134r055m40J492l903L391K0774J9037
$$ 89807 78512 71191 65655 71447 89922 103036 98902 89847 89407 90899 86996 90387 111161 130198
13144A30198p151k3731r998R049O016o321m451K963l917j4383m856J5654J6835
$$ 130198 123047 99316 89318 98367 104383 98062 93611 96574 92657 78274 73418 89072 105907
13131A05907k244j1575J42J0005K106p937k794P993O410n024j0266n115q9k383
$$ 105907 103663 92088 92230 102235 104341 96404 93610 101603 108013 102989 92723 87608 87519 85136
13117H5136o729m623L256P034J316m185L347J6824J4062o864j7023J240K1161
$$ 85136 78407 73784 77040 84074 85390 81205 84552 101376 115438 108574 91551 92791 113952
13104A13952Q268k3955l1078n372J3443J190j6280q330J4029K0740P373p734j3642
$$ 113952 122220 98265 67187 61815 75258 76448 60168 51838 65867 86607 93980 86246 72604
13091G2604j0874J011J7929K3806Q742j2834j9010q231L760O585J913l750k419
$$ 72604 61730 62741 80670 104476 113218 100384 81374 73143 76903 83488 85401 81651 79232
13078G9232Q328J4290j789k6780k3508J2698L4486Q027l1483k9872M378J8772
$$ 79232 87560 101850 100061 73281 49773 62471 96957 104984 73501 43629 48007 66779
13066F6779K361n885O813N396k2264l2565K746M1075K8699j7480l5754p969K4634
$$ 66779 69140 63255 70068 75464 53200 20635 23381 64456 93155 75675 39921 31952 56586
13053E6586K6755P972o658j0202q103l139K541M608K736M42k282p034j0003p157
$$ 56586 83341 91313 84655 74453 66350 63211 65752 70360 73096 73538 71256 64222 54219 47062
13039D7062k940k991l252J536M648k420j2083j0213K14L848m43J419J1185J1686
$$ 47062 44122 41131 37879 39415 44063 41643 29560 19347 19561 23409 22966 24385 35570 47256
13025D7256m616j9759j5056K539J2163O930l151r200j0407n956N877J7447J2496
$$ 47256 42640 22881 7825 10364 22527 29457 26306 17106 6699 743 6620 24067 36563
13012C6563j2835l4960k3613J7107M2908K0791k2831l1146N684L4697J5575k1931
$$ 36563 23728 -11232 -34845 -17738 25170 45961 23130 -8016 -2332 32365 47940 26009
13000B6009k5892R7J0629n054j1724N818J7262K557j3574p957J133p001j2242
$$ 26009 117 214 10843 5789 -5935 -117 17145 19702 6128 -1829 -696 -7697 -19939
12987a9939R803L5135K2505j8378l8231k2171m287n331l673J6648L1140J3860
$$ -19939 -10136 24999 47504 29126 -9105 -31276 -35563 -40894 -44567 -27919 3221 17081
12975A7081j8538k9849j2959Q984J7234J2048J650n724m873n76l002q194J424
$$ 17081 -1457 -31306 -44265 -35281 -18047 -5999 -4349 -10073 -14946 -15522 -18524 -26718 -25294
12962b5294K5170L2720N501k8168k7871k15J0327j1892l1197j5469J6375K2423
$$ -25294 -124 32596 38097 9929 -17942 -18157 -7830 -19722 -50919 -66388 -50013 -27590
12950b7590m453k9468k1107J3316L8618L0313K89j6434l057J6808R809j9357l1486
$$ -27590 -32043 -61511 -82618 -69302 -30684 -371 -82 -16516 -19573 -2765 7044 -12313 -43799
12937d3799p514K3874K6278K858j5660j5075o734j861n86k545o961m748Q599J6234
$$ -43799 -51313 -27439 -1161 1697 -13963 -29038 -35772 -37633 -38219 -40764 -47725 -52473 -43874 -27640
12923b7640P25k0907j3795J9035L2555N809k2843j2606J7415J9397q963k4655
$$ -27640 -26915 -47822 -61617 -42582 -10027 -4218 -27061 -39667 -22252 -2855 -11818 -36473
12911c6473q423R918L622j1091o264J3724K2490J0404p959j6810j3041j698R612
$$ -36473 -44896 -34978 -31356 -42447 -48711 -34987 -12497 -2093 -10052 -26862 -39903 -41601 -31989
12898c1989J3609Q317k131j3177k0786j8049k474J2956J1003m515j1634k870N219
$$ -31989 -18380 -10063 -12194 -25371 -46157 -64206 -66680 -53724 -42721 -47236 -58870 -61740 -56521
12885e6521K644K310J1960J4554k042j7797j0011P717O802r250j2672J535J1053
$$ -56521 -53877 -51567 -39607 -25053 -27095 -44892 -54903 -47186 -40384 -49634 -62306 -60771 -49718
12872d9718N531k969p783j2497q995J2844L2582J8122j7091k2455J0528K8055
$$ -49718 -44187 -47156 -54939 -67436 -76431 -63587 -31005 -12883 -29974 -52429 -41901 -13846
12860a3846j449l3738j9309J7211K0492o139j4729L677J2395m8l913J0909J4550
$$ -13846 -15295 -49033 -68342 -51131 -30639 -36778 -51507 -47830 -35435 -35483 -39396 -28487 -13937
12847a3937o707k3051j1189R200J2138L405r34k775o425m111J898o687k6002k0404
$$ -13937 -20644 -43695 -54884 -45684 -33546 -30141 -31075 -33850 -40275 -44386 -42488 -49175 -75177 -95581
12833i5581K0103M7957K2303k4951l3991n079J1767J947R53K1038K3575j3372
$$ -95581 -75478 -27521 -5218 -30169 -64160 -69239 -57472 -55525 -54572 -33534 -9959 -23331
12821b3331m8923l5366J1450L4561J2572j8665j7183J5493L9324K1197k5444m8921
$$ -23331 -72254 -107620 -96170 -61609 -49037 -67702 -84885 -69392 -30068 -8871 -34315 -83236
12809h3236j7835L3534M2024o12l4047j4439K3484K2203j0626j9227Q177K2179
$$ -83236 -101071 -67537 -25513 -26125 -60172 -74611 -51127 -28924 -39550 -58777 -50600 -28421
12797b8421l670k7352p584K6187J9968j6337k3804R812K9502K021l0634k0239
$$ -28421 -32091 -59443 -67027 -40840 -20872 -37209 -61013 -51201 -21699 -19678 -50312 -70551
12785g0551J0775J0836j3192j0963K0800K9495k852k5413k716K4857Q591k6961
$$ -70551 -59776 -48940 -62132 -73095 -52295 -22800 -25652 -51065 -53781 -28924 -20333 -47294
12773d7294k5665Q742K4259O060j1946j3450j5070j4981Q932L9809K8015k2008
$$ -47294 -72959 -64217 -39958 -33898 -45844 -59294 -74364 -89345 -80413 -40604 -12589 -34597
12761c4597l9322M175L9568P880m0774k6596K8549L6783j2270l8211l195L2466
$$ -34597 -73919 -69744 -30176 -22296 -63070 -89666 -61117 -24334 -36604 -74815 -78010 -45544
12749d5544J5661j7083r750K0120J7769j5657k7726J064L1060K4717n764k3647
$$ -45544 -29883 -46966 -56716 -36596 -18827 -34484 -62210 -61146 -30086 -5369 -11133 -34780
12737c4780j4891L805J1533O408L186J0465J5589J864k1623k5567j924J9728J1128
$$ -34780 -49671 -45866 -34333 -27925 -24739 -14274 1315 3179 -18444 -44011 -45935 -26207 -15079
12724a5079j5431k5429q936J1370J4804N515j693k976m730q182m601J0057K0886
$$ -15079 -30510 -55939 -64875 -53505 -38701 -33186 -34879 -37855 -42585 -50767 -55368 -45311 -24425
12711b4425P629k2517l2831m868K7399J9956j4946k3943N703K5988M725k4457
$$ -24425 -16796 -39313 -72144 -77012 -49613 -29657 -44603 -68546 -62843 -36855 -32130 -56587
12699e6587j8596Q473J6689N280J371N349k893j6195q857J2456J5381j397o525
$$ -56587 -75183 -66710 -50021 -44741 -43370 -38021 -40914 -57109 -65966 -53510 -38129 -39526 -46051
12686d6051N886P190q052q522J2140J4334j7514l5633k245M0988L1612j4969k8352
$$ -46051 -40165 -32975 -41027 -49549 -37409 -23075 -40589 -76222 -78467 -37479 -5867 -20836 -49188
12673d9188O914L0012K647l0556j2561L7177M9667N085m1247l6923M48J6133m250
$$ -49188 -42274 -12262 -9615 -40171 -52732 -15555 34112 39197 -2050 -38973 -38525 -22392 -26642
12660b6642k3084j2304Q368Q550n955r266M65M538R97M411J1782M128j5379k0524
$$ -26642 -49726 -62030 -53662 -45112 -51067 -60333 -59868 -55330 -54333 -49922 -38140 -34012 -49391 -69915
12646f9915o511J116o538m184J9896L6154J9435j0966k4836k3103j6807K026L1881
$$ -69915 -76426 -75310 -81848 -86032 -66136 -29982 -10547 -21513 -46349 -69452 -86259 -84233 -52352
12633e2352L7547L9l7730k7046Q792J1765j4017j2522K2320L1578o978l5533p943
$$ -52352 -14805 -14766 -52496 -79542 -70750 -58985 -73002 -85524 -63204 -31626 -38604 -74137 -82080
12620h2080L6802L7546P04k2703j6956p999r050o677N106J3756J0676Qj1922j8043
$$ -82080 -45278 -7732 -7028 -29731 -46687 -54686 -63736 -70413 -65307 -51551 -40875 -40867 -52789 -70832
12606g0832r829Q126J4709N61j4092q295Q221J3076N270j374m429q096n497Q453
$$ -70832 -80661 -72535 -57826 -57265 -71357 -79652 -71431 -58355 -53085 -54459 -58888 -66984 -72481 -64028
12592f4028J7922O627j2271j3773j89N229k800p624j694N691Q937R221J662j4217
$$ -64028 -46106 -39479 -51750 -65523 -65712 -60483 -63283 -70907 -72601 -66910 -57973 -48752 -47090 -61307
12578f1307j8204N225L0907J9630j9545l4639o279K3785J6816q778j3632L102
$$ -61307 -79511 -74286 -43379 -23749 -43294 -77933 -84212 -60427 -43611 -52389 -66021 -62919
12566f2919J2516M503m686m076K72K228L399L709p96r338j4554r957L664J6607
$$ -62919 -50403 -45900 -50586 -54662 -54390 -52162 -48763 -45054 -45850 -55188 -69742 -79699 -76035 -59428
12552e9428J6076J177j0826n603N319J714r036r36K2088K1527j5886m7330l0671
$$ -59428 -43352 -42175 -53001 -58604 -53285 -51571 -60607 -61543 -39455 -17928 -33814 -81144 -111815
12539a11815J3677L2177J2719p960m582P076N494m350p176k812k7O74L886P211
$$ -111815 -98138 -65961 -53242 -61202 -65784 -58708 -53214 -57564 -64740 -67552 -67579 -66905 -63019 -55808
12525e5808M512k250m169J085M196k429j0074k731J6520K1976M83k3168j7845
$$ -55808 -51296 -53546 -57715 -56630 -52434 -54863 -64937 -67668 -51148 -29172 -28689 -51857 -69702
12512f9702O608J4092K43l548J0227Q176k0720l2729K317M1975L1106j0763k2205
$$ -69702 -63094 -49002 -48759 -52307 -42080 -33904 -54624 -87353 -85036 -43061 -11955 -22718 -44923
12499d4923P37O590j6276k0618J0582K7926k95l0232j3704K2033J9849j5563k9418
$$ -44923 -44186 -37596 -53872 -74490 -63908 -35982 -36277 -66509 -80213 -58180 -38331 -53894 -83312
12486h3312l539K3325J9446j414j1560m599R140J7224R893j0029k1738j0302Q033
$$ -83312 -86851 -63526 -44080 -45494 -57054 -61653 -52513 -35289 -25396 -35425 -57163 -67465 -59432
12473e9432P335o006j996K1857L0988N489k7889l2612r332J3059J6975O989o963
$$ -59432 -52097 -58103 -60099 -38242 -7254 -1765 -29654 -62266 -71598 -58539 -41564 -34575 -41538
12460d1538j6629j2163P910K4725J5768j2304k4442j055L1330L0256o101l3783
$$ -41538 -58167 -70330 -62420 -37695 -21927 -34231 -58673 -59728 -28398 1858 -4243 -38026
12448c8026k1562O627Q394j3250j6440J0160K5080m25l1226j8323K4347L8582
$$ -38026 -59588 -52961 -44567 -57817 -74257 -64097 -39017 -39442 -70668 -88991 -64644 -26062
12436b6062Q353k0688j3732P889J2569Q248J5515K2003L220k7853l2703n149J8955
$$ -26062 -17709 -38397 -52129 -44240 -31671 -23423 -7908 14095 17315 -10538 -43241 -48390 -29435
12423b9435J4799k65n32R239P663p246j7146j1990j164M291N707P847O462m760
$$ -29435 -14636 -14901 -15433 -6194 1469 -5777 -22923 -34913 -36077 -31786 -26079 -18232 -11770 -16530
12409a6530j8192j5381Q148K9774K3121p623l0118k3256l96J3448J2563O172k385
$$ -16530 -34722 -50103 -41955 -12181 10940 3317 -26801 -50057 -50453 -37005 -24442 -18270 -20655
12396b0655j1974r583J3425L4194J8942k2896l8372k963L8278L1499q597k3518
$$ -20655 -32629 -42212 -28787 5407 24349 1453 -36919 -39882 -1604 29895 21298 -2220
12384b220j3J5712k938k1349m580K3736K1283m594j3380J216Q665J88J18J3156
$$ -2220 -2233 13479 10541 -10808 -15388 8348 29631 25037 11657 12873 21538 21726 21844 35000
12370C5000R470j9343l4302q362K4936J9411j4097k7425p376J4514J6226P483
$$ 35000 44470 25127 -9175 -17537 7399 26810 12713 -14712 -22088 -7574 8652 16135
12358A6135r56j0389j2666O197L2355L0846j284k4347j5420j870j1031k1565j203
$$ 16135 15179 4790 -7876 -1679 30676 61522 60238 35891 20471 18601 7570 -13995 -15198
12345a5198L2943L5504K707k1548r754J5804K1325L926j5385j9464n069J8316
$$ -15198 17745 53249 55956 34408 24654 40458 61783 65709 50324 30860 25791 44107
12333D4107L1545K1660J87q308Q42P779Q84n819K024J4661J4260K151o202n136
$$ 44107 75652 97312 97499 89191 90033 97812 98696 92877 94901 109562 123822 125973 119771 114635
12319A14635k035j375J54L664M561j8p597j3988j5284q427L996J1290M021j3299
$$ 114635 112600 111225 111379 115043 119604 119586 111989 98001 82717 74290 78286 89576 93597 80298
12305H0298k3757j4604Q677K5641J9837l177j8887r720J3911K5347J3494o179
$$ 80298 56541 41937 50614 76255 96092 92915 74028 64308 78219 103566 117060 110881
12293A10881j3300n007O520R162p00j5445j8224J039K6982K9968M145k0321j5446
$$ 110881 97581 92574 99094 108256 107556 92111 73887 74926 101908 131876 136021 115700 100254
12280A00254Q022J8711P506p656j1820n970N748J9054K0982J770k2351k2003L735
$$ 100254 108276 126987 134493 126837 115017 109047 114795 133849 154831 156601 134250 112247 115982
12267A15982K1864J1130r751j3486k454L648J602L029Q731P402l122j1840j1566
$$ 115982 137846 148976 139225 125739 123285 126933 128535 131564 140295 147697 144575 132735 121169
12254A21169o598m201p681j4272j3472K677K0353J2614j8492l1102n69L4779K3798
$$ 121169 114571 110370 102689 88417 74945 77622 97975 110589 92097 60995 60426 95205 119003
12241A19003j7238k5739Q626K6490l717l1766p153L6405L3079j1960l4660j2567
$$ 119003 101765 76026 84652 111142 107425 75659 68506 104911 137990 126030 91370 78803
12229G8803J0720L724r708k396J0812O524n519m233N439N449l378p568n391l079
$$ 78803 89523 93247 83539 81143 91955 98479 92960 88727 94166 99615 96237 88669 83278 80199
12215H0199J568J1557J6648O177j1057j6163m489J1565J8391J1333l133r658K89
$$ 80199 81767 93324 109972 116149 105092 88929 84440 96005 114396 125729 122596 112938 113227
12202A13227J2296O245q779m405J5603J1912k3383l9605l276L8943K5478k1676
$$ 113227 125523 131768 122989 118584 134187 146099 122716 83111 79835 118778 144256 122580
12190A22580k8968J2246L3926J923l3117k0508J6505K9008J5634L715n018k2151
$$ 122580 93612 105858 139784 141707 108590 88082 104587 133595 149229 152944 147926 125775
12178A25775l2052j1996K1117K8305O495r878l329O784K677n479k356O516N438
$$ 125775 93723 81727 102844 131149 137644 127766 124437 131221 133898 128419 126063 132579 138017
12165A38017o614j3369j793J8763K2878J323j9593r379J9176K3244m349k0204
$$ 138017 131403 118034 116241 135004 157882 159205 139612 130233 149409 172653 168304 148100
12153A48100J195K4478J1300j5932j3789P740O548j3232p775K3628K7958j3670
$$ 148100 149295 173773 185073 169141 155352 163092 169640 156408 148633 172261 200219 186549
12141A86549m6870k3081K8503M5764J8201j2133j4984q75P660O069O130J6608
$$ 186549 139679 116598 145101 190865 209066 196933 181949 181074 188734 194803 200933 217541
12129B17541K7547J6525j9726m7217l0795J4949M0201K6659N486K160L103o658
$$ 217541 245088 261613 241887 194670 163875 178824 219025 245684 251170 253330 256433 249775
12117B49775j2141j03J1761O125k849J253N671k114k859J9415L7895K1465r230
$$ 249775 237634 237531 249292 255417 252568 253821 259492 257378 254519 273934 311829 333294 324064
12104C24064j1489R682J2331j0281k0894k959J5674J3367N067Q041J4602J4775
$$ 324064 312575 322257 334588 324307 303413 300454 316128 329495 334562 342603 357205 371980
12092C71980J4485J6477J1122p72k952O562P876n511j0702Q977L5275L9280J7709
$$ 371980 386465 402942 414064 413292 410340 416902 424778 419267 408565 417542 452817 492097 509806
12079E09806q261j6479O13K8124L4746P180k2575j2566K6544M0620J0485k0275
$$ 509806 501545 485066 485679 513803 548549 555729 533154 520588 547132 587752 598237 577962
12067E77962j2627J3688J9826O699J472J1147K1755K5278K0722O449o673L162
$$ 577962 565335 579023 598849 605548 607020 618167 639922 665200 685922 692371 685698 688860
12055F88860L2184M3330K0377j512Q959K7101J6864l989M711L2835L7126J6944
$$ 688860 721044 764374 784751 783239 792198 819299 836163 832174 836885 869720 906846 923790
12043I23790J1280K5611K5346O505Q472M0553N7003L1642K844J0022L2163L0519
$$ 923790 935070 960681 986027 992532 1001004 1041557 1098560 1130202 1133046 1143068 1175231 1205750
12031A205750J5190K3078N2946O7101M7829J7387N887K2840N4773P4653O4167
$$ 1205750 1220940 1244018 1296964 1364065 1411894 1429281 1435168 1458008 1512781 1587434 1651601
12020A651601L9052L5165N7658P0303N3461L9816O0972Q9688Q0528M7689M8178
$$ 1651601 1690653 1725818 1783476 1853779 1907240 1947056 2008028 2097716 2178244 2225933 2274111
12009B274111R1881J22867J02379O3519N8895Q8384J10022J03296R0478R9033
$$ 2274111 2365992 2488859 2591238 2654757 2713652 2802036 2912058 3015354 3105832 3204865
11999C204865J25634J43323J35172J14645J10992J35123J66428J78654J70801
$$ 3204865 3330499 3473822 3608994 3723639 3834631 3969754 4136182 4314836 4485637
11990D485637J61985J63211J70007J79824J98440K24973K44391K42924K25934
$$ 4485637 4647622 4810833 4980840 5160664 5359104 5584077 5828468 6071392 6297326
11981F297326K16675K36287K79766L12779L07017K82412K91005L45495L92687
$$ 6297326 6514001 6750288 7030054 7342833 7649850 7932262 8223267 8568762 8961449
11972H961449L85754L54872L62627M09188M39120M37124M50328N00266N39800
$$ 8961449 9347203 9702075 10064702 10473890 10913010 11350134 11800462 12300728 12840528
11963A2840528N33724N23731N60892O19239O40812O35719O63569P27378P64274
$$ 12840528 13374252 13897983 14458875 15078114 15718926 16354645 17018214 17745592 18509866
11954A8509866P52541P53755Q15908Q96224R29095R26945R54754J027953J098093
$$ 18509866 19262407 20016162 20832070 21728294 22657389 23584334 24539088 25567041 26665134
11945B6665134J137713J180474J258279J345405J399107J426803J471843J542784
$$ 26665134 27802847 28983321 30241600 31587005 32986112 34412915 35884758 37427542
11937C7427542J597732J605927J590539J589951J600103J582649J516875J411363
$$ 37427542 39025274 40631201 42221740 43811691 45411794 46994443 48511318 49922681
11929D9922681J267117J063728P91524M66303R6214l33060q10355j262420j608385
$$ 49922681 51189798 52253526 53045050 53511353 53607567 53274507 52464152 51201732 49593347
11920D9593347j842234k020523k171182k261003k263553k211535k152815k089135
$$ 49593347 47751113 45730590 43559408 41298405 39034852 36823317 34670502 32581367
11912C2581367j993882j867244j735581j609304j479094j348937j237083j142174
$$ 32581367 30587485 28720241 26984660 25375356 23896262 22547325 21310242 20168068
11904B0168068j041167r28800q30728p65313p16438o59698n96942n46965n14169
$$ 20168068 19126901 18198101 17367373 16602060 15885622 15225924 14628982 14082017 13567848
11895A3567848m84289m46811m08128l81482l69393l57597l29705k91620k71866
$$ 13567848 13083559 12636748 12228620 11847138 11477745 11120148 10790443 10498823 10226957
11886A0226957k84000k98388k75727k25014j96108k08423k23495k07256j83433
$$ 10226957 9942957 9644569 9368842 9143828 8947720 8739297 8515802 8308546 8125113
11877H125113j91122k16738k13605j76873j50361j56471j65492j50189j31041
$$ 8125113 7933991 7717253 7503648 7326775 7176414 7019943 6854451 6704262 6573221
11868F573221j39630j64429j66655j38479j14283j22415j48031j53353j24394
$$ 6573221 6433591 6269162 6102507 5964028 5849745 5727330 5579299 5425946 5301552
11859E301552q6895p4826q9749j01714r2005p8495q4783j00201r6637p6180o8230
$$ 5301552 5214657 5139831 5050082 4948368 4856363 4777868 4693085 4592884 4496247 4420067 4351837
11848D351837p9183q3030p0563o6671p9722p7190m4257k5718o1305j10316j01573
$$ 4351837 4272654 4189624 4119061 4052390 3972668 3895478 3851221 3825503 3764198 3653882 3552309
11837C552309m2933j3488m4479p7196o0865k8363l3948o5926p4127n2733l9643
$$ 3552309 3509376 3495888 3451409 3374213 3313348 3284985 3251037 3185111 3110984 3058251 3018608
11826C018608m8340n3413m1711l0764l0063k5337j3551j6713m2111n9539m2873
$$ 3018608 2970268 2916855 2875144 2844380 2814317 2788980 2775429 2758716 2716605 2657066 2614193
11815B614193j2112o049k6347l8339k4303p831j6367l9920m4315j8526Q831N430
$$ 2614193 2602081 2596032 2569685 2531346 2507043 2499212 2482845 2442925 2398610 2380084 2388915 2394345
11803B394345k3201m0790k7627n528n536k2268k1143Q106K8891N198m3044n8106
$$ 2394345 2371144 2330354 2302727 2297199 2291663 2269395 2248252 2256358 2285249 2290447 2247403 2189297
11791B189297j8720K8933K8407j6515n0862m0402q079N575o863k3672k9729k6762
$$ 2189297 2170577 2199510 2227917 2211402 2160540 2120138 2112059 2117634 2110771 2087099 2057370 2030608
11779B030608j8455q034o054j9135l3149k8812j2613q836k0960k8055k2184j8130
$$ 2030608 2012153 2004119 1998065 1978930 1945781 1916969 1904356 1895520 1874560 1846505 1824321 1806191
11767A806191j8854p980Q839k784m4416o0187j6876L0128J0660m7511n4401J497
$$ 1806191 1787337 1779357 1788196 1785412 1740996 1680809 1663933 1694061 1704721 1657210 1602809 1604306
11755A604306L1847j3816p0060n9040m886J6929l906j8542j2731j7979l6594l0199
$$ 1604306 1636153 1622337 1552277 1493237 1488351 1505280 1501374 1482832 1470101 1452122 1415528 1385329
11743A385329M994J7836j6439m9846l4102L895N739k7629m1002j1784J8355P916
$$ 1385329 1390323 1408159 1391720 1341874 1307772 1311667 1317406 1289777 1248775 1236991 1255346 1263262
11731A263262k7602m4259k9959j0611p661j4721j7324j5770j8214k2186j6609
$$ 1263262 1235660 1191401 1161442 1150831 1143170 1128449 1111125 1095355 1077141 1054955 1038346
11720A038346p10R845m2k6150m6292l9799p628K3732K3257j1342m4710m0377n174
$$ 1038346 1037636 1047481 1047439 1021289 974997 935198 927570 951302 974559 963217 918507 878130 872956
11707H72956J8570P267j7420k4686j5717j1303j5950j7663j2831p488n84J0683
$$ 872956 891526 898793 881373 856687 840970 829667 813717 796054 783223 775735 775151 785834
11695G85834J4612q52k1492k1423l259M568q021k1315k2250j9620j5738R06K1743
$$ 785834 800446 799594 778102 756679 753420 757988 749967 728652 706402 686782 671044 671950 693693
11682F93693J5595j8815l6887j4023J0653l926l0644j8476J8714K1598j5457l2932
$$ 693693 709288 690473 653586 639563 650216 646290 615646 597170 615884 637482 622025 589093
11670E89093l451K4313N787l0236l1702k481J3302R92j4294j4235o105J17K781
$$ 589093 585642 609955 615742 585506 553804 551323 564625 565617 551323 537088 530983 531100 533881
11657E33881j038j1944j8339j1188k794r244k1003j5399O217J9394J3092J6r508
$$ 533881 532843 520899 502560 491372 488578 479334 458331 442932 449149 468543 481635 481651 472143
11644D72143j7940k1798r629J2799J9628Rk3019k2361o73J8152J9242O986n774
$$ 472143 454203 432405 422776 435575 455203 455212 432193 409832 409159 427311 446553 453539 447765
11631D47765r514n394m435j1710j4130Q21J7712Q896k0437l2748j3582N635r06
$$ 447765 438251 432857 428422 416712 402582 403403 421115 430011 409574 376826 363244 368879 367973
11618C67973j1167N441L2325K8233q076l5480k9652r100O25j964n250k410P234
$$ 367973 356806 362247 394572 422805 414729 379249 349597 340497 341122 339158 333908 331498 338732
11605C38732J6233R457j3761k5489m824K1054R643k6701l1451P155L1581L825
$$ 338732 354965 364422 350661 325172 320348 341402 351045 324344 292893 300048 331629 335454
11593C35454l2690k0987K0706L1060J218j9269m361J4845O015j8088k5143o664
$$ 335454 302764 281777 302483 333543 334761 315492 311131 325976 331991 313903 288760 282096
11581B82096J8186K4749L269k8195l4301l830K7916K2422p168j7504k383M240
$$ 282096 300282 325031 328300 300105 265804 261974 289890 312312 305144 287640 285257 289497
11569B89497q436j1134P832J7852J409j2420r78Q495j1184l1332j2025K4700K4140
$$ 289497 281061 269927 277759 295611 297020 284600 283622 292117 280933 249601 237576 262276 286416
11556B86416j2205k7670j203K1972O157k0746j7505O681J4802J729o922j601J623
$$ 286416 274211 246541 245338 267310 273467 252721 235216 241897 256699 258428 251506 249905 251528
11543B51528m754p251J565Q173J284p262M88J9620K5987Q442j5545k2067r711
$$ 251528 246774 239523 241088 249261 250545 243283 243771 263391 289378 297820 282275 260208 250497
11530B50497K867L137l661q500j0605j1187p189J407P973R746J1433J1995K557
$$ 250497 253364 256501 252840 244340 233735 222548 215359 216766 224739 234485 245918 257913 260470
11517B60470j2603j1600J0833K3327q99l6242l3021J0095L9812K1626j6167k8308
$$ 260470 247867 236267 247100 270427 269528 233286 200265 210360 250172 271798 255631 227323
11505B27323j1681N435J0019J0995J1362K625j3759k1233r313J2131K3512J4656
$$ 227323 215642 221077 231096 242091 253453 256078 242319 221086 211773 223904 247416 262072
11493B62072o818k2778k1824r645J867J1188K1056K1209n23k7854k4875J2040
$$ 262072 255254 232476 210652 201007 202874 214062 235118 256327 255804 227950 203075 215115
11481B15115L8779K1642j3245j8552M823J4643m091j8940m934J7522J7637l5q481
$$ 215115 253894 275536 262291 243739 248562 263205 259114 240174 235240 252762 270399 270364 261883
11468B61883l82P441N136K221O205P530l273j4420n630J8728K8007P158j6725
$$ 261883 261501 268942 274078 276299 282504 290034 286761 272341 266711 285439 313446 320604 303879
11455C03879j1244J0202P333j9180k1973J5490M1546J2323l3166k7207K0892L8061
$$ 303879 292635 302837 310170 290990 269017 284507 326053 338376 305210 278003 298895 336956
11443C36956K440k4324J870L8760K9177q936j6948J1080K7048R120j1245o569
$$ 336956 339396 315072 316942 355702 384879 375943 358995 370075 397123 406243 394998 388429
11431C88429Q563J1451P358J0894J6968J3533O948J1002J9495J2996p740j6900
$$ 388429 396992 408443 415801 426695 443663 457196 464144 475146 494641 507637 499897 482997
11419D82997L33K4266K7917J5914J4669K7605K8103O035q145J0435L5313K5961
$$ 482997 483330 507596 535513 551427 566096 593701 621804 627839 619694 630129 665442 691403
11407F91403l883k483L5522N4434K4982n474J3660N5378N8268K2561M089K3130
$$ 691403 687520 685037 720559 774993 799975 794501 808161 863539 921807 944368 948457 971587
11395I71587M0060K8600J7067L4382O0231O0733M2098L4860M5223N4917N7296
$$ 971587 1011647 1040247 1057314 1091696 1151927 1212660 1254758 1289618 1334841 1389758 1447054
11384A447054O2664P2328P4406O6843O3112P0711Q0379Q2087P9343Q1408Q9661
$$ 1447054 1509718 1582046 1656452 1723295 1786407 1857118 1937497 2019584 2098927 2180335 2269996
11373B269996R7580R9788R7212R5594R9959J08057J09294R4565O9178N1789N4113
$$ 2269996 2367576 2467364 2564576 2660170 2760129 2868186 2977480 3072045 3141223 3193012 3247125
11362C247125O1433M2715j0649o2749o8077l1123q409l6649q0863q1152l5762
$$ 3247125 3308558 3351273 3340624 3277875 3209798 3178675 3170266 3133617 3052754 2971602 2935840
11351B935840J12n063k2891k0436q697q978o881K0430N4108N6439L4679L5456
$$ 2935840 2935952 2930889 2907998 2887562 2878865 2869887 2863006 2883436 2937544 2993983 3028662 3064118
11339C064118P2125J02123R1987O6149O5924R0647J11842J24024J42652J61362
$$ 3064118 3136243 3238366 3330353 3396502 3462426 3553073 3664915 3788939 3931591 4092953
11329D092953J53991J25550J22004J67857K22651K30777J98747J86328K22092
$$ 4092953 4246944 4372494 4494498 4662355 4885006 5115783 5314530 5500858 5722950
11320E722950K65602K69174K45690K44264K74770K94356K71069K27086K02452
$$ 5722950 5988552 6257726 6503416 6747680 7022450 7316806 7587875 7814961 8017413
11311H017413J99166J84080J35121O1713j6638r0303j54773k03666k35839k60037
$$ 8017413 8216579 8400659 8535780 8597493 8580855 8490552 8335779 8132113 7896274 7636237
11301G636237k83814l02436l04833k87971k60862k35736k17863k02585j80469
$$ 7636237 7352423 7049987 6745154 6457183 6196321 5960585 5742722 5540137 5359668
11292E359668j47165j10341q5124p8954q0482o7867l2697O123J9864M209j1892
$$ 5359668 5212503 5102162 5017038 4938084 4857602 4789735 4757038 4763161 4783025 4787234 4775342
11281D775342J039L8057O9036P8473Q0036R0070J04933J13990J20146J32928J50290
$$ 4775342 4776381 4814438 4883474 4961947 5041983 5132053 5236986 5350976 5471122 5604050 5754340
11270E754340J62416J68920J78415J93552K09182K23921K40692K55302K56991
$$ 5754340 5916756 6085676 6264091 6457643 6666825 6890746 7131438 7386740 7643731
11261G643731K43610K26358K15272K07077J90489J57162J04910L6612m0130j16013
$$ 7643731 7887341 8113699 8328971 8536048 8726537 8883699 8988609 9025221 8985091 8869078
11251H869078j84943k43550k86995l11545l22357l31853l45749l54249l42637
$$ 8869078 8684135 8440585 8153590 7842045 7519688 7187835 6842086 6487837 6145200
11242F145200l10612k76187k56245k46117k26895j94400j67542j57929j46144
$$ 6145200 5834588 5558401 5302156 5056039 4829144 4634744 4467202 4309273 4163129
11233D163129j10508p0126o6157r7461j12537q2146m3173m0511n7164m4975m733
$$ 4163129 4052621 3982495 3916338 3818877 3706340 3624194 3581021 3540510 3483346 3438371 3433638
11222C433638J4984n497l0284k5734k361J5312K4394L1065L2543L0368L6904N2548
$$ 3433638 3448622 3443125 3412841 3387107 3384746 3400058 3424452 3455517 3488060 3518428 3555332 3607880
11210C607880N9793N3163M9335N4682N2523L8021L1978L9370L1039n084l2815
$$ 3607880 3667673 3720836 3770171 3824853 3877376 3915397 3947375 3986745 4017784 4012700 3979885
11199C979885k6029k1637o3877j24852j41634j15846j08470j37821j53408j26460
$$ 3979885 3953856 3932219 3868342 3743490 3601856 3486010 3377540 3239719 3086311 2959851
11189B959851r8514j07690j24671j07925p8448q4534j18189j23647q1780l5853
$$ 2959851 2861337 2753647 2628976 2521051 2442603 2358069 2239880 2116233 2034453 1998600
11179A998600k7886m9243o6583o6123n6007m5606l8885l6222l1638j8195m290
$$ 1998600 1970714 1921471 1854888 1788765 1732758 1687152 1648267 1612045 1580407 1562212 1557922
11168A557922j1557m3901o9762n4763r912J4086j1068n2684n8060k2526Q603M261
$$ 1557922 1546365 1502464 1432702 1377939 1368027 1382113 1371045 1318361 1260301 1237775 1246378 1250639
11156A250639j6155k2069j7065j9732k2599p313J0680l706m3726n7942k5206Q749
$$ 1250639 1234484 1212415 1195350 1175618 1153019 1145706 1156386 1152680 1108954 1051012 1025806 1034555
11144A034555q19k7725j6467K6267L5121j5266o5027m8457J4655M5218J0028l9390
$$ 1034555 1033736 1006011 989544 1015811 1050932 1035666 970639 922182 936837 982055 992083 952693
11132I52693m1658n654J1596j0128k9856j1830J9408J6555j9086l9289j7810J6445
$$ 952693 911035 905381 916977 906849 876993 865163 884571 901126 882040 842751 824941 841386
11120H41386K3407J810j9359k0303n876O116O47k0620l4818k0556J0104K0559
$$ 841386 864793 866603 847244 826941 821065 827181 827828 807208 772390 751834 761938 782497
11108G82497j873k7590k6691o863P312J0844J1999Q701k822j0680n345k053j6501
$$ 782497 780624 753034 726343 719480 726792 737636 749635 758336 755514 744834 739489 737436 720935
11095G20935k9955j2341K5501L8835J1164k3763l0595j4253j080j853q650j2448
$$ 720935 690980 678639 704140 742975 754139 730376 699781 685528 684448 682595 673945 661497
11083F61497j0439m636J65L158R947J8563J2801j2174k8946j0918K1329K2824
$$ 661497 651058 646422 646587 649745 659692 678255 691056 678882 649936 639018 660347 683171
11071F83171p431k2503m72K2610J2527j1401j4018Q06Q270Q061J3112J4323k621
$$ 683171 675740 653237 652765 675375 687902 676501 662483 663289 671559 679620 692732 707055 704434
11058G04434k0571j3130O808M546j5979j6323J0007K4799J0866N60J4534J9713
$$ 704434 683863 670733 677541 682087 666108 649785 659792 684591 695457 696017 710551 730264
11046G30264j2192m2774j7550M2416O0508J5772k6216j2340K3751K4362q6J888
$$ 730264 718072 675298 657748 700164 760672 776444 750228 737888 761639 786001 785915 787803
11034G87803K8969K8651p485k0345J9960N6874L2984j6454j7707K5750M4827K0126
$$ 787803 816772 845423 837938 817593 837553 894427 927411 910957 893250 919000 963827 983953
11022I83953O998L4614N6122L2229k20R250M3321N2650L7105L3211M4247M1848
$$ 983953 990951 1025565 1081687 1113916 1113696 1122946 1166267 1218917 1256022 1289233 1333480 1375328
11010A375328K5453K3974M1004M9138M0644L6861M3615M3478L8567N3650Q4962
$$ 1375328 1400781 1424755 1465759 1514897 1555541 1592402 1636017 1679495 1718062 1771712 1856674
10999A856674R2639O2325L0915K9289M1147M4698N3434Q0278R7653P6733M0689
$$ 1856674 1949313 2011638 2042553 2071842 2112989 2157687 2211121 2291399 2389052 2465785 2506474
10988B506474L3339N1860N7155M1800L8726N9648P1366M9815K1268K4512N4423
$$ 2506474 2539813 2591673 2648828 2690628 2729354 2789002 2860368 2910183 2931451 2955963 3010386
10977C010386P0174N0675J8629P940K3069L9099L5753K0042J1447J3533J2490
$$ 3010386 3080560 3131235 3149864 3157804 3180873 3219972 3255725 3275767 3287214 3300747 3313237
10966C313237J549q703r029o013q648j2831j1148q652j5663l0973m4268n0739
$$ 3313237 3314786 3306083 3297054 3291041 3282393 3269562 3258414 3249762 3234099 3203126 3158858 3108119
10954C108119n2563n0454m4242l8477l8194m2058m6627n2478n9283o1054n4437
$$ 3108119 3055556 3005102 2960860 2922383 2884189 2842131 2795504 2743026 2683743 2622689 2568252
10943B568252m6265m5618n3580o5404p5218p5231o2110m8556n2822o9815p1622
$$ 2568252 2521987 2476369 2422789 2357385 2282167 2206936 2144826 2096270 2043448 1973633 1902011
10932A902011m7863k4783k8095m7822o0171o2821o3085n2072k3631k367j4636
$$ 1902011 1854148 1829365 1801270 1753448 1693277 1630456 1567371 1515299 1491668 1489301 1474665
10921A474665m2035m4093k1458j2943k9770l9774k6544j7171l0994m2535k4609
$$ 1474665 1432630 1388537 1367079 1354136 1324366 1284592 1258048 1240877 1209883 1167348 1142739
10910A142739M104P350j4642l0484k3342n629K893o842k7305l4808j1685K1685
$$ 1142739 1146843 1154193 1139551 1109067 1085725 1080096 1082989 1076147 1048842 1014034 1002349 1024034
10898A024034K1414j7797m5053k2970J5648J7625j0116j8025K816J0347j3628
$$ 1024034 1045448 1027651 982598 959628 975276 992901 982785 964760 967576 977923 964295
10887I64295l2679j7564P026O139r833q215R977J4637k567j7741j6043j1646j6258
$$ 964295 931616 914052 921078 927217 917384 909169 919146 933783 931216 913475 897432 885786 869528
10874H69528j4298J0091L7740L3691o97k2850p369J5141K033l4051l7719P957
$$ 869528 855230 865321 903061 936752 936055 913205 905836 920977 923010 888959 851240 859197
10862H59197N0552L7637j2600l9910k2726M905J0946L311K776Q136N916l198o493
$$ 859197 909749 947386 934786 894876 872150 877055 888001 891312 894088 902224 908140 904942 898449
10849H98449M4P817R847Q158O537L564l378j0162p824M893J5993J4451O055L923
$$ 898449 898493 906310 916157 924315 930852 934416 931038 920876 913052 917945 933938 948389 954444 958367
10835I58367O296Q36q750l662J4950J8697l484k0002j912K9157L2048Q657l960
$$ 958367 964663 965499 956749 953087 968037 986734 983250 963248 961336 990493 1022541 1031198 1027238
10822A027238N136J0601J996M10J3462J5240q566k9368j5515J9964L7361K1869
$$ 1027238 1032374 1042975 1044971 1045381 1058843 1074083 1065517 1036149 1020634 1040598 1077959 1099828
10810A099828m154j2265L133K1791J8291p022k1998l507K4583K2389m204j2626
$$ 1099828 1095674 1083409 1086542 1108333 1126624 1119602 1097604 1094097 1118680 1141069 1136865 1124239
10798A124239N715J3231l984q945J7855L7181J7461p023N343K9379J7458j5370
$$ 1124239 1129954 1143185 1139201 1130256 1148111 1185292 1202753 1195730 1201073 1230452 1247910 1232540
10786A232540j7834Q245J6333J322L459K6483K6555m606j7506J0152L2366J2373
$$ 1232540 1214706 1222951 1239284 1240606 1244065 1270548 1297103 1292497 1274991 1285143 1317509 1329882
10774A329882j6936j1007J6617K7171J9769J6175J4324K317o198O321K4202K2406
$$ 1329882 1312946 1301939 1318556 1345727 1365496 1381671 1395995 1398312 1392114 1398435 1422637 1445043
10762A445043Q888O043R258K295n066M463J7279J2008M112J9835M0263K6039r662
$$ 1445043 1453931 1459974 1469232 1471527 1466461 1470924 1488203 1500211 1504323 1524158 1564421 1590460 1580798
10749A580798j2987K2813M3177K0067o344N15J6869J1262M441K6666N1808L2667
$$ 1580798 1567811 1590624 1633801 1653868 1647524 1648039 1664908 1676170 1680611 1707277 1759085 1791752
10737A791752j6122k9927J1268N2672M3539M558q571J7773M4456L7013P790n440
$$ 1791752 1775630 1745703 1756971 1809643 1853182 1857740 1849169 1866942 1911398 1948411 1956201 1950761
10725A950761J1071L2162K8732O156m035J2312L3200L1619J1096k448M625K1528
$$ 1950761 1961832 1993994 2022726 2028882 2024847 2037159 2070359 2101978 2113074 2110626 2115251 2136779
10713B136779L1600K9575K0624J2261R108J0151J1303J2682J8328K5504K3335
$$ 2136779 2168379 2197954 2218578 2230839 2239947 2250098 2261401 2274083 2292411 2317915 2341250
10702B341250R581m91O620K1905K6068J7622J3128K0447K7847K3843J4994J5971
$$ 2341250 2350831 2350340 2356960 2378865 2404933 2422555 2435683 2456130 2483977 2507820 2522814 2538785
10690B538785K8262L6077K4192p97j0596J4345N3473O1254K4477j2800k697M1133
$$ 2538785 2567047 2603124 2627316 2626519 2615923 2630268 2683741 2744995 2769472 2756672 2753975 2795108
10678B795108O1769L7800P661Q070K5456K9930K5983L6267N4210N1041K4686O296
$$ 2795108 2856877 2894677 2902338 2910408 2935864 2965794 2991777 3028044 3082254 3133295 3157981 3164277
10666C164277J3641K8196K9049K4520L3734N3910O4124N3541L2555J9979K7192
$$ 3164277 3177918 3206114 3235163 3259683 3293417 3347327 3411451 3464992 3497547 3517526 3544718
10655C544718M9344O6365O0210L7079K3606L4265N3191N7736M8783M4312N1783
$$ 3544718 3594062 3660427 3720637 3757716 3781322 3815587 3868778 3926514 3975297 4019609 4071392
10644D071392O2547O7927O5458N4218M0157M0801O4445Q7855P9324M6355L2905
$$ 4071392 4133939 4201866 4267324 4321542 4361699 4402500 4466945 4554800 4634124 4680479 4713384
10633D713384N8945R0058Q6412N8906M9263O8404Q5942P8156N8048N1845O6430
$$ 4713384 4772329 4862387 4948799 5007705 5056968 5125372 5211314 5289470 5347518 5399363 5465793
10622E465793Q8199J00442R5752Q1339P4373Q3104R5071R5482R0681R4958J01047
$$ 5465793 5553992 5654434 5750186 5831525 5905898 5989002 6084073 6179555 6270236 6365194 6466241
10611F466241R0932P4532Q3392J17134J32845J08016Q0086R2505J29108J41420
$$ 6466241 6557173 6631705 6715097 6832231 6965076 7073092 7153178 7245683 7374791 7516211
10601G516211J22801J10762J22518J34131J28452J21808J29733J41448J45264
$$ 7516211 7639012 7749774 7872292 8006423 8134875 8256683 8386416 8527864 8673128
10592H673128J49413J59640J63511J56428J57188J76439J94723J95460J93896
$$ 8673128 8822541 8982181 9145692 9302120 9459308 9635747 9830470 10025930 10219826
10583A0219826K04795K08386J86562J70027K00280K56743K77118K51677K39318
$$ 10219826 10424621 10633007 10819569 10989596 11189876 11446619 11723737 11975414 12214732
10574A2214732K73443L08955K97307K66873K79152L34235L74367L70393L53770
$$ 12214732 12488175 12797130 13094437 13361310 13640462 13974697 14349064 14719457 15073227
10565A5073227L60545L87406M13995M33731M48569M60475M80218N19168N61896
$$ 15073227 15433772 15821178 16235173 16668904 17117473 17577948 18058166 18577334 19139230
10556A9139230N75355N60134N62406O11970O75480P01739O93407O98517P42790
$$ 19139230 19714585 20274719 20837125 21449095 22124575 22826314 23519721 24218238 24961028
10547B4961028Q06416Q63121R06427R36156R53611R76378J025849J091445J139126
$$ 24961028 25767444 26630565 27536992 28473148 29426759 30403137 31428986 32520431 33659557
10538C3659557J165716J208623J284256J355966J393558J429222J510541J621992
$$ 33659557 34825273 36033896 37318152 38674118 40067676 41496898 43007439 44629431
10530D4629431J705328J748883J802878J900354K013134K104674K184885K285619
$$ 44629431 46334759 48083642 49886520 51786874 53800008 55904682 58089567 60375186
10522F0375186K411633K543748K670230K791978K914556L053772L227125L419363
$$ 60375186 62786819 65330567 68000797 70792775 73707331 76761103 79988228 83407591
10514H3407591L583561L705596L840374M043322M286151M490993M638899M787557
$$ 83407591 86991152 90696748 94537122 98580444 102866595 107357588 111996487 116784044
10506A16784044M976146N173514N346884N528144N766002O045691O306708O523938
$$ 116784044 121760190 126933704 132280588 137808732 143574734 149620425 155927133 162451071
10498A62451071O722250O914231P069895P158552P185839P176800P154058P150448
$$ 162451071 169173321 176087552 183157447 190315999 197501838 204678638 211832696 218983144
10490B18983144P212906P361306P554424P725286P849315P953279Q050401Q087974
$$ 218983144 226196050 233557356 241111780 248837066 256686381 264639660 272690061 280778035
10482B80778035P980178P693745P290724O881966O543803O286301O094619N975701
$$ 280778035 288758213 296451958 303742682 310624648 317168451 323454752 329549371 335525072
10474C35525072N943685N969460N974676N885724N672473N320779M795065M068872
$$ 335525072 341468757 347438217 353412893 359298617 364971090 370291869 375086934 379155806
10466C79155806L194143K306357J541772R59763N46631K64130P1259q0731k42160
$$ 379155806 382349949 384656306 386198078 387157841 387704472 387968602 388039861 387959130 387716970
10457C87716970m56922p79275j280638j997536k868097l756129m549825n208394
$$ 387716970 387260048 386480773 385200135 383202599 380334502 376578373 372028548 366820154
10449C66820154n712158o026797o155929o183199o203191o233369o252697o307182
$$ 366820154 361107996 355081199 348925270 342742071 336538880 330305511 324052814 317745632
10441C17745632o497440o850327p275826p677588q035798q339181q510475q482070
$$ 317745632 311248192 304397865 297122039 289444451 281408653 273069472 264558997 256076927
10433B56076927q308087q114808p950259p762448p528043p316960p197951p147971
$$ 256076927 247768840 239654032 231703773 223941325 216413282 209096322 201898371 194750400
10425A94750400p100303p033157o960656o871359o730309o527383o280554o001179
$$ 194750400 187650097 180616940 173656284 166784925 160054616 153527233 147246679 141245500
10417A41245500n692655n373851n066713m765666m453283m141989l864584l624073
$$ 141245500 135552845 130178994 125112281 120346615 115893332 111751343 107886759 104262686
10409A04262686l390047l150602k931611k752211k594478k436530k288390k171480
$$ 104262686 100872639 97722037 94790426 92038215 89443737 87007207 84718817 82547337
10401H2547337k081904j998487j914332j837238j767052j694670j620492j554666
$$ 82547337 80465433 78466946 76552614 74715376 72948324 71253654 69633162 68078496
10393F8078496j498378j440800j377055j316477j268707j230895j193653j154082
$$ 68078496 66580118 65139318 63762263 62445786 61177079 59946184 58752531 57598449
10385E7598449j118541j094163j078663j058433j020132r67186r20701q97871
$$ 57598449 56479908 55385745 54307082 53248649 52228517 51261331 50340630 49442759
10377D9442759q91412q77252q42541p98787p64552p42521p21659o98784o84951
$$ 49442759 48551347 47674095 46831554 46032767 45268215 44525694 43804035 43105251 42420300
10368D2420300o84053o76724o42611n95637n74043n86393n90471n47811m82688
$$ 42420300 41736247 41059523 40416912 39821275 39247232 38660839 38070368 37522557 37039869
10359C7039869m54824m77952n01261m80456m33834m07998m14355m26267m21439
$$ 37039869 36585045 36107093 35605832 35125376 34691542 34283544 33869189 33442922 33021483
10350C3021483l97817l58662l13157k88082l06514l48914l63267l26229k73042
$$ 33021483 32623666 32265004 31951847 31663765 31357251 31008337 30645070 30318841 30045799
10341C0045799k52204k67791k84144k75782k52209k36372k36106k41281k38844
$$ 30045799 29793595 29525804 29241660 28965878 28713669 28477297 28241191 27999910 27761066
10332B7761066k24977k06471j94039j93553k02337k12421k15524k06537j87769
$$ 27761066 27536089 27329618 27135579 26942026 26739689 26527268 26311744 26105207 25917438
10323B5917438j71729j73428j93217k09543j97938j61793j37256j55957k02214
$$ 25917438 25745709 25572281 25379064 25169521 24971583 24809790 24672534 24516577 24314363
10314B4314363k22547j89135j40814j38366j84052k16946j96788j58095j55246
$$ 24314363 24091816 23902681 23761867 23623501 23439449 23222503 23025715 22867620 22712374
10305B2712374j82787j91895j71311j61657j85039k09163k01954j81359j80073
$$ 22712374 22529587 22337692 22166381 22004724 21819685 21610522 21408568 21227209 21047136
10296B1047136j91352j87303j71500j72739j94338k08028j99460j85804j81946
$$ 21047136 20855784 20668481 20496981 20324242 20129904 19921876 19722416 19536612 19354666
10287A9354666j80213j74956j79083j98637k13171k03179j82196j78496j92747
$$ 19354666 19174453 18999497 18820414 18621777 18408606 18205427 18023231 17844735 17651988
10278A7651988j97704j80402j62636j69746j93920k04678j91145j75956j80672
$$ 17651988 17454284 17273882 17111246 16941500 16747580 16542902 16351757 16175801 15995129
10269A5995129j93046j86447j64321j59085j81186j97504j79996j51542j51911
$$ 15995129 15802083 15615636 15451315 15292230 15111044 14913540 14733544 14582002 14430091
10260A4430091j73981j75308j49830j41227j71945k03324j93384j57834j38312
$$ 14430091 14256110 14080802 13930972 13789745 13617800 13414476 13221092 13063258 12924946
10251A2924946j38959j36609j32291j43458j57211j45534j25326j43718j91661
$$ 12924946 12785987 12649378 12517087 12373629 12216418 12070884 11945558 11801840 11610179
10242A1610179j95872j29178o9675r6147j68885j83988j22758p0001q4016j25533
$$ 11610179 11414307 11285129 11215454 11119307 10950422 10766434 10643676 10573675 10489659 10364126
10232A0364126j38496j31651j36625j39715j13309q0661q7173j23132j34835j08806
$$ 10364126 10225630 10093979 9957354 9817639 9704330 9623669 9536496 9413364 9278529 9169723
10222I169723q7704r5813j04487r0654p8744r3352j11540j01709p9822q3004j05633
$$ 9169723 9082019 8986206 8881719 8791065 8712321 8618969 8507429 8405720 8325898 8242894 8137261
10211H137261j07430p9058n6772o7175r3290j05970j00168q7149p4198o6608p1647
$$ 8137261 8029831 7950773 7894001 7826826 7733536 7627566 7527398 7440249 7366051 7299443 7227796
10200G227796q5500q9469p2919n0763m6516o4169q5584r1168p7742o0002n6020
$$ 7227796 7142296 7052827 6979908 6929145 6882629 6818460 6732876 6641708 6563966 6503964 6447944
10189F447944o6693p2903o1792m8869n6780p7297p9694n8852m5600n8293p3609
$$ 6447944 6381251 6308348 6246556 6197687 6140907 6063610 5983916 5925064 5879464 5821171 5747562
10178E747562o5413m6775m5700n8540o0049m8240m4996n5716o1824n5839n1838
$$ 5747562 5682149 5635374 5589674 5531134 5471085 5422845 5377849 5322133 5260309 5204470 5152632
10167E152632n3717m5003k5144k5375o2494r8713q2247k1393J6998q379n9631
$$ 5152632 5098915 5053912 5028768 5003393 4940899 4842186 4759939 4738546 4755544 4747165 4687534
10156D687534p1187l6566j2246l5865p4108p1797k9703q25j6116m9363o2745n4199
$$ 4687534 4616347 4579781 4567535 4531670 4457562 4385765 4356062 4355237 4339121 4289758 4227013 4172814
10144D172814m2206l1779k0724j8529l0572l9391l0627k2831l8431n8406m6836
$$ 4172814 4130608 4098829 4078105 4059576 4029004 3989613 3958986 3936155 3897724 3839318 3792482
10133C792482j3829o897l5764n4366l2798j262J468j7803l3330m3753n4010m7877
$$ 3792482 3778653 3771756 3735992 3681626 3648828 3647566 3649034 3631231 3597901 3554148 3500138 3452261
10121C452261j9408l020k6085n5093m0709P92R389k3426m4720l0215j8574l5389
$$ 3452261 3432853 3429833 3403748 3348655 3307946 3308738 3318127 3294701 3249981 3219766 3201192 3165803
10109C165803m6016k0688O807n914l6473l4885p430l526l0325m0871j3113J2970
$$ 3165803 3119787 3099099 3105906 3099992 3063519 3028634 3021204 3017678 2987353 2946482 2933369 2946339
10097B946339k951m2709n8388l4691O24J3486o054l8651n0844k7601N095P272
$$ 2946339 2943388 2900679 2842291 2807600 2808224 2821710 2815656 2777005 2726161 2698560 2703655 2710927
10085B710927k1423l9321k2766Q47j309j8281k0805j2039j5560k7980k5485j1555
$$ 2710927 2689504 2650183 2627417 2628264 2626955 2608674 2587869 2575830 2560270 2532290 2506805 2495250
10073B495250j4083l1856k9122K908K2466m98l5814l9171j6824o190j3937j6332
$$ 2495250 2481167 2449311 2420189 2423097 2445563 2445065 2409251 2370080 2353256 2347066 2333129 2316797
10061B316797q966j1087k2726k1020n002k764k1374k8717n840J6985M657k8501
$$ 2316797 2307831 2296744 2274018 2252998 2247996 2245232 2223858 2195141 2189301 2206286 2210943 2182442
10049B182442m0926k3101k228K505j888n906j0718j4721j0564j708k924j6892
$$ 2182442 2141516 2118415 2116187 2118692 2116804 2110898 2100180 2085459 2074895 2073187 2070263 2053371
10037B053371k5862j5704K845O932r586k8062k6185l816J5854J3446l547j3942
$$ 2053371 2027509 2011805 2014650 2021582 2011996 1983934 1957749 1953933 1969787 1983233 1979686 1965744
10025A965744j3969j6972k2441j1890J3631K1216n792l2873k0066J6222K6395
$$ 1965744 1951775 1934803 1912362 1900472 1914103 1935319 1929527 1896654 1876588 1892810 1919205
10014A919205J974j7125q421N352L952J996J4191K4269J4220j995K20J9911L6667
$$ 1919205 1921179 1904054 1895633 1900985 1904937 1906933 1921124 1945393 1959613 1957618 1957838 1977749 2014416
10001B014416L6727J7868j1755k6306n54M6881O0138K2033j0506J5110O4217O2969
$$ 2014416 2051143 2069011 2057256 2030950 2030396 2077277 2137415 2159448 2148942 2164052 2228269 2291238
9989B291238J0947j6871J7598O3120O0868K7284J8341M4678O6169N8263M3272
$$ 2291238 2302185 2285314 2302912 2366032 2426900 2454184 2472525 2517203 2583372 2641635 2684907
9978B684907M9749O8699O7889L9967J6945K9120O1563P1281M7074K6052L7906
$$ 2684907 2734656 2803355 2871244 2911211 2928156 2957276 3018839 3090120 3137194 3163246 3201152
9967C201152O0196N5395L0232K1514L6309M8371M8684N3739O0871M4576J0055
$$ 3201152 3261348 3316743 3346975 3368489 3404798 3453169 3501853 3555592 3616463 3661039 3671094
9956C671094P53K9422M9379K7179j130R323L4461K1472j8778k5803J0882L3037
$$ 3671094 3671847 3701269 3750648 3777827 3776697 3786020 3820481 3841953 3823175 3797372 3808254 3841291
9944C841291O390k8327k4490r47n397l9127o1740n5034m1428m1434m6955m3987
$$ 3841291 3847681 3819354 3794864 3793917 3788520 3749393 3687653 3632619 3591191 3549757 3502802 3458815
9932C458815l6803l7205m4668m9906n1047n5729o8237q1182q2283o8484n2138
$$ 3458815 3422012 3384807 3340139 3290233 3239186 3183457 3115220 3034038 2951755 2883271 2831133
9921B831133n0399o5809p9641p0845m3415k7476m5272q0350r3332p0599m2435
$$ 2831133 2780734 2714925 2635284 2564439 2521024 2493548 2448276 2367926 2274594 2203995 2161560
9910B161560m2687o3865p0773n1217k9589k9183m4317n6608n7731m6884k7011
$$ 2161560 2118873 2055008 1984235 1933018 1903429 1874246 1829929 1773321 1715590 1668706 1641695
9899A641695j4633k9694n9919o1827k1333J3622l664m4951m4370P54K2909j2974
$$ 1641695 1627062 1597368 1537449 1475622 1454289 1467911 1464247 1419296 1374926 1375680 1398589 1385615
9887A385615n6009m6976m352J0041j6536l8225k4679M54K758j5140k6036j8463
$$ 1385615 1329606 1282630 1278278 1288319 1271783 1233558 1208879 1209333 1212091 1196951 1170915 1152452
9875A152452o182m979j4194k1960k1203j5825j2026r289n079l698r929j5761q400
$$ 1152452 1146270 1141291 1127097 1105137 1083934 1068109 1056083 1046794 1041715 1038017 1028088 1012327 1003927
9862A003927N991M533j7535l2805j9022M988M485j8342k5519m14K4226J1285k6745
$$ 1003927 1009918 1014451 996916 964111 945089 950077 954562 936220 910701 910287 934513 945798 919053
9849I19053m2825j9031R989O062j9498k3568M777K6227Q017k6248k9384P32J9350
$$ 919053 876228 857197 867186 873248 853750 830182 834959 861186 869203 842955 813571 814303 833653
9836H33653J355k5891k8155j0877R62L273N518K687j3123k5235j0779J7901K3968
$$ 833653 835008 809117 780962 770085 771047 774320 779838 782525 769402 744167 733388 751289 775257
9823G75257o2k1626j8053n737o098j1365n066N626L199p957q238M111J0209J266
$$ 775257 775195 753569 735516 729779 723681 712316 707250 712876 716075 708118 699880 703991 714200 715466
9809G15466q395m888M577M579n117j1146p780m106p633j1882q462l011n451r163
$$ 715466 707071 702183 706760 711339 706222 695076 687296 683190 675557 663675 655213 652202 646751 637588
9795F37588J048J8652J6216j2619l5163k3227N532J6234R244R505J5184P42k8719
$$ 637588 638636 657288 673504 660885 625722 602495 608027 624261 633505 643010 658194 658936 630217
9782F30217l3352k437K1963Q821j4500j0941N487m79k0749j7991Q387J9736N81
$$ 630217 596865 594428 616391 625212 610712 599771 605258 604779 584030 566039 574426 594162 594743
9769E94743k1192k2128j0602K272J9461L2109J6344k2742m0201j2665K0761J3854
$$ 594743 573551 551423 540821 543093 562554 594663 611007 588265 548064 535399 556160 570014
9757E70014j6528j8820J0779K4026j184k7398j8422P271J1458m646j0506M24L982
$$ 570014 553486 534666 545445 569471 568287 540889 522467 529738 541196 536550 526044 526468 530450
9744E30450j0262k0645q525J2416J6293o76j9903k4731j3037O610J9979J4951
$$ 530450 520188 499543 491018 503434 519727 519051 499148 474417 461380 467990 487969 502920
9732E02920m546j7874j1325M400J1403R631Q512M013j1863k4885j2804J2592J3120
$$ 502920 498374 480500 469175 473575 484978 494609 503121 507134 495271 470386 457582 470174 483294
9719D83294j4921k5816N466L5089J2608l5264l6842J6637N2632J9885m0648n6184
$$ 483294 468373 442557 448023 483112 495720 460456 423614 440251 492883 512768 472120 415936
9707D15936j7427K3053K7124P915m361j608L933J979m633n808J447N980k973j4932
$$ 415936 398509 421562 448686 456601 452240 450632 454565 456544 451911 446103 447550 453530 450557 435625
9693D35625p605J7451K8338N890k4951k7316k697J5235R320l943m930M614J1156
$$ 435625 428020 445471 473809 479699 454748 427432 424735 439970 449290 445347 440417 445031 456187
9680D56187O726n636j1406N632L7420M5384O282m3022m2516P251M0135J7242j9397
$$ 456187 462913 457277 445871 451503 488923 534307 540589 497567 455051 462302 502437 519679 500282
9667E00282j6271Q553R67l5047m0428J558L1873L873m3564m2177N952L4509J0266
$$ 500282 484011 492564 493531 458484 418056 419614 451487 455360 411796 369619 375571 410080 420346
9654D20346k5410k4954k650k893k5456k5575J2578M4169K5953j9239l3834p428
$$ 420346 394936 369982 367332 364439 338983 313408 325986 370155 396108 376869 343035 335607
9642C35607J2667m209k7923j8913R113J3111j0629k2916m443J7489J5269M6m603
$$ 335607 348274 344065 316142 297229 306342 319453 308824 285908 281465 298954 314223 314269 309666
9629C09666j684q221k0567j9255j397J4847J6233P156j993m479J980J0395N442
$$ 309666 307982 299761 279194 259939 258542 273389 289622 296778 294785 290306 292286 302681 308123
9616C08123j5494k9119j4442J1662J3412r702j9087L567K5244J0965k1858k8460
$$ 308123 292629 263510 249068 260730 274142 264440 245353 248920 274164 285129 263271 234811
9604B34811j194K3583J8998k325j5806j6122j0664k311P041R560K557k434M672
$$ 234811 233617 257200 276198 273873 258067 241945 231281 228970 236011 245571 248128 245694 250366
9591B50366J4363R620p088j5295o950J480l736r749J710J8927J2056j7696l0158
$$ 250366 264729 274349 267261 251966 245016 246496 242760 233011 234721 253648 265704 248008 217850
9578B17850l285K8340K0524j3806k3414L528K5055J3998n349p371p005k0669k5274
$$ 217850 214565 242905 263429 249623 226209 229737 254792 268790 263441 256070 249065 228396 203122
9565B03122J071K8797J7895j2646j3043J2327J1707k1687l1878O524M0881K1973
$$ 203122 204193 232990 250885 238239 225196 237523 249230 227543 195665 202189 243070 265043
9553B65043j9440k4016O250K0942J746j9722j6186M139J9057J5263p001k9163
$$ 265043 245603 221587 227837 248779 250525 230803 214617 218756 237813 253076 246075 216912
9541B16912k3340J1126L4155J4763k1321k6404N62J8119O867j0825j4556r868
$$ 216912 193572 204698 238853 253616 232295 205891 206453 224572 231439 220614 206058 196190
9529A96190l943O916J7897J5079J495m263P9j110q880p651J425N87o687K449K2252
$$ 196190 192247 199163 217060 232139 233634 229371 229450 228340 219460 211809 213234 213821 207134 209583 231835
9514B31835J6523j9235l8937j4137K0555K2015J481m695L531L79j4154j5564J578
$$ 231835 248358 229123 190186 176049 196604 218619 220100 215405 218936 219315 205161 189597 191175
9501A91175J6143J2785k664j4969j1222P570J7565k365k8519j4277L0448L5029
$$ 191175 207318 220103 217439 202470 191248 198818 216383 214018 185499 171222 201670 236699
9489B36699k3126o5901k7646L5827L2341j7134j6851L7864N1370o224m3966l037
$$ 236699 213573 147672 120026 155853 188194 171060 154209 192073 243443 237219 193253 190216
9477A90216M4563J9090l5355l0624J9811L3810j84j7333N132J8846k16j1973R497
$$ 190216 234779 253869 218514 187890 207701 241511 241327 223994 229126 247972 247756 235783 245280
9464B45280K8290J0274k0036k3515o534J015k111L161J4529J1869m772j1998N42
$$ 245280 273570 283844 263808 240293 233759 234774 232663 235824 250353 262222 257450 245452 245994
9451B45994J4283R443o629r585Q997K9056K5673m73k4223k6173j1236M787J3191
$$ 245994 260277 269720 263091 253506 262503 291559 317232 316759 292536 266363 255127 259914 273105
9438B73105R967q484l2705l6322n059L6596M7539J7729k2223l7779k2257O339
$$ 273105 283072 274588 241883 205561 200502 237098 284637 302366 280143 242364 220107 226446
9426B26446K5296K3517R262J069M284M899m527q202O398K1385J3339o982j0482
$$ 226446 251742 275259 284521 285590 289874 294773 290246 282044 288442 309827 323166 316184 305702
9413C05702K493M844q795j3404J547J4635J0763L523N052M810m240p120N557J6674
$$ 305702 308195 313039 304244 290840 292387 307022 317785 321308 326360 331170 326930 319810 325367 342041
9399C42041R923m481j0728j1420j1356k064J5239J6632p484k6026r318K2498K7361
$$ 342041 351964 347483 336755 325335 313979 311915 327154 343786 336302 310276 300958 323456 350817
9386C50817K003k0570k2437j4023m871L438J639j5020k4886o270K0322J6571j0798
$$ 350817 352820 332250 309813 295790 290919 294357 295996 280976 256090 249820 270142 286713 275915
9373B75915j7409N873J7828k378k0053n330J6671J0154j2960j7431j295J0626
$$ 275915 258506 264379 282207 279829 259776 254446 271117 281271 268311 250880 249585 260211
9361B60211J0588Q178J514j5314k6711j3505J0176J2838n236j3426q20J0595P384
$$ 260211 270799 278977 280491 265177 238466 224961 235137 247975 242739 229313 228493 239088 246472
9348B46472M345J1441J2697m007k0869j4783P890K0384R598j3122k7490k0503
$$ 246472 250817 262258 274955 270948 250079 235296 243186 263570 273168 260046 232556 212053
9336B12053L960K3308J4514j6822l6765k2372R892K5973J4263p812j8118q557
$$ 212053 216013 239321 253835 237013 200248 177876 187768 213741 228004 220192 202074 193517
9324A93517J2260K3608Q943k0803l1641r407J5334P330j9745k0798J2282L5823
$$ 193517 205777 229385 238328 217525 185884 176477 191811 199141 179396 158598 170880 206703
9312B06703J8632j3178j8312m49N800o855j1490L691J5488N776q473m487Q886
$$ 206703 225335 212157 193845 193396 199196 192341 180851 184542 200030 205806 197333 192846 201732
9299B01732P603o978j1596q88M410n972j3360k192J0924K031j9480k1395L432
$$ 201732 209335 202357 190761 189873 194283 188311 174951 172759 183683 185714 166234 144839 148271
9286A48271K5899K2511M625n549p204j1362j4603n237J2119K0445J5895Q796J469
$$ 148271 174170 196681 201306 195757 188553 177191 162588 157351 169470 189915 205810 214606 216075
9273B16075j1747k2328j3068P743P861j8136l0055J86L8485L3007p968k6930k367
$$ 216075 204328 182000 168932 176675 184536 166400 136345 136531 175016 208023 200055 173125 170758
9260A70758K3535J3292j3252j8830o133j305l733P993K9349K8666k329k8811j8233
$$ 170758 194293 207585 194333 175503 169370 168065 164332 172325 201674 230340 228011 199200 180967
9247A80967J5331K9945R173j9656k0971N673K5293J0531k3458l7135j5807J5565
$$ 180967 196298 226243 235416 215760 194789 200462 225755 236286 212828 175693 159886 175451
9235A75451K8967K3921J1668p418k9656l1724N19L8361L9600P679j3644n692L677
$$ 175451 204418 228339 240007 232589 202933 171209 171728 210089 249689 257368 243724 238032 241709
9222B41709o696j6848n694R590M788o847K880K5917K6412m260l3388l0632j286
$$ 241709 235013 218165 212471 222061 226849 220002 222882 248799 275211 270951 237563 206931 205645
9209B05645K7941L6815K2094l568k0405k0468j5225j3945n758J7687L4467J7529
$$ 205645 233586 270401 292495 288927 268522 248054 232829 218884 213126 230813 265280 282809
9197B82809j7422k4968M241K7283J3172j1459o638J8172K0190j0847l7849k7632
$$ 282809 265387 240419 244660 271943 285115 273656 267018 285190 305380 294533 256684 229052
9185B29052J0131M0998M3272K0176j0294k8067k2312N29K1304K4413J0574m742
$$ 229052 239183 280181 323453 343629 333335 305268 282956 283485 304789 329202 339776 335034
9173C35034n213R464J9600O225k1624l2065j0667J7723K1543M836l735L648O932
$$ 335034 329821 339285 358885 365110 343486 311421 300754 318477 340020 344856 341121 344769 351701
9160C51701k399n437Q253J6998J906j6463p315J7638J7947j0709k5692l330K3045
$$ 351701 349302 343865 352118 369116 371022 354559 347244 364882 382829 372120 346428 343098 366143
9147C66143J6299o181m685J5731J7404j468l722J7530K2122n111j9736R134L9028
$$ 366143 382442 376261 371576 387307 404711 403243 399521 417051 439173 434062 414326 423460 462488
9134D62488J8306k6706l1063N440K4337R185L868K1885J7164k4653m1479P384
$$ 462488 480794 454088 423025 428465 452802 461987 465855 487740 504904 480251 438772 446156
9122D46156O1658M5429j4266l1419N312K7558P536l924K4233M6446J9785k2404
$$ 446156 507814 553243 538977 507558 512870 540428 547964 544040 568273 614719 634504 612100
9110F12100k5740L64P603q594p766K2595M3929K5487j0937k2899k123K1668K3005
$$ 612100 586360 586724 594327 585733 577967 600562 644491 669978 659041 636142 634019 655687 678692
9097F78692R977P375J9710K4496O986j2928o041K1928L6079K2524N357N628J1733
$$ 678692 688669 696044 715754 740250 747236 734308 728267 750195 786274 808798 814155 819783 831516
9084H31516P247L007J6699L7260L6862J1492j2933j2662J1246L8943M8854L4454
$$ 831516 838763 841770 858469 895729 932591 944083 931150 918488 929734 968677 1017531 1051985
9072A051985J2953Q289J9669K3574J4333J6185L8053M7673K1699o568P371M5667
$$ 1051985 1064938 1073227 1092896 1116470 1130803 1146988 1185041 1232714 1254413 1247845 1255216 1300883
9060A300883N1783J9598K152K5471N0198L9664J6085J7589L8993N1970N3802N7553
$$ 1300883 1352666 1372264 1374416 1399887 1450085 1489749 1505834 1523423 1562416 1614386 1668188 1725741
9048A725741N6484L8581K1747L3790O3447O9865M2840J9496L2232O7367Q8382
$$ 1725741 1782225 1820806 1842553 1876343 1939790 2009655 2052495 2071991 2104223 2171590 2259972
9037B259972Q0930O1069N0668N6883P1069Q0556Q1992Q3491R2042J02724J05278
$$ 2259972 2340902 2401971 2452639 2509522 2580591 2661147 2743139 2826630 2918672 3021396 3126674
9026C126674R7799Q8915Q9500J04539J27319J40580J33294J17850J16910J31632
$$ 3126674 3224473 3313388 3402888 3507427 3634746 3775326 3908620 4026470 4143380 4275012
9016D275012J42355J44674J57337J82425J90664J70302J58132J86031K24807K27486
$$ 4275012 4417367 4562041 4719378 4901803 5092467 5262769 5420901 5606932 5831739 6059225
9006F059225K06977K14322K50803K66571K50502K52644K95780L30809L18441K97932
$$ 6059225 6266202 6480524 6731327 6997898 7248400 7501044 7796824 8127633 8446074 8744006
8996H744006L22526L71162L85290L64379L60705L93383M28939M44169M51599M58943
$$ 8744006 9066532 9437694 9822984 10187363 10548068 10941451 11370390 11814559 12266158 12725101
8986A2725101M56536M54036M78197N19675N31626N01328M74543M81537M87045
$$ 12725101 13181637 13635673 14113870 14633545 15165171 15666499 16141042 16622579 17109624
8977A7109624M52255M02860L83759L78370L34660K55563J97006J73705J33296
$$ 17109624 17561879 17964739 18348498 18726868 19061528 19317091 19514097 19687802 19821098
8968A9821098M7152l1701m3945j6259k4253q2162j25865j08250o0822l9914n0057
$$ 19821098 19868250 19836549 19792604 19776345 19752092 19669930 19544065 19435815 19374993 19335079 19285022
8957A9285022n3004k9477N910M2843Q9210J39939J66248J57237J49827J89853
$$ 19285022 19232018 19202541 19208451 19251294 19340504 19480443 19646691 19803928 19953755 20143608
8947B0143608K72363L46256L77194L82688M00009M39933M83903N13680N30524
$$ 20143608 20415971 20762227 21139421 21522109 21922118 22362051 22845954 23359634 23890158
8938B3890158N50071N86401O37952O85774P11818P21558P39808P79494Q23314
$$ 23890158 24440229 25026630 25664582 26350356 27062174 27783732 28523540 29303034 30126348
8929C0126348Q42597Q26874P88657P45949P05729O58454N85299M77929L50873
$$ 30126348 30968945 31795819 32584476 33330425 34036154 34694608 35279907 35757836 36108709
8920C6108709K21254P7993j03755l10026m82523n89597o73469p88280r12130r73046
$$ 36108709 36329963 36407956 36304201 35994175 35511652 34922055 34248586 33460306 32548176 31575130
8910C1575130r58097r36959r57734r74412r19190q08712p23772o98277o83637
$$ 31575130 30617033 29680074 28722340 27747928 26828738 26020026 25296254 24597977 23914340
8901B3914340o29249n50245m91798m59722m21249l61951l07293k80833k65917
$$ 23914340 23285091 22734846 22243048 21783326 21362077 21000126 20692833 20412000 20146083
8892B0146083k28830j70538j29626j25865j24425q1728j4215J6595o585k3968
$$ 20146083 19917253 19746715 19617089 19491224 19366799 19285071 19270856 19287451 19280866 19256898
8882A9256898J8330Q6907J06458O7816L7424N8355R5646R9331P4473N4387L9582
$$ 19256898 19275228 19362135 19468593 19536409 19573833 19632188 19727834 19827165 19901638 19956025 19995607
8871A9995607P403l7604o9220q9031j26959j89715k48969k90480l35987l97930
$$ 19995607 20003010 19965406 19896186 19807155 19680196 19490481 19241512 18951032 18615045 18217115
8861A8217115m48549m62989m64583m90388n30345n43096n24835n15682n30389
$$ 18217115 17768566 17305577 16840994 16350606 15820261 15277165 14752330 14236648 13706259
8852A3706259n28900m80212m18607l99335m20189m28251l95815l48603l16828
$$ 13706259 13177359 12697147 12278540 11879205 11459016 11030765 10634950 10286347 9969519
8843I969519k98346k83086k77528k82148k73553k38599k05389k07119k28376k23414
$$ 9969519 9671173 9388087 9110559 8828411 8554858 8316259 8110870 7903751 7675375 7451961
8833G451961j83339j48418j49094j68642j75947j65900j50932j36698j25020j21732
$$ 7451961 7268622 7120204 6971110 6802468 6626521 6460621 6309689 6172991 6047971 5926239
8823E926239j24040j17700j02940j02105j21332j28841j00998o8414p5860j09199
$$ 5926239 5802199 5684499 5581559 5479454 5358122 5229281 5128283 5059869 4984009 4874810
8813D874810j10893o9321m1253o7036j08980j07497o6282m0377n5447q0127p7879
$$ 4874810 4763917 4694596 4653343 4586307 4477327 4369830 4303548 4263171 4207724 4127597 4049718
8802D049718n2608l3891l9141o0928p8861p6788n6286l6262l3359m3903n1738
$$ 4049718 3997110 3963219 3924078 3863150 3784289 3707501 3651215 3614953 3581594 3537691 3485953
8791C485953m9265m1011l1974k5411k7989m1757n3473m8107l1980k5055l0420
$$ 3485953 3436688 3395677 3363703 3338292 3310303 3268546 3215073 3166966 3134986 3109931 3079511
8780C079511l2282k7198l2244n1233n7946l3723k889l235l0983m4992k5933k397
$$ 3079511 3047229 3020031 2987787 2936554 2878608 2844885 2841996 2838761 2807778 2762786 2736853 2734456
8768B734456p583l3252m5203l1204j2674j1846k5534l5484l2003k0182j0337r755
$$ 2734456 2726873 2693621 2648418 2617214 2604540 2592694 2567160 2531676 2499673 2479491 2469154 2459399
8756B459399j9385l2075l6948l1311k4659k4761k5681j9884j5423k3623l3298
$$ 2459399 2440014 2407939 2370991 2339680 2315021 2290260 2264579 2244695 2229272 2205649 2172351
8745B172351k2641q58n944m3911o4335k9904J8577J5694k7724l9601k156J8847
$$ 2172351 2149710 2148852 2142908 2098997 2034662 2004758 2023335 2039029 2011305 1971704 1969548 1988395
8733A988395j5940n1045k6853K0184J7100k5879l6738m296P641k6311n0049k2447
$$ 1988395 1972455 1921410 1894557 1914741 1931841 1905962 1869224 1864928 1872569 1846258 1796209 1773762
8721A773762J7132J9770J108l740o047k7245l9892r554L3445L1312r070k8010
$$ 1773762 1790894 1810664 1811772 1808032 1801985 1774740 1734848 1725294 1758739 1790051 1780981 1752971
8709A752971r127M021j0126k0473r320n219k3985l4354j6572m465k7315n2882
$$ 1752971 1743844 1747865 1737739 1717266 1707946 1702727 1678742 1644388 1627816 1623351 1596036 1543154
8697A543154l7473j16O883j9024l1914j3562L729n834k5805l0170j8249m892p22
$$ 1543154 1505681 1505565 1512448 1493424 1461510 1447948 1451677 1445843 1420038 1389868 1371619 1366727 1366005
8684A366005j0233k7776l1761o606K6684K8480n545l6352l5818j9786j3246j1904
$$ 1366005 1355772 1327996 1296235 1289629 1316313 1344793 1339248 1302896 1267078 1247292 1234046 1222142
8672A222142p40J1837N844j5786k8782j9258K924J8837J6664j237j8084j7307
$$ 1222142 1221402 1233239 1239083 1223297 1194515 1175257 1178181 1197018 1213682 1212445 1194361 1177054
8660A177054m502k226j4930j7843M319K7755K2297k410j2771l205R20j0604j8524
$$ 1177054 1172552 1170326 1155396 1137553 1141872 1169627 1191924 1189514 1176743 1173538 1174458 1163854 1145330
8647A145330j1569n487j1860j6524o683M380Q10p194k251P549J810j4942j7533
$$ 1145330 1133761 1128274 1116414 1099890 1093207 1097587 1098397 1091203 1088952 1096501 1098311 1083369 1065836
8634A065836n27J2817P577j201M061J4060Q463j0235j8618n916J1490J3626K870
$$ 1065836 1065309 1078126 1085703 1084502 1088563 1102623 1111086 1100851 1082233 1076317 1087807 1101433 1104303
8621A104303k168P401K0669K2956J3946N107L502N491O494R072J6387K3076K0571
$$ 1104303 1102135 1109536 1130205 1153161 1167107 1172214 1175716 1181207 1187701 1196773 1213160 1236236 1256807
8608A256807J0312L904Q510J8515K4487K4447K2038J9113J6506J8361K7641L8493
$$ 1256807 1267119 1271023 1279533 1298048 1322535 1346982 1369020 1388133 1404639 1423000 1450641 1489134
8596A489134M1129L5049K9805L1046L4076L4600L6384M1538M2355L3907K8096
$$ 1489134 1530263 1565312 1595117 1626163 1660239 1694839 1731223 1772761 1815116 1849023 1877119
8585A877119M0472O5239P9386P4012O5167O7233P2494O9551O6951P9155R8136
$$ 1877119 1917591 1982830 2062216 2136228 2201395 2268628 2341122 2410673 2477624 2556779 2654915
8574B654915J02299R2168R2725J14056J33047J28607J15636J22463J47136J62690
$$ 2654915 2757214 2849382 2942107 3056163 3189210 3317817 3433453 3555916 3703052 3865742
8564C865742J61794J66346J85985J97019J82701J70971J99868K55658K83312K64257
$$ 3865742 4027536 4193882 4379867 4576886 4759587 4930558 5130426 5386084 5669396 5933653
8554E933653K46667K77270L33037L55142L33495L15003L28672L45968L31274K94237
$$ 5933653 6180320 6457590 6790627 7145769 7479264 7794267 8122939 8468907 8800181 9094418
8544I094418K62818K30589J68583P8354n075o4792j22281j95107k62630k93462
$$ 9094418 9357236 9587825 9756408 9834762 9829687 9764895 9642614 9447507 9184877 8891415
8534H891415k89125k78223k75230k66188k36531j96581j69705j61046j48824j11394
$$ 8891415 8602290 8324067 8048837 7782649 7546118 7349537 7179832 7018786 6869962 6758568
8524F758568n7205j6977m892r56J9882N4635Q3261J01111J19076J38195J49691
$$ 6758568 6701363 6684386 6679494 6678538 6698420 6753055 6836316 6937427 7056503 7194698 7344389
8513G344389J59041J82117K13206K26702K20737K28312K67375L09618L24548L28430
$$ 7344389 7503430 7685547 7898753 8125455 8346192 8574504 8841879 9151497 9476045 9804475
8503I804475L56244M04943M43371M66837M98914N40916N63687N59073N58574N81072
$$ 9804475 10160719 10565662 11009033 11475870 11974784 12515700 13079387 13638460 14197034 14778106
8493A4778106N96086N66002M99376M30395L60731K56244R9112q5763k61517m13459
$$ 14778106 15374192 15940194 16439570 16869965 17230696 17486940 17586052 17500289 17238772 16825313
8483A6825313n42390o42259p02229p25679p31244p30928p16430o74506o10495
$$ 16825313 16282923 15640664 14938435 14212756 13481512 12750584 12034154 11359648 10749153
8474A0749153n45972m92924m42410l84646l28705k90176k66471k39247j99996
$$ 10749153 10203181 9710257 9267847 8883201 8554496 8264320 7997849 7758602 7558606
8465G558606j59934j32821j18159j04113q0862n0793k8667k5843l0151j4037K7150
$$ 7558606 7398672 7265851 7147692 7043579 6962717 6911924 6883257 6857414 6827263 6813226 6840376
8454F840376O1792O4968N6467O8265R1687R7235R5822J27250J84294K07951J79704
$$ 6840376 6902168 6967136 7023603 7091868 7183555 7280790 7376612 7503862 7688156 7896107 8075811
8443H075811J59467J92874K34831K22182J79822J80354K18885K10668J20416J6976
$$ 8075811 8235278 8428152 8662983 8885165 9064987 9245341 9464226 9674894 9795310 9812286
8433I812286l0985n1311j13632k20444l08239l40584l48409l72563m04520m04728
$$ 9812286 9781301 9729990 9616358 9395914 9087675 8747091 8398682 8026119 7621599 7216871
8423G216871l63332l19478l14123l35636l31535k78742k19410k05634k26293k23800
$$ 7216871 6853539 6534061 6219938 5884302 5552767 5274025 5054615 4848981 4622688 4398888
8413D398888j77849j30877j21302j31942j26753j05716r3180r4311r5002r1124
$$ 4398888 4221039 4090162 3968860 3836918 3710165 3604449 3511269 3416958 3321956 3230832
8403C230832q8527q3376o9617n9027o7398q4911q5858o6626m9431m7150m8339
$$ 3230832 3142305 3058929 2989312 2930285 2862887 2777976 2692118 2625492 2576061 2528911 2480572
8392B480572m1956l4977l6588m2369m4606m5161m8106m9473m4401l7675l7487
$$ 2480572 2438616 2403639 2367051 2324682 2280076 2234915 2186809 2137336 2092935 2055260 2017773
8381B017773m1828l9854k8036j8478k4880m1444m5679k8770j2542k0739m1375
$$ 2017773 1975945 1936091 1908055 1889577 1864697 1823253 1777574 1748804 1736262 1715523 1674148
8370A674148m2026k1094j1907k7183l6017j8025l503k2954m7493l0549R936J2103
$$ 1674148 1632122 1611028 1599121 1571938 1535921 1517896 1514393 1491439 1443946 1413397 1423333 1435436
8358A435436k9295m8607j3073K2200M54m7110n1437j1880R261j3628l6620k1978
$$ 1435436 1406141 1357534 1344461 1366661 1367115 1320005 1268568 1256688 1265949 1252321 1215701 1193723
8346A193723N464L146k3679l4632j4946Q332P614j3033l2015l7638l1011j4697
$$ 1193723 1199187 1202333 1178654 1144022 1129076 1137408 1145022 1131989 1099974 1062336 1031325 1016628
8334A016628N543J3565k935k7754k6332O849L0085O496l9548n0196j4921J4542
$$ 1016628 1022171 1035736 1032801 1005047 978715 985564 1015649 1022145 982597 932401 917480 932022
8322I32022K74k8582k4064Q650K3655L477k1892k3290o972N073M255m476j3345
$$ 932022 932296 903714 879650 888300 911955 915432 893540 870250 863278 868351 872606 868130 854785
8309H54785j4325m425O274M259p122j1342m789j782p924q114O675J7771L369k4313
$$ 854785 840460 836035 842309 846568 839446 828104 823315 821533 813609 805495 812170 829941 833310 808997
8295H08997k8651K453L5386K9486j1850m2818k8915J3293L8891K8657M652o570
$$ 808997 780346 782799 818185 847671 835821 793003 764088 777381 816272 844929 849581 843011
8283H43011n882p243r727k557J1126J5293L521j4497k6357k4068m152K2651K9036
$$ 843011 837129 829886 820159 817602 828728 844021 847542 833045 806688 782620 778468 801119 830155
8270H30155O00l6012m0131j2715L571j4212l8393l5488j3168l09k604m752k086
$$ 830155 830755 794743 754612 741897 745468 731256 692863 657375 644207 643898 641294 636542 634456
8257F34456k513n295l184j211r722k0889j5500N264J6540M248j4759j5489M491
$$ 634456 631943 626648 623464 622253 612531 591642 576142 581406 597946 602194 587435 571946 576437
8244E76437K5080K6755Q300j3801k1192j1696O17O037J1224K2358K7304J1302
$$ 576437 601517 628272 636572 622771 601579 589883 590500 596537 607761 630119 657423 668725
8232F68725j5757k7626j6448k74N489M375K010o605k2898l4291l0206j6868n930
$$ 668725 652968 625342 608894 608620 614109 618484 620494 613889 590991 556700 526494 509626 503696
8219E03696J69J585o963k3728l0524j3544J2061J6500n721k7375k3814l865M035
$$ 503696 503865 505450 498487 474759 444235 430691 442752 459252 453531 426156 402342 398477 402512
8206D02512r707k3523j4875N857N980k2085m1379j6517L1035M2636J002m1951
$$ 402512 392805 369282 354407 360264 366244 344159 302780 286263 317298 359934 360936 318985
8194C18985l3147J2073L6815K1072l151r561j0056j9355k3209o105J3287N178
$$ 318985 285838 297911 334726 355798 352647 343086 333030 313675 290466 284361 297648 302826
8182C02826k2807l0730k185L0568K8515m280k8471j8884R725K5713J5719q238
$$ 302826 280019 249289 247104 277672 306187 301907 273436 254552 264277 289990 305709 297471
8170B97471k6790k9111j5462N159J8875J6915N153k334j542k507j1193j7534j0795
$$ 297471 270681 241570 226108 231267 250142 267057 272210 269876 268334 265827 254634 237100 226305
8157B26305J561L725m427q823n872p615j7066j6459O634L3836L4293M664k5078
$$ 226305 227866 231591 227164 218341 212469 204854 187788 171329 177963 211799 246092 250756 225678
8144B25678k7253n420J5703J8627N279j1252j8608j1865L523J4395J0871k798
$$ 225678 198425 193005 208708 227335 232614 221362 202754 190889 194412 208807 219678 216880
8132B16880j1630p050K385K531o214r279j205K932r935k5677j8703Q576K4175
$$ 216880 205250 198200 200585 203116 196902 187623 186418 189350 179415 153738 135035 143611 167786
8119A67786J2205k558O487K3566J3824j8578l0976n775K0786J1676j6792k2126
$$ 167786 179991 177433 183920 207486 221310 202732 171756 165981 186767 198443 181651 159525
8107A59525K20J4114M25j6448r205J2128J8405L241j3344j5472p329K59L926M746
$$ 159525 159745 173859 174284 157836 148631 160759 179164 182405 169061 153589 146260 146519 150445 155191
8093A55191J657n532j0956o392Q657K2299J9280j450k0357j6464N655J7945M139
$$ 155191 156848 151316 140360 133968 142625 164924 184204 182754 162397 145933 151588 169533 173672
8080A73672j7134j6460N676J9041N601j5336j3430J1834L0543K0929m050j5301
$$ 173672 156538 140078 145754 164795 170396 155060 141630 153464 184007 204936 200886 185585
8068A85585n856K124p839j8437k498K9805L4448m591m3027l2193J0943K7225K119
$$ 185585 179729 181853 174014 155577 153079 182884 217332 212741 169714 137521 148464 175689 177808
8055A77808j6555K205K3252M815l1319l3650j436J9390J1236L112J0040P076j7623
$$ 177808 161253 163458 186710 191525 160206 126556 125120 144510 155746 158858 168898 175974 158351
8042A58351l0773o127K7583K7787J052j4129q278k875l634L466J2954K504j9697
$$ 158351 127578 121451 149034 176821 177873 163744 155466 152591 148957 152423 165377 167881 148184
8029A48184j5748J8529L4927M263l2165k0886K2031L4926L590k0997m013K1079
$$ 148184 132436 150965 185892 190155 157990 137104 159135 194061 197651 176654 172641 193720
8017A93720O573l5424m8684j1593L3733L7878N793j5806k468J9598J5395q381
$$ 193720 200293 164869 116185 104592 138325 176203 181996 166190 163722 183320 198715 190334
8005A90334j6260L66R984q561l0755k3263M925J8164Q840J824P647Q181m487j1359
$$ 190334 174074 174440 184424 175863 145108 121845 126770 144934 153774 155598 163245 171426 166939 155580
7991A55580l531k233j9513k9250p360K3482K5067K551p263L344O571p503j4759
$$ 155580 152049 149816 130303 101053 93693 117175 142242 144793 137530 140874 147445 139942 125183
7978A25183l469M217n288j0298N356J7262o83k6351j7898J9737L7379J1529k4230
$$ 125183 121714 125931 120643 110345 115701 132963 132280 105929 88031 107768 145147 156676 132446
7965A32446k8149k590J9051J8564O688q89l551r587j9135k0075k851K3315L6071
$$ 132446 104297 101707 120758 139322 146010 145121 141570 131983 112848 92773 89922 113237 149308
7952A49308K4265n66k0352k7944k2981m933J6880K0627j364k3969j9631J428P947
$$ 149308 173573 173007 152655 124711 101730 96797 113677 134304 132940 108971 89340 90768 98715
7939I8715k250k587J1692J2427j0403k5114q354J4835J1132q168j0077M905J0590
$$ 98715 96465 93878 105570 117997 107594 82480 74126 88961 100093 91925 81848 86753 97343
7926I7343M716P332J4912J904k7251l3231m156J9117M509k0788j4396J4503K2894
$$ 97343 102059 109391 124303 126207 98956 65725 61569 80686 85195 64407 50011 64514 87408
7913H7408K719j1035R50J5527Q851p353r263J309L803p919j8726j5327j747R232
$$ 87408 90127 79092 80042 95569 104420 97067 87804 89113 92916 84997 66271 50944 49197 58429
7899E8429J0579M318l799q967q180m64J0250J4132M653q779p281J0772K0612L638
$$ 58429 69008 73326 69527 60560 52380 51916 62166 76298 80951 72172 64891 75663 96275 99913
7885I9913k0464j7694P631J5279q228k4104j407K8937J8642j9826k9377J511J9963
$$ 99913 79449 61755 69386 84665 76437 52333 50926 79863 98505 78679 49302 50813 70776
7872G0776m606k8613n026L6474L2143j6353m3703j8571J7019J8385j699q544p56
$$ 70776 66170 37557 32531 69005 101148 84795 41092 22521 39540 57925 56226 47682 46926
7859D6926L058L335R416J1259k410j3121J875K3553J2637k4869l8106o295K8883
$$ 46926 49984 53319 62735 73994 71584 58463 60338 83891 96528 71659 33553 27258 56141
7846E6141K4937m133j9136j4179r687p972N172K3102K0827l083j9887j3453q75
$$ 56141 81078 76945 57809 43630 33943 25971 31143 54245 75072 71989 52102 38649 37774
7833C7774J167L121J7009K6629R874k1582l3228j5774M722Q594P737J5648J6925
$$ 37774 38941 42062 59071 85700 95574 73992 40764 24990 29712 38306 46043 61691 78616
7820G8616p486l8227l4123P135L6714J8308k1094k8551L126L1210K5118R62j1431
$$ 78616 71130 32903 -1220 5915 42629 60937 39843 11292 14418 45628 70746 71708 60277
7807F0277p818k100n73q54k494l248L922J6397J6687k996k3155k1920o346J550
$$ 60277 52459 50359 49786 48932 46438 43190 47112 63509 80196 77200 54045 32125 25779 27329
7793B7329n43N05K508p766k0865r846K2383L4975O783k7244k3739P255K0836M421
$$ 27329 26786 27291 29799 22033 1168 -8678 13705 48680 55463 28219 4480 11735 32571 36992
7779C6992j0526l070P620N6j1783k166K1344K4535l445l0928k4514O316K1877
$$ 36992 26466 23396 31016 31072 19289 17123 38467 63002 59557 28629 4115 10431 32308
7766C2308M731j8777j5614J0089K5595J5216k577o646j831l548r174m750O395
$$ 32308 37039 18262 2648 12737 38332 53548 50971 44325 42494 38946 29772 25022 31417
7753C1417M942j1401j7678K816K7944K1500j5785m0986k2569J6539K6571l617
$$ 31417 36359 24958 7280 10096 38040 59540 43755 2769 -19800 -3261 23310 19693
7741A9693l0325j2788L0711M5437J2360k7944l0164J56K2452J6168k818j3099
$$ 19693 -10632 -23420 7291 52728 65088 37144 6980 7136 29588 45756 42938 29839
7729B9839j1078l447K720p64j4898k1773k695K7213K9067l172k5822p892J9024
$$ 29839 18761 15314 18034 17270 2372 -19401 -22096 5117 34184 31012 5190 -2702 16322
7716A6322R545j9977j5814K1510L0999r715m0358r966L8658L2593j7331l4679
$$ 16322 25867 5890 -9924 11586 42585 32870 -7488 -17454 21204 53797 36466 1787
7704A787K979L4870J6955j6829k1201q414q722r515J2783L3238J1137l4437m2473
$$ 1787 4766 39636 56591 39762 18561 10147 1425 -8090 4693 37931 49068 14631 -27842
7691b7842j477L3764K5437K38m755L062q61j2212j1859j853K668Q53L49j323p314
$$ -27842 -29319 4445 29882 30120 25365 28427 27566 15354 3495 1642 4310 5163 5512 4189 -3125
7676c125p656L820J3119P802j1M772J0869j25j7707j6047L348J3288L872n207
$$ -3125 -10781 -6961 6158 13960 13949 18721 29590 29465 11758 -4289 -941 12347 16219 11012
7662A1012J343J3113J3484J806j0200j1460M47J3990J0906r698k3903j4845J049
$$ 11012 12355 25468 38952 40758 30558 19098 19545 33535 44441 34743 10840 -4005 -2956
7649b956N45q418l108J2179J4262K789k258P45l110q895P78J4509N064j6297j2011
$$ -2956 -2411 -10829 -13937 -1758 12504 15293 13035 13780 10670 1775 2553 17062 22126 5829 -6182
7634f182J0818M490l0420l2005J7239M7177J1979k7532l223M2258K6029l2583
$$ -6182 4636 9126 -21294 -53299 -36060 11117 23096 -4436 -7659 34599 60628 28045
7622B8045m3690K477K5821l053k1467M568K1779n827k6743L910L7794J3948l3877
$$ 28045 -15645 -13168 12653 9600 -11867 -7299 14480 8653 -18090 -14180 23614 37562 3685
7609C685l1697J3122K8912k219k4742o418J8034J3057o721j2528m462L125P133
$$ 3685 -28012 -14890 14022 11803 -12939 -19357 -1323 11734 5013 -7515 -11977 -8852 -1719
7596a719Q366L173m849n193N29O44l135J346R005K040j3855j1066J2402K1930
$$ -1719 6647 9820 4971 -222 307 951 -2184 -838 8167 10207 -3648 -14714 -2312 19618
7582A9618L46k0638q752J7410J8115o384k1070j2325j404k382k276P706J2095
$$ 19618 19964 -674 -9426 7984 26099 19715 -1355 -13680 -15084 -17466 -19742 -12036 59
7569E9j25j0405K318K4283K3683p12j6520p844N62j4152l1333j7673J4681J9709
$$ 59 -66 -10471 -8153 16130 39813 39101 22581 14737 15299 1147 -30186 -47859 -33178 -13469
7555a3469j1392l1403o362L2465L5562O857j0291k122M544l337m697J1988K3502
$$ -13469 -24861 -56264 -62626 -30161 5401 12258 1967 -155 4389 1052 -3645 8343 31845
7542C1845Q694j8352l1408k5546j0511P544K0544J6319L73j879J5584K1802l991
$$ 31845 40539 22187 -9221 -34767 -45278 -37734 -17190 -871 -498 -2377 13207 35009 31018
7529C1018l1692k1277J4045K6450N550j2191n735L219m694j4667r001L418R869
$$ 31018 -674 -21951 -7906 18544 24094 11903 6168 9387 4693 -9974 -18975 -15557 -5688
7516e688J6300K3674J0879k8141n4326k9172K3180M0947R125k2202j1913J8316
$$ -5688 10612 34286 45165 17024 -37302 -66474 -43294 -2347 6778 -15424 -27337 -9021
7504i021K4089J729j7185j6659r627o311M18J2609J5172k83j6101j0558R383J6067
$$ -9021 15068 16797 -388 -17047 -26674 -32985 -32567 -19958 -4786 -5069 -21170 -31728 -22345 -6278
7490f278R78j1930o16K2032K4949K233j8916j6655k706J73n407N09J5396J0589
$$ -6278 -5300 -17230 -17846 4186 29135 31368 12452 -4203 -6909 -6736 -12143 -11634 3762 14351
7476A4351k1670m3160j7501L1456M3673N547k8726j3857K2741K5036q238k7362
$$ 14351 -7319 -50479 -67980 -36524 7149 12696 -16030 -29887 -7146 17890 9652 -17710
7464a7710r953J2007J0757K274N719M778j5989k9053l383L4487L0840j0699k9923
$$ -17710 -27663 -15656 -4899 -2625 3094 7872 -8117 -37170 -40553 -6066 24774 14075 -15848
7451a5848k532K3302O083k3591j6034J6813K3907k391j9701p210O653k140j4933
$$ -15848 -18380 4922 11005 -12586 -28620 -11807 12100 9709 -9992 -17202 -10549 -12689 -27622
7438b7622o360J2957J5085k601j6777j0672R150K2892J5840n916j5567M215L0120
$$ -27622 -33982 -21025 -5940 -8541 -25318 -35990 -26840 -3948 11892 5976 -9591 -5376 24744
7425B4744K1164k0349m2485j6550J7587J1238j7957j7293J3262K1854q104l0950
$$ 24744 45908 25559 -16926 -33476 -15889 -4651 -22608 -39901 -26639 -4785 -12889 -43839
7413d3839j4653J1354J2769O232J8715L1129J2167j9488k1176J992P290j1103
$$ -43839 -58492 -47138 -34369 -28137 -9422 21707 33874 14386 -6790 -4798 2492 -8611
7401h611j5852K494P843j2649j9766R584L6618K1781j0477j3639O730J1031m909
$$ -8611 -24463 -21969 -14126 -26775 -46541 -36957 -339 21442 10965 -2674 4056 15087 10178
7388A0178j1209k034o1p528l171J0418N913j5585j9325K786J5015m85j2816O44
$$ 10178 -1031 -3065 -3126 -10654 -13825 -3407 2506 -13079 -32404 -29618 -14603 -15088 -27904 -27260
7374b7260J2959j278j6470k111J7919N254k0958j2539K2331K7416q330l0956q805
$$ -27260 -14301 -15579 -32049 -34160 -16241 -10987 -31945 -44484 -22153 5263 -3067 -34023 -42828
7361d2828K0761J7972j14k910j963j7190k4639O269M5887L6000j7315m3256r555
$$ -42828 -22067 -4095 -4209 -7119 -9082 -26272 -50911 -44642 1245 37245 19930 -23326 -32881
7348c2881L0170J8741k1902l1235j478K0873J1748k511J646Q603p05j1992m700
$$ -32881 -2711 16030 -5872 -37107 -38585 -17712 -5964 -8475 -6829 1774 1069 -10923 -15623
7335a5623Q785M312q846j984J9266J7276j3922k9932l668K6153J1409k7589k9453
$$ -15623 -6838 -2526 -11372 -13356 5910 23186 9264 -20668 -24336 1817 13226 -14363 -43816
7322d3816J3610M1675J6158k5952l0871k609J5222O805m634j671O421P095J525
$$ -43816 -30206 11469 27627 1675 -29196 -31805 -16583 -9778 -14412 -16083 -9662 -2567 -1042
7309a042n185j0954j1580m606J875m36l758M354J6694J4412j322q747K77Q784
$$ -1042 -6227 -17181 -28761 -33367 -31492 -31928 -35686 -31332 -14638 -226 -1548 -10295 -10018 -1234
7295a234M147l840m348l306o728o266K823P714q7o005L412J3271L085j5434j4144
$$ -1234 2913 -927 -5275 -8581 -15309 -21575 -18752 -11038 -11125 -17130 -13718 -447 2638 -12796 -26940
7280b6940L598N581j4410k0344R788M1287K6421k4476n0238j8839L0221L8798
$$ -26940 -23342 -17761 -32171 -52515 -42727 -1440 24981 505 -49733 -68572 -38351 447
7268D47M557k3137j4738L498k985k1179j3001J8886K8968j93k6071j0423J9576
$$ 447 5004 -18133 -32871 -29373 -32358 -53537 -66538 -47652 -18684 -18877 -44948 -55371 -35795
7255c5795J5113j3524j3566J9957L1488l086l1226o379L3509K3661k3363l6149
$$ -35795 -20682 -34206 -47772 -27815 3673 587 -30639 -37018 -3509 20152 -3211 -39360
7243c9360L332L3691J2595k0859j4592J4576J4869j4572k5936j671K0559J0372
$$ -39360 -36028 -2337 10258 -10601 -25193 -10617 4252 -10320 -36256 -37927 -17368 -6996
7231f996j1431j2325J431L211n654l18K1258K9887R341j8256k5189j5134q423
$$ -6996 -18427 -30752 -29321 -26110 -31764 -32082 -10824 19063 28404 10148 -15041 -30175 -38598
7218c8598o951J169J1291O703o857l511J6805J8197j4299l9226j5156L0032L2968
$$ -38598 -45549 -44380 -33089 -26386 -33243 -36754 -19949 -1752 -16051 -55277 -70433 -40401 -7433
7205g433j0090l4506l573L7559L1896o829k2149N19K2270J3322j3369l0748k7089
$$ -7433 -17523 -52029 -55602 -18043 13853 7024 -15125 -14606 7664 20986 7617 -23131 -50220
7192e0220m766K2395K9405M743k4913k2527O393K0473M408j2727r659l106p867
$$ -50220 -54986 -32591 -3186 1557 -23356 -45883 -39490 -19017 -14609 -27336 -36995 -40101 -47968
7179d7968o697J2112K2927M339j7244p489J5833J0597j6928k0197R724K8111Q247
$$ -47968 -54665 -42553 -19626 -15287 -32531 -40020 -24187 -13590 -30518 -50715 -40991 -12880 -4633
7166d633j9665k0138j518J0499J3529J5426R401q509j9754r569N890N840n44M625
$$ -4633 -24298 -44436 -45954 -35455 -21926 -6500 2901 -5608 -25362 -34931 -29041 -23201 -23745 -19120
$$ [...]
##END NTUPLES=NMR SPECTRUM
##END=
