##TITLE=1H ikalashn
K-544
22.11.2024
##JCAMPDX= 6.0         $$ Bruker NMR JCAMP-DX V2.0
##DATA TYPE= NMR SPECTRUM
##DATA CLASS= NTUPLES
##ORIGIN= UXNMR, Bruker Analytische Messtechnik GmbH
##OWNER= root
$$ TOPSPIN		Version 1.3
$$ 2024-11-22 15:23:45.171 +0400  Irina@DPX200
$$ Compression mode = diff/dup
##.OBSERVE FREQUENCY= 200.131300845
##.OBSERVE NUCLEUS= ^1H
##.ACQUISITION MODE= SIMULTANEOUS
##.ACQUISITION SCHEME= undefined
##.AVERAGES= 32
##.DIGITISER RES= 18
##SPECTROMETER/DATA SYSTEM= spect
##.PULSE SEQUENCE= zg
##.SOLVENT NAME= CDCl3
##.SHIFT REFERENCE= INTERNAL, CDCl3, 1, 17.49637
##AUDIT TRAIL= $$ (NUMBER, WHEN, WHO, WHERE, WHAT)
$$ ##TITLE= Audit trail, TOPSPIN		Version 1.3
$$ ##JCAMPDX= 5.01
$$ ##ORIGIN= Bruker BioSpin GmbH
$$ ##OWNER= Irina
$$ $$ F:/spectra/data/iren/nmr/1H/4/pdata/1/auditp.txt
$$ ##AUDIT TRAIL=  $$ (NUMBER, WHEN, WHO, WHERE, VERSION, WHAT)
(   1,<2024-11-22 15:22:59.078 +0400>,<Irina>,<DPX200>,<TOPSPIN 1.3>,
      <created by zg
	started at 2024-11-22 15:20:48.796 +0400,
	POWCHK disabled, PULCHK disabled
       terminated by command 'halt'
       configuration hash MD5:
       BE 6D 3F 07 2A EA 11 49 91 17 2B D3 AF B3 58 0D
       data hash MD5: 16K
       D5 68 DB 28 93 77 86 68 B0 F7 DB BA D7 29 B2 F8>)
(   2,<2024-11-22 15:22:59.984 +0400>,<Irina>,<DPX200>,<TOPSPIN 1.3>,
      <Start of raw data processing
       efp BC_mod = 2 LB = 0.02 FT_mod = 6 PKNL = 1 PHC0 = 102.8034 PHC1 = 0.3094282 SI = 32K 
       data hash MD5: 32K
       A4 10 AA 59 A8 86 C4 4A AF 09 FE 5E 5A DA 3C 54>)
(   3,<2024-11-22 15:23:02.171 +0400>,<Irina>,<DPX200>,<TOPSPIN 1.3>,
      <apk 
       data hash MD5: 32K
       20 D8 7B 73 A3 A8 C6 F2 64 DC 13 EA 57 A4 A8 E6>)
(   4,<2024-11-22 15:23:28.562 +0400>,<Irina>,<DPX200>,<TOPSPIN 1.3>,
      <pk fgphup PHC0 = -6.331665 PHC1 = 7.2 
       data hash MD5: 32K
       BC F6 B2 18 64 B8 5F D0 97 A0 FF 75 79 C8 D7 16>)
(   5,<2024-11-22 15:23:30.093 +0400>,<Irina>,<DPX200>,<TOPSPIN 1.3>,
      <abs n ABSG = 5 
       data hash MD5: 32K
       AC 17 44 E0 7C EB 69 F9 74 D1 A5 5E 35 87 4C E1>)
$$ ##END=
$$ 
$$ $$ hash MD5
$$ $$ 5D B8 53 29 EE 79 80 3C 35 C1 C7 87 AF 2D 54 11
##$RELAX= 
##$RELAX= 
##$RELAX= 
##$RELAX= 
##$RELAX= 
##$RELAX= 
##$RELAX= 
##$RELAX= 
##$RELAX= 
$$ Bruker specific parameters
$$ --------------------------
##$DU= <F:/spectra>
##$EXPNO= 4
##$NAME= <1H>
##$PROCNO= 1
##$TYPE= <nmr>
##$USER= <iren>
##$AMP= (0..31)
100 100 100 100 100 100 100 100 100 100 100 100 100 100 100 100 100 100 
100 100 100 100 100 100 100 100 100 100 100 100 100 100 
##$ANAVPT= -1
##$AQSEQ= 0
##$AQ_mod= 1
##$AUNM= <au_zg>
##$AUTOPOS= <>
##$BF1= 200.13
##$BF2= 200.13
##$BF3= 200.13
##$BF4= 200.13
##$BF5= 200.13
##$BF6= 200.13
##$BF7= 200.13
##$BF8= 200.13
##$BYTORDA= 1
##$CFDGTYP= 0
##$CFRGTYP= 5
##$CHEMSTR= <none>
##$CNST= (0..63)
1 1 145 1 1 1 1 1 1 1 1 1 1 1 1 1 1 1 1 1 1 1 1 1 1 1 1 1 1 1 1 1 1 1 
1 1 1 1 1 1 1 1 1 1 1 1 1 1 1 1 1 1 1 1 1 1 1 1 1 1 1 1 1 1 
##$CPDPRG= <>
##$CPDPRG1= <>
$$ [...]
##$SW_h= 4401.40845070422
##$TD= 16384
##$TD0= 1
##$TE= 300
##$TE2= 300
##$TE3= 300
##$TEG= 300
##$TL= (0..7)
0 120 120 120 120 120 120 120 
##$TP= (0..7)
150 150 150 150 150 150 150 150 
##$TP07= 0
##$TPNAME0= <>
##$TPNAME1= <>
##$TPNAME2= <>
##$TPNAME3= <>
##$TPNAME4= <>
##$TPNAME5= <>
##$TPNAME6= <>
##$TPNAME7= <>
##$TPOAL= (0..7)
0.5 0.5 0.5 0.5 0.5 0.5 0.5 0.5 
##$TPOFFS= (0..7)
0 0 0 0 0 0 0 0 
##$TUNHIN= 0
##$TUNHOUT= 0
##$TUNXOUT= 0
##$USERA1= <user>
##$USERA2= <user>
##$USERA3= <user>
##$USERA4= <user>
##$USERA5= <user>
##$V9= 5
##$VALIST= <valist>
##$VCLIST= <CCCCCCCCCCCCCCC>
##$VD= 0
##$VDLIST= <DDDDDDDDDDDDDDD>
##$VPLIST= <PPPPPPPPPPPPPPP>
##$VTLIST= <TTTTTTTTTTTTTTT>
##$WBST= 1024
##$WBSW= 25
##$XGAIN= (0..3)
0 0 0 0 
##$XL= 0
##$YL= 0
##$YMAX_a= 2781437
##$YMIN_a= -3094467
##$ZGOPTNS= <>
##$ZL1= 120
##$ZL2= 120
##$ZL3= 120
##$ZL4= 120
##$ABSF1= 17.49637
##$ABSF2= -4.496376
##$ABSG= 5
##$ABSL= 3
##$ALPHA= 0
##$AQORDER= 0
##$ASSFAC= 0
##$ASSFACI= 0
##$ASSFACX= 0
##$ASSWID= 0
##$AUNMP= <proc_1d>
##$AXLEFT= 0
##$AXRIGHT= 0
##$AXTYPE= 0
##$AXUNIT= <>
##$AZFE= 0.1
##$AZFW= 0.1
##$BCFW= 0
##$BC_mod= 2
##$BYTORDP= 0
##$COROFFS= 0
##$CY= 7568.61572265625
##$DATMOD= 1
##$DC= 0
##$DFILT= <>
##$DTYPP= 0
##$F1P= 17.9538593292236
##$F2P= -4.03888763876832
##$FCOR= 0.5
##$FTSIZE= 32768
##$FT_mod= 6
##$GAMMA= 0
##$GB= 0
##$INTBC= 0
##$INTSCL= 5.656564e-011
##$ISEN= 128
##$LB= 0.02
##$LEV0= 0
##$LPBIN= 0
##$MAXI= 945.577
##$MC2= 0
##$MEAN= 0
##$ME_mod= 0
##$MI= -402.1523
##$NCOEF= 0
##$NC_proc= -5
##$NLEV= 6
##$NOISF1= 8.587773
##$NOISF2= 6.764455
##$NSP= 0
##$NTH_PI= 0
##$NZP= 0
##$OFFSET= 17.49637
##$PC= 1
##$PHC0= 297.9476
##$PHC1= 19.52262
##$PH_mod= 1
##$PKNL= yes
##$PPARMOD= 0
##$PPDIAG= 0
##$PPIPTYP= 0
##$PPMPNUM= 100
##$PPRESOL= 1
##$PSCAL= 0
##$PSIGN= 0
##$REVERSE= no
##$SF= 200.13
##$SI= 32768
##$SIGF1= 16.12182
##$SIGF2= -4.496377
##$SINO= 3.521527
##$SIOLD= 32768
##$SREGLST= <1H.CDCl3>
##$SSB= 0
##$STSI= 32768
##$STSR= 0
##$SW_p= 4401.40845070422
##$SYMM= 0
##$S_DEV= 0
##$TDeff= 16384
##$TDoff= 0
##$TI= <>
##$TILT= no
##$TM1= 0
##$TM2= 0
##$TOPLEV= 0
##$USERP1= <user>
##$USERP2= <user>
##$USERP3= <user>
##$USERP4= <user>
##$USERP5= <user>
##$WDW= 1
##$XDIM= 32768
##$YMAX_p= 344349251
##$YMIN_p= -721160
$$ End of Bruker specific parameters
$$ ---------------------------------
##NTUPLES= NMR SPECTRUM
##VAR_NAME=  FREQUENCY,     SPECTRUM/REAL,   SPECTRUM/IMAG
##SYMBOL=    X,             R,               I
##VAR_TYPE=  INDEPENDENT,   DEPENDENT,       DEPENDENT
##VAR_FORM=  AFFN,          ASDF,            ASDF
##VAR_DIM=   32768,         32768,           32768
##UNITS=     HZ,            ARBITRARY UNITS, ARBITRARY UNITS
##FACTOR=    0.134324425510551, 1,           1
##FIRST=     4401.40845070422, -626506,      -1853294
##LAST=      0,             305463,          -2951054
##MIN=       0,             -721160,         0
##MAX=       4401.40845070422, 344349251,    0
$$ Real data points
##PAGE= N=1
##DATA TABLE= (X++(R..R)), XYDATA
$$ [...]
11095A4445482L3613Q3785J04750P3295J9664k7550o0101o7380m2532j2591j7826
11084A4532609n2317o6779m1660j3770j3313j9599m784J9309K7729K0571P459
11073A4395455j0247j7132J3264O4434P5996L4118P410M2976Q4989O4043J4135
11062A4769441J6248O5592Q9751P4439P2062R5389J01937Q6177R1540J21917J34341
11051A5718834J30966J60713K12961K14912J63681J50796K09843K50566K08621
11042A7421893J55205J74213K23382K15642J62478J30991J18634Q0555L6953M2163
11032A8762109P5302O7183J7671j2756j2051j7382j9616K5994R2728R5224K9051
11021A9103457l540N8066J45909J67216J23048P8123O9982R3084J31302J68766
$$ y = [14445482, 14479095, 14562880, 14667630, 14740925, 14760589, 14733039, 14672938, 14605558, 14563026, 14550435, 14532609, 14480292, 14413513, 14371853, 14358083, 14344770, 14325171, 14320387, 14339696, 14367425, 14387996, 14395455, 14385208, 14368076, 14381340, 14445774, 14521770, 14555888, 14563298, 14606274, 14691263, 14755306, 14769441, 14785689, 14851281, 14941032, 15015471, 15087533, 15182922, 15284859, 15371036, 15462576, 15584493, 15718834, 15849800, 16010513, 16223474, 16438386, 16602067, 16752863, 16962706, 17213272, 17421893, 17577098, 17751311, 17974693, 18190335, 18352813, 18483804, 18602438, 18682993, 18719946, 18762109, 18837411, 18904594, 18922265, 18909509, 18897458, 18880076, 18860460, 18886454, 18979182, 19074406, 19103457, 19099917, 19157983, 19303892, 19471108, 19594156, 19672279, 19742261, 19835345, 19966647, 20135413]
11011B0135413J95564K20371K51167K65599K41753K09254K13220K35402K20174
11002B2187917J74441J59014J76441J63020J11920R9420J47503J66552J01622
10993B3487850L9063P7384J66403J78748R6273K3245L3077Q9686J19643R5834
10983B4407206M4151Q270N497K66n1282j22060j39390j08469j21588k00360k38841
10972B3483400j84164j53442k42070l27369k43844p5308n0474j76087k21399r9186
10962B1710057n504p9645j67617r3321L6282J8774r4399r0724L8109Q9324k489
10951B1358847o7291j053O7983J7568n9738k8362N8012N9391j5631m5753p265
10940B1336708J6013M672K5442P9063P8371R588k1716M0450J08912J00575O9968
$$ y = [20135413, 20330977, 20551348, 20802515, 21068114, 21309867, 21519121, 21732341, 21967743, 22187917, 22362358, 22521372, 22697813, 22860833, 22972753, 23072173, 23219676, 23386228, 23487850, 23526913, 23604297, 23770700, 23949448, 24045721, 24068966, 24102043, 24191729, 24311372, 24407206, 24451357, 24459627, 24465124, 24465390, 24414108, 24292048, 24152658, 24044189, 23922601, 23722241, 23483400, 23299236, 23145794, 22903724, 22576355, 22332511, 22257203, 22206729, 22030642, 21809243, 21710057, 21704553, 21624908, 21457291, 21363970, 21400252, 21419026, 21324627, 21233903, 21272012, 21361336, 21358847, 21291556, 21290503, 21358486, 21376054, 21316316, 21287954, 21345966, 21405357, 21389726, 21343973, 21336708, 21352721, 21357393, 21382835, 21461898, 21540269, 21549857, 21528141, 21568591, 21677503, 21778078, 21848046]
10929B1848046J02725J62542J56876R9006Q4867J34054J70678J61661J63556K08475
10919B3292486K41040K12532J62623J55706J89876K19025K27386K37746K69391
10910B5207811L17490L55012L45663K88427K50941L04503M16535M75697M45318
10901B8407397M12837M49099N06429N19160N19981N68433O35203O61627O78452
10892C3358618P50981Q47797Q87554Q88690R41622J046350J118220J156346J254168
10883D2250346J417407J530479J558095J622203J792743J950500J974687J936478
10875E6032938J960304J994555J889420J643639J401698J224450J021558P22956
10867F7891518L78440N5417k49296n56773q52468j117545j344597j507099j582222
$$ y = [21848046, 21950771, 22113313, 22270189, 22369195, 22454062, 22588116, 22758794, 22920455, 23084011, 23292486, 23533526, 23746058, 23908681, 24064387, 24254263, 24473288, 24700674, 24938420, 25207811, 25525301, 25880313, 26225976, 26514403, 26765344, 27069847, 27486382, 27962079, 28407397, 28820234, 29269333, 29775762, 30294922, 30814903, 31383336, 32018539, 32680166, 33358618, 34109599, 34957396, 35844950, 36733640, 37675262, 38721612, 39839832, 40996178, 42250346, 43667753, 45198232, 46756327, 48378530, 50171273, 52121773, 54096460, 56032938, 57993242, 59987797, 61877217, 63520856, 64922554, 66147004, 67168562, 67891518, 68269958, 68325375, 68076079, 67519306, 66666838, 65549293, 64204696, 62697597, 61115375]
10858F1115375j608033j642585j668425j624554j529731j469825j454625j403144
10850D8714453j296076j220350j216905j205776j127148j040502j002352r56895
10842C9648449q50213p53140p47984p73922p22513o27828o10325o61323o41365
10833C3259836n02490l67863l49742m04549m22452l71746k99667k55674k59408
10824C0026245k94334l05722k55260j89135j86677k33459k31280j55694j03583
10815B8071101j38137j87773j70472j26086j30261j52656j15262m1415k3300o4458
10805B6921281p7843l8925j9043m6257n1320K770M4420J4253k6695M995P5249
10794B6802885Q8502M3480K8822P4068J07147P9614M4557O4165J07080J01242
$$ y = [61115375, 59507342, 57864757, 56196332, 54571778, 53042047, 51572222, 50117597, 48714453, 47418377, 46198027, 44981122, 43775346, 42648198, 41607696, 40605344, 39648449, 38798236, 38045096, 37297112, 36523190, 35800677, 35172849, 34562524, 33901201, 33259836, 32757346, 32389483, 32039741, 31635192, 31212740, 30840994, 30541327, 30285653, 30026245, 29731911, 29426189, 29170929, 28981794, 28795117, 28561658, 28330378, 28174684, 28071101, 27932964, 27745191, 27574719, 27448633, 27318372, 27165716, 27050454, 27009039, 26985739, 26921281, 26843438, 26804513, 26785470, 26739213, 26687893, 26690663, 26735083, 26749336, 26722641, 26727636, 26802885, 26891387, 26934867, 26963689, 27037757, 27144904, 27224518, 27269075, 27333240, 27440320, 27541562]
10784B7541562N0679K9624O7743J04460P7625J2733j2910K6573Q0228R8352R4923
10773B8171592J08657J32026J22774Q0410O3148J10322J85282K24916K17805J97437
10763B9614369J81255J63211J55415J83523K35239K62519K49258K31676K34019
10754C1510484K32876K13137K08409K41410K68009K39342J88817J89427K40077
10745C3531988K66998K39418K11142K28770K64762K74406K65149K70157K95134
10736C5847924L30035L77091M28659M52292M39675M37944M86564N53423N85356
10727C9938963N94468O32546O99288P47447P74042Q30512R30723J024723J092352
10718D7265064J190708J360973J549483J686476J800802J980726K240491K501832
$$ y = [27541562, 27592241, 27621865, 27689608, 27794068, 27871693, 27884426, 27871516, 27898089, 27978317, 28076669, 28171592, 28280249, 28412275, 28535049, 28615459, 28678607, 28788929, 28974211, 29199127, 29416932, 29614369, 29795624, 29958835, 30114250, 30297773, 30533012, 30795531, 31044789, 31276465, 31510484, 31743360, 31956497, 32164906, 32406316, 32674325, 32913667, 33102484, 33291911, 33531988, 33798986, 34038404, 34249546, 34478316, 34743078, 35017484, 35282633, 35552790, 35847924, 36177959, 36555050, 36983709, 37436001, 37875676, 38313620, 38800184, 39353607, 39938963, 40533431, 41165977, 41865265, 42612712, 43386754, 44217266, 45147989, 46172712, 47265064, 48455772, 49816745, 51366228, 53052704, 54853506, 56834232, 59074723, 61576555]
10710F1576555K704654K855249K943079K888979K634818K238062J811124J390808
10702H1043328R35320M38104m0202m75225r31063j449217j944927k295150k495252
10693G2785716k633802k723581k671267k447451k179986k004759j900044j756460
10685E4468366j555189j374793j252992j151149j051641r84021r36978q43924
10677D5317679o93412n67686n23436n08963m54560l77012l28167k97264k42096
10668D1325083j78391j57236j73213j70213j31386r4934p9166n5311n949M3761
10658D0323045P0404Q3892R6173R5337P3434N4174O9230J17211J60231J60635
10648D1303766J21862R2336J14629J66941J81553J35762R0516J08180J63109J77739
$$ y = [61576555, 64281209, 67136458, 70079537, 72968516, 75603334, 77841396, 79652520, 81043328, 81978648, 82416752, 82376550, 81901325, 80970262, 79521045, 77576118, 75280968, 72785716, 70151914, 67428333, 64757066, 62309615, 60129629, 58124870, 56224826, 54468366, 52913177, 51538384, 50285392, 49134243, 48082602, 47098581, 46161603, 45317679, 44624267, 44056581, 43533145, 43024182, 42569622, 42192610, 41864443, 41567179, 41325083, 41146692, 40989456, 40816243, 40646030, 40514644, 40419710, 40340544, 40285233, 40279284, 40323045, 40393449, 40477341, 40573514, 40668851, 40742285, 40796459, 40865689, 40982900, 41143131, 41303766, 41425628, 41517964, 41632593, 41799534, 41981087, 42116849, 42207365, 42315545, 42478654, 42656393]
10638D2656393J27728O3357L5509M5361O5776P4141O2508M3175L9549N1038M6996
10627D3311531K0371J3306N0571Q7648P9379N9023P8368J09203R4728O7077J02341
10616D4073546J73120J73762J02675Q2452J59526K21964J86685J38990J85263
10607D5497983K75131K92930K46841K35450K77212L04059K97751L09311L51918
10598D8088586L85512M06856M51507N02764N00759M54858M48337N08145N62568
10589E2309892N61017N50154N87089O49584O84310O90437P05439P44565P94119
10580E8276606Q39579Q76460R16234R88484J105537J228669J316040J398930J547331
10571F8493870J756898J944905K075374K207445K383964K549791K633525K645015
$$ y = [42656393, 42784121, 42847478, 42882987, 42928348, 42994124, 43068265, 43130773, 43173948, 43213497, 43264535, 43311531, 43331902, 43345208, 43395779, 43483427, 43562806, 43621829, 43700197, 43809400, 43904128, 43971205, 44073546, 44246666, 44420428, 44523103, 44605555, 44765081, 44987045, 45173730, 45312720, 45497983, 45773114, 46066044, 46312885, 46548335, 46825547, 47129606, 47427357, 47736668, 48088586, 48474098, 48880954, 49332461, 49835225, 50335984, 50790842, 51239179, 51747324, 52309892, 52870909, 53421063, 54008152, 54657736, 55342046, 56032483, 56737922, 57482487, 58276606, 59116185, 59992645, 60908879, 61897363, 63002900, 64231569, 65547609, 66946539, 68493870, 70250768, 72195673, 74271047, 76478492, 78862456, 81412247, 84045772, 86690787]
10563H6690787K629310K575476K439081K221146J961418J674905J348286R81994
10555A02522403N91324J84909k17274n66872q30900j032832j208803j343235j393254
10546I6705466j361810j298424j230802j136967r90065q01316o09171m38538k75619
10537H8562754q7492J24828L10121M35368N52529P41511R93023J219889J392510
10528I4245041J578452J821113K071431K288226K514954K789561L063156L285802
10520A13657736L485366L663541L700200L490070L111915K721565K324460J811234
10512A37966087J191297O09742J11430m38332j134500j871808k477599k895001
10504A31061316l165411l330955l428837l495814l508407l396480l174093k967982
$$ y = [86690787, 89320097, 91895573, 94334654, 96555800, 98517218, 100192123, 101540409, 102522403, 103113727, 103298636, 103081362, 102514490, 101683590, 100650758, 99441955, 98098720, 96705466, 95343656, 94045232, 92814430, 91677463, 90687398, 89886082, 89276911, 88838373, 88562754, 88475262, 88600090, 88910211, 89345579, 89898108, 90639619, 91632642, 92852531, 94245041, 95823493, 97644606, 99716037, 102004263, 104519217, 107308778, 110371934, 113657736, 117143102, 120806643, 124506843, 127996913, 131108828, 133830393, 136154853, 137966087, 139157384, 139767126, 139878556, 139440224, 138305724, 136433916, 133956317, 131061316, 127895905, 124564950, 121136113, 117640299, 114131892, 110735412, 107561319, 104593337]
10496A04593337k851786k747428k567868k359147k204017k076985j912601j742729
10488H6130776j635878j555900j418345j250791j155189j126390j050931q93479
10480G6043873p47855o76663o28292n55013m92358m60352l94356k54475j17334
10471G1717175o8992p0919k5860P0820J46159J89470K69626M04544N11532N28176
10461G3671731N08769N40686O13220O44050O18586O20858P03649P98537Q11597
10452G9531683P64972P67407Q55330R43860R55172R23233R27489R76798J013125
10443H7659069R93837R16770P91523O40016N04883M03262K86753R8872j40197
10434I2154788l58053n26898o79661q37069r80316j099438j209374j306128j361110
$$ y = [104593337, 101741551, 98994123, 96426255, 94067108, 91863091, 89786106, 87873505, 86130776, 84494898, 82938998, 81520653, 80269862, 79114673, 77988283, 76937352, 76043873, 75296018, 74619355, 73991063, 73436050, 72943692, 72483340, 72088984, 71834509, 71717175, 71648183, 71577264, 71551404, 71622224, 71768383, 71957853, 72227479, 72632023, 73143555, 73671731, 74180500, 74721186, 75334406, 75978456, 76597042, 77217900, 77921549, 78720086, 79531683, 80296655, 81064062, 81919392, 82863252, 83818424, 84741657, 85669146, 86645944, 87659069, 88652906, 89569676, 90361199, 91001215, 91506098, 91909360, 92196113, 92294985, 92154788, 91796735, 91269837, 90590176, 89753107, 88772791, 87673353, 86463979, 85157851, 83796741]
10425H3796741j375060j387788j414054j414923j358068j270117j202178j167700
10417G3206853j135808j071348r71854q76050q30238q29129q07624p20998o10816
10408F5352988n46907n25276m83142m03136l31926k91470k44081j66297r4003
10399F2266750o3825n8263l8907R43L6274L5831j4098q0474r4375l7695P844l4716
10387F1925289j16037j37321j19246j65129k61525k73060j70257r6945j36456
10378F0449313j72601r6181j501k5541j09145r6692L312M3058j9177q0024q8511
10367E9806310j11498j83243k41206k48428k53941k93106l35261l61179l91498
10358E7386950m14473l88493l38365l40485l87144l81388l01334k47757k77114
$$ y = [83796741, 82421681, 81033893, 79619839, 78204916, 76846848, 75576731, 74374553, 73206853, 72071045, 70999697, 70027843, 69151793, 68321555, 67492426, 66684802, 65963804, 65352988, 64806081, 64280805, 63797663, 63394527, 63062601, 62771131, 62527050, 62360753, 62266750, 62202925, 62144662, 62105755, 62106698, 62142972, 62178803, 62164705, 62084231, 61989856, 61952161, 61960005, 61925289, 61809252, 61671931, 61552685, 61387556, 61126031, 60852971, 60682714, 60585769, 60449313, 60276712, 60180531, 60179030, 60153489, 60044344, 59947652, 59950964, 59994022, 59974845, 59894821, 59806310, 59694812, 59511569, 59270363, 59021935, 58767994, 58474888, 58139627, 57778448, 57386950, 56972477, 56583984, 56245619, 55905134, 55517990, 55136602, 54835268, 54587511, 54310397]
10349E4310397l07506k59807j82229j52922j56541j47327j47604j84911k03859
10340E2567691j45919o3267m9852r6868j14910p4584l3597l6300o5274q7659q5923
10329E1713538m9589J1038N5018N8179M8034N1927M8942K3709K1160P8579J42699
10318E2203234J34864P1968L9487O1753Q3817P4653O3531O8879O8823N4589M4925
10307E2970523L6552N877k9605k0537K7014M2955j539m5688l3983k428j9470p8807
10295E2850864j06855o5321j665J1234l7203q5233p7779l9151l9488r0871j24165
10284E2194367r3230m9369o0039r7170q0540r063L5547J5938j1510P471N1371
10273E1903773P4219P1757O3152N2786M1520L9724M5890M6328N0047Q1776J26020
$$ y = [54310397, 54002891, 53743084, 53560855, 53407933, 53251392, 53104065, 52956461, 52771550, 52567691, 52421772, 52358505, 52308653, 52211785, 52096875, 52022291, 51988694, 51952394, 51887120, 51799461, 51713538, 51663949, 51674987, 51730005, 51788184, 51836218, 51888145, 51937087, 51960796, 51981956, 52060535, 52203234, 52338098, 52410066, 52449553, 52511306, 52595123, 52669776, 52733307, 52802186, 52871009, 52925598, 52970523, 53007075, 53012952, 52983347, 52962810, 52989824, 53032779, 53031240, 52985552, 52951569, 52949141, 52929671, 52850864, 52744009, 52678688, 52677023, 52688257, 52651054, 52565821, 52488042, 52448891, 52409403, 52318532, 52194367, 52101137, 52051768, 51991729, 51894559, 51814019, 51804956, 51840503, 51856441, 51844931, 51852402, 51903773, 51977992, 52049749, 52112901, 52165687, 52207207, 52246931, 52292821, 52339149, 52389196, 52470972, 52596992]
10262E2596992J29096Q1469M6210O9094J06047Q7639K4377m810M1119J13940J37100
10251E3428273R3414M0180M0602Q8854J20627J03131Q0652J00885J33566J20119
10241E4350303P9910Q9259J54705J89794J42738P5344P5580J45975K18647K39726
10231E5761981K07420J63680J69992K50007L40890L53137K93198K62681L14483
10222E8117469L85166M06172M01463M19187M40570M28137M05756M16881M50076
10213F1870877M74017M98223N30063N25427M64665M27446M94202O07106O33157
10204F6525183N49450M65590M66589N30422O07234O85723P59086Q06213Q37570
10195G2233060Q99486J008513J130474J238469J345577J473076J629993J823307
$$ y = [52596992, 52726088, 52807557, 52853767, 52922861, 53028908, 53116547, 53140924, 53136114, 53177233, 53291173, 53428273, 53521687, 53561867, 53602469, 53691323, 53811950, 53915081, 53995733, 54096618, 54230184, 54350303, 54430213, 54519472, 54674177, 54863971, 55006709, 55082053, 55157633, 55303608, 55522255, 55761981, 55969401, 56133081, 56303073, 56553080, 56893970, 57247107, 57540305, 57802986, 58117469, 58502635, 58908807, 59310270, 59729457, 60170027, 60598164, 61003920, 61420801, 61870877, 62344894, 62843117, 63373180, 63898607, 64363272, 64790718, 65284920, 65892026, 66525183, 67074633, 67540223, 68006812, 68537234, 69144468, 69830191, 70589277, 71395490, 72233060, 73132546, 74141059, 75271533, 76510002, 77855579, 79328655, 80958648, 82781955]
10187H2781955K046744K274348K512072K819091L196040L476390L435330L021676
10179A05563646K404153J790036J285385R16695O50405L52156j41477q28584j503591
10170A10488824j979211k265522k464154k579989k541702k350279k097539j855791
10162I2354637j631140j415692j219379j051603r13899q02841o97507n72830m46332
10153H3603414l67242l34865k85275j91140j05691o4539k3851M2678P2244K5096
10143H2370829j2392N2931J62736J93372J52958J56637K35069L14052L76292M89437
10133H4491921O55202P83902Q62269R98818J235709J454260J556590J613237J716930
10124I5368838J802929J757953J625485J537904J483950J314399R85166O36704
$$ y = [82781955, 84828699, 87103047, 89615119, 92434210, 95630250, 99106640, 102541970, 105563646, 107967799, 109757835, 111043220, 111959915, 112610320, 112962476, 112820999, 111992415, 110488824, 108509613, 106244091, 103779937, 101199948, 98658246, 96307967, 94210428, 92354637, 90723497, 89307805, 88088426, 87036823, 86122924, 85320083, 84622576, 84049746, 83603414, 83236172, 82901307, 82616032, 82424892, 82319201, 82254662, 82230811, 82273489, 82345733, 82370829, 82358437, 82411368, 82574104, 82767476, 82920434, 83077071, 83312140, 83626192, 84002484, 84491921, 85147123, 85931025, 86793294, 87792112, 89027821, 90482081, 92038671, 93651908, 95368838, 97171767, 98929720, 100555205, 102093109, 103577059, 104891458, 105876624, 106513328]
10116A06513328L87334J82111q2740l92499o58653q53528j006686j116538j157706
10107A01814423j149565j133692j096854r93947q40690p05862o07650m94713l44479
10098I4446971k03769j05116j5557R4150J97818K75705L60766M70091N58213O03981
10088I6683253O74461Q19945R73850J061290J142951J316362J521063J607178
10080A05800353J583248J608142J707641J696956J466559J160098R44329P67148
10072A16734474N05578K13786J9999j31232m05270p76694j024922j052542j009706
10063A13073471j043424j095426j038192q76943p10776n82843m67192l47792k30381
10054A06680502j10225J7658J44275K72048M17880N74120P12280Q34393R63533
$$ y = [106513328, 106900662, 107082773, 107000033, 106607534, 105948881, 105095353, 104088667, 102972129, 101814423, 100664858, 99531166, 98434312, 97440365, 96599675, 95893813, 95286163, 94791450, 94446971, 94243202, 94138086, 94122529, 94216679, 94414497, 94690202, 95050968, 95521059, 96079272, 96683253, 97357714, 98177659, 99151509, 100212799, 101355750, 102672112, 104193175, 105800353, 107383601, 108991743, 110699384, 112396340, 113862899, 115022997, 115967326, 116734474, 117240052, 117453838, 117473837, 117342605, 116937335, 116160641, 115135719, 114083177, 113073471, 112030047, 110934621, 109896429, 109019486, 108308710, 107725867, 107258675, 106910883, 106680502, 106570277, 106587935, 106732210, 107004258, 107422138, 107996258, 108708538, 109542931, 110506464]
10045A10506464J078088J127685J126982J154102J235152J311454J347811J390377
10037A20278115J484363J614144J757909J922714K097574K259526K453246K763928
10029A36631519L178755L590016L977262M451281N049804N635844O104448O551849
10021A75170778P092874P607812P819417P554480O811998N676790M330835L063787
10013B25128771K060436J183719J29854j207508k661724m034345n228647o158593
10005B09211963o731775o972683p008065o890450o579070o117849n662091n276861
9997A57973119m871847m400851l963769l627113l300508k899191k494362k189147
9989A30226331j968979j793383j713720j757150j794787j686888j499566j427866
$$ y = [110506464, 111584552, 112712237, 113839219, 114993321, 116228473, 117539927, 118887738, 120278115, 121762478, 123376622, 125134531, 127057245, 129154819, 131414345, 133867591, 136631519, 139810274, 143400290, 147377552, 151828833, 156878637, 162514481, 168618929, 175170778, 182263652, 189871464, 197690881, 205245361, 212057359, 217734149, 222064984, 225128771, 227189207, 228372926, 228502780, 227295272, 224633548, 220599203, 215370556, 209211963, 202480188, 195507505, 188499440, 181608990, 175029920, 168912071, 163249980, 157973119, 153101272, 148700421, 144736652, 141109539, 137809031, 134909840, 132415478, 130226331, 128257352, 126463969, 124750249, 122993099, 121198312, 119511424, 118011858, 116583992]
9981A16583992j539487j723672j861829j925154j926057j888387j853978j826473
9973A02038955j736261j550777j371242j307022j299788j207588j033008r15255
9965I1618014q99827q76304p73010o60480o05357n58921m69785l91338l80886
9956H6002106l81433l09949k04483j77503k50753l30210l40426l07330k95631
9947H3404388l20282l45201l42015l25747l31600l64117l84836l63517l23369
9938H0303704l05395l02750k74845k20699j84694j82151j73781j31953q1285m9378
9928G8396773k4777P697L3483M0444M3506M7128K6628j8772m1215j7639k891n0724
9916G8439641j17593j16568m8432k036k1699m9173k1710L5874N9440M3183M0063
$$ y = [116583992, 115044505, 113320833, 111459004, 109533850, 107607793, 105719406, 103865428, 102038955, 100302694, 98751917, 97380675, 96073653, 94773865, 93566277, 92533269, 91618014, 90718187, 89841883, 89068873, 88408393, 87803036, 87244115, 86774330, 86382992, 86002106, 85620673, 85310724, 85106241, 84928738, 84677985, 84347775, 84007349, 83700019, 83404388, 83084106, 82738905, 82396890, 82071143, 81739543, 81375426, 80990590, 80627073, 80303704, 79998309, 79695559, 79420714, 79200015, 79015321, 78833170, 78659389, 78527436, 78446151, 78396773, 78371996, 78379693, 78413176, 78453620, 78497126, 78544254, 78570882, 78552110, 78510895, 78493256, 78490365, 78439641, 78322048, 78205480, 78157048, 78155012, 78133313, 78084140, 78062430, 78098304, 78157744, 78200927, 78240990]
9905G8240990Q5217J62782K40982L00684L28192L17168K92471L05196L83485N02251
9895H1159418O15869P05126P76565Q36267Q91513R65430J079769J229520J399162
9886H9658639J589118J795948J994336K190641K460942K846266L224238L407031
9878A09167159L387805L343367L322965L102780K507501J745093J189006Q73401
9870A28639077M59010k63034j080433j684145k068867k426396k787525k997378
9862A15790309k992009k881938k741955k498134k095441j656214j378554j325835
9854I8220229j374266j341870j142567q46899o17636n63509o41048p14416p04212
9845I0273806o46531o15510o35479o77309o99848o80235o33268o09387o44096
$$ y = [78240990, 78326207, 78488989, 78729971, 79030655, 79358847, 79676015, 79968486, 80273682, 80657167, 81159418, 81775287, 82480413, 83256978, 84093245, 84984758, 85950188, 87029957, 88259477, 89658639, 91247757, 93043705, 95038041, 97228682, 99689624, 102535890, 105760128, 109167159, 112554964, 115898331, 119221296, 122324076, 124831577, 126576670, 127765676, 128639077, 129098087, 128835053, 127754620, 126070475, 124001608, 121575212, 118787687, 115790309, 112798300, 109916362, 107174407, 104676273, 102580832, 100924618, 99546064, 98220229, 96845963, 95504093, 94361526, 93514627, 92896991, 92333482, 91692434, 90978018, 90273806, 89627275, 89011765, 88376286, 87698977, 86999129, 86318894, 85685626, 85076239, 84432143]
9836H4432143p04141p17054o61655n93275n63623n49940m90923l72111k44684
9827G9534737j62568j24870r0935l9223J0837M0294O6751J11915J54563J61166
9817G9662667J52375J78519K26842K28558J78914J61251K03652K07810J06067
9808H1306655J823K9421J33298J38012J8800o1097p747O7603L7531n3232q8414
9797H1522653o6853p3047j28313j87729k47411l44709m66183n52437n93803o37722
9787G8224446o97487p33154p33917p41215p65453p51361o65677n61153n03512
9778G2071517m76905m18884l25196k58681k54593k70629k48890j87882j26152
9769F9503705q3390n2157l0518k2458j0675K9722Q5576J15334J15141J29461J75828
$$ y = [84432143, 83728002, 83010948, 82349293, 81756018, 81192395, 80642455, 80151532, 79779421, 79534737, 79372169, 79247299, 79156364, 79117141, 79127978, 79168272, 79235023, 79346938, 79501501, 79662667, 79815042, 79993561, 80220403, 80448961, 80627875, 80789126, 80992778, 81200588, 81306655, 81308478, 81337899, 81471197, 81609209, 81628009, 81566912, 81559165, 81626768, 81664299, 81611067, 81522653, 81455800, 81382753, 81254440, 81066711, 80819300, 80474591, 80008408, 79455971, 78862168, 78224446, 77526959, 76793805, 76059888, 75318673, 74553220, 73801859, 73136182, 72575029, 72071517, 71594612, 71175728, 70850532, 70591851, 70337258, 70066629, 69817739, 69629857, 69503705, 69420315, 69368158, 69337640, 69315182, 69304507, 69334229, 69419805, 69535139, 69650280, 69779741, 69955569]
9758F9955569K10192K01871J91204K22452K67496K80184K82980L20766L65346
9749G2298060L61139L40224L80054M54692M54571L70541L24348L71596M08403
9740G5763628L47230K59820K44522K60409K15497J33146R5396Q5374K8871n2117
9730G7381776p5566o2939j13058k17131k56863k08312j92369k71716l42486l07549
9720G5333787k35206k43579l17508l49789l06845k49829k22926k11194j95548
9711G3001363j77047j51673j14480q0949o2356l5961J9435P8270J02898J05290
9701G2684790J26334J65756J82627J65064J52894J77522K11428J98744J24247
9692G4189406L3701k0649m5010r0802j70332k25570k17695k07743k78471l96487
$$ y = [69955569, 70165761, 70367632, 70558836, 70781288, 71048784, 71328968, 71611948, 71932714, 72298060, 72659199, 72999423, 73379477, 73834169, 74288740, 74659281, 74983629, 75355225, 75763628, 76110858, 76370678, 76615200, 76875609, 77091106, 77224252, 77319648, 77405022, 77433893, 77381776, 77306210, 77243271, 77130213, 76913082, 76656219, 76447907, 76255538, 75983822, 75641336, 75333787, 75098581, 74855002, 74537494, 74187705, 73880860, 73631031, 73408105, 73196911, 73001363, 72824316, 72672643, 72558163, 72477214, 72414858, 72378897, 72398332, 72476602, 72579500, 72684790, 72811124, 72976880, 73159507, 73324571, 73477465, 73654987, 73866415, 74065159, 74189406, 74223107, 74202458, 74157448, 74066646, 73896314, 73670744, 73453049, 73245306, 72966835, 72570348]
9682G2570348m42071l83065l23291l46855m07705m26105m08554m01242l97086
9673F9034374l70910l50566l69567l93848l75121l33783l09953k79936k08925
9664F6041765j37699j16485r9955k4345N4074L7662k1920K5599J82215K77657
9654F6218568K33071J78964K35266L33818L67704L77084M48491N36814N40417
9645F9470197M81867M64096M95125M99819M67640M40014L74929J84949q3654k65983
9635G2528999l05293l23120m18639n37755o08604o72731p81889q71492q55135
9626F7154341p72900p28589p28616o96918o18308n54447n29166n02798m62730
9617F1559869m42143m34708l82985k81330k10238k26040k78651k84831k36766
$$ y = [72570348, 72128277, 71745212, 71421921, 71075066, 70667361, 70241256, 69832702, 69431460, 69034374, 68663464, 68312898, 67943331, 67549483, 67174362, 66840579, 66530626, 66250690, 66041765, 65904066, 65787581, 65687626, 65663281, 65717355, 65755017, 65733097, 65758696, 65940911, 66218568, 66451639, 66630603, 66865869, 67199687, 67567391, 67944475, 68392966, 68929780, 69470197, 69952064, 70416160, 70911285, 71411104, 71878744, 72318758, 72693687, 72878636, 72794982, 72528999, 72223706, 71900586, 71481947, 70944192, 70335588, 69662857, 68880968, 68009476, 67154341, 66381441, 65652852, 64924236, 64227318, 63609010, 63054563, 62525397, 62022599, 61559869, 61117726, 60683018, 60300033, 60018703, 59808465, 59582425, 59303774, 59018943, 58782177]
9608E8782177j93088j94483k27803k53391k40274j90914j46609j47311j78587
9599E7009717j87891j58128j24811j13231j09474j08008j26708j46908j06841
9590E5827717k622O9958M0983k3543j9616L4485L8461j6267l1725L0823Q7852
9579E6036506P4485M4323O7750J17183J32420J34241J80260K47435K58375K16049
9569E7509027K17964L14087M24949M42739L66202K88366K75867L08421L34348
9560F0481970L41029L46333L45365L07276K31377J69442J63934J88631J88587
9551F2763944J61458J47122J41328Q6418k8482j19926j11385m2553k2599r4106
9541F2881219j94333k45305k37542k18295k27512k57694k68800k42422k14877
$$ y = [58782177, 58589089, 58394606, 58166803, 57913412, 57673138, 57482224, 57335615, 57188304, 57009717, 56821826, 56663698, 56538887, 56425656, 56316182, 56208174, 56081466, 55934558, 55827717, 55825095, 55895053, 55936036, 55912493, 55892877, 55927362, 55965823, 55949556, 55917831, 55948654, 56036506, 56110991, 56155314, 56223064, 56340247, 56472667, 56606908, 56787168, 57034603, 57292978, 57509027, 57726991, 58041078, 58466027, 58908766, 59274968, 59563334, 59839201, 60147622, 60481970, 60822999, 61169332, 61514697, 61821973, 62053350, 62222792, 62386726, 62575357, 62763944, 62925402, 63072524, 63213852, 63300270, 63271788, 63151862, 63040477, 62997924, 62975325, 62881219, 62686886, 62441581, 62204039, 61985744, 61758232, 61500538, 61231738, 60989316, 60774439]
9532F0774439k32212k73902k66601j91553j26337j40285j93738j96308j33770
9523E9019733p4913o6252p7702n3575K3183J18105J74569J73356J77996K75326
9513E9689826M40476N26555M48678L10686K62066K93030K88597K35103K20459
9504F2715476K43034J89951L9438p5867p7573p2737j80562l42859m20482l96245
9494F1621574l68619l99896m74083n64453o50314o96766o94014o85776o98132
9485E6389521o87918o24709n62390n52060n48414m92629m24006m06531m07354
9476E1683510l65653l22100l42922l67477k92602j75936j72175k68468k79174
9467D9097003j41081j8014l5504r6021p0349p680j0351l5504P393O1071J0656
$$ y = [60774439, 60542227, 60268325, 60001724, 59810171, 59683834, 59543549, 59349811, 59153503, 59019733, 58944820, 58878568, 58800866, 58747291, 58770474, 58888579, 59063148, 59236504, 59414500, 59689826, 60130302, 60656857, 61105535, 61416221, 61678287, 61971317, 62259914, 62495017, 62715476, 62958510, 63148461, 63187899, 63112032, 63034459, 62961722, 62781160, 62438301, 62017819, 61621574, 61252955, 60853059, 60378976, 59814523, 59164209, 58467443, 57773429, 57087653, 56389521, 55701603, 55076894, 54514504, 53962444, 53414030, 52921401, 52497395, 52090864, 51683510, 51317857, 50995757, 50652835, 50285358, 49992756, 49816820, 49644645, 49376177, 49097003, 48955922, 48937908, 48902404, 48806383, 48736034, 48728354, 48718003, 48682499, 48689892, 48750963, 48761619]
9456D8761619q9020p2397O1924J25253K3228j02001q8669K0409P4544M3641K9074
9445D8787605Q6659J53533J58844J21643J06425J35351J82809K24044K48919K46863
9435E0452695K22397K18678K75599L56390L71052K99647K35062K54710L04893
9426E2991123K87626K19563K02391K50271K63176J90654J08115Q4075P5968K5288
9416E4698250l5791n7400p5247j43811k23953k41430k18949k43590l22748l76119
9406E2759212l66926l44033l44644l43860l21253l01256l00494k95816k69910
9397D9871020k39476k19363k01354j80382j62793j44924j20522j01706r1551n8303
9387D8350646N982L1488m0751j37221j25781j3051N0131j2150r8309j01176o3644
$$ y = [48761619, 48672599, 48600202, 48662126, 48787379, 48810607, 48708606, 48619937, 48640346, 48714890, 48758531, 48787605, 48874264, 49027797, 49186641, 49308284, 49414709, 49550060, 49732869, 49956913, 50205832, 50452695, 50675092, 50893770, 51169369, 51525759, 51896811, 52196458, 52431520, 52686230, 52991123, 53278749, 53498312, 53700703, 53950974, 54214150, 54404804, 54512919, 54596994, 54672962, 54698250, 54662459, 54605059, 54529812, 54386001, 54162048, 53920618, 53701669, 53458079, 53135331, 52759212, 52392286, 52048253, 51703609, 51359749, 51038496, 50737240, 50436746, 50140930, 49871020, 49631544, 49412181, 49210827, 49030445, 48867652, 48722728, 48602206, 48500500, 48408949, 48350646, 48356628, 48388116, 48347365, 48210144, 48084363, 48071312, 48121443, 48109293, 48010984, 47909808, 47846164]
9376D7846164p4328j07736q4986k8816l1439r6361j31751j00072o7589q5559j13473
9365D6924054r7368n5449m0948o4599r4292j03489q8436n7219k5978j1328j0097
9354D6274851j841J5940J5535j8681n3783m3340N841L3170R49n4425p0875m2598
9342D6060743j9163k7843l9517k4655j93P704J0122K6542M1650L5869K9459M4343
9330D6145061N1476J9621j0745J8461P3362O6675K378k2740K3132N8435L2257
9319D6457373M460K7467N6830N1721O0648J18669J57147J20125P9312J12971J56898
9308D7403621J19616P0310J38095K71835K96974K03018J67747K62302L40264K99148
9298D9572930K54851L26871M15887L65468K30189J94237K84074L47002K99146
$$ y = [47846164, 47771836, 47664100, 47579114, 47550298, 47518859, 47422498, 47290747, 47190675, 47123086, 47037527, 46924054, 46826686, 46771237, 46730289, 46665690, 46571398, 46467909, 46379473, 46322254, 46296276, 46284948, 46274851, 46273010, 46288950, 46304485, 46285804, 46232021, 46188681, 46194522, 46227692, 46228641, 46174216, 46103341, 46060743, 46041580, 46013737, 45974220, 45949565, 45949372, 45957076, 45967198, 45993740, 46035390, 46071259, 46100718, 46145061, 46196537, 46216158, 46205413, 46223874, 46297236, 46363911, 46366289, 46343549, 46366681, 46425116, 46457373, 46461833, 46489300, 46546130, 46597851, 46658499, 46777168, 46934315, 47054440, 47133752, 47246723, 47403621, 47523237, 47593547, 47731642, 48003477, 48300451, 48503469, 48671216, 48933518, 49273782, 49572930, 49827781, 50154652, 50570539, 50936007, 51166196, 51360433, 51644507, 51991509, 52290655]
9289E2290655K23464K01104J96461J60318J24232J22700J13745N4367r983q903
9279E3468160M2955P2633N7610L5923K2308r508n3349n2844Q963N9755K9394m6448
9267E3635552p5398m0956j5352l8619o0564l1876J5230K7971K1817M5404R2739
9256E3575948J17524J12442J08817J14505J18034J37764J93146K39566K16255
9247E4934001J56112J54114K17093K48132K08864J87873K52266L33749L42373
9238E7034577L08092L12978L48713L49110L20836L28753L70162L74567L33171
9229F0080959L25206L86939M41784M10338L29706L03350L60823M26444M31012
9220F3496561M06979M35142N16470N60259N24839N01316N82479O99339P04795
$$ y = [52290655, 52514119, 52715223, 52911684, 53072002, 53196234, 53318934, 53432679, 53487046, 53477063, 53468160, 53511115, 53583748, 53641358, 53677281, 53699589, 53690081, 53636732, 53583888, 53592851, 53652606, 53682000, 53635552, 53560154, 53519198, 53503846, 53465227, 53404663, 53372787, 53388017, 53415988, 53437805, 53483209, 53575948, 53693472, 53805914, 53914731, 54029236, 54147270, 54285034, 54478180, 54717746, 54934001, 55090113, 55244227, 55461320, 55709452, 55918316, 56106189, 56358455, 56692204, 57034577, 57342669, 57655647, 58004360, 58353470, 58674306, 59003059, 59373221, 59747788, 60080959, 60406165, 60793104, 61234888, 61645226, 61974932, 62278282, 62639105, 63065549, 63496561, 63903540, 64338682, 64855152, 65415411, 65940250, 66441566, 67024045, 67723384, 68428179]
9211F8428179O03917N58625O37776P16501O92169O45307O72487P00974O24942
9202G4280877N14451N06918N68036N54352M63884M21879M42089M13235L25458
9193G8491179K94526L30185K97451J67484R3102J47010J92054J27180O3848J11763
9183H0315782J71789J19584M0136P8673J79494J86225J14977J10979J87704K21711
9173H1727054J81707J62318J94177K04990J76655J71463J93055J83262J61257
9164H3355938J98621K53484K14666J25631J59274L25847M20756L43471K56903
9155H5654591L13244M21923M44511M41698N35208O62485O81172O25873O49117
9146I0429822P63719Q50657Q92183R89661J148050J244102J245912J282366J431135
$$ y = [68428179, 69032096, 69590721, 70228497, 70944998, 71637167, 72282474, 72954961, 73655935, 74280877, 74795328, 75302246, 75870282, 76424634, 76888518, 77310397, 77752486, 78165721, 78491179, 78785705, 79115890, 79413341, 79580825, 79673927, 79820937, 80012991, 80140171, 80204019, 80315782, 80487571, 80607155, 80647291, 80725964, 80905458, 81091683, 81206660, 81317639, 81505343, 81727054, 81908761, 82071079, 82265256, 82470246, 82646901, 82818364, 83011419, 83194681, 83355938, 83554559, 83808043, 84022709, 84148340, 84307614, 84633461, 85054217, 85397688, 85654591, 85967835, 86389758, 86834269, 87275967, 87811175, 88473660, 89154832, 89780705, 90429822, 91193541, 92044198, 92936381, 93926042, 95074092, 96318194, 97564106, 98846472, 100277607]
9137A00277607J594107J660398J655414J638580J576022J426487J262367J184307
9129A12275289J168901J109805R77078Q38079P41126O72876O28451O37097P00237
9120A19748939P71649Q27299R06729J053822J247358J421776J544611J650080
9112A29172263J794518J989340K188195K346492K483140K658716K891622L132494
9104A48656780L342276L558191L840241M176982M501497M796416N120440N510185
9096A83503008N911303O246815O510448O734683O888404O873104O627210O179850
9088B35474825N589544M889295M120494L356024K626609J866025J007179J13428
9080B59043423o71125j302208j869966k421398k843991k999718k911376k730089
$$ y = [100277607, 101871714, 103532112, 105187526, 106826106, 108402128, 109828615, 111090982, 112275289, 113444190, 114553995, 115531073, 116369152, 117110278, 117783154, 118411605, 119048702, 119748939, 120520588, 121347887, 122254616, 123308438, 124555796, 125977572, 127522183, 129172263, 130966781, 132956121, 135144316, 137490808, 139973948, 142632664, 145524286, 148656780, 151999056, 155557247, 159397488, 163574470, 168075967, 172872383, 177992823, 183503008, 189414311, 195661126, 202171574, 208906257, 215794661, 222667765, 229294975, 235474825, 241064369, 245953664, 250074158, 253430182, 256056791, 257922816, 258929995, 259043423, 258372298, 257070090, 255200124, 252778726, 249934735, 246935017, 244023641, 241293552]
9072B41293552k556729k384537k193809j997103j776803j472067j069270o39168
9064B27204066k43431J37650N38484R22494J221000J418263J530835J523966J322803
9055B35576130R16465L95054j40313o70650j243660j892716k593877l288482l926070
9046B23131881m483825m952737n313138n536832n621104n605899n537348n422047
9038A80658951n242032n011263m783874m593813m414938m205446l973026l764115
9030A44670444l594280l425301l224238l015834k847203k713562k556564k346009
9022A20947453k131556j985465j909233j832602j707692j569041j478959j437305
9014A06895600j380032j263543j117808j004312r45507r15665q84976q45421p97690
$$ y = [241293552, 238736823, 236352286, 234158477, 232161374, 230384571, 228912504, 227843234, 227204066, 226960635, 227098285, 227636769, 228559263, 229780263, 231198526, 232729361, 234253327, 235576130, 236492595, 236887649, 236747336, 236076686, 234833026, 232940310, 230346433, 227057951, 223131881, 218648056, 213695319, 208382181, 202845349, 197224245, 191618346, 186080998, 180658951, 175416919, 170405656, 165621782, 161027969, 156613031, 152407585, 148434559, 144670444, 141076164, 137650863, 134426625, 131410791, 128563588, 125850026, 123293462, 120947453, 118815897, 116830432, 114921199, 113088597, 111380905, 109811864, 108332905, 106895600, 105515568, 104252025, 103134217, 102129905, 101184398, 100268733, 99383757, 98538336, 97740646]
9005I7740646p42011o90435o63898o62083o56124o29971o09282o21876o45461
8996I1819505o32755n83832n50317n59435n77325n68385n49905n53029n60738
8987H6683784n30147m63365m12492m11733m36190m35805l92052l36009l15926
8978H2950065l40200l54961l06820k32583k35097l38393m24798l81085k63858
8969H0072270k29773l17811m02281l78467k97639k70700l14347l58585l59723
8960G7142944l39224l28819l27288l09565k56193j81609j36078j53407j98177
8951G4912584k06653j78989j72817k00766k10104j83908j75647k04363k07934
8942G3171403j59823j37866j93843k44378j99419j22314j31823k02257k09123
$$ y = [97740646, 96998635, 96308200, 95644302, 94982219, 94326095, 93696124, 93086842, 92464966, 91819505, 91186750, 90602918, 90052601, 89493166, 88915841, 88347456, 87797551, 87244522, 86683784, 86153637, 85690272, 85277780, 84866047, 84429857, 83994052, 83602000, 83265991, 82950065, 82609865, 82254904, 81948084, 81715501, 81480404, 81142011, 80717213, 80336128, 80072270, 79842497, 79524686, 79122405, 78743938, 78446299, 78175599, 77861252, 77502667, 77142944, 76803720, 76474901, 76147613, 75838048, 75581855, 75400246, 75264168, 75110761, 74912584, 74705931, 74526942, 74354125, 74153359, 73943255, 73759347, 73583700, 73379337, 73171403, 73011580, 72873714, 72679871, 72435493, 72236074, 72113760, 71981937, 71779680, 71570557]
8933G1570557j40975j05822j31161j23769n5966k8139q5147j20275n0945L7772
8923G0766130L3563k1779j3164N9078R7697P3181N1136P2318J07219J27098J37083
8912G1489560J38930J29932J34299J71846K05308J85354J38439J37152J85275
8903G2916095K09193J73921J30838J24188J22085Q5586M9786P3496J36051J51164
8893G4172403Q9435L3256P5672J92143K61524K16737J22891P5424O9855L5953
8883G5345293k9335n3559j8736o556p6511j77416k31670k40350k45553k48077
8873G4017530k29522k07217j99268j77862j22512p5365p5672q6742o1958l3423
8863G2747989n0389p9150o0566k1818k4685m4970k2017J0566k0029o8588k5092
$$ y = [71570557, 71429582, 71323760, 71192599, 71068830, 71012864, 70984725, 70899578, 70779303, 70728358, 70766130, 70799693, 70777914, 70764750, 70823828, 70921525, 70994706, 71045842, 71118160, 71225379, 71352477, 71489560, 71628490, 71758422, 71892721, 72064567, 72269875, 72455229, 72593668, 72730820, 72916095, 73125288, 73299209, 73430047, 73554235, 73676320, 73761906, 73811692, 73885188, 74021239, 74172403, 74261838, 74295094, 74370766, 74562909, 74824433, 75041170, 75164061, 75239485, 75309340, 75345293, 75315958, 75262399, 75243663, 75237107, 75160596, 74983180, 74751510, 74511160, 74265607, 74017530, 73788008, 73580791, 73381523, 73203661, 73081149, 73005784, 72930112, 72843370, 72781412, 72747989, 72697600, 72618450, 72557884, 72536066, 72511381, 72466411, 72444394, 72454960, 72434931, 72366343, 72341251]
8852G2341251Q3412J12518L8013n42O6577J39429J46624J64113K41639K84546
8842G3617580K36363K21033L45682M95186N03344M22406M22423M95942M80748
8833G7240707L50073K61857K94544L29494K59308J51227J14658J28010R8021J5737
8823G9243636l8677j0787P3493J54298K04206K51658L38390M46263N01504M84440
8813H1648424M80876N56344O31426N80817M22195K92700K53120K36004J86528
8804H5288434J26398O0622m9613j83881k52133k32600k08080k19352j99845j11910
8794H4018040k6743K570K9414R2591J26099Q9256O9185J30661J72442Q1821n7156
8783H4728180q1670j5236k6372j47207k29896k02721j79683k51168l31414l13560
$$ y = [72341251, 72424663, 72537181, 72575194, 72574652, 72641229, 72780658, 72927282, 73091395, 73333034, 73617580, 73853943, 74074976, 74420658, 74915844, 75419188, 75841594, 76264017, 76759959, 77240707, 77590780, 77852637, 78147181, 78476675, 78735983, 78887210, 79001868, 79129878, 79227899, 79243636, 79204959, 79194172, 79267665, 79421963, 79626169, 79877827, 80216217, 80662480, 81163984, 81648424, 82129300, 82685644, 83317070, 83897887, 84320082, 84612782, 84865902, 85101906, 85288434, 85414832, 85475454, 85425841, 85241960, 84989827, 84757227, 84549147, 84329795, 84129950, 84018040, 83991297, 83993867, 84023281, 84115872, 84241971, 84331227, 84400412, 84531073, 84703515, 84785336, 84728180, 84646510, 84631274, 84604902, 84457695, 84227799, 84025078, 83845395, 83594227, 83262813, 82949253]
8773H2949253k47393k43330k88849k86015k19910j67793j59156j37978p4661k1348
8763H1102820k1459l5097l352O1007J03847J22705J64033K31171K65024K42238
8753H2232937K29299K87534L74387M10489M09439M50394N36519N86672N79392
8744H6097062N91309O51257O69828N86398M85839M73189N13657N06603M52823
8735I1027965M25819M23574L82035L14512L05799L68032M25490M52271N04840
8726I4630337N97514O66795O98058P73650R34777J087605J117967J041887R88139
8717A02536729J069575J293288J550178J692545J689903J693365J837910J986238
8709A15349731J827237J286447O85839L86457L85505L87006J74936k23488o74047
$$ y = [82949253, 82701860, 82458530, 82169681, 81883666, 81663756, 81495963, 81336807, 81198829, 81124168, 81102820, 81081361, 81046264, 81042912, 81103919, 81207766, 81330471, 81494504, 81725675, 81990699, 82232937, 82462236, 82749770, 83124157, 83534646, 83944085, 84394479, 84930998, 85517670, 86097062, 86688371, 87339628, 88009456, 88595854, 89081693, 89554882, 90068539, 90575142, 91027965, 91453784, 91877358, 92259393, 92573905, 92879704, 93247736, 93673226, 94125497, 94630337, 95227851, 95894646, 96592704, 97366354, 98301131, 99388736, 100506703, 101548590, 102536729, 103606304, 104899592, 106449770, 108142315, 109832218, 111525583, 113363493, 115349731, 117176968, 118463415, 119149254, 119535711, 119921216, 120308222, 120483158, 120259670, 119585623]
8700A19585623j070027j340874j463635j493075j499675j470231j337139j099840
8692A08811127q46767o55237n23908m00395k38465n1289O3311Q441j53691k11117
8682A05802010n4117J62980K25093J42514Q1922P3492j1363j91569l01377k51846
8672A05677739j80977k32556l36467l48045k92290l06778m04221m56699m04773
8663A02714933l35569l24788l20520k44360j27679o8891q8197j00422m1788L5255
8653A01097974M0304r881J356J17826K21196J84379O2313K7329J28664K32081
8643A02103541K23810J62476J65946K38121K95524L07136L14185L39381L61841
8634A04511961L76052M06680M59611N08472N34976N46253N53081N61170N77947
$$ y = [119585623, 118515596, 117174722, 115711087, 114218012, 112718337, 111248106, 109910967, 108811127, 107964360, 107309123, 106785215, 106384820, 106146355, 106095066, 106158377, 106166818, 106013127, 105802010, 105747893, 105910873, 106135966, 106278480, 106360402, 106433894, 106422531, 106230962, 105929585, 105677739, 105496762, 105264206, 104927739, 104579694, 104287404, 103980626, 103576405, 103119706, 102714933, 102379364, 102054576, 101734056, 101489696, 101362017, 101293126, 101204929, 101104507, 101062719, 101097974, 101138278, 101128397, 101129753, 101247579, 101468775, 101653154, 101715467, 101742796, 101871460, 102103541, 102327351, 102489827, 102655773, 102893894, 103189418, 103496554, 103810739, 104150120, 104511961, 104888013, 105294693, 105754304, 106262776, 106797752, 107344005, 107897086, 108458256, 109036203]
8625A09036203O00619O07164N84463N52638N37796N36208N27258N03386M69759
8616A13955494M40495M48587N16445N95704N96155N15478M72276N43344O35166
8607A18719144O16452N28190N30906O54655P46674P05531O32761O68975P82880
8598A24586168Q37058Q03592P87847Q49941R21424R31286R20884R70396J067391
8589A32675987J124442J109092J084971J112497J168694J199762J210233J248358
8581A41934036J322047J385268J410472J423744J452695J484967J504184J527021
8573A53444434J569151J605544J607385J599150J634434J722164J817815J890158
8565A66890235J960474K063226K192736K308338K387665K462497K590120K782747
$$ y = [109036203, 109636822, 110243986, 110828449, 111381087, 111918883, 112455091, 112982349, 113485735, 113955494, 114395989, 114844576, 115361021, 115956725, 116552880, 117068358, 117540634, 118083978, 118719144, 119335596, 119863786, 120394692, 121049347, 121796021, 122501552, 123134313, 123803288, 124586168, 125423226, 126226818, 127014665, 127864606, 128786030, 129717316, 130638200, 131608596, 132675987, 133800429, 134909521, 135994492, 137106989, 138275683, 139475445, 140685678, 141934036, 143256083, 144641351, 146051823, 147475567, 148928262, 150413229, 151917413, 153444434, 155013585, 156619129, 158226514, 159825664, 161460098, 163182262, 165000077, 166890235, 168850709, 170913935, 173106671, 175415009, 177802674, 180265171, 182855291, 185638038]
8557A85638038K979889L113958L192541L280332L407197L546829L691318L878350
8549B12728452M113113M329003M478176M607956M786969N002076N200262N395870
8541B50641877N651862N968582O271414O511885O715649O923099P133276P301994
8533C03119638P339998P118746O545793N659041M619755L611018K745549K012056
8525C42771594J261352L16305q07534j835835k492918k778883k867311k787274
8517C30779496k402225j700420q70422n641J028149K232970L136431L079371J883704
8508C37161413J03758j424196k244420k565130l009077m074705n728320p473277
8500C10746046q824582r676320j0189108j0446922j0373917r940936r279657q553076
$$ y = [185638038, 188617927, 191731885, 194924426, 198204758, 201611955, 205158784, 208850102, 212728452, 216841565, 221170568, 225648744, 230256700, 235043669, 240045745, 245246007, 250641877, 256293739, 262262321, 268533735, 275045620, 281761269, 288684368, 295817644, 303119638, 310459636, 317578382, 324124175, 329783216, 334402971, 338013989, 340759538, 342771594, 344032946, 344349251, 343541717, 341705882, 339212964, 336434081, 333566770, 330779496, 328377271, 326676851, 325806429, 325800788, 326828937, 329061907, 332198338, 335277709, 337161413, 337265171, 335840975, 333596555, 331031425, 328022348, 323947643, 318219323, 310746046, 301921464, 292245144, 282056036, 271609114, 261235197, 251294261, 242014604, 233461528]
8492B33461528p829432p130278o507245o005372n603765n244950m896202m557999
8484A85686285m242255l958525l695735l415266l094619k773598k516314k329804
8476A59660169k163169j983152j802685j637015j484942j357313j270234j200527
8468A46761132j099326r61937q34065p35084o28256m88856l50432k51237j76892
8459A41235047r3557l812P3419J55497K80713M46323O06608P38559Q66039J001558
8449A45306394J117273J222523J419506J788984K246724K646282L029273L584480
8441A62361439M293770M885270N341377O128253P429459Q311970P398250M647982
8433B10797770J859006Q40745J422555J840261Q60663j141849l127286m601109
$$ y = [233461528, 225632096, 218501818, 211994573, 205989201, 200385436, 195140486, 190244284, 185686285, 181444030, 177485505, 173789770, 170374504, 167279885, 164506287, 161989973, 159660169, 157497000, 155513848, 153711163, 152074148, 150589206, 149231893, 147961659, 146761132, 145661806, 144699869, 143865804, 143130720, 142502464, 142013608, 141663176, 141411939, 141235047, 141141490, 141137678, 141211097, 141366594, 141647307, 142093630, 142700238, 143438797, 144304836, 145306394, 146423667, 147646190, 149065696, 150854680, 153101404, 155747686, 158776959, 162361439, 166655209, 171540479, 176881856, 183010109, 190439568, 198751538, 206149788, 210797770, 212656776, 213497521, 214920076, 216760337, 217621000, 216479151, 213351865, 208750756]
8425B08750756n620053o239021o465524o460665o353917o012920n308945m458633
8417A61831078l807613l400176l040886k671254k398854k223139k009412j713325
8409A40566419j403014j081753o98103l09440l4163J49311L81990P20846J109754
8400A39401847J517270J958725K434184K968070L607510M267018M783877N306464
8392A66244965O271292P554595P971160O391767L406991J101646Q05458J629501
8384B01377375J668592J66706k064905l979768n278963o136145o672246o954195
8376A72126451p084719p035489o644460n944434n262070m838158m560267m225024
8368A26531830l864883l628619l495648l319975l070570k838760k651891k445613
$$ y = [208750756, 203130703, 196891682, 190426158, 183965493, 177611576, 171598656, 166289711, 161831078, 158023465, 154623289, 151582403, 148911149, 146512295, 144289156, 142279744, 140566419, 139163405, 138081652, 137383549, 137074109, 137039946, 137189257, 137571247, 138292093, 139401847, 140919117, 142877842, 145312026, 148280096, 151887606, 156154624, 160938501, 166244965, 172516257, 180070852, 188042012, 194433779, 197840770, 198942416, 199747874, 201377375, 203045967, 203212673, 201147768, 197168000, 191889037, 185752892, 179080646, 172126451, 165041732, 158006243, 151361783, 145417349, 140155279, 135317121, 130756854, 126531830, 122666947, 119038328, 115542680, 112222705, 109152135, 106313375, 103661484, 101215871]
8360A01215871k207375k006064j868085j736383j576289j434204j357440j318427
8352H7711604j256557j159266j069239j026163j021268j007398r49113q62628
8344G9359972p99911p89444q02329p84656p16142o29814n78256n83525o16612
8335G3059283o26869n95216n52368n38770n57554n79243n81188n62982n29571
8326F7935522m83398m38676m24377m55129m99644m95964m19390l31073l21899
8317F4065972l91317m28490l57990k56146k44581l03615l05254k29341k08621
8308F1340617l09583m03030l50723k16617j67417k32510k97335k96873k78765
8299E8787764k81499k76463k49588k36784k50787k54900k33205k17177k25146
$$ y = [101215871, 99008496, 97002432, 95134347, 93397964, 91821675, 90387471, 89030031, 87711604, 86455047, 85295781, 84226542, 83200379, 82179111, 81171713, 80222600, 79359972, 78560061, 77770617, 76968288, 76183632, 75467490, 74837676, 74259420, 73675895, 73059283, 72432414, 71837198, 71284830, 70746060, 70188506, 69609263, 69028075, 68465093, 67935522, 67452124, 67013448, 66589071, 66133942, 65634298, 65138334, 64718944, 64387871, 64065972, 63674655, 63246165, 62888175, 62632029, 62387448, 62083833, 61778579, 61549238, 61340617, 61031034, 60628004, 60277281, 60060664, 59893247, 59660737, 59363402, 59066529, 58787764, 58506265, 58229802, 57980214, 57743430, 57492643, 57237743, 57004538, 56787361, 56562215]
8290E6562215k37794k42906k44552k28501j82821j45091j55869j76611j39723
8281E4808347p0827n9885j09046j21762o3555j9273n2154j13145j39776j45583
8271E3913341j55647j48186j23521j42817k28513l05217l09386k82711k87154
8262E1930189l04000k93823k81945k98939l04911k63955k30373k62579l08386
8253D9381278k83897k20909k19257k80039l04980k56181k05982k14874k53468
8244D7141691k68929k55711k36413k25587k27150k29774k08616j67034j54284
8235D5168193j97631k48377k48807k15379j93447j75418j41824j34351j88244
8226D3424715k34963j91306j14936j32897k26446k42881j41641o6140j12738j82096
$$ y = [56562215, 56324421, 56081515, 55836963, 55608462, 55425641, 55280550, 55124681, 54948070, 54808347, 54737520, 54677635, 54568589, 54446827, 54383272, 54363999, 54311845, 54198700, 54058924, 53913341, 53757694, 53609508, 53485987, 53343170, 53114657, 52809440, 52500054, 52217343, 51930189, 51626189, 51332366, 51050421, 50751482, 50446571, 50182616, 49952243, 49689664, 49381278, 49097381, 48876472, 48657215, 48377176, 48072196, 47816015, 47610033, 47395159, 47141691, 46872762, 46617051, 46380638, 46155051, 45927901, 45698127, 45489511, 45322477, 45168193, 44970562, 44722185, 44473378, 44257999, 44064552, 43889134, 43747310, 43612959, 43424715, 43189752, 42998446, 42883510, 42750613, 42524167, 42281286, 42139645, 42073505, 41960767, 41778671]
8216D1778671j54617q3600r1659j68586k04288j66555j21925j10519j11834j19490
8206D0445598j48512j71721j41061p8658o3218j11239j48357j23479q2231q9025
8196C9288097j31277j50101j31230j12682j15455j16975j01074r2752j16247j44448
8186C8075856j30618q4602p0022j10490j47044j25486q2091q4150j17545j11835
8176C7011973o5588n4892j00853j22853o9568j1981l4535r9301j08222n9291l9344
8165C6245545p3804q8244m0206O020j2980n2409l4102J8209R892o8654j11711
8154C5797556n2463L4728M5493m229k2524L966M236l6993m7410L84L6314K0849
8142C5779907J5350N4595O2056o789m6522L5081J29644P7960n7446p3158M6969
$$ y = [41778671, 41624054, 41540454, 41448795, 41280209, 41075921, 40909366, 40787441, 40676922, 40565088, 40445598, 40297086, 40125365, 39984304, 39905646, 39842428, 39731189, 39582832, 39459353, 39377122, 39288097, 39156820, 39006719, 38875489, 38762807, 38647352, 38530377, 38429303, 38336551, 38220304, 38075856, 37945238, 37860636, 37790614, 37680124, 37533080, 37407594, 37325503, 37241353, 37123808, 37011973, 36946385, 36891493, 36790640, 36667787, 36598219, 36586238, 36551703, 36452402, 36344180, 36284889, 36245545, 36171741, 36083497, 36043291, 36049311, 36036331, 35983922, 35949820, 35968029, 35977921, 35909267, 35797556, 35745093, 35779821, 35825314, 35821085, 35798561, 35802527, 35806763, 35769770, 35722360, 35722744, 35759058, 35779907, 35795257, 35849852, 35911908, 35905119, 35858597, 35893678, 36023322, 36101282, 36043836, 35970678, 36017647]
8131C6017647J07564K6448m5667m70N3218N847n8023l0502K0437p796n1606o411
8119C6030686O1903K8644n4180m0864M9428O8267k49k4194L5164P2182M4638L6102
8107C6307527P2981O7853L812k346R9163J86116J54316P5172O1952R7770J04638
8096C7228954Q5828R0238J09706J11227J12626J41612J71376J66844J43586J25922
8086C8487919J08178J03995J53777K29427K26365J21430M0383P9443J56424J47802
8076C9855143Q4092P7729J26156J32880Q3745N5367O3898M6133l825r912N0025
8065D0561431R8167Q3118N6371P8209J23764J31720R5303O3481P9673J39667J92367
8054D1703271J86239J35509J15579J61671K13985K13333J98250K29605K68547
$$ y = [36017647, 36125211, 36151659, 36105992, 36105522, 36158740, 36164587, 36106564, 36076062, 36096499, 36088703, 36037097, 36030686, 36092589, 36121233, 36067053, 36026189, 36075617, 36143884, 36143635, 36119441, 36154605, 36226787, 36271425, 36307527, 36380508, 36448361, 36452173, 36449827, 36548990, 36735106, 36889422, 36964594, 37026546, 37124316, 37228954, 37314782, 37405020, 37514726, 37625953, 37738579, 37880191, 38051567, 38218411, 38361997, 38487919, 38596097, 38700092, 38853869, 39083296, 39309661, 39431091, 39471474, 39550917, 39707341, 39855143, 39939235, 40016964, 40143120, 40276000, 40359745, 40415112, 40479010, 40525143, 40521318, 40511406, 40561431, 40659598, 40742716, 40799087, 40877296, 41001060, 41132780, 41228083, 41291564, 41371237, 41510904, 41703271, 41889510, 42025019, 42140598, 42302269, 42516254, 42729587, 42927837, 43157442, 43425989]
8045D3425989K35630J61455J54900K24385K59379K13574J80358K34186L08655
8036D5398511L08588K58154K48679K92412L15762K78201K28292K35712L03087
8027D7867398L56877L27604K43742K16739K97145L85273L57689K51715K18291
8018E0522473K96720L63419L35385K91551L21276L72116L52440K93926K90510
8009E3439816L36400L50205L25704L33502L82275L96887L49131L06660L21329
8000E6541909L55947L63033L64349L99723M48100M57947M30951M22718M63698
7991F0248375N20452N49463N62888O08904O87243P25034O71866N90416N89918
7982F5754559O73535P28588O90110O28865O23785O30219N65194M63314M31969
$$ y = [43425989, 43661619, 43823074, 43977974, 44202359, 44461738, 44675312, 44855670, 45089856, 45398511, 45707099, 45965253, 46213932, 46506344, 46822106, 47100307, 47328599, 47564311, 47867398, 48224275, 48551879, 48795621, 49012360, 49309505, 49694778, 50052467, 50304182, 50522473, 50819193, 51182612, 51517997, 51809548, 52130824, 52502940, 52855380, 53149306, 53439816, 53776216, 54126421, 54452125, 54785627, 55167902, 55564789, 55913920, 56220580, 56541909, 56897856, 57260889, 57625238, 58024961, 58473061, 58931008, 59361959, 59784677, 60248375, 60768827, 61318290, 61881178, 62490082, 63177325, 63902359, 64574225, 65164641, 65754559, 66428094, 67156682, 67846792, 68475657, 69099442, 69729661, 70294855, 70758169, 71190138]
7973G1190138M75949M88610M25251L66847L74025L84722L22530K22133J63922
7964G4414127J41564Q6268p947p6845j00374j36929k20371k96037l04974k80372
7954G3218110k99800l66069m01127l61685l00424k84679l01363k88607k33942
7945G0380414j85366j71028j62492j29758q7186o2831n5433m4533k0124J2029
7935F9473692L2259J1122n4088j06446q3901j6728q542r6662j99985k43390k58538
7924F8448793l02267l49916l53274l42574l71571m09499l98717l82834m49126
7915F5089015n59994n84232n09683m78783n66228o60221o44274n78071n90210
7906E9917319o76120p21469o80544o21177o08657o33782o55308o49843o20311
$$ y = [71190138, 71666087, 72154697, 72579948, 72946795, 73320820, 73705542, 74028072, 74250205, 74414127, 74555691, 74641959, 74634012, 74557167, 74456793, 74319864, 74099493, 73803456, 73498482, 73218110, 72918310, 72552241, 72151114, 71789429, 71489005, 71204326, 70902963, 70614356, 70380414, 70195048, 70024020, 69861528, 69731770, 69644584, 69581753, 69526320, 69481787, 69461663, 69473692, 69505951, 69517073, 69462985, 69356539, 69272638, 69255910, 69247368, 69150706, 68950721, 68707331, 68448793, 68146526, 67796610, 67443336, 67100762, 66729191, 66319692, 65920975, 65538141, 65089015, 64529021, 63944789, 63435106, 62956323, 62390095, 61729874, 61085600, 60507529, 59917319, 59241199, 58519730, 57839186, 57218009, 56609352, 55975570, 55320262, 54670419, 54050108]
7897E4050108n96052o09648o42141o28184n56525n14701n71318o61239o69357
7888D8600943n96003n47331n75191o20945o25623o07943o06126o11951n98795
7879D3211035n69428n46654n45393n65487n85826n70300n14667m73663m93756
7870C8345861n35170n22368m59639m21027m28780m29639m03742m00450m32411
7861C4312635m31208l64966l11688l39443l88117l62458k86764k63034l07627
7852C1257330l37373l10274k77007k78794k86093k68536k48752k48598k45358
7843B8756545k23174k14256k43102k73274k57908k10292j78096j74994j84276
7834B6797173k05285k42854k65565k32665j63959j30417j63192k15713k31886
$$ y = [54050108, 53454056, 52844408, 52202267, 51574083, 51017558, 50502857, 49931539, 49270300, 48600943, 48004940, 47457609, 46882418, 46261473, 45635850, 45027907, 44421781, 43809830, 43211035, 42641607, 42094953, 41549560, 40984073, 40398247, 39827947, 39313280, 38839617, 38345861, 37810691, 37288323, 36828684, 36407657, 35978877, 35549238, 35145496, 34745046, 34312635, 33881427, 33516461, 33204773, 32865330, 32477213, 32114755, 31827991, 31564957, 31257330, 30919957, 30609683, 30332676, 30053882, 29767789, 29499253, 29250501, 29001903, 28756545, 28533371, 28319115, 28076013, 27802739, 27544831, 27334539, 27156443, 26981449, 26797173, 26591888, 26349034, 26083469, 25850804, 25686845, 25556428, 25393236, 25177523, 24945637]
7825B4945637k11374j85620j66687j50802j44674j53583j62058j59185j66219
7816B3445435k01555k31872k05781j36701j01578j39103j94098j94939j51208
7807B1888600j30258j55824j79889j58037j10632r1067j18490j61656j77715j53844
7797B0451188j16812j06554j33435j63206j57482j25541j12136j30776j40974
7788A9264272j10841p2919q2418j34639j65891j39543r2409p9008j00809j17598
7778A8168197j09194r3432q9367r4460j03082j20768j46103j57127j34722r2484
7768A7027458o7434q0035j11949j26394j08990q5573r1747j22039j27236q1525
7758A6024536l3411m9905j16209j45890j04857o2708q1903j17457r4359l8274
$$ y = [24945637, 24734263, 24548643, 24381956, 24231154, 24086480, 23932897, 23770839, 23611654, 23445435, 23243880, 23012008, 22806227, 22669526, 22567948, 22428845, 22234747, 22039808, 21888600, 21758342, 21602518, 21422629, 21264592, 21153960, 21062893, 20944403, 20782747, 20605032, 20451188, 20334376, 20227822, 20094387, 19931181, 19773699, 19648158, 19536022, 19405246, 19264272, 19153431, 19080512, 18998094, 18863455, 18697564, 18558021, 18465612, 18386604, 18285795, 18168197, 18059003, 17965571, 17876204, 17781744, 17678662, 17557894, 17411791, 17254664, 17119942, 17027458, 16960024, 16879989, 16768040, 16641646, 16532656, 16447083, 16355336, 16233297, 16106061, 16024536, 15991125, 15941220, 15825011, 15679121, 15574264, 15511556, 15429653, 15312196, 15217837, 15179563]
7748A5179563l8707j01862j39138j08623p0667p5540q8476p2102n9052q1224r8722
7737A4245450p0674l7729n8046j08918j28001j10058q7472n9201k1168k0327q2490
7726A3461366j30062q3271o273k2149j07648j24843n4605k6731q5941j10428l7683
7715A2671732P606p0310j54166j02926K929q036j10776j32191m4649q83o9533
7704A1988797j33361r8467l3460k6601m7164l7580k7700o0655r4421p3783l3626
7693A1321979m1085q5079j02674p5625l4853p625j4311o8879j30090j13950j7681
7682A0630127L9758j8450r7767p3612P438P015p0465r0058k6280q198q2343j12234
7670A0104931j0959Q4623J6482j33244j57472l6943M7500K352o2596m3922l653
$$ y = [15179563, 15140856, 15038994, 14899856, 14791233, 14720566, 14645026, 14556550, 14484448, 14425396, 14344172, 14245450, 14174776, 14137047, 14079001, 13970083, 13842082, 13732024, 13644552, 13585351, 13564183, 13543856, 13461366, 13331304, 13248033, 13241760, 13219611, 13111963, 12987120, 12932515, 12905784, 12819843, 12709415, 12671732, 12679338, 12609028, 12454862, 12351936, 12354865, 12346829, 12236053, 12103862, 12059213, 12058330, 11988797, 11855436, 11756969, 11723509, 11696908, 11649744, 11612164, 11584464, 11523809, 11429388, 11355605, 11321979, 11280894, 11195815, 11093141, 11017516, 10982663, 10975038, 10960727, 10891848, 10761758, 10647808, 10630127, 10669885, 10651435, 10553668, 10480056, 10487494, 10494509, 10424044, 10333986, 10307706, 10299508, 10217165, 10104931, 10093972, 10178595, 10195077, 10061833, 9904361, 9867418, 9914918, 9917270, 9854674, 9810752, 9807099]
7659I807099l3684r2065q8858m5601m3486o7736l6074L8216M4884m4084j13697
7648I324914p4044P486J4186m9143q0614m1290p98k0340o3031n2368J8527P3498
7636I056983M4605m4538j01507p2758q475M115m3800p8869n6248j5526n761j5380
7624H662841j6835k4843n3676o4027k2056K4434O312n4632p6075m2966j7260k4564
7612H296653k5227q456j8687o1480p5681l8121q877k5612l8793j0068R260k8082
7600G966829o8231m0423K0981L1585j1326m5400n4309o6137o9505l1786J5412
7589G647690Q484l7843m9424j8616j0233l7425l8764J481J7701j7248l9476j0929
7577G415398O951l8410r1003p2205n240K4535q037n4309o9722m8098n792K2966
$$ y = [9807099, 9773415, 9681350, 9592492, 9546891, 9503405, 9435669, 9399595, 9437811, 9482695, 9438611, 9324914, 9250870, 9258356, 9272542, 9223399, 9142785, 9101495, 9100697, 9080357, 9017326, 8964958, 8983485, 9056983, 9101588, 9057050, 8955543, 8882785, 8874310, 8878425, 8834625, 8755756, 8699508, 8683982, 8678221, 8662841, 8646006, 8621163, 8567487, 8503460, 8481404, 8505838, 8512150, 8457518, 8381443, 8338477, 8321217, 8296653, 8271426, 8262970, 8244283, 8182803, 8107122, 8069001, 8060124, 8034512, 7995719, 7985651, 7994911, 7966829, 7898598, 7858175, 7879156, 7910741, 7899415, 7854015, 7799706, 7733569, 7664064, 7632278, 7647690, 7656174, 7618331, 7568907, 7550291, 7540058, 7502633, 7463869, 7465350, 7483051, 7465803, 7426327, 7415398, 7422349, 7383939, 7292936, 7220731, 7215491, 7240026, 7231989, 7177680, 7107958, 7059860, 7054068, 7077034]
7565G077034N891l6363m1684k045J2619l0552o2842k9242J0636j2842m7318q787
7553F834505N2255J7355r2452j29147m7720K6991L874m5341k9489J3603N847l0667
7541F579614k8273r76r739m4681m4561q557O516j1022j4964R272K1081K02k1309
7528F432603j7873o579r353k2576l5016l9740k6102M032J8535m851l2228j8969
7516F241883J1577P02m1105m4055l175Q57n8853q8998j7463P5335O0397m9096
7504F088006j12785n8072L4200N5306L056m4593l9566o336L310k8917o7034n7871
7492E768704J527M7692K7715k4970l5102L609K0183k1342o3084m1043J7240L3396
7480E734525j0396n4623n1317k1191r176j8867j8795Q32J0416j0726l3989j9316
$$ y = [7077034, 7082925, 7046562, 7004878, 7002833, 7015452, 6984900, 6922058, 6892816, 6903452, 6890610, 6843292, 6834505, 6886760, 6904115, 6811663, 6682516, 6634796, 6661787, 6665661, 6620320, 6590831, 6604434, 6610281, 6579614, 6551341, 6550365, 6540626, 6495945, 6451384, 6442827, 6449343, 6438321, 6423357, 6432629, 6453710, 6453912, 6432603, 6414730, 6408151, 6398798, 6376222, 6341206, 6301466, 6275364, 6279396, 6297931, 6293080, 6260852, 6241883, 6253460, 6254162, 6213057, 6169002, 6165827, 6166684, 6107831, 6018833, 6001370, 6076705, 6137102, 6088006, 5975221, 5917149, 5951349, 6006655, 6009711, 5965118, 5925552, 5919216, 5922526, 5893609, 5826575, 5768704, 5770231, 5817923, 5845638, 5820668, 5785566, 5789175, 5809358, 5788016, 5724932, 5683889, 5701129, 5734525, 5724129, 5669506, 5618189, 5596998, 5587822, 5568955, 5550160, 5550992, 5561408, 5550682, 5516693, 5497377]
7468E497377J7182J8140k2750l8160O452L9756j2955r5807q8997L824N0210p136
7456E367136o1414j7181N6109M2671l3536o1452k6197q411k6795j7554K5382K2885
7444E261643m4244q2592l1890L8256M1216m292l4344m4219n5177m5902l698J4486
7432E009243l2934p5769k7864N6853M7702n3936j02533k9415N3996L3527m1133
7421D837737n7986k2538j8900m3489j2347O9944Q2585k4820j28005r3370K6687
7410D615498O9086m692o6638k5689M2085K4774n3460q3188m0416j191k574J813
7398D475408L0864K5553m0786q9691m9890K2002K3169l3065l9361L0330P3649
7387D428182J6513p3212q6761k7341J0967j3874m7173l6747p530o971k5017j7372
$$ y = [5497377, 5514559, 5532699, 5509949, 5471789, 5478241, 5517997, 5505042, 5409235, 5320238, 5324062, 5374272, 5367136, 5305722, 5288541, 5344650, 5387321, 5353785, 5292333, 5266136, 5257725, 5230930, 5213376, 5238758, 5261643, 5217399, 5134807, 5102917, 5141173, 5182389, 5178097, 5143753, 5099534, 5044357, 4998455, 4994757, 5009243, 4976309, 4900540, 4872676, 4929529, 4977231, 4923295, 4820762, 4791347, 4845343, 4878870, 4837737, 4779751, 4757213, 4738313, 4694824, 4682477, 4752421, 4835006, 4810186, 4682181, 4588811, 4615498, 4684584, 4679892, 4613254, 4587565, 4629650, 4654424, 4600964, 4517776, 4477360, 4476169, 4473595, 4475408, 4506272, 4531825, 4491039, 4401348, 4351458, 4373460, 4396629, 4363564, 4324203, 4354533, 4428182, 4444695, 4371483, 4284722, 4257381, 4268348, 4254474, 4207301, 4170554, 4163024, 4156053, 4131036, 4113664]
7375D113664J4544K2568p115k5763L21K9411N235n1824o9037k5086K5380L1202
7363D063500k127m2765o5157m7209R999N2498K5685l3948l4602K5086L8870l6674
7351C953156r6029m3519N2885O5491o606o4663o7881m8674j6324L2288M2977k4976
7339C778125q8088l8330O9693Q5908O158k9485J2912J1684o5662p9835K6604R7190
7327C786874J8239p6618k9936O8546L8152q4115j15285l2109K2828M562J0374
7316C611512O1734N6740k6607p2967k8002J6987j975k3120n25P401l1207m4872
7304C525099q5J6991m0248o9404J0577R6478N1460o9756j00892j4415O0621M5584
7292C512010o000l2822m3307m8874k7189J5302K7850m253k9261q352K8965L6135
$$ y = [4113664, 4128208, 4150776, 4143661, 4117898, 4118219, 4147630, 4152865, 4101041, 4032004, 4006918, 4032298, 4063500, 4061373, 4018608, 3953451, 3906242, 3916241, 3968739, 3994424, 3960476, 3925874, 3950960, 3989830, 3953156, 3857127, 3813608, 3866493, 3931984, 3925378, 3860715, 3792834, 3744160, 3727836, 3760124, 3803101, 3778125, 3690037, 3651707, 3721400, 3807308, 3813466, 3783981, 3796893, 3808577, 3742915, 3663080, 3689684, 3786874, 3805113, 3728495, 3698559, 3767105, 3805257, 3721142, 3605857, 3573748, 3596576, 3601138, 3611512, 3673246, 3729986, 3703379, 3630412, 3602410, 3619397, 3617422, 3594302, 3593777, 3601178, 3569971, 3525099, 3525014, 3542005, 3501757, 3432353, 3442930, 3539408, 3590868, 3521112, 3420220, 3405805, 3466426, 3512010, 3506010, 3473188, 3429881, 3381007, 3353818, 3369120, 3396970, 3392717, 3363456, 3355104, 3384069, 3420204]
7280C420204J2191j2254j8825j0587N29K815n638j5924k4518l5208l5081n44N0847
7267C328007N5592r859p7798p4708k3384n8j9124l0354j2165P032J3877K3305
7255C180363K5890o028n1878n3538p389K3108P373q856R448K3720p364m9195m1745
7242C043909M647K2787j3889n6489m8274N302M7995M0724K290k3124k5193k7385
7230B973300l1027p724L2338K5174m4018q3230j9489O7752M8337n2668q3620k591
7218B822534O2120K6136k6029o862K4065j0954m9957o722N0169K898r1865p3713
7206B721820M7179Q6496j5864r2543k3555O6833K0460q9672p9081M6675J02415
7195B791163J7068o7430l1006M8195L9217l5450n6051l176K7627o233l1312Q213
$$ y = [3420204, 3432395, 3420141, 3401316, 3390729, 3391258, 3394073, 3388435, 3372511, 3347993, 3312785, 3277704, 3277160, 3328007, 3383599, 3373740, 3295942, 3221234, 3197850, 3197792, 3178668, 3148314, 3136149, 3143181, 3157058, 3180363, 3206253, 3200225, 3148347, 3094809, 3087420, 3110528, 3117901, 3109045, 3118493, 3142213, 3134849, 3085654, 3043909, 3048556, 3071343, 3057454, 3000965, 2952691, 2957993, 3005988, 3046712, 3049002, 3025878, 3000685, 2973300, 2942273, 2934549, 2966887, 2992061, 2948043, 2864813, 2845324, 2913076, 2961413, 2908745, 2825125, 2822534, 2884654, 2910790, 2884761, 2877899, 2901964, 2891010, 2841053, 2834331, 2884500, 2887398, 2795533, 2721820, 2768999, 2855495, 2839631, 2747088, 2723533, 2790366, 2810826, 2721154, 2642073, 2688748, 2791163, 2808231, 2740801, 2709795, 2757990, 2797207, 2761757, 2705706, 2702530, 2730157, 2723924, 2692612, 2700825]
7183B700825N1854K0313n3401p0539j4287L2264J5279k1251k1301l076j1474l2926
7171B592280j9667K4621M5549K0190j5601k7932k4973k3165j5978K459J5179O407
7159B579369j5229l3169l9535k4594J8656O3124N7808j992m8600k5130L2510M4556
7147B607774N05l3504j8347P261j221k3750j5500J6408K2475j3565n0137m5580
7135B452819j0902J1618O618K43J4356K6211k589n8355p1096m569P5820P3677
7123B513851o874o0721k8442K2576Q078m2007l8494J6968L3767j6117m8967p100
7111B346518M3609J9808m2391m3225K3703O4227K9899j7392j2080J6971L845m4557
7099B388935n5628K022O7238N8925k0840q1169m8269L8374O6488o058q9587p7869
$$ y = [2700825, 2752679, 2772992, 2719591, 2649052, 2634765, 2667029, 2682308, 2661057, 2639756, 2636680, 2625206, 2592280, 2572613, 2597234, 2642783, 2662973, 2647372, 2619440, 2594467, 2571302, 2555324, 2557783, 2572962, 2579369, 2564140, 2530971, 2491436, 2466842, 2485498, 2548622, 2606430, 2604438, 2555838, 2530708, 2563218, 2607774, 2608279, 2574775, 2556428, 2563689, 2562468, 2538718, 2523218, 2539626, 2562101, 2548536, 2498399, 2452819, 2441917, 2453535, 2460153, 2460396, 2474752, 2500963, 2498374, 2440019, 2368923, 2364354, 2440174, 2513851, 2506977, 2446256, 2417814, 2440390, 2448468, 2406461, 2367967, 2384935, 2418702, 2402585, 2353618, 2346518, 2390127, 2409935, 2367544, 2324319, 2348022, 2412249, 2442148, 2424756, 2412676, 2429647, 2433492, 2388935, 2333307, 2335329, 2402567, 2461492, 2440652, 2359483, 2311214, 2349588, 2416076, 2410018, 2320431, 2242562]
7087B242562R721O0272K6905j7305K53M8656N3810J0129k5510k4192j2062j3871
7075B359368j7900n368J7648K9291J5769j8021m9417n1856k1568J2537J9168J396
7063B291047j1062l560O375j732j8542j5083J4909L8064K1223k0587m1878l1760
7051B227414k3244k6165l039N2274O9207Q88p6690n8176K6531N1995n576l8083
7039B197336O498M2660Q557k5776L114K9973j0562m5306R119P2953K2127q5973
7027B224720q7873J7583O7141J958n1861r666M3615K1374k4412j8610J1100J5673
7015B210742J9937M4706L6699k9740p5906m0057J3707O285k4906j1881J2149j2482
7003B149253m0826M22O5195N4366j4764m3287j9485j1234j8029J7894O5778L1963
$$ y = [2242562, 2252283, 2312555, 2339460, 2322155, 2322408, 2371064, 2424874, 2435003, 2409493, 2385301, 2373239, 2359368, 2341468, 2336100, 2353748, 2383039, 2398808, 2380787, 2331370, 2279514, 2257946, 2270483, 2289651, 2291047, 2279985, 2276425, 2282800, 2281068, 2262526, 2247443, 2262352, 2300416, 2321639, 2301052, 2259174, 2227414, 2204170, 2178005, 2174966, 2227240, 2296447, 2297335, 2220645, 2162469, 2189000, 2240995, 2235419, 2197336, 2203834, 2246494, 2255051, 2229275, 2232389, 2262362, 2251800, 2206494, 2215613, 2288566, 2310693, 2224720, 2136847, 2154430, 2221571, 2223529, 2171668, 2162002, 2205617, 2226991, 2202579, 2183969, 2195069, 2210742, 2230679, 2275385, 2312084, 2282344, 2206438, 2166381, 2180088, 2186373, 2161467, 2149586, 2161735, 2149253, 2108427, 2108849, 2174044, 2228410, 2213646, 2170359, 2150874, 2139640, 2121611, 2139505, 2205283, 2237246]
6991B237246o0234p7554P007O4070K2827k1344J2086N0004J0418m3534j9096L8595
6979B220491L0927j7419r395M4826M5488j8106m8278p215K6676L678j4235K6764
6967B284202O6950K7383n5976q0596k6280K8602L0579J1888J3351J5950j1254
6956B304799m3247l3381P519K2939j692j8050M677K9498J2445k6443l4956o294
6944B217814J9843K0729J3097J5652K4501K7239J6209q908l1502k3538J5917M5540
6932B352593L2692j443j8594j8329j7571o380K6203N1807M5182L6328N5142N9747
6920B597377L771n7621l4850M1499N5857k349k1057L6853O5067K511n1450l870
6908B631738P2349O2748j536j0703L8640N7979K4102k892M490J7193K6047M5251
$$ y = [2237246, 2177012, 2099458, 2106465, 2170535, 2193362, 2172018, 2184104, 2234108, 2244526, 2200992, 2181896, 2220491, 2251418, 2233999, 2224604, 2269430, 2314918, 2296812, 2248534, 2241319, 2267995, 2271673, 2257438, 2284202, 2351152, 2378535, 2322559, 2241963, 2215683, 2244285, 2274864, 2286752, 2300103, 2316053, 2304799, 2261552, 2228171, 2235690, 2258629, 2256937, 2238887, 2243564, 2273062, 2285507, 2259064, 2224108, 2217814, 2237657, 2258386, 2271483, 2287135, 2311636, 2338875, 2355084, 2346176, 2314674, 2291136, 2307053, 2352593, 2385285, 2383842, 2365248, 2346919, 2329348, 2322968, 2349171, 2400978, 2446160, 2482488, 2537630, 2597377, 2601148, 2543527, 2508677, 2550176, 2606033, 2603684, 2582627, 2619480, 2684547, 2687058, 2635608, 2631738, 2704087, 2766835, 2765299, 2754596, 2793236, 2851215, 2875317, 2872425, 2876915, 2894108, 2920155, 2965406]
6896B965406N5624L3639J5699M4894Q0642N6897K460j813L8351M9433K9936M5391
6884C416559Q7508P2843j253l2439K0089P0922N7957L6800O3771R4538P6157M8730
6872D012182P2211J22229J36815J12547Q8773Q4025R9244J33441J56307J27175
6862E144949P5556Q3814J51572J76836J27459J14183K04704K85589K39153J55865
6852F759680K05280L61449M43185M05479L98898N14683O52637P10997P49503Q54107
6842A2055898R52502Q97164O81426M57591L49519L29299K84113J45959n9667k59012
6832A5834792m05518n14376o21974p21859p68261p42571o79661o18930n67163
6823A0194479n24044n02196m96096m68701m02298l33574l04563l04497k96034
$$ y = [2965406, 3021030, 3054669, 3070368, 3115262, 3195904, 3252801, 3255261, 3253448, 3291799, 3341232, 3371168, 3416559, 3504067, 3576910, 3575657, 3543218, 3563307, 3634229, 3692186, 3728986, 3792757, 3887295, 3963452, 4012182, 4084393, 4206622, 4343437, 4455984, 4544757, 4628782, 4728026, 4861467, 5017774, 5144949, 5220505, 5304319, 5455891, 5632727, 5760186, 5874369, 6079073, 6364662, 6603815, 6759680, 6964960, 7326409, 7769594, 8175073, 8573971, 9088654, 9741291, 10452288, 11201791, 12055898, 13008400, 13905564, 14586990, 15044581, 15394100, 15723399, 16007512, 16153471, 16093804, 15834792, 15429274, 14914898, 14292924, 13571065, 12802804, 12060233, 11380572, 10761642, 10194479, 9670435, 9168239, 8672143, 8203442, 7801144, 7467570, 7163007, 6858510, 6562476]
6814F562476k74635k58505k37651j86015j22757j06853j52421j94023j68299r8805
6804D762512n9867p4613r6412q9513p6206q4235r3787p5911n0504n5074p4710
6793C931680o2338k5100k5171p8324j15326q0708j7692n038m5444p2492n0414
6782C353633j4164j1774m5497p5721o3989j5281J5978j6253p8657q5878j8482
6771B943915L8627J4637m5340n6790k5130j8145m1630l6721O519K6899k520l0772
6759B773549j7987L800n859l0581l4840k1640j4425j3908n246J3006K7978K5711
6747B699558J124k7607k5643R706K8772N04k6006N476N1828K4917n9983r2936
6735B589710l6135K4317K1117m768p39J1883N764Q832L3860L2655j2329l5600
$$ y = [6562476, 6287841, 6029336, 5791685, 5605670, 5482913, 5376060, 5223639, 5029616, 4861317, 4762512, 4702645, 4628032, 4531620, 4442107, 4365901, 4281666, 4187879, 4111968, 4061464, 4006390, 3931680, 3869342, 3844242, 3819071, 3740747, 3625421, 3544713, 3527021, 3521983, 3476539, 3404047, 3353633, 3339469, 3327695, 3282198, 3206477, 3142488, 3127207, 3143185, 3126932, 3048275, 2962397, 2943915, 2982542, 2997179, 2951839, 2895049, 2869919, 2851774, 2810144, 2773423, 2779942, 2806841, 2804321, 2773549, 2755562, 2759362, 2753503, 2722922, 2688082, 2666442, 2652017, 2638109, 2632863, 2645869, 2673847, 2699558, 2700682, 2673075, 2647432, 2657138, 2685910, 2686414, 2660408, 2665884, 2717712, 2742629, 2682646, 2589710, 2553575, 2577892, 2599009, 2594241, 2593502, 2605385, 2611149, 2619981, 2653841, 2686496, 2674167, 2638567]
6723B638567JK7254p552m0402j876N2170L8229l551J2113N1047K2991l7055j5272
6710B736664P3205R3403J5378l7977j014L9566J7681K171N2198R2145M0473l8986
6698C084907l3264M3574Q6402O3999L8169M3954N1947M5429N0517P9227J04353
6687C659214J04615R2577Q8379R4499J01501J01864R9282J08195J31117J41786
6677D723029J21833J07295J48345K21760K49028K17408K09925K83270L88151M52855
6667G122899M76692M97712N44864O64273Q82904J068106R57364M85567p467j02186
6657A2590728J83156M00391K28257j75560m61006n34904n63317o48076p08870
6648A0310799o72689o03897n87169n90473n24304l86887k77226k69176l22162
$$ y = [2638567, 2638568, 2665822, 2658270, 2617868, 2615992, 2668162, 2706391, 2702840, 2714953, 2766000, 2788991, 2751936, 2736664, 2809869, 2903272, 2918650, 2880673, 2879659, 2919225, 2936906, 2939077, 2991275, 3083420, 3123893, 3084907, 3051643, 3095217, 3181619, 3245618, 3283787, 3327741, 3379688, 3425117, 3475634, 3554861, 3659214, 3763829, 3856406, 3944785, 4039284, 4140785, 4242649, 4341931, 4450126, 4581243, 4723029, 4844862, 4952157, 5100502, 5322262, 5571290, 5788698, 5998623, 6281893, 6670044, 7122899, 7599591, 8097303, 8642167, 9306440, 10189344, 11257450, 12214814, 12700381, 12692914, 12590728, 12773884, 13174275, 13402532, 13226972, 12765966, 12231062, 11667745, 11019669, 10310799, 9638110, 9034213, 8447044, 7856571, 7332267, 6945380, 6668154, 6398978, 6076816]
6639F076816l36922k77202k04917j91448k26973k45146k14490j62116j16783q0028
6629D020791n7902o8098r9946j16166j11276j16449j29017j02533l8010j0241
6619C171153n1056q1900l7655J3844k2939j03634j06970l3049K504l2537m5957
6608B671804m450J049o4803r3143k1837L0236m2709j30712p5378N2852N3551p3507
6596B302953j24960k8289N1993N288m8708Q512P8204K1729r2055j02317j9996
6585B052354J4516k4666l7404j65N040l6377m2923n22P145l6471m1923J4490L4091
6572A907185k5334o2911j1686L6542j0031q0653o2641J2361L5503J558j1078J0055
6560A738870J1092j3083k2379k3414m6228n5506p4P0204N7687k2641n8257j6102
$$ y = [6076816, 5739894, 5462692, 5257775, 5066327, 4839354, 4594208, 4379718, 4217602, 4100819, 4020791, 3962889, 3894791, 3794845, 3678679, 3567403, 3450954, 3321937, 3219404, 3181394, 3171153, 3120097, 3038197, 3000542, 3014386, 2991447, 2887813, 2780843, 2747794, 2750298, 2717761, 2671804, 2667354, 2668403, 2603600, 2510457, 2488620, 2518856, 2476147, 2345435, 2270057, 2322909, 2376460, 2302953, 2177993, 2149704, 2201697, 2206985, 2158277, 2166789, 2244993, 2266722, 2174667, 2072350, 2052354, 2066870, 2042204, 2004800, 2004635, 2009675, 1973298, 1930375, 1929853, 1936998, 1900527, 1858604, 1873094, 1907185, 1881851, 1818940, 1807254, 1843796, 1833765, 1753112, 1690471, 1702832, 1738335, 1739893, 1728815, 1738870, 1749962, 1736879, 1714500, 1691086, 1644858, 1589352, 1589278, 1659482, 1717169, 1694528, 1636271, 1620169]
6548A620169J8974k899k8436j6689n711j9317j4575K3582L4304r726l6025R903
6536A573554O0097K4167o5612j00394m9204J7911M0529K4555l833l1908m2493
6525A447369j7710K4290L4351q297o2736o7225p422O3445P7723K8727k0639j6976
6513A474900J7099K3062r363m0967m8995m1973k0008J9535M2853J3300l6315l8089
6501A355039J882J2452j5984j3491L4535M5012j7882o4588k4994K7544k543o8858
6489A268124n7739K7482P8785N0952K066k0833l0597l4253j3425J9201K1827q875
6477A302715l5052l9041k7733O099N6421O3373j2201r3925p1867K8753P2917J6322
6465A266781l9251j8191K3261J6515n536J0207L1554M166m3929m6551m089L1424
$$ y = [1620169, 1639143, 1636244, 1607808, 1591119, 1585408, 1566091, 1551516, 1575098, 1609402, 1599676, 1563651, 1573554, 1633651, 1657818, 1592206, 1491812, 1442608, 1460519, 1501048, 1525603, 1521770, 1489862, 1447369, 1429659, 1453949, 1488300, 1480003, 1417267, 1350042, 1342620, 1406065, 1483788, 1512515, 1491876, 1474900, 1491999, 1515061, 1505698, 1464731, 1415736, 1373763, 1353755, 1373290, 1416143, 1429443, 1393128, 1355039, 1356921, 1369373, 1353389, 1339898, 1374433, 1419445, 1401563, 1336975, 1311981, 1339525, 1336982, 1268124, 1210385, 1237867, 1316652, 1367604, 1369670, 1348837, 1318240, 1283987, 1270562, 1289763, 1311590, 1302715, 1267663, 1228622, 1200889, 1206988, 1263409, 1326782, 1314581, 1220656, 1148789, 1177542, 1250459, 1266781, 1227530, 1209339, 1232600, 1249115, 1243579, 1253786, 1285340, 1289506, 1245577, 1199026, 1194937, 1226361]
6453A226361M0549L6783J4358l5523p8450p0759k5842P064J4286J6541J5144k802
6441A157710j7397M843M5951M9621P487k4317j3275l86k6861n6526k6872M3881
6429A143859O6434O584n9542n2010K208K3492O191P429K5619l191o9070o6751
6417A031252L0425R0935J7719q2520n7625M3505N2370l7014o3369K1686P2181
6406A119545J257p3184l3082N0436N4915L716r870O236j1992m4244k7825J4512
6394A050420J5471j2463j0902Q724k187k2375k068K8096Q247k8109o909M4524
6382A070469L9372j2277k6172j952j2983n0695l3945K5293K7578k7541k8753M1303
6370A009697O1628j2047o2708k0126J8510k1524m7261K5243R6070M1898o6128
$$ y = [1226361, 1266910, 1303693, 1318051, 1282528, 1204078, 1133319, 1107477, 1114541, 1128827, 1145368, 1160512, 1157710, 1140313, 1145156, 1191107, 1240728, 1248215, 1223898, 1210623, 1210237, 1183376, 1126850, 1099978, 1143859, 1210293, 1216877, 1157335, 1105325, 1107533, 1131025, 1137216, 1144645, 1170264, 1167073, 1098003, 1031252, 1061677, 1152612, 1170331, 1087811, 1030186, 1073691, 1126061, 1089047, 1025678, 1047364, 1119545, 1120802, 1047618, 1014536, 1064972, 1119887, 1123603, 1113733, 1119969, 1107977, 1063733, 1035908, 1050420, 1065891, 1053428, 1042526, 1051250, 1049063, 1026688, 1024620, 1052716, 1060963, 1032854, 1025945, 1070469, 1109841, 1097564, 1071392, 1069440, 1056457, 1005762, 971817, 997110, 1024688, 997147, 968394, 1009697, 1071325, 1059278, 996570, 976444, 994954, 973430, 926169, 951412, 1047482, 1089380, 1023252]
6359A023252p6620j438L1199K384O50L3975K4752k0932j4765L5492K0176p0678
6347I87447j05650k6715M7913J6064m7685k6833M8655O7619J7554k2766k6561
6336I29042l5720n1633k3172M4944P0466J5188m8178l8753J8283L7742Q23k8924
6324H90108q482K7053K7325o66j5969p684M641J4584K7701K6797j0575n7308n3838
6311H63687L107M1737J4802l1636l1603J616O491k4656l9252j2244K0919K7440
6299H40408K2267L0862M4033L3886m799m6603o0437l7096J136K0921J4280L487
6287H62345J557q932l6423m6201m823N5153O2206K514n2512l5538K8302N2437
6275H80085Q65o1908n2181J8513N3330O948m2972j3185M6202K4913n8205o6350
$$ y = [1023252, 946632, 945194, 976393, 978777, 979427, 1013402, 1038154, 1017222, 1002457, 1037949, 1058125, 987447, 881797, 855082, 902995, 919059, 871374, 844541, 893196, 960815, 978369, 955603, 929042, 893322, 841689, 818517, 863461, 933927, 949115, 900937, 862184, 880467, 918209, 919032, 890108, 881626, 908679, 936004, 935338, 919369, 911685, 916326, 930910, 958611, 985408, 974833, 917525, 863687, 866794, 908531, 923333, 891697, 860094, 861710, 868201, 843545, 804293, 792049, 812968, 840408, 862675, 893537, 937570, 971456, 966657, 920054, 859617, 822521, 823657, 844578, 858858, 862345, 863902, 854970, 818547, 772346, 767523, 822676, 884882, 887396, 834884, 799346, 827648, 880085, 880950, 819042, 766861, 785374, 838704, 845652, 802680, 789495, 835697, 860610, 802405, 736055]
6263G36055L3065R7212K9003o3300m1340M1246M2306k5180l0846L3326M2635k8574
6251H65608n4317K0995Q1862L6406l9874m7101j6812j9380k7131J2499N3955K4611
6239H91321m2806o0264j9351K2456M3555N1770K5704l7715o4323J201Q0478N7220
6227I49246m2374q5714l3279K2408J7005r091j1462o103n120J2180L3956J3980
6215H55632l6208m4464K745L1705O434j4665Q754K8179M559j8093n831q705n8295
6202G51747p9567r054P2229M7144m4666n7047L6080R9843M2904n6775p7445j4190
6190G11203M4816M2590j560l6369k8691Q526K2368j6617n6264j9720P2626J08272
6178H51180L8253m6484m6686M577Q512m2105o6056l2142K919J070j907K5367N1310
$$ y = [736055, 769120, 866332, 895335, 832035, 790695, 831941, 874247, 849067, 818221, 851547, 894182, 865608, 811291, 832286, 914148, 950554, 910680, 863579, 846767, 827387, 800256, 812755, 866710, 891321, 848515, 788251, 768900, 791356, 834911, 886681, 912385, 874670, 810347, 811548, 892026, 949246, 906872, 821158, 787879, 810287, 827292, 818201, 806739, 800636, 795516, 807696, 841652, 855632, 819424, 774960, 777705, 809410, 815844, 801179, 809933, 838112, 842671, 824578, 818747, 810042, 751747, 672180, 663126, 735355, 782499, 737833, 680786, 716866, 816709, 859613, 802838, 725393, 711203, 756019, 798609, 797049, 760680, 731989, 740515, 762883, 746266, 690002, 670282, 742908, 851180, 889433, 842949, 796263, 800840, 809352, 767247, 701191, 669049, 671968, 673038, 671131, 696498, 747808]
6165G47808L9814Q638j0496k0044k6466j2640J5758Q418m9588q5204l4790M6005
6153F27213N4135m054k3953L1886P8720M3953l1303o6258m5703o138K5093L1811
6141G15402J453m1163m0186J0893M5600K1885j4379j2658j668k4427m8046k0110
6129E92596K9975L4431r44j7472r376j5058k3087J1688O6024O5932R957k6456
6117G18210j8108j5729l0051p117M7856M4040l9496q7850k1253O9713N9865k1966
6105F98114n3939j2203K0452N599j0417j960k428k2334k0169J7380L9274R393
6093F66762l3284l2223N771K5489K418k5279r294L9158N3817P18o2365n5321P277
6080E83644L2367j0548m3102p720L8190K1278k5290k3110K0000L4789J2719N493
$$ y = [747808, 787622, 796260, 785764, 765720, 739254, 726614, 742372, 750790, 701202, 615998, 581208, 627213, 681348, 677294, 653341, 685227, 763947, 807900, 776597, 710339, 664636, 658498, 683591, 715402, 716855, 675692, 635506, 646399, 691999, 713884, 699505, 686847, 685179, 660752, 612706, 592596, 622571, 657002, 656058, 638586, 629210, 614152, 591065, 602753, 668777, 734709, 744666, 718210, 700102, 684373, 654322, 647205, 695061, 739101, 699605, 611755, 590502, 660215, 720080, 698114, 644175, 631972, 652424, 658023, 647606, 645646, 643218, 620884, 600715, 618095, 657369, 666762, 633478, 601255, 607026, 632515, 634933, 609654, 600360, 639518, 693335, 694053, 631688, 576367, 583644, 616011, 605463, 562361, 554641, 592831, 614109, 588819, 565709, 585709, 620498, 633217, 638710]
6068F38710K1149J7620o457q397R663L93l2552l0640J0908K4442j1998l0023J2189
6055F15007N3217K7231k9560l9830l823J3003j4925m3126k7494J7584L8864P362
6043F13510m0932l7874K7311P5177L4381m9554o8498n532M4412J7491l7892n0968
6031E21032k3315O346K6709L9586L4928J7241P373m796m6320q2383l9299O0302
6019E17404Q9156J590p9025m3893L4896L5373j0688Q923P4751O4786k7533p3463
6007E92277k1087K9640N306k9980p419K6262P408k3760n6M4536K8153l7134n8201
5994E55945n121M6049K8201k7881m9074j9068J5585J7649mo995J019Q652J0796
5981E75753R460o021l8684n2429j2168M3290L5778k7235m3821K4346P5987K6128
$$ y = [638710, 659859, 677479, 671022, 662625, 672288, 672681, 640129, 609489, 620397, 644839, 632841, 602818, 615007, 668224, 695455, 665895, 626065, 622242, 635245, 620320, 577194, 549700, 567284, 606148, 613510, 572578, 534704, 562015, 637192, 671573, 622019, 553521, 547989, 592401, 609892, 572000, 521032, 497717, 504063, 530772, 570358, 605286, 622527, 629900, 625104, 578784, 496401, 457102, 517404, 606560, 608150, 529125, 485232, 520128, 555501, 544813, 553736, 628487, 693273, 665740, 592277, 571190, 600830, 606136, 576156, 568737, 594999, 602407, 578647, 578591, 623127, 651280, 614146, 555945, 550824, 596873, 625074, 597193, 548119, 529051, 544636, 562285, 562281, 555286, 556305, 564957, 575753, 585213, 579192, 540508, 488079, 475911, 519201, 554979, 527744, 483923, 508269, 584256, 610384]
5969F10384n0943m2949J1182m961o9947n0638O2179J19356N0932k6857j1188L0478
5957F27028L56n8768n1108O503K8524N336r591q402j9740k9203n663K4749J8251
5944E28272n697m892K737j8154l6358o094L6445K7995p234m287J7348m899m0196
5931D84986o477O4121N2896m0758p7973k728O5834K8238m7779o0741l2414k8004
5919C99201k4954K1395O4071L9072r142j94L3967L853o5839n8185M2571J11347
5907E57163O4126l2097p4326n4936k4576K21K8603M5074K8648m994k4630k4959
5895D83317j5931K232K3026K2638j80l169L7259O8558K3448o9986j03240k9635
5883D38337O3373O3000k4113q7224n7332J7952N4377L4391j48k0330k9178k6629
$$ y = [610384, 559441, 516492, 527674, 522713, 452766, 402128, 464307, 583663, 634595, 607738, 596550, 627028, 627384, 568616, 517508, 524011, 552535, 557871, 548280, 539878, 520138, 490935, 485272, 510021, 528272, 522575, 517683, 520420, 502266, 465908, 459814, 496259, 524254, 517020, 512733, 530081, 525182, 484986, 478509, 542630, 595526, 554768, 476795, 474067, 539901, 568139, 520360, 459619, 427205, 399201, 374247, 395642, 459713, 498785, 489643, 489449, 523416, 527269, 461430, 403245, 445816, 557163, 621289, 589192, 514866, 459930, 435354, 435575, 464178, 509252, 537900, 532906, 508276, 483317, 467386, 469618, 492644, 515282, 515102, 511933, 549192, 617750, 641198, 571212, 467972, 438337, 501710, 564710, 540597, 453373, 396041, 413993, 468370, 502761, 502613, 482283, 453105, 426476]
5871D26476n150J9794J7972q438k2558q383O619j220j6023j3009M838K0463K7162
5858D48543K3309R898M699K3973M0764J0341m7132n4392L31K6080k6366o4356
5846C95692O654J10294R6434k3267q5962k8084K9852n963n6633k3414L9295K5820
5834D80718l4035k8770M1833O6980P776m7391k8757J9709K7025m984k9650k3437
5822D47017Q396M5691M9049q702q4516r1928j3687O3730O1062L291l2534k2015
5810D24854L16O445r23j0457j1125M963K2998J3278j8175k3044J4228L8845Q923
5797D71126k9053j2406K7557J1559m9240n7445J6130P6150M1454l7816o1724k3074
5785C73218L689j3414k5259J1609O8354Q4814M3765j7290n1988m5707j6692Q885
$$ y = [426476, 421326, 441120, 459092, 450654, 428096, 419713, 426332, 425112, 409089, 396080, 400918, 421381, 448543, 471852, 481750, 486449, 510422, 551186, 561527, 514395, 460003, 460334, 486414, 460048, 395692, 402346, 512640, 609074, 585807, 499845, 471761, 501613, 495650, 439017, 415603, 454898, 480718, 446683, 417913, 459746, 526726, 534502, 487111, 458354, 478063, 505088, 500104, 470454, 447017, 455413, 501104, 550153, 541451, 456935, 365007, 351320, 415050, 476112, 479403, 446869, 424854, 425170, 431615, 430692, 420235, 409110, 414073, 437071, 450349, 432174, 409130, 423358, 462203, 471126, 442073, 429667, 457224, 468783, 419543, 362098, 378228, 454378, 495832, 458016, 396292, 373218, 376907, 363493, 338234, 349843, 418197, 503011, 546776, 529486, 477498, 431791, 415099, 423984]
5773D23984J7073P086j3279k5721j0168K6288M1858Q377m1217m7959o823K8337
5761D07836K3947M666k291j0721l3656m2951j2533L0772M3451K7410J3468O169
5749D55567r508k5728k3910j4182j5334j0769K2454N3825L1365k8619n0520r756
5737C74885L0209J4672k6899l6165q554J8821K6736K2759J4724P044N965P373
5725D51570j071j3243q530P061K962j7786j1513K9162M6253N126m1362l3168J040
5712D16501j311k5321q724L7315L4805k8075o5483k4858L4777M1431J4578R869
5700D35504J7637o672m6177m0767P729K9642j084k4594L407L4843R278l9229l1206
5687C48311K5588M0763j2094m3577J1096P7349M6149n5196r5487k8532N1180N6127
$$ y = [423984, 441057, 448143, 434864, 409143, 398975, 425263, 467121, 475498, 434281, 386322, 379499, 407836, 431783, 436449, 434158, 423437, 389781, 346830, 334297, 365069, 408520, 435930, 449398, 455567, 446059, 420331, 396421, 382239, 366905, 356136, 378590, 432415, 463780, 435161, 384641, 374885, 405094, 419766, 392867, 356702, 348148, 366969, 393705, 416464, 431188, 438232, 444197, 451570, 450499, 437256, 428726, 435787, 438749, 420963, 409450, 438612, 484865, 489991, 448629, 415461, 416501, 415190, 389869, 381145, 418460, 453265, 425190, 359707, 334849, 369626, 411057, 425635, 435504, 453141, 446469, 400292, 359525, 367254, 396896, 395812, 371218, 374625, 409468, 418746, 379517, 348311, 373899, 414662, 402568, 358991, 370087, 447436, 493585, 438389, 342902, 314370, 365550, 421677]
5675D21677J3012j6266l2925n7219n5640O857Q3414R3549L3405l0426n8128o0225
5663C41085m0740Q433N8108N7120O784l7113m2550k7342p093K0646L5642O983
5651C79963l9747l6266K3158N7291J3508n2913n9232n806M1274M2268J4275n924
5639C71849L661L2707L7848j0563p0598o4379J0467O1902K7549m0079n5897j5859
5627B88608K5356M2995M6889L3086n083m0020l9862j7077j273J0189K7009K4943
5615C95760j2083l9927j1096M0228M1716m342k7023K11K8063J9096l316r573p773
5602D09941j3660k3696l2316l6147j7515L2168P2817N1048k0060o7662n2663p426
5590B94829K4890L5433K5137r193m5961m3486M837N4423O0878K0165l8708o8756
$$ y = [421677, 434689, 418423, 385498, 328279, 272639, 279496, 362910, 456459, 489864, 459438, 401310, 341085, 300345, 308778, 366886, 424006, 430790, 393677, 351127, 323785, 316692, 337338, 372980, 379963, 340216, 303950, 327108, 384399, 397907, 344994, 285762, 279956, 321230, 363498, 377773, 371849, 375510, 408217, 446065, 435502, 364904, 300525, 310992, 372894, 400443, 360364, 304467, 288608, 313964, 356959, 403848, 436934, 431851, 391831, 351969, 334892, 333619, 343808, 370817, 395760, 383677, 343750, 332654, 372882, 414598, 410256, 383233, 383444, 411507, 430603, 427287, 417714, 409941, 396281, 372585, 340269, 304122, 286607, 318775, 391592, 442640, 422580, 354918, 302255, 294829, 319719, 355152, 380289, 371096, 325135, 281649, 286486, 340909, 401787, 421952, 383244, 314488]
5578C14488l0333N2773Q6317J5943q0078q4964p538M2086K5408R655K6221K2657
5566C92635j6051k6376O668P065m5957n6537K1266P9795K6285n6733m5146K6315
5554C13229L7256j6105l9429j3624l556j9846r763K5372K8254n136k5438k5923
5542B45291l0963j3866N3976J00655L9142o5725p0521J5095M1697k4264m7340
5531B43177L0009Q1086J9362n0495k0391L9426K0863l2706k4709J6029P708k1645
5519C07714J405M0179J3749l8767k0074M1081L2251l9557n4403J1487M6452m247
5507C37270n7783m4758o151Q801K0351M1294L3090o005j2542K6090K9778l6687
5495C32748q5250m0558L7515N4191K1999Q318J1107r113k7778K621M5821K7319
$$ y = [314488, 284155, 336928, 423245, 439188, 359110, 274146, 266608, 308694, 334102, 343757, 369978, 392635, 376584, 350208, 356876, 363941, 317984, 261447, 282713, 362508, 388793, 332060, 286914, 313229, 350485, 334380, 294951, 281327, 277771, 257925, 248162, 273534, 301788, 296652, 271214, 245291, 214328, 200462, 254438, 355093, 394235, 328510, 257989, 273084, 314781, 290517, 243177, 273186, 354272, 373634, 323139, 302748, 342174, 363037, 330331, 305622, 321651, 329359, 307714, 309119, 349298, 363047, 324280, 304206, 345287, 377538, 337981, 283578, 295065, 341517, 337270, 279487, 234729, 228578, 237379, 257730, 299024, 332114, 326109, 313567, 339657, 369435, 332748, 247498, 206940, 244455, 298646, 320645, 328963, 340070, 330957, 303179, 305800, 351621, 378940]
5483C78940l1629l5516K8969O2840M294q0658r5610l5855K8905M8137K7641R13
$$ y = [378940, 347311, 311795, 340764, 403604, 407898, 327240, 231630, 195775, 224680, 272817, 300458, 301371]
$$ [...]
##END NTUPLES=NMR SPECTRUM
##END=
