##TITLE=1H ikalashn
K-543-2
1.10.2024
##JCAMPDX= 6.0         $$ Bruker NMR JCAMP-DX V2.0
##DATA TYPE= NMR SPECTRUM
##DATA CLASS= NTUPLES
##ORIGIN= UXNMR, Bruker Analytische Messtechnik GmbH
##OWNER= root
$$ TOPSPIN		Version 1.3
$$ 2024-10-01 10:22:54.109 +0400  Irina@DPX200
$$ Compression mode = diff/dup
##.OBSERVE FREQUENCY= 200.131392401
##.OBSERVE NUCLEUS= ^1H
##.ACQUISITION MODE= SIMULTANEOUS
##.ACQUISITION SCHEME= undefined
##.AVERAGES= 32
##.DIGITISER RES= 18
##SPECTROMETER/DATA SYSTEM= spect
##.PULSE SEQUENCE= zg
##.SOLVENT NAME= DMSO
##.SHIFT REFERENCE= INTERNAL, DMSO, 1, 17.95386
##AUDIT TRAIL= $$ (NUMBER, WHEN, WHO, WHERE, WHAT)
$$ ##TITLE= Audit trail, TOPSPIN		Version 1.3
$$ ##JCAMPDX= 5.01
$$ ##ORIGIN= Bruker BioSpin GmbH
$$ ##OWNER= Irina
$$ $$ F:/spectra/data/iren/nmr/1H/4/pdata/1/auditp.txt
$$ ##AUDIT TRAIL=  $$ (NUMBER, WHEN, WHO, WHERE, VERSION, WHAT)
(   1,<2024-10-01 10:22:14.109 +0400>,<Irina>,<DPX200>,<TOPSPIN 1.3>,
      <created by zg
	started at 2024-10-01 10:20:06.359 +0400,
	POWCHK disabled, PULCHK disabled
       configuration hash MD5:
       BE 6D 3F 07 2A EA 11 49 91 17 2B D3 AF B3 58 0D
       data hash MD5: 16K
       85 DB FA 8B 51 21 F9 67 6C DA B6 4C 26 E2 68 98>)
(   2,<2024-10-01 10:22:41.000 +0400>,<Irina>,<DPX200>,<TOPSPIN 1.3>,
      <Start of raw data processing
       efp BC_mod = 2 LB = 0.05 FT_mod = 6 PKNL = 1 PHC0 = 197.1588 PHC1 = 2.685347 SI = 32K 
       data hash MD5: 32K
       0A 7C 4D E5 04 9F 2E 0F 42 32 70 00 7C 74 35 A9>)
(   3,<2024-10-01 10:22:43.046 +0400>,<Irina>,<DPX200>,<TOPSPIN 1.3>,
      <apk 
       data hash MD5: 32K
       02 3B 93 0A F6 07 04 47 57 37 08 4A 4F 5B FC 7D>)
(   4,<2024-10-01 10:22:45.421 +0400>,<Irina>,<DPX200>,<TOPSPIN 1.3>,
      <abs n ABSG = 5 
       data hash MD5: 32K
       68 D6 8D ED F3 5D 2C C5 60 87 6D 79 06 D3 BF 0D>)
$$ ##END=
$$ 
$$ $$ hash MD5
$$ $$ 87 3D 2E 68 84 D4 CC 31 5B 14 33 99 28 30 DA 4E
##$RELAX= 
##$RELAX= 
##$RELAX= 
##$RELAX= 
##$RELAX= 
##$RELAX= 
##$RELAX= 
##$RELAX= 
##$RELAX= 
$$ Bruker specific parameters
$$ --------------------------
##$DU= <F:/spectra>
##$EXPNO= 4
##$NAME= <1H>
##$PROCNO= 1
##$TYPE= <nmr>
##$USER= <iren>
##$AMP= (0..31)
100 100 100 100 100 100 100 100 100 100 100 100 100 100 100 100 100 100 
100 100 100 100 100 100 100 100 100 100 100 100 100 100 
##$ANAVPT= -1
##$AQSEQ= 0
##$AQ_mod= 1
##$AUNM= <au_zg>
##$AUTOPOS= <>
##$BF1= 200.13
##$BF2= 200.13
##$BF3= 200.13
##$BF4= 200.13
##$BF5= 200.13
##$BF6= 200.13
##$BF7= 200.13
##$BF8= 200.13
##$BYTORDA= 1
##$CFDGTYP= 0
##$CFRGTYP= 5
##$CHEMSTR= <none>
##$CNST= (0..63)
1 1 145 1 1 1 1 1 1 1 1 1 1 1 1 1 1 1 1 1 1 1 1 1 1 1 1 1 1 1 1 1 1 1 
1 1 1 1 1 1 1 1 1 1 1 1 1 1 1 1 1 1 1 1 1 1 1 1 1 1 1 1 1 1 
##$CPDPRG= <>
##$CPDPRG1= <>
##$CPDPRG2= <>
##$CPDPRG3= <>
##$CPDPRG4= <mlev>
##$CPDPRG5= <mlev>
##$CPDPRG6= <mlev>
##$CPDPRG7= <mlev>
##$CPDPRG8= <mlev>
##$CPDPRGB= <>
##$CPDPRGT= <>
##$D= (0..63)
0 2 0 0 0 0 0 0 0 0.06 0 0.03 0 0 0 0 0.0002 0 0 0 0 0 0 0 0 0 0 0 0 0 
$$ [...]
##$SW_h= 4401.40845070422
##$TD= 16384
##$TD0= 1
##$TE= 300
##$TE2= 300
##$TE3= 300
##$TEG= 300
##$TL= (0..7)
0 120 120 120 120 120 120 120 
##$TP= (0..7)
150 150 150 150 150 150 150 150 
##$TP07= 0
##$TPNAME0= <>
##$TPNAME1= <>
##$TPNAME2= <>
##$TPNAME3= <>
##$TPNAME4= <>
##$TPNAME5= <>
##$TPNAME6= <>
##$TPNAME7= <>
##$TPOAL= (0..7)
0.5 0.5 0.5 0.5 0.5 0.5 0.5 0.5 
##$TPOFFS= (0..7)
0 0 0 0 0 0 0 0 
##$TUNHIN= 0
##$TUNHOUT= 0
##$TUNXOUT= 0
##$USERA1= <user>
##$USERA2= <user>
##$USERA3= <user>
##$USERA4= <user>
##$USERA5= <user>
##$V9= 5
##$VALIST= <valist>
##$VCLIST= <CCCCCCCCCCCCCCC>
##$VD= 0
##$VDLIST= <DDDDDDDDDDDDDDD>
##$VPLIST= <PPPPPPPPPPPPPPP>
##$VTLIST= <TTTTTTTTTTTTTTT>
##$WBST= 1024
##$WBSW= 25
##$XGAIN= (0..3)
0 0 0 0 
##$XL= 0
##$YL= 0
##$YMAX_a= 396117
##$YMIN_a= -398374
##$ZGOPTNS= <>
##$ZL1= 120
##$ZL2= 120
##$ZL3= 120
##$ZL4= 120
##$ABSF1= 17.95386
##$ABSF2= -4.038887
##$ABSG= 5
##$ABSL= 3
##$ALPHA= 0
##$AQORDER= 0
##$ASSFAC= 0
##$ASSFACI= 0
##$ASSFACX= 0
##$ASSWID= 0
##$AUNMP= <proc_1d>
##$AXLEFT= 0
##$AXRIGHT= 0
##$AXTYPE= 0
##$AXUNIT= <>
##$AZFE= 0.1
##$AZFW= 0.1
##$BCFW= 0
##$BC_mod= 2
##$BYTORDP= 0
##$COROFFS= 0
##$CY= 7568.61572265625
##$DATMOD= 1
##$DC= 0
##$DFILT= <>
##$DTYPP= 0
##$F1P= 17.9538593292236
##$F2P= -4.03888763876832
##$FCOR= 0.5
##$FTSIZE= 32768
##$FT_mod= 6
##$GAMMA= 0
##$GB= 0
##$INTBC= 0
##$INTSCL= 1.483618e-010
##$ISEN= 128
##$LB= 0.05
##$LEV0= 0
##$LPBIN= 0
##$MAXI= 945.577
##$MC2= 0
##$MEAN= 0
##$ME_mod= 0
##$MI= -402.1523
##$NCOEF= 0
##$NC_proc= -4
##$NLEV= 6
##$NOISF1= 8.587773
##$NOISF2= 6.764455
##$NSP= 0
##$NTH_PI= 0
##$NZP= 0
##$OFFSET= 17.95386
##$PC= 1
##$PHC0= 307.0287
##$PHC1= 0.1640022
##$PH_mod= 1
##$PKNL= yes
##$PPARMOD= 0
##$PPDIAG= 0
##$PPIPTYP= 0
##$PPMPNUM= 100
##$PPRESOL= 1
##$PSCAL= 0
##$PSIGN= 0
##$REVERSE= no
##$SF= 200.13
##$SI= 32768
##$SIGF1= 16.12182
##$SIGF2= -4.496377
##$SINO= 3.521527
##$SIOLD= 32768
##$SREGLST= <1H.CDCl3>
##$SSB= 0
##$STSI= 32768
##$STSR= 0
##$SW_p= 4401.40845070423
##$SYMM= 0
##$S_DEV= 0
##$TDeff= 16384
##$TDoff= 0
##$TI= <>
##$TILT= no
##$TM1= 0
##$TM2= 0
##$TOPLEV= 0
##$USERP1= <user>
##$USERP2= <user>
##$USERP3= <user>
##$USERP4= <user>
##$USERP5= <user>
##$WDW= 1
##$XDIM= 32768
##$YMAX_p= 326920132
##$YMIN_p= -141884
$$ End of Bruker specific parameters
$$ ---------------------------------
##NTUPLES= NMR SPECTRUM
##VAR_NAME=  FREQUENCY,     SPECTRUM/REAL,   SPECTRUM/IMAG
##SYMBOL=    X,             R,               I
##VAR_TYPE=  INDEPENDENT,   DEPENDENT,       DEPENDENT
##VAR_FORM=  AFFN,          ASDF,            ASDF
##VAR_DIM=   32768,         32768,           32768
##UNITS=     HZ,            ARBITRARY UNITS, ARBITRARY UNITS
##FACTOR=    0.134324425510551, 1,           1
##FIRST=     4401.40845070423, 15639,        -129451
##LAST=      0,             -5613,           -131204
##MIN=       0,             -141884,         0
##MAX=       4401.40845070423, 326920132,    0
$$ Real data points
##PAGE= N=1
##DATA TABLE= (X++(R..R)), XYDATA
$$ [...]
14423i985O541r176K541J3863R04j5969j0446O596Q597n273j4468r365j36R22
$$ -9985 -3444 -12620 -10079 3784 4688 -11281 -21727 -15131 -6534 -11807 -26275 -35640 -35776 -34854
14409c4854n578p510L997J9649J9265jj5490j0023N021J2655J5618J7743M913
$$ -34854 -40432 -47942 -43945 -24296 -5031 -5032 -20522 -30545 -25524 -12869 2749 20492 25405
14396B5405k4488l5795o054K7091J5659j8369j5417J9957K3975j5331l3157J822
$$ 25405 917 -34878 -40932 -13841 1818 -16551 -31968 -12011 11964 -3367 -36524 -34702
14384c4702L1203M468l6490k8131J4047K9985J0562o283o947p353o393P617J8599
$$ -34702 -3499 969 -35521 -63652 -49605 -19620 -9058 -15341 -22288 -29641 -36034 -28417 -9818
14371i818M578j5693j0056P728J058k0441j5211J4314K3677M709k375J6261K4400
$$ -9818 -5240 -20933 -30989 -23261 -22203 -42644 -57855 -43541 -19864 -15155 -17530 -1269 23131
14358B3131L592j4716q003L21r603j6683k014J3806Q986j885j54L009l421k340
$$ 23131 26723 12007 4004 4325 -5278 -21961 -23975 -10169 -1183 -3068 -3222 -213 -3634 -5974
14344e974J5077J9663r901m1762l3742K881K4519J9341P742k384j5500j7948M772
$$ -5974 9103 28766 18865 -22897 -56639 -53758 -29239 -9898 -2156 -4540 -20040 -37988 -33216
14331c3216K8428J5786k0726l0392j894J9260L825j7290o468K1126K4294j786
$$ -33216 -4788 10998 -9728 -40120 -42014 -22754 -18929 -36219 -42687 -21561 2733 947
14319I47k3875k0748n056M386P993J4578J9867J0860r821j8648j345K0396J2564
$$ 947 -22928 -43676 -48732 -44346 -36353 -21775 -1908 8952 -869 -19517 -20862 -466 12098
14306A2098k0765l6339j1591K1175K2179J467l133J1757J4660m269j7427o876
$$ 12098 -8667 -45006 -56597 -35422 -13243 -11776 -14909 -3152 11508 7239 -10188 -17064
14294a7064Q457N928q494j5717r871L118J5023J5306N62j1535j017J8092J0546
$$ -17064 -8607 -2679 -11173 -26890 -36761 -33643 -18620 -3314 -2752 -14287 -15304 2788 13334
14281A3334k2995l7752j0879K1435J9751o60l851N134j547j5538m642K3385K4147
$$ 13334 -9661 -47413 -58292 -36857 -17106 -17766 -21617 -16483 -18030 -33568 -38210 -14825 9322
14268I322j0285l2971j3894J5351J4824l832m595J3313K0423O044j2530k1562
$$ 9322 -963 -33934 -47828 -32477 -17653 -21485 -26080 -12767 7656 13700 1170 -20392
14256b0392k1138r759J1830K4966J1312j3414j4824P728J7466j555j7926m692
$$ -20392 -41530 -51289 -39459 -14493 -3181 -16595 -31419 -23691 -6225 -7780 -25706 -30398
14244c0398J5079N945k0518k3025M185K4089J4996k126l759K382J75n714m389
$$ -30398 -15319 -9374 -29892 -52917 -48732 -24643 -9647 -11773 -15532 -13150 -12975 -18689 -23078
14231b3078j724n977o264R854K7580K0239r201k6785j2645J2475J5732n490k2768
$$ -23078 -24802 -30779 -37043 -27189 391 20630 11429 -15356 -28001 -15526 206 -5284 -28052
14218b8052j4341Q076J5888J595j2220o339P292O789k753M08J3176J0772n103
$$ -28052 -42393 -34317 -18429 -16834 -29054 -35393 -28101 -21312 -24065 -23657 -10481 291 -4812
14205d812j678K5745L3337k355l5609j6355K8447L4137j887k3062r086l89j8549
$$ -4812 -6490 19255 52592 50237 14628 -1727 26720 60857 58970 35908 26822 26433 7884
14192G884k8818o509J7534J1963l331L64Q104n077k1852j1296J4325J8923K114
$$ 7884 -20934 -27443 -9909 2054 -1277 -913 7191 2114 -19738 -31034 -16709 2214 4328
14179D328o291k34r34j1018q127J2522K5766J4373q630k1867j8322l513J0391
$$ 4328 -1963 -2197 -3131 -14149 -22276 -9754 16012 30385 21755 -112 -18434 -21947 -11556
14166a1556R780m310j1405K2J1366K825j2004r190L192J152r167k393J6591J8344
$$ -11556 -1776 -6086 -17491 -17469 -6103 -3278 -15282 -24472 -21280 -20128 -29295 -31688 -15097 3247
14152C247J757m387N448O333n730n383Q760N730j5987j5117J7153K7510j2929
$$ 3247 5004 617 6065 12398 6668 1285 10045 15775 -212 -15329 1824 29334 16405
14139A6405m7825j7963L9593M3154r841m4470k4879L570j296j7038o453K0130
$$ 16405 -31420 -49383 -9790 33364 23523 -20947 -45826 -42256 -43552 -60590 -67043 -46913
14127d6913K7304R535q603j0881l088L404M535L783P327J4681J4298j490j9694
$$ -46913 -19609 -10074 -18677 -29558 -32646 -29242 -24707 -20924 -13597 1084 15382 13892 -5802
14114e802k0379n787K857j337k053J0805K3516J9308l1k0998l1552k2508N566
$$ -5802 -26181 -31968 -29111 -30448 -32501 -21696 1820 21128 21097 99 -31453 -53961 -48395
14101d8395L0791K6697n61j4792j247J1046k757k1185j2469J0067Q968j2969j5377
$$ -48395 -17604 9093 8532 -6260 -7507 3539 782 -20403 -32872 -22805 -13837 -26806 -42183
14088d2183J0910K4642J76k8947k1196J0236K2681J0298L002R312N660j3749k0219
$$ -42183 -31273 -6631 -6455 -35402 -56598 -46362 -23681 -13383 -10381 -1069 4591 -9158 -29377
14075b9377J43J7524M239j9589j7525O436J7432N081o111K11J0833R138l139j6066
$$ -29377 -29234 -11710 -7471 -27060 -44585 -38149 -20717 -15636 -21747 -21536 -10703 -1565 -4704 -20770
14061b0770k1968j2619J2204L1089K0181j0292k4340j0004P094P437L525R329
$$ -20770 -42738 -55357 -43153 -12064 8117 -2175 -26515 -36519 -29425 -21988 -18463 -9134
14049i134J5243J1467P033O145m474k2633j8855J3124K8707m566m6286l5028J9378
$$ -9134 6109 17576 24609 30754 26280 3647 -15208 -2084 26623 22057 -24229 -59257 -39879
14036c9879M9917K9113m412j5980j5848j8953j4637K284J1053k64j1031j370J6502
$$ -39879 10038 39151 34739 18759 2911 -16042 -30679 -28395 -17342 -17606 -28637 -30007 -13505
14023a3505K0172Q303o522j5919j3901J960J6788Q940j5342k3067j763K0836J7834
$$ -13505 6667 14970 8448 -7471 -21372 -19412 -2624 6316 -9026 -32093 -33856 -13020 4814
14010D814k475j7760k0622j1714Q471K5327J6717r297j4838J0545K8170J0751
$$ 4814 2339 -15421 -36043 -47757 -39286 -13959 2758 -6539 -21377 -10832 17338 28089
13998B8089j3085q706N991l958k5274j8201J3253K5772O383j1652o071M688o19
$$ 28089 15004 6298 12289 8331 -16943 -35144 -21891 3881 10264 -1388 -7459 -2771 -3390
13985c390j3284j3941p09J3607J7157P042o994r207J675P715o33p950j087P123
$$ -3390 -16674 -30615 -31324 -17717 -560 6482 -512 -9719 -8044 -329 -962 -8912 -9999 -2876
13971b876K777k973P04k140k1842l0481l527K9657K6314O72k507J2294L801k2351
$$ -2876 -99 -3072 -2368 -4508 -26350 -56831 -60358 -30701 -4387 -3715 -6222 6072 9873 -12478
13957a2478j6506K2778L5048l670l9767k8705K250J3209J2933J9522J5717r708
$$ -12478 -28984 -6206 28842 25172 -14595 -43300 -41050 -27841 -14908 4614 20331 10623
13945A0623k5058q932N404j0644k3058N561M1097K9570r574j5349J2122J8129
$$ 10623 -14435 -23367 -17963 -28607 -51665 -46104 -5007 24563 14989 -360 11762 29891
13933B9891p756j8216K300J0479j5093l3463j1079K2939K6055M211j0692j1761
$$ 29891 22135 3919 6219 16698 1605 -31858 -42937 -19998 6057 10268 -424 -12185
13921a2185j0767o117Q536K0025J1201p805j0197Q224K1577R233j5228j9631M507
$$ -12185 -22952 -29069 -20533 -508 10693 2888 -7309 915 22492 31725 16497 -3134 1373
13908A373K5344P944l4783m9878j2754L5686M1575P787j7988j0940Q863J5925
$$ 1373 26717 34661 -122 -50000 -62754 -27068 14507 22294 4306 -6634 2229 18154
13896A8154P557o857j6357r230J1447J9195j046k0249l922K7335K2836j6222l4188
$$ 18154 25711 18854 2497 -6733 4714 23909 22863 2614 -1308 26027 48863 32641 -1547
13883a547q400J7315O544j5623j2855M456Q497L437N970P329m975j2843M154K6111
$$ -1547 -9947 7368 13912 -1711 -14566 -10110 -1613 1824 7794 15123 10148 -2695 1459 27570
13869B7570J9093r951k3767j1025M588O330J801p22m691j1793j6990j7381j1814
$$ 27570 46663 36712 12945 1920 6508 12838 14639 13917 9226 -2567 -19557 -36938 -48752
13856d8752K580K0295K4752J0340n660p626j863K141R218J8688J2160j3982k9354
$$ -48752 -46172 -25877 -1125 9215 3555 -4071 -5934 -3793 5425 24113 36273 22291 -7063
13843g063j2280J2897J3925O32j123P95j3166k5438p822J9953J5695j2146j7512
$$ -7063 -19343 -6446 7479 8111 6988 7783 -5383 -30821 -38643 -18690 -2995 -15141 -32653
13830c2653K974P902r623j0077J4372K1163k091r513J8761L3547J413l1741j6707
$$ -32653 -29679 -21777 -31400 -41477 -27105 -5942 -8033 -17546 1215 34762 36175 4434 -12273
13817a2273J5481J0426j5286r488J8559J5084k0351l1937k633K0000N433j5496
$$ -12273 3208 13634 -1652 -11140 7419 22503 2152 -29785 -32418 -12418 -6985 -22481
13805b2481r474R278J4632J0971J0640L629j8788l5594k2400R118K5247J5487
$$ -22481 -31955 -22677 -8045 2926 13566 17195 -1593 -37187 -59587 -50469 -25222 -9735
13793i735J533L744J5463J4477o610k6843j9712R812K5499Q230j3921o848J4424
$$ -9735 -8202 -4458 11005 25482 18872 -7971 -27683 -17871 7628 15858 1937 -4911 9513
13780I513P622k6186l7267j579M0599M1155O512k2578k8061k1853j3170O14J6652
$$ 9513 17135 -9051 -46318 -47897 -7298 33857 40369 17791 -10270 -32123 -45293 -44679 -28027
13767b8027K4016J7917L392j0574j2680L027K1888J7442j1653l2166k0514M087
$$ -28027 -4011 13906 17298 6724 -5956 -2929 18959 36401 24748 -7418 -27932 -23845
13755b3845J1992O997R004J2932K294j0327OJ9476R363k5514l3722J347K8240
$$ -23845 -11853 -4856 4148 17080 19374 9047 9053 28529 37892 12378 -21344 -19997 8243
13742H243O172k8546j9746J8285K3783j4227l9854j7138K0441K7820J2917J0969
$$ 8243 14415 -14131 -33877 -15592 8191 -6036 -45890 -63028 -42587 -14767 -1850 9119
13730I119K2655J7331j1392l0527j5414J3533J8525m415k1571q886J4796J4364
$$ 9119 31774 49105 37713 7186 -8228 5305 23830 19415 -2156 -11042 3754 18118
13718A8118j1287k6581j0034J4431J2641j0005j8474m24J9388J8967O958J706
$$ 18118 6831 -19750 -29784 -15353 -2712 -12717 -31191 -31615 -12227 6740 13698 15404
13706A5404M806P747O969M27j4163k6941k0705MP038p777j2998J3496M1197K8173
$$ 15404 20210 27957 34926 35353 21190 -5751 -26456 -26452 -19414 -27191 -40189 -26693 14504 42677
13692D2677j2639l0543j1360J0695J4023J4511K0382J0669j9921l7024j7562R205
$$ 42677 30038 -505 -11865 -1170 12853 27364 47746 58415 38494 1470 -16092 -6887
13680f887N774j5064j3508J3548L1261K0926k15j1762j2724r122l125J917K847
$$ -6887 -1113 -16177 -29685 -16137 15124 36050 35835 24073 11349 2227 -898 1019 3866
13667C866K967L573l632j9433k3822k707K2260J8948o272j6184J823K0720J8791
$$ 3866 6833 10406 6774 -12659 -36481 -39188 -16928 2020 -4252 -20436 -18613 2107 20898
13654B0898P108J697j941j1014j6657j0587j895j042k806M99L444q11o175m162
$$ 20898 28006 29703 27762 16748 91 -10496 -12391 -13433 -16239 -15740 -12296 -13107 -19282 -23444
13640b3444K544Q069J3102J6742J1528k569j1863p509J888N996O999P270j069
$$ -23444 -20900 -12831 271 17013 28541 25972 14109 6600 8488 14484 21483 28753 27684
13627B7684j8944k6679o935K6170L8521J5144k3161m1399k3997R651K3524O321
$$ 27684 8740 -17939 -24874 1296 39817 54961 31800 -9599 -33596 -23945 -421 5900
13615E900j1955j265K0735J3606j6980k0634J5501L6778L965m0234l3977J0119
$$ 5900 -6055 -7320 13415 27021 10041 -10593 4908 41686 45651 5417 -28560 -18441
13603a8441L0203J1087o233j248J816r831j4335j473P175Q65j400P786O578j1862
$$ -18441 11762 22849 16616 15368 17184 7353 -6982 -8455 -1280 -415 -1815 5971 12549 687
13589F87j8722J553J9726Q556j2383j0976P028J5422J1518Q804N587n726j4310
$$ 687 -18035 -16482 3244 11800 -583 -11559 -4531 10891 22409 31213 36800 31074 16764
13576A6764p602K538J62m396M370J2764M39j7552j1377J0924J4014n928j6151
$$ 16764 9162 11700 11862 7466 11836 24600 25039 7487 -3890 7034 21048 15120 -1031
13563a031k595J2090J1538O232K472q756k0187p413K3065K7254r670m0294k2389
$$ -1031 -3626 8464 20002 26234 28706 19950 -237 -7650 15415 42669 32999 -7295 -29684
13550b9684J5915K0489o041j5165P820K6078J4015p968j2934n324k732o482p878
$$ -29684 -13769 6720 679 -14486 -6666 19412 33427 25459 12525 7201 4469 -2013 -9891
13537i891n365j451L545N715L04l891Q273K9215K9549J118k4061j7552L912O438
$$ -9891 -15256 -16707 -13162 -7447 -7143 -11034 -2761 26454 56003 57121 33060 15508 19420 25858
13523B5858q443j1605K500R086j244o335O434J4964j338k4669k3766j09J6925
$$ 25858 17415 5810 8310 17396 16152 9817 16251 31215 29877 5208 -18558 -18667 -1742
13510a742J2868J232l479k654j093K870Q789R804L070n294r162q059l399J715
$$ -1742 11126 12358 8879 6225 5132 8002 16791 26595 29665 24371 15209 7150 3751 5466
13496E466N49q076j1175K415J9223J4468r168j9186P28K5069K3128J898r317l367
$$ 5466 6015 -2061 -13236 -10821 8402 22870 13702 -5484 -4756 20313 43441 45339 36022 32655
13482C2655J411m069p781j333N819L773l182p488j0221j3022r724K648J2593P438
$$ 32655 34066 29997 22216 20883 26702 30475 27293 19805 9584 -3438 -13162 -10514 2079 9517
13468I517n198m003J4183K3515K881k8566l0672J580K6199J2466j3471r398J4790
$$ 9517 4319 316 14499 38014 40895 12329 -18343 -16763 9436 21902 8431 -967 13823
13455A3823J1940k2857l7231k249L7992L0119j0533k7685p047J4551J2574K749
$$ 13823 25763 2906 -34325 -36574 1418 31537 21004 -6681 -13728 823 13397 16146
13443A6146M405J2855J4812M656j6462l5147k6492J1585L6377J1293l1214k7432
$$ 16146 20551 33406 48218 52874 36412 1265 -25227 -13642 22735 34028 2814 -24618
13431b4618J9263L7817n73l6488j7409K1180J8473j4462k0333R970L0120J4538
$$ -24618 -5355 32462 31889 -4599 -22008 -828 17645 3183 -17150 -7180 22940 37478
13419C7478j2526k3015j5585J121J8051J8276n199k5740j2328J9945K6708J520
$$ 37478 24952 1937 -13648 -12527 5524 23800 18601 -7139 -19467 478 27186 28706
13407B8706j5742l743J0201K18j6788j2877O955J6937P535r179j7260q201J1555
$$ 28706 12964 9221 19422 19640 2852 -10025 -3070 13867 21402 12223 -5037 -13238 -1683
13394a683J8973r45k6807k2678Q473K5536J1309m056K700J0836j455j5272p122
$$ -1683 17290 16345 -10462 -33140 -24667 869 12178 8122 10822 21658 20203 4931 -2191
13381b191O336P11o886J1224L4271J9475k2218l4787m390J8682J131k2907j1437
$$ -2191 4145 4856 -2030 9194 43465 62940 40722 5935 1545 20227 21358 -1549 -12986
13368a2986J8030J9980p231k3472r702R609Q855l508l050J4332K7541J7828p021
$$ -12986 5044 25024 17793 -5679 -15381 -5772 3083 -425 -3475 10857 38398 56226 49205
13355D9205k0771j1599J159o655k6564k5406O599L7154L2817J022k5001k8808
$$ 49205 28434 16835 17994 11339 -15225 -40631 -34032 3122 35939 36961 11960 -16848
13343a6848j8471k297J8738L6163L4827J4197p416j6071j6234j6183j3298k704
$$ -16848 -35319 -37616 -18878 17285 52112 66309 58893 42822 26588 10405 -2893 -5597
13331e597J0192J6100J3992Q138n06j0818j5161p393N405R652K993m168m713k452
$$ -5597 4595 20695 34687 42825 42319 31501 16340 8947 14352 24004 26997 22829 18116 15664
13317A5664k136j790R05L257L534M562O117K103p789j2194l507Q520J0645O606
$$ 15664 13528 11738 12643 15900 19434 23996 30113 32216 24427 12233 8726 17246 27891 34497
13303C4497Q353J1921K087j8420k6542j2958K525K119l227L538J3200N766j1954
$$ 34497 42850 54771 56858 38438 11896 -1062 1463 3582 355 3893 17093 22859 10905
13290A0905j3369M674J4904K100j4283j2446K81N655M207M848J249j3980k2327
$$ 10905 -2464 2210 17114 19214 4931 -7515 -7234 -1579 2628 7476 8725 -5255 -27582
13277b7582J90L6629L9685k36l2277j4411K3697K3595j4385l3033p184J9235M837
$$ -27582 -27392 9237 48922 48686 16409 1998 25695 49290 34905 1872 -5312 13923 18760
13264A8760k4330j9198J2586K0690m826j7397R867L9246K5594j5927l3847j2805
$$ 18760 -5570 -24768 -12182 8508 3682 -13715 -3848 35398 60992 45065 11218 -1587
13252a587J3477J4658k535j5150j3689l531O847J1456R408M916j51r138j8848
$$ -1587 11890 26548 24013 8863 -4826 -8357 -1510 9946 19354 24270 24119 14981 -3867
13239c867j4914P210K6416K0709M38o211L927Q000j711p318k358n647k2588k5054
$$ -3867 -18781 -11571 14845 35554 35992 29781 33708 41708 39997 32679 30321 24674 2086 -22968
13225b2968M530L5175K6447j0786k8317q430J7146J7611J78j1824j1280m610K812
$$ -22968 -18438 16737 43184 32398 4081 -4349 12797 30408 30586 18762 7482 2872 5684
13212E684N100l710j4920p636J9335L4900J5694j5292j7359P686J6876q331l2527
$$ 5684 10784 7074 -7846 -15482 3853 38753 54447 39155 21796 29482 46358 38027 5500
13199E500k0415R413J5087m186j2627R86R268j130n432J1846K3678N002k0073
$$ 5500 -14915 -5502 9585 5399 -7228 -6242 3026 1896 -3536 8310 31988 36990 16917
13186A6917j3853J3493K0682J023j3176p206K81j07M689J3473O136j2205q835
$$ 16917 3064 16557 37239 38262 25086 17880 18161 18054 22743 36216 42352 30147 21312
13173B1312J7514K3810o430k9750j4383N429p045k1347N297M2638L0958j4314
$$ 21312 38826 62636 56206 26456 12073 17502 10457 -10890 -5593 37045 68003 53689
13161E3689k2985J2350K3797j6108m8137k4540J8488K7195R427P78N83q096j3414
$$ 53689 30704 43054 66851 50743 2606 -21934 -3446 23749 33176 33954 34537 26441 13027
13148A3027k08J0748k034j4508L439K8137J7765j2332j2511J3155R611l2815n2317
$$ 13027 12819 23567 21533 7025 10464 38601 56366 44034 31523 44678 54289 21474 -30843
13135c0843j0289M4595M5127j167l0627j3062J8738K2769k071k4670k0995L195
$$ -30843 -41132 3463 48590 47423 16796 3734 22472 45241 43170 18500 -2495 700
13123G00K2155J8509N78j1490j1963j0852j1804n718R388J8545R676q046j5831
$$ 700 22855 41364 41942 30452 18489 7637 -4167 -9885 -497 18048 27724 19678 3847
13110C847q477K624N800K262L236J4371K3699J3149j3114k5184o179J8690J4567
$$ 3847 -4630 -2006 3794 6056 9292 23663 47362 60511 47397 22213 16034 34724 49291
13097D9291j0828j8005K653J5651k591k5423j6887J4400L0246J6977k940p730
$$ 49291 38463 20458 23111 38762 36171 10748 -6139 8261 38507 55484 52544 44814
13085D4814q72K196m554j3350j2160J320J3190Q176p125r378P089J8187M621j8015
$$ 44814 43942 46138 41584 28234 16074 17394 30584 38760 31635 22257 29346 47533 52154 34139
13071C4139k1530m946Q688P564J939K158M680K014o362j4727j5407m997P994R098
$$ 34139 12609 7663 16351 23915 25854 28012 32692 34706 28344 13617 -1790 -6787 1207 10305
13057A0305j711o666L677J5053J2633L806J240j83q326j1871Q42J5287J2050J392
$$ 10305 8594 1928 5605 20658 33291 37097 38337 38154 29828 17957 18799 34086 46136 47528
13043D7528L663Q419o761k6262j4025K0023K5248q362l0353j1882R058k251j6276
$$ 47528 51191 59610 52849 26587 12562 32585 57833 49471 19118 7236 16294 14043 -2233
13030b233L757K9727J3813k5705l0661J661J7716q36j2264P663K5840J3039q183
$$ -2233 1524 31251 45064 19359 -11302 -9641 8075 7239 -5025 2638 28478 41517 33334
13017C3334p919K008j709r115J21J4764J0103r352j8679j1469j040N846J0304
$$ 33334 25415 27423 25714 16599 16720 31484 41587 32235 13556 2087 1047 6893 17197
13004A7197Q287O19J637J3211J0123j7425l0433N092M9993L6393k5213n1019q625
$$ 17197 25484 26103 27740 40951 51074 33649 3216 8308 58301 94694 69481 18462 9837
12991I837L3876J6893j9567j0038K4478J4938l4112m6544J865M2568K0686k5018
$$ 9837 43713 60606 41039 31001 55479 70417 36305 -10239 -8374 34194 54880 29862
12979B9862k8758O326K7785J6491j166o551o987o315J737R603N3k0811k4597j765
$$ 29862 1104 7430 35215 51706 50540 43989 37002 30687 32424 42027 42080 21269 -3328 -5093
12965e093K3693K8299J5485P26q710j1270p343m797j0402j2538M987K8722K4952
$$ -5093 18600 46899 62384 63110 54400 43130 35787 30990 20588 8050 13037 41759 66711
12952F6711p006k4821n430J7099N503k0005j5612J3440K2525P77j5418m959R441
$$ 66711 59705 34884 29454 46553 52056 32051 16439 29879 52404 53181 37763 32804 42245
12939D2245P390K146O211L964j5223k8502j4269R994J5920Q910J0632J4578j509
$$ 42245 49635 51781 57992 61956 46733 18231 3962 13956 29876 38786 49418 63996 62487
12926F2487k7438k6486P323L4240K2202j2704l2401k2183K493J8243J2418p207
$$ 62487 35049 8563 15886 50126 72328 59624 27223 5040 7533 25776 38194 30987
12914C0987j5526L156K8890K5889p217l0672j7439J0900J9049O545k215K73R71
$$ 30987 15461 18617 47507 73396 66179 35507 18068 28968 48017 54562 52347 52620 53591
12901E3591l345k96J2215J7444M060j6082k2095q081J1278J5738O00j6028j3358
$$ 53591 50246 49950 62165 79609 83669 67587 45492 37411 48689 64427 65027 48999 35641
12888C5641L295P520q430j7947N17K7281K8569N814j0971j0259p373r367n930
$$ 35641 38936 46456 38026 20079 20596 47877 76446 82260 71289 61030 53657 44290 38360
12875C8360J786k217j5259j2711R256K1108P272o736K263J5598O678j1471q685
$$ 38360 40146 37929 22670 9959 19215 40323 47595 40859 43122 58720 65398 53927 45242
12862D5242J0020J2570q463k7352k5643j0958L445J2005J1357M453N304J7410
$$ 45242 55262 67832 59369 32017 6374 -4584 -1139 10866 22223 26676 31980 49390
12850D9390J8491n592k6009q372K6026K4517j3525l2474r217J1823l554k2513
$$ 49390 67881 62289 36280 27908 53934 78451 64926 32452 23235 35058 31504 8991
12838H991n189K5354K3251l826j2801J636P060l775l884J3891K2121O175j4129
$$ 8991 3802 29156 52407 48581 35780 37416 44476 40701 36817 50708 72829 79004 64875
12825F4875k0340j7634j1333N080K5714K7189L706j8816j9047p578l202m099Q41
$$ 64875 44535 26901 15568 20648 46362 73551 77257 58441 39394 31816 28614 24515 25356
12812B5356J0620J7851K0615J6107j287k3905k9977j1845J0393J5267M593p828
$$ 25356 35976 53827 74442 90549 89262 65357 35380 23535 33928 49195 53788 45960
12800D5960j4273j0250O069K0939J4389n837p150J5766K4539k946l0856j9389
$$ 45960 31687 21437 27506 48445 62834 56997 49847 65613 90152 87206 56350 36961
12788C6961J0098J0168j5096k1275p00R609k571n541J3263K0317l730k5079j0783
$$ 36961 47059 57227 42131 20856 20156 29765 27194 21653 34916 55233 51503 26424 15641
12775A5641J6881J7251o257j8556p599R173J8761K0430J1160o800j4747k396Q378
$$ 15641 32522 49773 43516 24960 17361 26534 45295 65725 76885 70085 55338 52942 61320
12762F1320m781k2901j2597J5354J8285q986k4172n798J4941R599l548N74P496
$$ 61320 56539 33638 21041 36395 54680 45694 21522 15724 30665 40264 36716 37290 44786
12749D4786n832k2311j0652J7412K1752j096j2787M122K1685J6270K975P00k120
$$ 44786 38954 16643 5991 23403 45155 44059 31272 35394 57079 73349 76324 77024 74904
12736G4904j9459l3153j9422Q438J8118P342L88K777k596j4156p083J8969K6560
$$ 74904 55445 22292 2870 11308 29426 36768 37156 39933 37337 23181 16098 35067 61627
12723F1627l339l4531k4675J3051L1651J7565m03j958K121k14l579l863p272j1710
$$ 61627 58288 23757 -918 12133 43784 61349 60946 58988 61109 60895 57316 53453 46181 34471
12709C4471m712J0837J4512K542k980P026R235j1955l2153k2437M661J5802O843
$$ 34471 29759 40596 55108 57650 54670 61696 70931 58976 26823 4386 9047 24849 31692
12696C1692m26J136J584L361J6516K8396J5554j3700k5999j4805o373q498J648
$$ 31692 31266 32402 33986 37347 53863 82259 97813 84113 58114 43309 36936 28438 30086
12683C0086K5022K4799j0449l3334o084L5507L3464n451k6812j4053p22m387n357
$$ 30086 55108 79907 69458 36124 30040 65547 99011 93560 66748 52695 51973 47586 42229
12670D2229M407M805o894l456K0096K7423j66k7128j7881Q168J2654n68j804R152
$$ 42229 46636 51441 44547 41091 61187 88610 88444 61316 43435 51603 64257 63689 61885 71037
12656G1037Q847k172k457N211m208k8885l4380o598K4661K8441J0068p006j1509
$$ 71037 79884 77712 75255 80466 76258 47373 12993 6395 31056 59497 69565 62559 51050
12643E1050m056R876J5281q73k3255j9450J0256K4426K30k9020k2651Q451K4658
$$ 51050 46994 56870 72151 71278 48023 28573 38829 63255 63485 34465 11814 20265 44923
12630D4923J7266P479J759r478j6612J099L0407L0402n675l3978k1712R490K2427
$$ 44923 62189 69668 71427 61949 45337 46436 76843 107245 101570 67592 45880 55370 77797
12617G7797J5381Q324L755p640j8598j3594K375R644L894j927j614r89k580m332
$$ 77797 93178 101502 105257 97617 79019 65425 67800 77444 81338 79411 77797 76808 74228 69896
12603F9896r919k0873k2838k023K6309L0165M953j7777j2817P941J7016O578r177
$$ 69896 59977 39104 16266 14243 40552 70717 75670 57893 45076 53017 70033 76611 67434
12590F7434j4523n639P433P882q377k0368n856K2028K5805k638k7111j9862m16
$$ 67434 52911 47272 54705 62587 54210 33842 27986 50014 75819 73181 46070 26208 25792
12577B5792J386n705M190K3079K0153l713j4161J439J5815Q687l793k407L686
$$ 25792 27178 21473 25663 48742 68895 65182 51021 52460 68275 76962 73169 70762 74448
12564G4448k00n878m46P836N440j965l953o587j4279r667J6644L3614P719l6253
$$ 74448 74248 68370 67924 75760 81200 79235 75282 68695 54416 44749 61393 95007 102726 66473
12550F6473l9978J253K7131L188k7480j4297K2207K6884l642k2766r649Q107Q368
$$ 66473 26495 27748 54879 58067 30587 16290 38497 65381 61739 38973 29324 37431 45799
12537D5799M183Q507R608k59m685O926J6106N150j2138j3583l783p81l622l25
$$ 45799 49982 58489 68097 67838 63153 70079 86185 91335 79197 65614 61831 61050 57428 57103
12523E7103M553m54n670O764K6247K2864n203k5574j9547m855L67N112J8821K4912
$$ 57103 61656 61202 55532 62296 88543 111407 106204 80630 61083 56228 56595 61707 80528 105440
12509A05440O564k0228k6420j0868L152L624j731o131r532p602K778R835J068
$$ 105440 112004 91776 65356 54488 57640 61264 59533 53402 43870 36268 39046 48881 49949
12496D9949j1455m657J7006K4058P406p935m703N72r046j8614q216Q790N974j0118
$$ 49949 38494 33837 50843 74901 82307 74372 69669 70241 61195 42581 34365 43155 49129 39011
12482C9011q332J5509K9345J3867r129j1886j89K736m384k206J3597K1864O786
$$ 39011 30679 46188 75533 89400 80271 68385 68196 70932 66548 64342 77939 99803 106589
12469A06589j7219k3253o819R983Q963j796l402N042P663m1k581Q234J4925j63
$$ 106589 89370 66117 59298 69281 78244 76448 73046 78088 85751 85710 83129 91363 106288 106125
12455A06125k3001k3917r70J6574J0311m873p945l33M425K457k159p008p646J446
$$ 106125 83124 59207 58237 74811 85122 80249 72304 71971 76396 78853 76694 69686 62040 63486
12441F3486J2041O476j0600q345K2090M1160J4212l0475l8108p842J1437R70o457
$$ 63486 75527 82003 71403 63058 85148 126308 140520 110045 71937 64095 75532 76502 70045
12428G0045P120J3480m614j7165j260J4639K052j3138K329K2848M719l1676k8191
$$ 70045 77165 90645 86031 68866 67606 82245 84297 71159 73488 96336 101055 69379 41188
12415D1188J3911L4203J2323n184P378J1978j6867l8358j4180K2103J9196q638
$$ 41188 55099 89302 101625 96441 103819 115797 98930 60572 46392 68495 87691 79053
12403G9053j1677J0068J3806q834k1822q833O494Q005P293R988N239l197L330
$$ 79053 67376 77444 91250 82416 60594 51761 58255 66260 73553 83541 88780 85583 88913
12390H8913J8338J1332j8432l1128p820J7014Q591j7460k5827j3360J47Q414J4763
$$ 88913 107251 118583 100151 69023 61203 78217 86808 69348 43521 30161 30308 38722 53485
12377E3485J2116j891o972J0781K6871R812k5604l3056n00L3168L1879L786j9675
$$ 53485 65601 63710 56738 67519 94390 104202 78598 45542 45042 78210 110089 113875 94200
12364I4200k2569j1384L38L946J028J051P397R100l523k0740k4402j1706O225
$$ 94200 71631 60247 60585 64531 65559 66610 74007 83107 79584 58844 34442 22736 28961
12351B8961K1915L0593K1413o671k7606j5646J2848J7578m170j1979J0879K6103
$$ 28961 50876 81469 102882 96211 68605 52959 65807 83385 79215 67236 78115 104218
12339A04218J125l4230l0139P043K5892Q881o549O421K0261k75l7408m1150k92
$$ 104218 105343 71113 40974 48017 73909 82790 76241 82662 102923 102648 65240 24090 23798
12326B3798M1060M1652J0691j4658j7634q400K812J3359J4556j643j9673j2154
$$ 23798 64858 106510 117201 102543 84909 76509 79321 92680 107236 105593 85920 73766
12314G3766J5842K3404p467l8279k7565O164J3556q422j4646J3617L9199K7698
$$ 73766 89608 113012 105545 67266 39701 45865 59421 50999 36353 49970 89169 116867
12302A16867l514j6755n482Q760R684l474k1922k8019q403K0461K2105r195l2596
$$ 116867 113353 96598 91116 99876 109560 106086 84164 56145 47742 68203 90308 81113 48517
12289D8517j5857J8833K9201J0184j1563k0204j6598M44K4801K9605p37l5572
$$ 48517 32660 51493 80694 90878 79315 59111 42513 42957 67758 97363 96626 61054
12277F1054l1789N008K9874K2839N363l683p478o389M814J1704n504k7869j4775
$$ 61054 29265 34273 64147 86986 92349 88666 81188 74799 79613 91317 85813 57944 43169
12264D3169K5581L5201m247l5180j0953L0824K8698q050k1841J86J5788K996j0790
$$ 43169 68750 103951 99704 64524 53571 84395 113093 105043 83202 83388 99176 102172 91382
12251I1382k538J0381M992j0199j2615J203J5907J7850N617j0335j4709l502P675
$$ 91382 88844 99225 104217 94018 81403 82606 98513 116363 121980 111645 96936 93434 101109
12238A01109K592j1780j5113l944N562M032k53R85M387N181N056N281K343o008
$$ 101109 103701 91921 76808 72864 78426 82458 82205 83190 87577 92758 97814 103095 105438 99430
12224I9430j6648k2228j3201J1957L2760K0618j8616l7272o492L5720L3077p115
$$ 99430 82782 60554 47353 59310 92070 112688 94072 56800 50308 86028 119105 111990
12212A11990k6847p133R121n802j9867j458K3462J5381j1468j2605J5075L1383
$$ 111990 85143 78010 87131 81329 61462 60004 83466 98847 87379 74774 89849 121232
12200A21232J5765q841j7009j1720o940n195k379J753N133N581N92o754o424L949
$$ 121232 136997 128156 111147 99427 92487 87292 84913 86666 91799 97380 97972 91218 84794 88743
12186H8743J1057M762m806l856K640L027J406O184P837n502j9582j1446J0181
$$ 88743 99800 104562 99756 95900 98540 101567 102973 109157 116994 111492 91910 80464 90645
12173I0645J4732j560j1464l801J635n634p862N527J7154J3290N012O3j3237l2290
$$ 90645 105377 103817 92353 88552 90187 84553 76691 82218 99372 112662 117674 117737 104500 72210
12159G2210k6342J2868M0347J8048k1498j9722J8269L2741K533k6653j6512J1618
$$ 72210 45868 58736 99083 117131 95633 75911 94180 126921 129454 102801 86289 97907
12147I7907J9542O951l488o079q498q265N60R589O970k619o081j856K552M542
$$ 97907 117449 124400 120912 114833 106335 98070 98630 108219 115189 112570 106489 104633 107185 111727
12133A11727M843O31p384r894k763L470l23o656n428k289p057j2797m938J2972
$$ 111727 116570 117201 109817 99923 97160 100630 100307 93651 88223 85934 78877 66080 61142 74114
12119G4114K0471P496j2813k0242q046J2379K2526J5329M184M826R143m434l0257
$$ 74114 94585 102081 89268 69026 60980 73359 95885 111214 115398 120224 129367 124933 94676
12106I4676l2414J748L3475K5195l500q908P023N624j8668k8166o410J5749J3262
$$ 94676 62262 64010 97485 122680 119180 110272 117295 122919 104251 76085 69675 85424 98686
12093I8686K559L227L382r758j8372m436J4632J2973j782n106K865L932k946m015
$$ 98686 101245 104472 107854 98096 79724 75288 89920 102893 101111 96005 98870 102802 99856 95841
12079I5841O08p47o369m067N572J0627P423R31n603o025Q472K7341K1058j3153
$$ 95841 96449 95702 89333 85266 90838 101465 108888 109819 104216 98191 106663 134004 155062 141909
12065A41909l2741r380K1248J2676j5995j3172J5108J6022j5053k4777L026J7782
$$ 141909 109168 99788 121036 133712 117717 104545 119653 135675 120622 95845 98871 116653
12053A16653o853k4388J994L2340J7718j7290k0074J533R93k2255k4442O629L4407
$$ 116653 109800 85412 87406 119746 137464 120174 100100 101633 102626 80371 55929 62558 96965
12040I6965L1179P368j6085k6727j5914J0009K1224J375j8906l673K7255K4901
$$ 96965 128144 135512 119427 92700 76786 86795 108019 109394 90488 86815 114070 138971
12028A38971j1052l2424j8266J954N314M636J0242R891Q45o67N318n26j3799o102
$$ 138971 127919 95495 77229 79183 84497 89133 99375 109266 110111 109444 114762 114236 100437 94335
12014I4335J9141K0856r994k6951k385K5247J4996j1533j2238O769J1758M09o734
$$ 94335 113476 134332 124338 97387 95002 120249 135245 123712 111474 118243 130001 130410 123676
12001A23676r229j5810j2883J0400K6373O169k5085k1283J0176K1004J129j1312
$$ 123676 114447 98637 85754 96154 122527 128696 103611 82328 92504 113508 114637 103325
11989A03325M56Q765k258r991J31P942j78m600Q211J6158J43j8004q638J6470
$$ 103325 103781 112546 110288 100297 100428 108370 108192 103592 111803 127961 128104 110100 101462 117932
11975A17932K1648J673j3493n782O925J265j5521j5053J0702L3015K2235r205
$$ 117932 139580 141253 127760 121978 128903 130168 114647 99594 110296 143311 165546 156341
11963A56341k1208l551J0264j654j4402k533J1931j673k2870j1384J9036J8329
$$ 156341 135133 131582 141846 140192 125790 123257 135188 133515 110645 99261 118297 136626
11951A36626j4145k6291j528J6129K747n917J4741K9674P143k3731k4558r549
$$ 136626 122481 96190 94662 110791 113538 107621 122362 152036 159179 135448 110890 101341
11939A01341o839k899J9249K7962o554m3377k3889K9279M1950M951j7761J623
$$ 101341 94502 91603 110852 138814 132260 88883 64994 94273 136223 141174 123413 125036
11927A25036J7226j791j9208q82K4895J6885j4075k9359j9248j307J1385J2380
$$ 125036 142262 140471 121263 120381 145276 162161 148086 118727 99479 98172 109557 121937
11915A21937k741k0093j3405J3330K0977m194k2144k360K2519R148k2458k0455
$$ 121937 119196 99103 85698 99028 120005 115811 93667 91307 113826 122974 100516 80061
11903H0061J3010K5848J400j7447k08K4630J7931j1610k5738j1444R584J6172
$$ 80061 93071 118919 120319 102872 102664 127294 145225 133615 107877 96433 106017 122189
11891A22189R998M208M315M850N34l892n7P878M545j2078k0741o154J3641J0863
$$ 122189 132187 136395 140710 145560 146094 142202 142145 150023 154568 142490 121749 115595 129236 140099
11877A40099q225j0501J1796K5278M164k9032l2426j060K7991K4084j808j5894
$$ 140099 131874 121373 133169 158447 162611 133579 101153 100093 128084 152168 150360 134466
11865A34466m794J0542M635j6903k2692J649K9905K7362k392k2164j1158J1103
$$ 134466 129672 140214 144849 127946 105254 106903 136808 164170 161778 139614 128456 139559
11853A39559J6937O082m320r285j5654k0137r616J4018K7237J3102j3667k2211
$$ 139559 156496 162578 158258 148973 133319 113182 103566 117584 144821 157923 144256 122045
11841A22045l892J6766J4068n564j4013j487J0875M233r244o594R129J4376K886
$$ 122045 118153 134919 148987 143423 129410 127923 138798 143031 133787 127193 136322 150698 153584
11828A53584o906m378p92k809J261J2982Q686k1108l9798r598M3515N3597O262
$$ 153584 146678 142300 141508 138699 139960 152942 161628 140520 100722 91124 134639 188236 194498
11815A94498l8090k9163O336J3608p151j0902J4859L2208J5893r368j1659J851
$$ 194498 156408 127245 133581 147189 140038 129136 143995 176203 192096 182728 171069 172920
11803A72920N728r88j495L993o5j2772j4176K504J7966J3807l327j3295p565N037
$$ 172920 178648 177660 176165 180158 180093 167321 153145 155649 173615 187422 184095 170800 163235 168272
11789A68272J0837L983q879j3825l887J1487J6226N981r095j7270j3668J15J4853
$$ 168272 179109 183092 174213 160388 156501 167988 184214 190195 181100 163830 150162 150277 165130
11776A65130J6131L67j5174j2443J235M606l564m817M984R031K252J102R484N918
$$ 165130 181261 181628 166454 154011 155246 159852 156288 151471 156455 165486 167738 168840 178324 184242
11762A84242j6866k9930j2095J1692Q776p960m875J2023Q035j6627k3867j815
$$ 184242 167376 137446 125351 137043 145819 137859 132984 145007 153042 136415 112548 110733
11750A10733J5797O851o709k466P109P409J2090K9424L1908j414l8152l3036J304
$$ 110733 126530 133381 126672 124206 131315 138724 150814 180238 212146 210732 172580 139544 140848
11737A40848J2523q644j6098J2591L5824J3325k7466k9866Q511L4158J6137j4479
$$ 140848 153371 144727 128629 141220 177044 190369 162903 133037 141548 175706 191843 177364
11725A77364j6168M465J1447k231q462N760J5254k120k6546k3440M419K1162J0861
$$ 177364 161196 165661 177108 174877 166415 172175 187429 185309 158763 135323 139742 160904 171765
11712A71765l625r30Q249O307Q41P935J8354Q664j7884k9107q769J8481K0386
$$ 171765 168140 167210 175459 181766 182607 190542 208896 217560 199676 170569 161800 180281 200667
11699B00667P4j2527n491P61j0579k2664r808J8134K4016n50j7469J666K8409
$$ 200667 200741 188214 182723 183484 172905 150241 140433 158567 182583 182033 164564 166230 194639
11686A94639J8212j8985l0682j347K4608J1204j8368k2836k399J2493R695K267
$$ 194639 212851 193866 163184 161837 186445 197649 179281 156445 154046 166539 176234 178501
11674A78501Q00N418J4789K1111Q600k1051l6751j7116J2981J4617q145j6869
$$ 178501 179301 184719 199508 220619 229219 208168 171417 154301 167282 181899 173754 156885
11662A56885J959K1085J6422m156j9960j9679k038K2365L0443J1849q751j633
$$ 156885 158844 179929 196351 192195 172235 152556 150518 172883 203326 215175 206424 204791
11650B04791K1051K1237n422k4404j8623q014n254M188K2718K4511P16j8613j2685
$$ 204791 225842 247079 241657 217253 198630 190616 185362 189550 212268 236779 237495 218882 206197
11637B06197k419p378r013R156K2379P424r253M757K4393N311l3513l1186J4536
$$ 206197 203778 196400 187387 196543 218922 226346 217093 221850 246243 251554 218041 186855 201391
11624B01391L5851j169m3020k9869J8463L8824J5291j0805p020J3748K2827J2495
$$ 201391 237242 236073 193053 163184 181647 220471 235762 224957 217937 231685 254512 267007
11612B67007m093j2659r818k936j499n839o389K496J2390J0649k099j1340o732
$$ 267007 262914 250255 240437 237501 236002 230163 223774 226270 238660 249309 247210 235870 229138
11599B29138M264N131q253k0676j6263N38J1350R026M594P728J3663J4622J1117
$$ 229138 233402 238533 230280 209604 193341 193879 205229 214255 218849 226577 240240 254862 265979
11586B65979N231m210j2179q047N152Q892j484m926J0883K3549Q662j8581k3997
$$ 265979 271210 267000 254821 246774 251926 260818 259334 254408 265291 288840 297502 278921 254924
11573B54924n373R047O942L874R010J0573J114r231j1962j0885q764l324Q05l534
$$ 254924 249551 258598 265540 269414 278424 288997 290111 280880 268918 258033 249269 245945 246750 243216
11559B43216q913k170J0242R795j967n653J477K881l257M50J5421K0033O061r393
$$ 243216 234303 232133 242375 252170 250203 244550 246027 248908 245651 246101 261522 281555 287616 278223
11545B78223j6211k1988k2844k423K7681K9063l241k4682r522R178r78j7146o987
$$ 278223 262012 240024 217180 214757 242438 271501 268260 243578 234056 243234 242256 225110 218123
11532B18123J1942P971l641Q824K8318J5172j8269k2448O252K0284J916j1902
$$ 218123 230065 238036 234395 243219 271537 286709 268440 245992 252244 272528 274444 262542
11520B62542J180J2069m046k3555j5599R665K3790K2198J6041N754j0224j8742
$$ 262542 263722 275791 271745 248190 232591 242256 266046 288244 304285 310039 299815 281073
11508B81073q938P101J1313N806L893N656J041q956j0687L068K2030K7591J1322
$$ 281073 272135 279236 290549 296355 300248 305904 306945 297989 287302 290370 312400 339991 351313
11495C51313j3957k4513j2126N938J1025O762N833O095l51o086j013M249m192
$$ 351313 337356 312843 300717 306655 317680 324442 330275 336370 336019 329933 328920 333169 328977
11482C28977j2769o45J8157J3297n858n78K7926L2652j482k7851j1719J6309J4989
$$ 328977 316208 315563 333720 347017 341159 340581 368507 401159 399677 371826 360107 376416 391405
11469C91405l688o905K08m975j2705q32J6709J1025p381m860J4457J4170j0592
$$ 391405 387717 380812 381020 376045 363340 362508 379217 390242 382861 378001 392458 406628 396036
11456C96036k3984q960R299J0019N884R981R709n776j9999j3438N712J4554O066
$$ 396036 372052 363092 372391 382410 388294 398275 407984 402208 382209 368771 374483 389037 395103
11443C95103q601j7877j7414q188L082P653N011L617P962J1666O992l881r837
$$ 395103 386502 368625 351211 343023 346105 353758 358769 362386 370348 382014 389006 385125 375288
11430C75288j447J7475K8376J5772j0086j9740q25K4227K6697N853j6264k2596
$$ 375288 373841 391316 419692 435464 425378 405638 404813 429040 455737 461590 445326 422730
11418D22730j2659J593K739j4123k4628m92M0544M5395M016k5650l023K9870J6894
$$ 422730 410071 411664 414403 400280 375652 375160 415704 461099 465115 439465 436442 466312 483206
11405D83206j9625j9689J1298J7180o945j0759J3641J6271j4162k3530R430L0386
$$ 483206 463581 443892 455190 472370 465425 454666 468307 484578 470416 446886 456316 486702
11393D86702O017j4739R759L4730P520l4702k5265J8202K5668p046j8978P254
$$ 486702 492719 477980 487739 522469 529989 495287 470022 488224 513892 506846 487868 495122
11381D95122K1854k93j9415k942K3173K2059q11j7686j7972o791Q986J8191J1379
$$ 495122 516976 516683 497268 494326 517499 539558 538747 521061 503089 496298 505284 523475 534854
11368E34854j881k905O992J0993P683Q746R754k409j5594m913K0034K2818Q2j1253
$$ 534854 532973 530068 537060 548053 555736 564482 574236 571827 556233 551320 571354 594172 594254 583001
11354E83001L446J3860J190r835Q33J2887P678M487K0093K9748Q902j7924j3771
$$ 583001 586447 600307 601497 591662 592495 605382 613060 617547 637640 667388 676290 658366 644595
11341F44595J0774J9515J1272J0366J2799m964l0556k3990J3985L3510J0009j8998
$$ 644595 655369 674884 686156 696522 709321 704357 673801 649811 663796 697306 707315 688317
11329F88317j3538J1687J8703N037k035P672J7869J5638N164n676j3066j2864
$$ 688317 674779 686466 705169 710206 708171 715843 733712 749350 754514 748838 735772 722908
11317G22908l804O089Q339O320P635R598N872K162P963J5900R849n387n760J3383
$$ 722908 719104 725193 733532 739852 747487 757085 762957 765119 773082 788982 798831 793444 787684 801067
11303H01067K5015J1743m033M706K3284J7319r098j6362P539K7065J5907l640
$$ 801067 826082 837825 833792 838498 861782 879101 870003 853641 861180 888245 904152 900512
11291I00512j453J2471J2394L734Q085J8514J0778r509j2625M010J1947L430M436
$$ 900512 899059 911530 923924 927658 935743 954257 965035 955526 942901 946911 958858 962288 966724
11278I66724K3677L0344N648j9084p063K6418L5422Q372k0613k0721K048K1785
$$ 966724 990401 1020745 1026393 1007309 1000246 1026664 1062086 1070458 1049845 1029124 1031172 1052957
11266A052957K3743J3709O844J0729J7618J5949P129Q33l217j1434j5263J731
$$ 1052957 1076700 1090409 1097253 1107982 1125600 1141549 1148678 1149511 1146294 1134860 1119597 1121328
11254A121328L0468L7788J3631j0346o670R788J1661K324J967J0543J4268J3609
$$ 1121328 1151796 1189584 1203215 1192869 1186199 1195987 1207648 1209972 1211939 1222482 1236750 1250359
11242A250359J6130J5117L735l503O418J4981j008k4504j8925J2889L0928J8902
$$ 1250359 1266489 1281606 1285341 1281838 1288256 1303237 1302229 1277725 1258800 1271689 1302617 1321519
11230A321519L201N958J6630J9502J6065R334l551j2792n13K4806K9248L285j9023
$$ 1321519 1324720 1330678 1347308 1366810 1382875 1392209 1388658 1375866 1375353 1400159 1429407 1432692 1413669
11217A413669q478J8677K9535K0836J3001J4540J5338O776p478j5239m118K3337
$$ 1413669 1405191 1423868 1453403 1474239 1487240 1501780 1517118 1523894 1516416 1501177 1497059 1520396
11205A520396M1490K6955n742j7600J415K1003K0316J4578J6895J1338r285j4258
$$ 1520396 1561886 1588841 1583099 1565499 1566914 1587917 1608233 1622811 1639706 1651044 1641759 1627501
11193A627501J8730N5033M5127o31k5035n740K0929K1371P737N928J4938J8889
$$ 1627501 1646231 1701264 1746391 1745760 1720725 1714985 1735914 1757285 1765022 1770950 1785888 1804777
11181A804777J6406J6288J7480J2702N237O479J8646L1124L4628L0969K6378K1378
$$ 1804777 1821183 1837471 1854951 1867653 1872890 1879369 1898015 1929139 1963767 1994736 2021114 2042492
11169B042492J3563Q022J4907L2124M0611K7915Q589N522J6228J7823M588k827
$$ 2042492 2056055 2064077 2078984 2111108 2151719 2179634 2188223 2193745 2209973 2227796 2232384 2229557
11157B229557Q923K5709K9520K2508J5631J0327L834j351l112k063O055K3166
$$ 2229557 2238480 2264189 2293709 2316217 2331848 2342175 2346009 2344658 2341546 2339483 2345538 2368704
11145B368704L3441K0118o43L954K7686K7898k558j5422J3925L9170J7489j5758
$$ 2368704 2402145 2422263 2421620 2425574 2453260 2481158 2478600 2463178 2477103 2516273 2533762 2518004
11133B518004l818L6529M3226R326j4037m105J1967J9197L1138M0098J8180j9560
$$ 2518004 2514186 2550715 2593941 2603267 2589230 2585125 2597092 2616289 2647427 2687525 2705705 2686145
11121B686145j8712K7198N5749K9974n613m7K6250K4903m80q538J1047K9141K4227
$$ 2686145 2667433 2694631 2750380 2780354 2774741 2774694 2800944 2825847 2825367 2816829 2827876 2857017 2881244
11108B881244L022j6379j8070K672K7391K9556J3583J1641K8882K9513p89k1468
$$ 2881244 2884266 2867887 2849817 2852489 2879880 2909436 2923019 2934660 2963542 2993055 2992266 2970798
11096B970798l47L0171K5194J596O412L5114M1157J6480K639J8595L2287J9111
$$ 2970798 2970451 3000622 3025816 3027412 3033824 3068938 3110095 3126575 3129214 3147809 3180096 3199207
11084C199207L154J6121M6248N4981K9624j329k701K7001N2448M1859P854o626
$$ 3199207 3202361 3218482 3264730 3319711 3349335 3348006 3345305 3372306 3424754 3466613 3474467 3467841
11072C467841J4492M0620M2114K9445K5182K6192K2935K9028N3833O7859M0505
$$ 3467841 3482333 3522953 3565067 3594512 3619694 3645886 3668821 3697849 3751682 3819541 3860046
11061C860046k183n807L2143N9347M8114K9591L7084N8590O5748N6782M7749M3410
$$ 3860046 3857863 3852056 3884199 3943546 3991660 4021251 4058335 4116925 4182673 4239455 4287204 4330614
11049D330614L7327K8187K2419K7039M3094N9967O2136N1297M8778O1645O6374
$$ 4330614 4367941 4396128 4418547 4445586 4488680 4548647 4610783 4662080 4710858 4772503 4838877
11038D838877M8493L3810M6878O3881N2253L4762N5794R7247R6950N2202L2086
$$ 4838877 4887370 4921180 4968058 5031939 5084192 5118954 5174748 5271995 5368945 5421147 5453233
11027E453233O9183J09384J00923O9886O4502P7963P7456O9088Q0106J03343J09392
$$ 5453233 5522416 5631800 5732723 5802609 5867111 5945074 6022530 6091618 6171724 6275067 6384459
11016F384459R7352R1128R7662J04715J08945J14874J16784J09182J04031J13338
$$ 6384459 6481811 6572939 6670601 6775316 6884261 6999135 7115919 7225101 7329132 7442470
11006G442470J27212J31029J29809J34634J41132J41823J42968J50416J57287
$$ 7442470 7569682 7700711 7830520 7965154 8106286 8248109 8391077 8541493 8698780
10997H698780J61678J73428J88314J85763J69922J75558K08834K25144K00351
$$ 8698780 8860458 9033886 9222200 9407963 9577885 9753443 9962277 10187421 10387772
10988A0387772J79628K08774K57866K71122K59519K76635L23217L47164L32116
$$ 10387772 10567400 10776174 11034040 11305162 11564681 11841316 12164533 12511697 12843813
10979A2843813L17660L26715L34809L23082L06566K94070K68931K28519K01353
$$ 12843813 13161473 13488188 13822997 14146079 14452645 14746715 15015646 15244165 15445518
10970A5445518K05592K23896K34341K35875K32529K22994K15551K24083K41875
$$ 15445518 15651110 15875006 16109347 16345222 16577751 16800745 17016296 17240379 17482254
10961A7482254K48239K45340K56525K83919L02528L04036L11622L40103L72813
$$ 17482254 17730493 17975833 18232358 18516277 18818805 19122841 19434463 19774566 20147379
10952B0147379L91067M00282M15840M44503M85382N29536N59876N73391N96040
$$ 20147379 20538446 20938728 21354568 21799071 22284453 22813989 23373865 23947256 24543296
10943B4543296O48669P08904P39472P41889P44201P49920P44881P41622P63162
$$ 24543296 25191965 25900869 26640341 27382230 28126431 28876351 29621232 30362854 31126016
10934C1126016P90688P85464P59316P62659Q02439Q35571Q47197Q68663R09911
$$ 31126016 31916704 32702168 33461484 34224143 35026582 35862153 36709350 37578013 38487924
10925C8487924R42207R58867R83790J008486R95316R57761R57814J005340J045021
$$ 38487924 39430131 40388998 41372788 42381274 43376590 44334351 45292165 46297505 47342526
10916D7342526J064895J122338J229654J316599J354520J414234J538867J661561
$$ 47342526 48407421 49529759 50759413 52076012 53430532 54844766 56383633 58045194
10908E8045194J725672J789698J924243K093275K234147K374817K568978K787518
$$ 58045194 59770866 61560564 63484807 65578082 67812229 70187046 72756024 75543542
10900G5543542K980491L180672L437968L712006L937335M138472M379998M667609
$$ 75543542 78524033 81704705 85142673 88854679 92792014 96930486 101310484 105978093
10892A05978093M997699N424178N968289O557610P172975P936804Q914822R980973
$$ 105978093 110975792 116399970 122368259 128925869 136098844 144035648 152950470 162931443
10884A62931443J1067054J2369190J4044785J5884068J7608645J9244574K0609925
$$ 162931443 173998497 186367687 200412472 216296540 233905185 253149759 273759684
10877B73759684K0533723J7453209J1243441L930075j962482n532978p664453
$$ 273759684 294293407 311746616 322990057 326920132 324957650 319424672 311760219
10870C11760219r551074j1709735j4152288j6629556j8485723j8910089j7742329
$$ 311760219 302209145 290499410 276347122 259717566 241231843 222321754 204579425
10863B04579425j5743143j3829377j2302043j0999630r853505q944509q214363
$$ 204579425 188836282 175006905 162704862 151705232 141851727 132907218 124692855
10856A24692855p487301o735914o079118n550178n068611m613648m243900l956245
$$ 124692855 117205554 110469640 104390522 98840344 93771733 89158085 84914185 80957940
10848H0957940l678810l399468l172920l007654k857325k710197k583587k449549
$$ 80957940 77279130 73879662 70706742 67699088 64841763 62131566 59547979 57098430
10840E7098430k267727k070623j917359j789099j632702j477144j390617j345218
$$ 57098430 54830703 52760080 50842721 49053622 47420920 45943776 44553159 43207941
10832D3207941j250702j113394j030242j019700r93182r17136q67759q80833q78074
$$ 43207941 41957239 40843845 39813603 38793903 37800721 36883585 36015826 35134993 34256919
10823C4256919q10162p56207p93695q64533q68375q15996p87048p88704p62842
$$ 34256919 33446757 32690550 31896855 31032322 30163947 29347951 28560903 27772199 27009357
10814B7009357p03039o61323o48160o18877n63969n29233n30508n23132m81792
$$ 27009357 26306318 25644995 24996835 24377958 23813989 23284756 22754248 22231116 21749324
10805B1749324m45430m47273m54878m24422l74206l53565l63441l60171l29674
$$ 21749324 21303894 20856621 20401743 19977321 19603115 19249550 18886109 18525938 18196264
10796A8196264l07324l16769l32261l22072k97138k88233k95633k94408k80541
$$ 18196264 17888940 17572171 17239910 16917838 16620700 16332467 16036834 15742426 15461885
10787A5461885k77147k91727k98614k76744k41076k20200k21090k32338k44838
$$ 15461885 15184738 14893011 14594397 14317653 14076577 13856377 13635287 13402949 13158111
10778A3158111k50109k34400j98386j70891j76982k00078k02931j81349j66375
$$ 13158111 12908002 12673602 12475216 12304325 12127343 11927265 11724334 11542985 11376610
10769A1376610j71690j71929j45596j12082j05184j25992j43084j33526j07799
$$ 11376610 11204920 11032991 10887395 10775313 10670129 10544137 10401053 10267527 10159728
10760A0159728r4389j08615j38062j56120j49688j31174j20516j21910j26003
$$ 10159728 10065339 9956724 9818662 9662542 9512854 9381680 9261164 9139254 9013251
10751I013251j27882j29455j27958j18097j05727j04213j14605j22559j18439
$$ 9013251 8885369 8755914 8627956 8509859 8404132 8299919 8185314 8062755 7944316
10742G944316j08798j04407j06772j09897j08039j00564r4316r7387j04642r8936
$$ 7944316 7835518 7731111 7624339 7514442 7406403 7305839 7211523 7114136 7009494 6910558
10732F910558p7596o4691p8433r8803r3447o7415n5415o7176p6318o9143o6613
$$ 6910558 6832962 6768271 6689838 6591035 6497588 6430173 6374758 6307582 6231264 6162121 6095508
10721F095508q1824r0477o9672m0127l8940o5825q6495q2024o7463o2423o6753
$$ 6095508 6013684 5923207 5853535 5813408 5774468 5708643 5622148 5540124 5472661 5410238 5343485
10710E343485p0121o8488o3325n5208m6458m5137n7796p7003q3414o8101m8534
$$ 5343485 5273364 5204876 5141551 5086343 5039885 4994748 4936952 4859949 4776535 4708434 4659900
10699D659900m8597o3050o2949m3085l6308o1155q4388o8921l5101l0299n4064
$$ 4659900 4611303 4548253 4485304 4442219 4405911 4344756 4260368 4191447 4156346 4126047 4071983
10688D071983o5281n5361n5239o7965n9103k8893k7378o8998r5793o6445k3895
$$ 4071983 4006702 3951341 3896102 3828137 3769034 3740141 3712763 3643765 3547972 3481527 3457632
10677C457632k3872m8112m8219l2097l8880o0233n8136l9730m2650n9161m7444
$$ 3457632 3433760 3385648 3337429 3305332 3266452 3206219 3148083 3108353 3065703 3006542 2959098
10666B959098j3645r434m2653o1111l9396j5734k1544l5615l4786l4188m6052
$$ 2959098 2945453 2936019 2893366 2832255 2792859 2777125 2755581 2719966 2685180 2650992 2604940
10655B604940m8886l1824k4344m5032o1544m1895j0839j1697l8494m9999l4099
$$ 2604940 2556054 2524230 2499886 2454854 2393310 2351415 2340576 2328879 2290385 2240386 2206287
10644B206287j7244j9119l2534m3938m7041l9283k5082j8064k5129l5380l5582
$$ 2206287 2189043 2169924 2137390 2093452 2046411 2007128 1982046 1963982 1938853 1903473 1867891
10633A867891k6139j4250o586j4000m0728o1897m2214Q908L3870N83n1324o4859
$$ 1867891 1841752 1827502 1820916 1806916 1766188 1704291 1662077 1670985 1704855 1705438 1654114 1589255
10621A589255l7657q774N09l139j4532l1892m0500k7022l005J0428J0348L601
$$ 1589255 1551598 1542824 1543333 1540194 1525662 1493770 1453270 1426248 1423243 1433671 1444019 1447620
10609A447620j1599l1520l5042j4149M095m105k0958j9714j0918j7082k5236j1185
$$ 1447620 1436021 1404501 1369459 1355310 1359405 1355300 1334342 1314628 1303710 1286628 1261392 1250207
10597A250207Q611Q78k2914k3234k186K52k2502l3231j6495j53k060o142k387
$$ 1250207 1258818 1259696 1236782 1213548 1211362 1211614 1189112 1155881 1139386 1139233 1137173 1131031 1128644
10584A128644k406m952N538J6899j870l8425m0653O72L1747K0846K721Q084J1102
$$ 1128644 1126238 1121286 1126824 1143723 1141853 1103428 1062775 1063447 1095194 1116040 1118761 1126845 1137947
10571A137947j1650k8300q328J7904J1219q043j567J5195M672k0176j8739M250
$$ 1137947 1126297 1097997 1089669 1107573 1118792 1110749 1109182 1124377 1129049 1108873 1090134 1094384
10559A094384J0852k305q453p417j7486k4452k261K5536J1888l0580m1644j0801
$$ 1094384 1105236 1102931 1094478 1087061 1069575 1045123 1042862 1068398 1080286 1049706 1008062 997261
10547I97261Q775o776j8244k714N544j4575k6389l115J8547J684k3701j2137J8299
$$ 997261 1006036 999260 981016 978302 983846 969271 942882 939767 958314 959998 936297 924160 942459
10534I42459J8113j0050k0869m412M041j0470k0364p077Q000k85k3491l4200k0261
$$ 942459 960572 950522 929653 925241 929282 918812 898448 891371 899371 899086 875595 841395 821134
10521H21134O193K3268J8613J223q434n224n328j7001k3041r629N439j467j9471
$$ 821134 827327 850595 869208 870431 861997 856773 851445 834444 811403 801774 807213 805746 786275
10508G86275j8667J655J2096m37j6062j6278p587k671j764k644q720j6456j2746
$$ 786275 767608 769263 781359 780922 764860 748582 740995 738324 736560 733916 725196 708740 695994
10495F95994L518J3001J795j6702j9008k234J4565J4850O60j3774j7981j4357
$$ 695994 699512 712513 714308 697606 678598 676364 690929 705779 706439 692665 674684 660327
10483F60327j2084j2076m268J3954K5531J4105r286j9200j3700j5679l1673l5699
$$ 660327 648243 636167 631899 645853 671384 685489 676203 657003 643303 627624 595951 560252
10471E60252r088K5912L4623J6689o30o140j3012k5234k5752p051J1466J1964
$$ 560252 551164 577076 611699 628388 627758 621618 608606 583372 557620 550569 562035 573999
10459E73999M921Q684J7133J0986p043j4602o465k343j1571j6166l233R411J786
$$ 573999 578920 587604 604737 615723 608680 594078 587613 585270 573699 557533 554300 563711 565497
10446E65497j2934r613M749J211k0847k9202j0126J0115Q692m47K839Q463k724
$$ 565497 552563 542950 547699 548910 528063 498861 488735 498850 507542 507095 509934 518397 515673
10433E15673k1711k5166j3125l677N18J0645K2185J7328k656j4829q161L472N536
$$ 515673 493962 468796 455671 451994 452512 463157 485342 502670 500014 485185 477024 480496 486032
10420D86032r17j0099j8604j9865j0833l428q525j3135m00J3514m91k8303k3130
$$ 486032 485115 475016 456412 436547 425714 422286 413761 400626 400226 413740 413249 384946 361816
10407C61816J7037L4122j844l9547k3351J9273K3266j0184k1245P543K6146K859
$$ 361816 378853 412975 411131 371584 348233 367506 390772 380588 359343 366886 393032 395891
10395C95891k5912j7831J0892J7717k027j8620j5545j801J1088J7515J1498n079
$$ 395891 369979 352148 363040 380757 378730 360110 344565 342764 353852 371367 382865 377786
10383C77786j4401l359J3394J0722j0777k5371j7365K761J7864K1994J5538q51
$$ 377786 363385 360026 373420 384142 373365 347994 330629 333390 351254 373248 388786 387935
10371C87935j9945k7534j7069J302J1570P397m776j2016m049J5301K5120P740
$$ 387935 367990 340456 323387 324689 336259 343656 338880 326864 322815 338116 363236 370976
10359C70976k4131l4887j0384J9042J6752r174j7422N467K4562R229k0005k2600
$$ 370976 346845 311958 301574 320616 337368 328194 310772 316239 340801 350030 330025 307425
10347C07425O07J0721p896k5194j4734O508R425k39L951K1283K3463R13k0876
$$ 307425 308032 318753 310857 285663 270929 277437 286862 286623 290574 311857 335320 336233 315357
10334C15357j8864k095P817O616L683K430k34l122k724j277l190p024p590j861
$$ 315357 296493 294398 302215 308831 312514 314944 314710 311588 308864 307587 304397 297373 289783 287922
10320B87922J0451K4596K7170Q055j8650k2771J496K1421R983j3113j0933J2809
$$ 287922 298373 322969 350139 358194 339544 316773 318269 339690 349673 336560 325627 338436
10308C38436J9745j790j9248r160Q061O581k870J562R696j565k0203j2249J8759
$$ 338436 358181 356391 337143 327983 336044 342625 339755 341317 351013 349448 329245 316996 335755
10295C35755K8397j410l1064k1533Q971J7777K701m728K673L10j7347k1814l85
$$ 335755 364152 362742 331678 310145 319116 336893 339594 334866 337539 337849 320502 298688 298303
10282B98303J6466J115k6315k8223m835J2402J0459N240P228P966K356l157q281
$$ 298303 314769 315884 289569 261346 256511 268913 279372 284612 291840 299806 302162 299005 290724
10269B90724j8940k5956j1679J4915K0356k568j7264K407K8851K1188j3330l2991
$$ 290724 271784 245828 234149 249064 269420 266852 249588 251995 280846 302034 288704 255713
10257B55713k2460l499P079J2333R880r276l0783k3813R412K6691O711j7541j1572
$$ 255713 233253 229754 236833 249166 259046 249770 218987 195174 204586 231277 237988 220447 208875
10244B08875O769K015j5480o655K6381L6759N045k8965k4724L924J7525Q575m44
$$ 208875 215644 217659 202179 195524 221905 258664 263709 234744 210020 213944 231469 240044 239600
10231B39600k72k632r855q233M003Q734k056j0301k81J4694J2652k367q313j965
$$ 239600 239328 236696 226841 218608 222611 231345 229289 218988 218707 233401 246053 243686 235373 233408
10217B33408k642j6026j9550K327K7844K5012j207j4471P3J4284l75k9541l5879
$$ 233408 230766 214740 195190 197517 225361 250373 249166 234695 234768 249052 248677 219136 183257
10204A83257j1306J5144K1207J8066K2175K1755m506m3317n0602r236L9303M1847
$$ 183257 171951 187095 208302 226368 248543 270298 265792 222475 171873 162637 201940 243787
10192B43787P28l1496k3149l75o82j6501j3311J0610K0155J790j1484P291L1801
$$ 243787 244515 213019 189870 189495 188813 172312 159001 169611 189766 191556 180072 187363 219164
10179B19164K0000j8751l3959r006J4889K679k2807j9638Q631K2533Q599o010
$$ 219164 239164 220413 186454 177448 192337 195016 172209 152571 161202 183735 192334 186324
10167A86324j376P680L236n433j169J2023J8640J5356P150o527k2771k5920r373
$$ 186324 184948 192628 195864 190431 189262 201285 219925 235281 242431 235904 213133 187213 177840
10154A77840N272l414j9030r047K1128L2057J1268p801j21J4444R912l475l556
$$ 177840 183112 179698 160668 151621 172749 204806 216074 208273 208152 222596 232508 229033 225477
10141B25477M012K145k787L532J0271O5j3084l645J7480J7085l707j2445m431
$$ 225477 229489 231634 228847 232379 242650 242715 229631 225986 243466 260551 256844 244399 239968
10128B39968p992k3196j1547L1326M8582O250m2745k9962K6647N0676J8736j7279
$$ 239968 231976 208780 197233 228559 277141 283391 240646 210684 237331 288007 306743 289464
10116B89464j6967j368k303j1850q561J300n97r218n282J0362J5712j36k0229
$$ 289464 272497 271129 268826 256976 248415 249715 249118 239900 234618 244980 260692 260556 240327
10103B40327j9536M809K7476K2131n292j9930j867K5139K4687j728j7960m588
$$ 240327 220791 225600 253076 275207 269915 249985 248118 273257 297944 296216 278256 273668
10091B73668J7584K0370L196j3908j6035l205J3483J9309R747j650m66O378K496
$$ 273668 291252 311622 314818 300910 284875 281670 295153 314462 324209 322559 322093 328471 330967
10078C30967q122o768N493P593l507o033N945Q914o813j3930P121L0148K1040
$$ 330967 322845 316077 321570 329163 325656 319623 325568 334482 327669 313739 320860 351008 372048
10065C72048r302k3290j1492L814P866M875q04o118r42J4969J8709k514j9931
$$ 372048 362746 339456 327964 331778 339644 344519 343715 337597 336655 351624 370333 367819 347888
10052C47888j839K9744K6339r404k4975j179J9595N366j5718p062J6485J7473
$$ 347888 346049 375793 402132 392728 367753 366574 386169 391535 375817 368755 385240 402713
10040D02713m190j8201j2941l329k26n45j366k074J048O353L794n789m793J1418
$$ 402713 398523 380322 367381 364052 363826 363281 361915 359841 360889 367242 371036 365247 360454 371872
10026C71872J9373L964j1808k077J6671J1073j2800j8985p63J1799M529k080M660
$$ 371872 391245 395209 383401 381324 397995 409068 396268 377283 376520 388319 392848 390768 395428
10013C95428P733l463r958K621J5727Q634n495k120J2498J1430p912j7620o68
$$ 395428 403161 399698 389740 392361 408088 416722 411227 409107 421605 433035 425123 407503 406835
10000D06835K3821K6026L394j7822j5392L648J5207J0477M196P686J0090J62r093
$$ 406835 430656 456682 460076 442254 426862 430510 445717 456194 460390 468076 478166 478328 469235
9987D69235j632P611o489k8868j7310K5723M1729K495l6590j2875M6458N9567
$$ 469235 467603 475214 468725 439857 422547 448270 489999 492494 455904 443029 489487 549054
9975E49054P669m1835l3866P712L0285K2932Q060k789j1122j1292M10J0089O006
$$ 549054 556723 514888 481022 488734 519019 541951 550011 547222 536100 524808 525218 535307 541313
9962E41313J738J4059K9451K1421n684j9892p554J1994J9982J9388J6763Q984
$$ 541313 543051 557110 586561 607982 602298 582406 574852 586846 606828 626216 642979 651963
9950F51963j774l025N958Q304j603n880M436R477l649r148J9147N4813M7566P33
$$ 651963 650189 647164 653122 661426 659823 653943 658379 667856 664207 655059 674206 729019 776585 777318
9936G77318k6558m201K7005K0847o960j2205O979J7079J1002J4717L3120L5904
$$ 777318 750760 746559 773564 794411 787451 775246 782225 799304 810306 825023 858143 894047
9924H94047J0630r532N367L4321L5340N762j6941p714J8840L4620L0854J8782
$$ 894047 904677 895145 900512 934833 970173 975935 958994 951280 970120 1004740 1035594 1054376
9912A054376J1093J0735J3102J4263J6025K1197K5332K0648R772N930J4894K6901
$$ 1054376 1065469 1076204 1089306 1103569 1119594 1140791 1166123 1186771 1196543 1202473 1217367 1244268
9900A244268L2384L4242L6362L2775K0512J1504J6594K7008K7988K2780K5535
$$ 1244268 1276652 1310894 1347256 1380031 1400543 1412047 1428641 1455649 1483637 1506417 1531952
9889A531952L6715M3614M0297K9990J4833K260J1458M7409P6715O2065J8228k806
$$ 1531952 1568667 1612281 1652578 1682568 1697401 1699661 1711119 1758528 1835243 1897308 1915536 1912730
9877A912730J4893L3662K7934K2028L9355N7245M7810K8947L2169M6632M2477
$$ 1912730 1927623 1961285 1989219 2011247 2050602 2107847 2155657 2184604 2216773 2263405 2305882
9866B305882L0392M5157P8869Q5648N5924L3627M6470O6752O2226M4479M0318
$$ 2305882 2336274 2381431 2460300 2545948 2601872 2635499 2681969 2748721 2810947 2855426 2895744
9855B895744M8732N4973O0476P0424P4243O6187O5033Q5286J07118J04265Q5938
$$ 2895744 2944476 2999449 3059925 3130349 3204592 3270779 3335812 3421098 3528216 3632481 3718419
9844C718419Q0148Q8829R2322Q8670R3868J07363J11142J03395J01825J11229
$$ 3718419 3798567 3887396 3979718 4068388 4162256 4269619 4380761 4484156 4585981 4697210
9834D697210J17594J18153J27779J49187J65062J67649J69418J77022J83112J92046
$$ 4697210 4814804 4932957 5060736 5209923 5374985 5542634 5712052 5889074 6072186 6264232
9824F264232K20890K61331K76299K56905K48860K90926L55655L90012L93579M10758
$$ 6264232 6485122 6746453 7022752 7279657 7528517 7819443 8175098 8565110 8958689 9369447
9814I369447M54156M83431M66441M21458L84651L67184L61632L65673L78984L93512
$$ 9369447 9823603 10307034 10773475 11194933 11579584 11946768 12308400 12674073 13053057 13446569
9804A3446569M05864M28590M72983N27530N65556N68438N32604M62938L73113
$$ 13446569 13852433 14281023 14754006 15281536 15847092 16415530 16948134 17411072 17784185
9795A7784185K89007K37706K27234K39574K46529K36179K26739K49547L10299
$$ 17784185 18073192 18310898 18538132 18777706 19024235 19260414 19487153 19736700 20046999
9786B0046999L70482L77529L11531J93135N3955p9862j79361k21609k21574k29434
$$ 20046999 20417481 20795010 21106541 21299676 21353631 21273769 21094408 20872799 20651225 20421791
9776B0421791k73417l21528l22826k74022k20772k02985k26681k84051l66411
$$ 20421791 20148374 19826846 19504020 19229998 19009226 18806241 18579560 18295509 17929098
9767A7929098m48965m93396m86589m61333m60534m89844n19555n24022n02539
$$ 17929098 17480133 16986737 16500148 16038815 15578281 15088437 14568882 14044860 13542321
9758A3542321m66551m26314l94868l89394m15137m51590m66475m48300m19995
$$ 13542321 13075770 12649456 12254588 11865194 11450057 10998467 10531992 10083692 9663697
9749I663697m13852m34274m52620m40586m00697l58271l30840l15475l01927k85156
$$ 9663697 9249845 8815571 8362951 7922365 7521668 7163397 6832557 6517082 6215155 5929999
9739E929999k63258k34818k04352j82761j75627j75046j68581j53715j38629j30446
$$ 5929999 5666741 5431923 5227571 5044810 4869183 4694137 4525556 4371841 4233212 4102766
9729D102766j27476j23653j17033j10642j05534r7601q5164p6043p8739q7196
$$ 4102766 3975290 3851637 3734604 3623962 3518428 3420827 3335663 3259620 3180881 3093685
9719C093685q5246o9414n5265n4586n9744o1197o5500p8608q4919o7380m0343
$$ 3093685 3008439 2939025 2883760 2829174 2769430 2708233 2642733 2564125 2479206 2411826 2371483
9708B371483l3659m6332m7620k8463j7772l4549n6524n7584m7423m6383m5696
$$ 2371483 2337824 2291492 2243872 2215409 2197637 2163088 2106564 2048980 2001557 1955174 1909478
9697A909478k7369o197j2333l9438n0192l4586k3517l4981m4323k7823n032r225
$$ 1909478 1882109 1875912 1863579 1824141 1773949 1739363 1715846 1680865 1636542 1608719 1603687 1594462
9685A594462l5003m6925l2884j8587k5152l8016l2214j2047m196j5457k1462p360
$$ 1594462 1559459 1512534 1479650 1461063 1435911 1397895 1365681 1353634 1349438 1333981 1312519 1305159
9673A305159K278k0820n5755n2445p547K1747n3l2089k2258Q353J234l9801n1726
$$ 1305159 1307437 1286617 1230862 1178417 1170870 1192617 1192564 1160475 1138217 1146570 1147804 1108003 1056277
9660A056277j5142J5250J713k0629j3869l973k6649n3794l6473Q908K3672N96
$$ 1056277 1041135 1056385 1058098 1037469 1023600 1019627 992978 939184 902711 911619 935291 935887
9648I35887j1933L305P499k0252m4256l2770q624p336k1422k1284o208k17j1178
$$ 935887 923954 927259 934758 914506 870250 837480 828856 821520 800098 778814 772606 772389 761211
9635G61211k2725k0338n697J0085J5170N467q853j4848j6351k5219l2991j7824
$$ 761211 738486 718148 712451 722536 737706 743173 734320 719472 703121 677902 644911 627087
9623F27087J4022K5327J520k4278k1392o375r344k2910k0380n070k157j2685j3790
$$ 627087 641109 666436 667956 643678 622286 615911 606567 583657 563277 558207 556050 543365 529575
9610E29575m20Q133L284j744J968O926M529p354k7554m3218l0542J0413L7166
$$ 529575 529155 537288 540572 538828 540796 547722 552251 544897 517343 474125 443583 453996 491162
9597D91162J5556k5146l0417k860N782j7618k8135l495J6687K21k2987j4008J0919
$$ 491162 506718 481572 451155 448295 454077 436459 408324 404829 421516 421737 398750 384742 395661
9584C95661J3007n268j3958r212r828j6812j5591o794k075j201p80q680k2845
$$ 395661 408668 403400 389442 380230 370402 353590 337999 331205 329130 327929 327149 318469 295624
9571B95624j8911R647K6396N578j8578m699K1775Q784k8843k9038J0635K4581
$$ 295624 276713 286360 312756 318334 299756 295057 316832 325616 296773 267735 278370 302951
9559C02951j1309l9612j8631J1335Q90k8226k6813J684J7347R954N05k058l869
$$ 302951 291642 252030 233399 244734 245624 217398 190585 192269 209616 219570 220075 218017 214148
9546B14148l160P21n944k3911k3825Q744L6246J8593k1650k9505J659K6830J8962
$$ 214148 210988 211709 205765 181854 158029 166773 203019 221612 199962 170457 172116 198946 217908
9533B17908l732j7774j9736j0600P494J7337L777j5559j0835J0709J3257r770
$$ 217908 214176 196402 176666 166066 173560 190897 194674 179115 168280 178989 192246 182476
9521A82476k5909j6597j658j488q454p080M440J9655K7188J1285k2947l4939J491
$$ 182476 156567 139970 138312 136824 128370 121290 125730 145385 172573 183858 160911 125972 127463
9508A27463M4435L1905k1988m2444j0297J1013j3661l1896P66L8252K0720k2971
$$ 127463 171898 203803 181815 139371 129074 140087 126426 94530 95296 133548 154268 131297
9496A31297k4932Q788J5877j2692k2468P053K9825J2133j7767k1590n239M134
$$ 131297 106365 115153 131030 118338 95870 102923 132748 144881 127114 105524 100285 104419
9484A04419R01k805j185K175J890n330j3606q871R335J9167Q609j604O994J5075
$$ 104419 105320 102515 101330 103505 105395 100065 86459 77588 86923 106090 114699 113095 120089 135164
9470A35164M61j5455l115J5054j555l2850k2569K2097L3056n650k8716o12K4812
$$ 135164 135625 120170 117055 132109 130554 97704 75135 97232 130288 124638 95922 95310 120122
9457A20122K04l3787k2620Q850P835j0948L65K7544J6703k5515l6390k6L0096
$$ 120122 120326 86539 63919 72769 80604 69656 70021 97565 114268 88753 52363 52337 82433
9444H2433K0766J919J908K901j1669j8547J786K3794J5303j1229j9594k922J2729
$$ 82433 103199 105118 107026 109927 98258 79711 81497 105291 120594 109365 89771 86849 99578
9431I9578O720j5024k9945j9270J1859L1424J4100k1098l0220m091K0765J7734
$$ 99578 106298 91274 61329 42059 53918 85342 99442 78344 48124 44033 64798 82532
9419H2532K638k785l859q267l723J1716J0863j6190k9624J407L6330J7120l3330
$$ 82532 85170 82385 78526 70259 66536 78252 89115 72925 43301 44708 81038 98158 64828
9406F4828l6460J7657M7292N096m5259k8514K4448K8842j9308m2801r280K5537
$$ 64828 28368 46025 93317 98413 53154 24640 49088 77930 58622 15821 6541 32078
9394C2078J7711J123J4577K7926m77l9478k8613J9887L6529L835k3373j4026l900
$$ 32078 49789 50912 65489 93415 92938 53460 24847 44734 81263 85098 61725 47699 43799
9381D3799j8972k4713P179L8867K5497r491j4962M782P487r869j3763p44J033
$$ 43799 24827 114 7293 46160 71657 62166 47204 51986 59473 49604 35841 35097 36130
9368C6130p969J237K3751K0295j0732k2132K506J7857o017l1471j7266J3346J5885
$$ 36130 28161 29398 53149 73444 62712 40580 43086 60943 54926 23455 6189 19535 35420
9355C5420j130J824K3163K4494k353k1835j0941J0049J2110n054k0191j7606N14
$$ 35420 34290 36114 59277 83771 81418 59583 48642 58691 70801 65747 45556 27950 28464
9342B8464J8829K2690J1365m542j7892k6734k3454k503J9405J6873m029r418Q416
$$ 28464 47293 69983 81348 76806 58914 32180 8726 6223 25628 42501 38472 29054 37470
9329C7470J6497j896j5445J991K4594J7968m256r649l168p003j0540O959K4815
$$ 37470 53967 52071 36626 38617 63211 81179 76923 67274 64106 57103 46563 53522 78337
9316G8337R309k1421k1219N038J0208j0658j3086J3107K3387Lj4582N299K1674
$$ 78337 87646 66225 45006 50044 60252 49594 36508 49615 73002 73005 58423 63722 85396
9303H5396J932k1710q878J9197J8636l746r422M488Q961j289m411L996N808k300
$$ 85396 87328 65618 56740 75937 94573 90827 81405 85893 94854 93565 89154 93150 98958 96658
9289I6658l037Q653J6583R981l081j0314p145L715J2565R131k348o751l920j0366
$$ 96658 93621 102274 118857 128838 125757 115443 108298 112013 124578 133709 131361 124610 120690 110324
9275A10324k4622j8810J5986M4445L3951J688j4903j1285o751m581J515P0j8806
$$ 110324 85702 66892 82878 127323 161274 162962 148059 136774 130023 125442 126957 127027 108221
9262A08221l1433r843K6916L2896J721k6739k4077j306J8774K3363P253j8901
$$ 108221 76788 66945 93861 126757 128478 101739 77662 76356 95130 118493 125746 106845
9250A06845k4772K141K7031J3696j5921j5712O322L573k3303k5236N386J6820
$$ 106845 82073 84214 111245 124941 109020 93308 99630 103203 79900 54664 60050 76870
9238G6870j1168l0301q527J5881O221q977M836K0058j796l4136k6338R382J8302
$$ 76870 65702 35401 26874 42755 48976 39999 44835 64893 63097 28961 2623 12005 30307
9225C0307p626k4095j0215P188N503n621j1543r522K132J9340K2096L99k0822
$$ 30307 22681 -1414 -11629 -4441 1062 -4559 -16102 -25624 -23492 -4152 17944 18343 -2479
9212b479j6099j661l596n619J9170M3945K1763k5615k8439J5862L0096j6465n1675
$$ -2479 -18578 -20239 -23835 -29454 -10284 33661 55424 29809 1370 17232 47328 30863 -20812
9199b0812j5741M1017L9876m188j8878M889J1990j3569k6376n196J2148j328j7866
$$ -20812 -36553 4464 44340 40152 21274 26163 38153 24584 -1792 -6988 5160 3832 -14034
9186a4034q234J0792J3495Q425J0639O230j7032l2670j2559J9631J8820r353j6827
$$ -14034 -22268 -11476 2019 10444 21083 27313 10281 -22389 -34948 -15317 3503 -5850 -22677
9173b2677Q086K2581J720k1565j3701O573P732R05J1224K2290K635k9275k5982
$$ -22677 -14591 7990 9710 -11855 -25556 -18983 -11251 -10346 878 23168 25803 -3472 -29454
9160b9454P243J4789j5652k7611R751M4791K5032j7727k1674O153J2520o851q845
$$ -29454 -22211 -7422 -23074 -50685 -40934 3857 28889 11162 -10512 -4359 8161 1310 -7535
9147g535J0481P637k2953k9489Q037L6343J2993k4923k2267R170J9337J093j1833
$$ -7535 2946 10583 -12370 -41859 -33822 2521 15514 -9409 -31676 -22506 -3169 -2076 -13909
9134a3909p746m933p148l75R918M031r675k805J8158J1909k8082m9009j1776M5511
$$ -13909 -21655 -26588 -33736 -34111 -24193 -20162 -29837 -32642 -14484 -2575 -30657 -79666 -91442 -45931
9120d5931N3885M848m1586l5997N316L1565K0846l716j1814k288M224q27k977
$$ -45931 7954 12802 -28784 -64781 -59465 -27900 -7054 -10770 -22584 -24872 -20648 -21475 -24452
9107b4452Q289J7244L113k3906l0282n675K0206J8476p1n357N762Q202r280k5925
$$ -24452 -16163 1081 4194 -19712 -49994 -55669 -35463 -16987 -17058 -22415 -16653 -8451 -17731 -43656
9093d3656k0697k064Q074O074M558P110N222j499k636K057q82j3117j5257L139
$$ -43656 -64353 -66417 -58343 -52269 -47711 -40601 -35379 -36878 -39514 -37457 -38339 -51456 -66713 -63574
9079f3574K2148J8996K564k389N366O521k550n770Q86L111k379j678O116L070
$$ -63574 -41426 -22430 -19866 -22255 -16889 -10368 -12918 -18688 -17802 -14691 -17070 -18748 -12632 -9562
9065i562j1892j3121Q426K2519M513k3394k4415K5J9359J9209Q001p092k0491
$$ -9562 -21454 -34575 -26149 -3630 883 -22511 -46926 -46901 -27542 -8333 -332 -7424 -27915
9052b7915j7316O493K4304J1291j4030j5680K455N573j1297j6596P43J3100M385
$$ -27915 -45231 -38738 -14434 -3143 -17173 -32853 -30398 -24825 -36122 -52718 -51975 -38875 -34490
9039c4490l511P901K2249J8512K503j0710j8210j6887J038K3570K1356o779k3555
$$ -34490 -38001 -30100 -7851 10661 13164 2454 -15756 -32643 -31605 -8035 13321 6542 -17013
9026a7013r401P378K587k059J4010K1318j0438m5659k7977K4663L8238m048l5097
$$ -17013 -26414 -19036 -16449 -18508 -4498 16820 6382 -39277 -67254 -42591 -4353 -8401 -43498
9013d3498q307L3589K8907j1599k9576o823J9048J6583k589j2181o676K241O706
$$ -43498 -51805 -18216 10691 -908 -30484 -37307 -18259 -1676 -4265 -16446 -23122 -20881 -14175
9000a4175P882P569M527j166n622o144n753p119m317Q498J9922J0241j5076k2500
$$ -14175 -6293 1276 5803 4637 -985 -7129 -12882 -20001 -24318 -15820 4102 14343 -733 -23233
8986b3233J737K3010N862k7964k8072O987K7168R612r360J709J9675J1321j0720
$$ -23233 -21496 1514 7376 -20588 -48660 -41673 -14505 -4893 -14253 -12544 7131 18452 7732
8973G732j4975n331n802j1552m67J8587J5802n150r627P589J1539j0801k3806
$$ 7732 -7243 -12574 -18376 -29928 -30395 -11808 3994 -1156 -10783 -3194 8345 -2456 -26262
8960b6262k193K3778J5388j3375k0873k959Q904L720K052J1604J2848j921j1638
$$ -26262 -28455 -4677 10711 -2664 -23537 -26496 -17592 -13872 -11820 -216 12632 10711 -927
8947i27m220O02j2249k1558l319K4254K3460m797k1291p177J1734R226l315k534
$$ -927 -5147 -4545 -16794 -38352 -41671 -17417 6043 1246 -20045 -27222 -15488 -6262 -9577 -12111
8933a2111O405J884j3297j2682J0400K5905P195k7266l2564L784M0677L2496j2039
$$ -12111 -5706 -3822 -17119 -29801 -19401 6504 13699 -13567 -46131 -42347 -1670 30826 18787
8920A8787l9833k1894J1408J6209n020j5217k076Q392q71j1433l748J0528J1252
$$ 18787 -21046 -42940 -31532 -15323 -20343 -35560 -37636 -29244 -30115 -41548 -45296 -34768 -23516
8907b3516L179L288J0216R728Lr436j4382j3165R6J9429K0203n720k4629m454
$$ -23516 -20337 -17049 -6833 2895 2898 -6538 -20920 -34085 -33989 -14560 5643 -77 -24706 -29160
8893b9160K9689K5890j4111l3520o785K2756J2884j4555j4908Q325J5855j722
$$ -29160 529 26419 12308 -21212 -27997 -5241 7643 -6912 -21820 -13495 2360 638
8881F38j3111P07J7818J0041j5232k3540J152L1463K6920j1030l3003o526L2573
$$ 638 -12473 -11766 6052 16093 861 -22679 -21527 9936 36856 25826 -7177 -13703 18870
8868A8870K6656j8188m0083j5952P499m171j7849K776K8951J6382j5376j5486
$$ 18870 45526 27338 -12745 -28697 -21198 -25369 -43218 -40442 -11491 4891 -10485 -25971
8856b5971J1024J5254p888j2460J5559L2986J2283j7024k1799j1615o746k226
$$ -25971 -14947 307 -7581 -20041 -4482 28504 40787 23763 1964 -9651 -16397 -18623
8844a8623Q793J2212J513k453J2603K3505Q295j6140k1269r280q77n27m8P25K76
$$ -18623 -9830 2382 3895 1442 14045 37550 45845 29705 8436 -844 -1721 -2248 -2296 -1571 -1295
8829a295M919J1772L661j8344k3758K58J9796N155j7664q147K0278K2809j375
$$ -1295 3624 15396 19057 713 -23045 -22787 -2991 2164 -15500 -23647 -3369 19440 18065
8816A8065j1056M641J1786m039j2381N768K2543R440j6628k1500l009J3167R980
$$ 18065 7009 11650 23436 19397 7016 12784 35327 44767 28139 6639 3630 16797 26777
8803B6777p825k3550j9870M794K5112J4437j4572k2528k557Q732p083j8499K90
$$ 26777 18952 -4598 -24468 -19674 5438 19875 5303 -17225 -19782 -11050 -18133 -36632 -36342
8790c6342K2269J4034m688M014K6676J9591j3102k2318L526J8394l807k6647j3739
$$ -36342 -14073 -39 -4727 -713 25963 45554 32452 10134 13660 32054 28247 1600 -12139
8777a2139J3149J5719J406L85P466l789k4090j7381J4547K6036k520l2306k4173
$$ -12139 1010 16729 18135 18520 25986 22197 -1893 -19274 -4727 21309 18789 -13517 -37690
8764c7690O683K1076J3260O341Q975R991O469N684L088j2074k9836k7097m995
$$ -37690 -31007 -9931 3329 9670 18645 28636 35105 40789 43877 31803 1967 -25130 -30125
8751c0125R545N304P82P279Q757m562j1854M542K4715J9564m121j6834j0714j69
$$ -30125 -20580 -15276 -14494 -7215 1542 -3020 -14874 -10332 14383 33947 29826 12992 2278 2109
8737B109R180J8378J3182j6078l9378j7577L0410M1217k19l3894j5087J9637J5584
$$ 2109 11289 29667 42849 26771 -12607 -30184 226 41443 41224 7330 -7757 11880 27464
8724B7464j4927k1913j232R478J176L05J0619O760r677m869K2679K7787p209l5254
$$ 27464 12537 -9376 -10608 -1130 46 351 10970 17730 8053 3184 25863 53650 46441 11187
8710A1187j5889K0674K3432j462j2159m257o780j8585p540K4889L3774J026l1582
$$ 11187 -4702 15972 39404 37942 25783 21526 14746 -3839 -11379 13510 47284 48310 16728
8697A6728k4100M745J2595l103j1186O21J3291J1254J271m623m283k43N731R661
$$ 16728 -7372 -2627 9968 6865 -4321 -3700 9591 20845 22116 17493 13210 12967 18698 28359
8683B8359P190po442r876j0015m285P338J6865J5059J362j6126k5187j4095J5221
$$ 28359 35549 35542 29100 19224 9209 4924 12262 29127 44186 45548 29422 4235 -9860 5361
8669E361L6618K2644j4145k7982l628J6524l018k9775j1375L6326M7045N718k9545
$$ 5361 41979 64623 50478 22496 18868 35392 32374 2599 -8776 27550 74595 80313 50768
8656E0768j8939O043O790j740O463J3596m569k3400p056K4212K2089j0439k5875
$$ 50768 31829 37872 44662 42922 49385 62981 58412 35012 27956 52168 74257 63818 37943
8643C7943j0363L456J252N152J8767J2981j4624k1315J1516L9268J9854k1548
$$ 37943 27580 31036 32288 37440 56207 69188 54564 33249 44765 84033 103887 82339
8631H2339l3498j2761M306K270l342k826j020K688J0983J2464k176j6093p679
$$ 82339 48841 36080 40386 42656 39314 36488 35468 38156 49139 61603 59427 43334 35655
8618C5655J2054J4190j975j0079j491M727j60O11J6335K8209J6064j2954l4607
$$ 35655 47709 61899 59924 49845 48354 53081 52921 53532 69867 98076 114140 101186 66579
8605F6579l3166j0150J8859L1399J6921p122j3036J76N714r633k4105j3938R655
$$ 66579 33413 23263 42122 73521 90442 83320 70284 70460 76174 66541 42436 28498 38153
8592C8153J5851j871j6986o755J7141K4129N023j5633j2359O705J2572j529j1009
$$ 38153 54004 52133 35147 28392 45533 69662 74685 59052 46693 53398 65970 64441 53432
8579E3432R87J7928J7133L031n890p111r254j0562n147P66J217N845J8486J7859
$$ 53432 54419 72347 89480 92511 86621 79510 70256 59694 54547 55313 56530 62375 80861 98720
8565I8720q570k9079p884L1601L3396n278k9801j4908L047k444m359J8381L2095
$$ 98720 90150 61071 53187 84788 118184 112906 83105 68197 71244 68800 64441 82822 114917
8552A14917M317l3142k8605R678K9059J0696j4688j9646p160R456J8813R391j4281
$$ 114917 119234 86092 57487 67165 96224 106920 92232 72586 65426 74882 93695 103086 88805
8539H8805k2834o4K3833J2586j6504j6670J3139K6617N283j5436q132N538r81
$$ 88805 65971 65907 89740 102326 85822 69152 82291 108908 114191 98755 90623 96161 95180
8526I5180j2951l410J8663K2607L684j3883j5727j3031j7125j8897m294J9511
$$ 95180 82229 78819 97482 120089 123773 109890 94163 81132 64007 45110 40816 60327
8514F0327K8110J2282o584n259P146M703j1148j3389J580M726j1443j2033J8763
$$ 60327 88437 100719 94135 88876 96022 100725 89577 76188 77768 82494 71051 59018 77781
8501G7781L8300J0493k7856k1264J4045J9769m954r227J1995Q737k5970l3204
$$ 77781 116081 126574 98718 77454 91499 111268 106314 97087 109082 117819 91849 58645
8489E8645Q761L7803P966l3371k3975J4686K1455m265j3709N816K0564J2656j662
$$ 58645 67406 105209 113175 79804 55829 70515 91970 87705 73996 79812 100376 113032 111370
8476A11370r285j1568n795O699N206k0236l7932j4205K9174M0555J2469j3116
$$ 111370 102085 90517 84722 91421 96627 76391 38459 24254 53428 93983 106452 93336
8464I3336r066Q303J3890J656k1016l6844k3360J6699M2534K5062p725j3031L29
$$ 93336 84270 92573 106463 108119 87103 50259 26899 43598 86132 111194 103469 90438 90767
8451I0767m692k3409k0612Q94O076l786N041K6384J7489j7203k1592J3927K8117
$$ 90767 86075 62666 42054 42948 49024 45238 50279 76663 94152 76949 55357 69284 97401
8438I7401n934k9571Q10L5094J3832k9645k5969J5058K5950o050k6263o212J8936
$$ 97401 91467 61896 62706 97800 111632 81987 56018 71076 97026 90976 64713 58501 77437
8425G7437J4245p568j6384m749J3359J9679N795j2910q452J6983K3035p876l2498
$$ 77437 91682 84114 67730 62981 76340 96019 101814 88904 80452 97435 120470 112594 80096
8412H0096r599K9312K5647j2193k3639N095K3800M233k0594j8564l661J935K696
$$ 80096 70497 99809 125456 113263 89624 94719 118519 122752 102158 83594 79933 81868 84564
8399H4564M670j502j1939m875J6082J6781q591j9151N765K8098J4028r381l640
$$ 84564 89234 87732 75793 70918 87000 103781 95190 76039 81804 109902 123930 114549 110909
8386A10909J4158N164j9943j9810N136J5239k65j0705j008P192m2o019J840J0098
$$ 110909 125067 130231 110288 90478 95614 110853 110588 99883 98875 106067 106025 100006 101846 111944
8372A11944P346L844P386N911q789k2030j8007l225O666P994L925n695j5349j0556
$$ 111944 119290 123134 130520 136431 127642 105612 87605 84380 91046 99040 102965 97270 81921 71365
8358G1365J0055K3337J0985j0615j1060R832K1006M294k0520k2508J586K5093
$$ 71365 81420 104757 115742 105127 94067 103899 124905 129199 108679 86171 87757 112850
8346A12850K3145J84j4705p66K6535K9508l393l5690k6792J0822K5716Q3k5153
$$ 112850 135995 136179 121474 120708 147243 176751 173358 137668 110876 121698 147414 147497 122344
8333A22344j3430J2188Q565j6749j8750J0025K7117R924r966k904J1106K511j4852
$$ 122344 108914 121102 129667 112918 94168 104193 131310 141234 131268 128364 139470 141981 127129
8320A27129j0778O829Q570k033K739J9950J7280j0196k9143k0500k584O654J1403
$$ 127129 116351 123180 131750 129717 132456 152406 169686 159490 130347 109847 107263 113917 125320
8307A25320J2589O41j4338o328J8073J8900j0360k3264M627L0918J5576j2073
$$ 125320 137909 138550 124212 117884 135957 154857 144497 121233 125860 156778 172354 160281
8295A60281o387J4672M344k6359k5099J1872L3487J6751o350j1132j1306j5965
$$ 160281 153894 168566 172910 146551 121452 133324 166811 183562 177212 166080 154774 138809
8283A38809j0128M975K995j5931j3354K2554M6117J9905k7439m3997k3848J149
$$ 138809 128681 133656 136651 120720 107366 129920 176037 195942 168503 124506 100658 101807
8271A01807J2884J5479J1606K355k609J097K872j023K767J4911J1739j2498k3052
$$ 101807 114691 130170 141776 144131 141522 142619 145491 144468 147235 162146 173885 161387 138335
8258A38335K969L1733K0944j2414j9829J699J2545N22o347K501K811j4275k2853
$$ 138335 141304 173037 193981 181567 161738 163437 175982 176504 170157 172658 175469 161194 138341
8245A38341r094M997L706M461J9564K7005Q021j5749j4743J005M19j7120k2403
$$ 138341 129247 134244 137950 142411 161975 188980 197001 181252 166509 167514 167933 150813 128410
8232A28410k865K1163K7374J5547j774j3862j3406M84J5493J4423l716j9559j5778
$$ 128410 125545 146708 174082 189629 187855 173993 160587 161071 176564 190987 187271 167712 151934
8219A51934K790J6860J5879O406j196o181j2428j5915p775R175J8392J0570k573
$$ 151934 154724 171584 187463 193869 192673 186492 174064 158149 150374 159549 177941 188511 185938
8206A85938m807J960L691j982k395Q747J8591R706j6345l4529k0295J7694L7351
$$ 185938 181131 183091 186782 184800 182405 191152 209743 219449 203104 168575 148280 165974 203325
8193B03325J1911k7581k6967J2863L2717M850k2411n013K0602L07l6860k0198
$$ 203325 215236 187655 160688 173551 206268 211118 188707 183694 204296 204603 167743 147545
8181A47545L8085N1265k146m0861j3197K3259O665k5328j0070K5833J5351k7427
$$ 147545 185630 236895 234749 193888 180691 203950 210615 185287 175217 201050 216401 188974
8169A88974k9731J4429L5118M930k0480j2K9913K2711p239j9207q586K712P730
$$ 188974 159243 173672 208790 213720 193240 193228 223141 245852 238613 219406 210820 213532 221262
8156B21262J2752J4413N351r390j7822j3339K855J8355J3294j1424k0424R486
$$ 221262 234014 248427 253778 244388 226566 213227 216082 234437 247731 236307 215883 225369
8144B25369M1400K2933k8216m1277L38L3505J5993j3562r590Q627N011p167q44
$$ 225369 266769 289702 261486 220209 220547 254052 270045 256483 246893 255520 260531 253364 252520
8131B52520P778n195j6824J799K3834R943j5834m195K7460J9387k3818l3355J0096
$$ 252520 260298 255103 238279 240078 263912 273855 258021 253826 281286 300673 276855 243500 253596
8118B53596M2440J8089k4217k9508k511J9895K4240J3610j2795l8947k9300J7884
$$ 253596 296036 314125 289908 260400 257889 277784 302024 315634 302839 263892 234592 252476
8106B52476M9283K5588j9146k6327N157K7710J7634k974r013j081P864R215K032
$$ 252476 301759 327347 308201 281874 287031 314741 332375 329401 320388 319307 327171 336386 338418
8093C38418n347k601M928N56j3606j4476J637O856j0106j7541P360L3257K1295
$$ 338418 333071 330470 335398 335954 322348 307872 309509 316365 306259 288718 296078 329335 350630
8080C50630j0547j6641L418J2779M729O214J8111R830j9104k7779j530J9321L723
$$ 350630 340083 323442 326860 339639 344368 350582 368693 378523 359419 331640 330110 349431 353154
8067C53154k0265j1882J9934L5697K3606M520o402j1875j3870q699J418R375J3221
$$ 353154 332889 321007 340941 376638 400244 404764 398362 386487 372617 363918 365336 374711 387932
8054C87932J3780Q756l35l978J690O210J015n025R40J3993J6328R08j8885k2397
$$ 387932 401712 410468 410133 406155 407845 414055 415070 410045 410985 424978 441306 442214 423329 400932
8040D00932k194K4498K7486k149l2745k5512J2372L2726J1919j6114j0164J9173
$$ 400932 398738 423236 450722 448573 415828 390316 402688 435414 447333 431219 421055 440228
8028D40228K7918K739k2783j4775J9885M3923L0009j1227l9399k4927J6276L8818
$$ 440228 468146 470885 448102 433327 453212 497135 527144 515917 476518 451591 467867 506685
8016E06685K1216j2131k7268j8026L374K8578M6954L9528N094k3870j8391O702
$$ 506685 527901 515770 488502 470476 473850 502428 549382 588910 594004 570134 551743 558445
8004E58445J6466O885J595P976J1052O818O866R754J720j1273o284J5570K4633
$$ 558445 574911 581796 583391 591367 602419 609237 616103 625857 627577 616304 610020 625590 650223
7991F50223R299o221m134K45o666o854J6832M2399L5070o28k4415j1654K1389
$$ 650223 659522 653301 649167 649412 642746 635892 652724 695123 730193 729565 705150 693496 714885
7978G14885M2309L5521J0629j0038j1691k71P406O347N252O131Q44p386k095J6398
$$ 714885 757194 792715 803344 793306 781615 781344 788750 795097 800349 806480 807324 799938 797843 814241
7964H14241K3672J0124J739J8784L8015K7216j889j2404q90M721K98J1636L8788
$$ 814241 837913 848037 849776 868560 906575 933791 931902 919498 918608 923329 923627 935263 974051
7951I74051M1985M670l0012j8035K0372L3293J5124O863K3689L0248K762k4596
$$ 974051 1016036 1020706 990694 972659 993031 1026324 1041448 1048311 1072000 1102248 1105010 1080414
7939A080414o733M2072O2869L2068q697j1559J7987L9222L3155J6331Q062R990
$$ 1080414 1073681 1115753 1178622 1210690 1201993 1190434 1208421 1247643 1280798 1297129 1305191 1315181
7927A315181J6970K5874L0409K5055J7143J9126K8606L4001L7680M8851N4506
$$ 1315181 1332151 1358025 1388434 1413489 1430632 1449758 1478364 1512365 1550045 1598896 1653402
7916A653402L1407n937r251L2244O5280M8887J8721K9485O4533O3518K5191J3418
$$ 1653402 1684809 1678872 1669621 1701865 1767145 1816032 1834753 1864238 1928771 1992289 2017480 2030898
7904B030898N3531Q9074O9351K5912K0685N5371P9275O7675M7682M9693O8226
$$ 2030898 2084429 2173503 2242854 2268766 2289451 2344822 2424097 2491772 2539454 2589147 2657373
7893B657373P7591O5714M5180L8378N1641O2632M4243M521j5518M807L3570K5119
$$ 2657373 2734964 2800678 2845858 2884236 2935877 2998509 3042752 3047273 3031755 3036562 3070132 3095251
7881C095251k3200p2654r0513p6720n2602m2454n9386r1404j07137r0665o2633
$$ 3095251 3072051 2999397 2908884 2832164 2779562 2737108 2677722 2586318 2479181 2388516 2325883
7870B325883n1825n8007o2417o1852o6214p1190o2855m5862l8508m0951l7112
$$ 2325883 2274058 2216051 2153634 2091782 2025568 1954378 1891523 1845661 1807153 1766202 1729090
7859A729090k7637k9340l9485l5941k0260k2160m6133n3913k5748m90j7074m8004
$$ 1729090 1701453 1672113 1632628 1596687 1576427 1554267 1508134 1454221 1428473 1427983 1410909 1362905
7847A362905m0022o17J2834j4883l5596k0227m291k1755m3611k7708O357P500
$$ 1362905 1322883 1322266 1335100 1320217 1284621 1264394 1260103 1238348 1194737 1167029 1173386 1180886
7835A180886k1563k9765n042O401j7394l3130p598J7952r289o1700o5199j0950
$$ 1180886 1159323 1129558 1124516 1130917 1113523 1080393 1072795 1090747 1081458 1019758 954559 943609
7823I43609L1478J6961j9275k7475j1917k873k935K62q32j5358k3547n156J8270
$$ 943609 975087 992048 972773 945298 933381 930508 927573 927835 927003 911645 888098 882942 901212
7810I01212J0463k1287l5766j9779m46K492l067j0477k3645l1830j4847J6583
$$ 901212 911675 890388 854622 834843 834397 836889 833822 823345 799700 767870 753023 769606
7798G69606K4418M62j8586j0242j63j2478k5273j0234J4667J2421j4145l0597
$$ 769606 794024 794486 775900 765658 765495 753017 727744 717510 732177 744598 730453 699856
7786F99856k4051j0929k005M151O98j8199l2246j5389J9550L2048J1595j0644
$$ 699856 675805 664876 662871 667022 667720 649521 617275 601886 621436 653484 665079 654435
7774F54435j2343o568q605j1070o928o576j4186j4062L00Q350n159k1822j6786
$$ 654435 642092 635524 626919 615849 608921 602345 588159 574097 574397 582747 577588 555766 538980
7761E38980L391J3505O313n653j2726j1966l77J5347J4941q075k8318k1522j877
$$ 538980 542371 555876 562189 556536 543810 531844 531467 546814 561755 553680 525362 503840 501963
7748E01963J758n969J823K1632J9613j0952l2137j6180J4927K3744N198j8964
$$ 501963 503721 497752 499575 521207 540820 529868 497731 481551 496478 520222 525420 506456
7736E06456l0981k3677K316K8776K7941o4j9487r410L721q032k3535q574J9093
$$ 506456 475475 451798 454114 482890 510831 510767 491280 481870 485591 477559 454024 445450 464543
7723D64543J2775k3382l4674k742K3885P465k1112j5922J2356K0210N58j5169
$$ 464543 477318 453936 419262 416520 440405 447870 426758 410836 423192 443402 443960 428791
7711D28791j0741j635k159p688r172k814J0907K0389O720k5547l8902j1826K1247
$$ 428791 418050 416415 414256 406568 397396 394582 405489 425878 432598 407051 368149 356323 377570
7698C77570J5077j7002k3780K952K0552R751M20R264P782j9858l7053j2248K3236
$$ 377570 392647 375645 351865 354817 375369 385120 385540 394804 402586 382728 345675 333427 356663
7685C56663K0319j2543k6339o463J5560J7084Q080M28q365j5659r662O743J3073
$$ 356663 376982 364439 338100 331637 347197 364281 372361 372789 364424 348765 339103 345846 358919
7672C58919R36j2803j0490L531J1599M528r879j5911q000O20m120j2733m819J3296
$$ 358919 359855 347052 336562 340093 351692 356220 346341 330430 322430 323050 318930 306197 301378 314674
7658C14674J2658q411j5390L626J2479r529k3918J778K8838Q832k6388j3377K9009
$$ 314674 327332 318921 303531 307157 319636 310107 286189 287967 316805 325637 299249 285872 314881
7645C14881K5449k3121l3371J7700M6874L020m4257j9269L5902L3891j8880m4302
$$ 314881 340330 317209 283838 301538 348412 351432 307175 287906 323808 357699 338819 294517
7633B94517j8952Q368Q444J583N58o057j1890L614K6080J8613j2446k1629j188
$$ 294517 275565 283933 292377 293960 294518 288461 276571 280185 306265 324878 312432 290803 289615
7620B89615N700j7162k7479L198L8050L0936o371k9607k4667r156N853K0004K3205
$$ 289615 295315 278153 250674 253872 291922 322858 316487 286880 262213 253057 258910 278914 302119
7607C02119M134k4416l3779j5013R595J4080r11j0341K735K1712J5318j5614l0868
$$ 302119 306253 281837 248058 233045 242640 256720 255809 245468 248203 269915 285233 269619 238751
7594B38751n441L0070L0097k003k4074j7159n6J0865J6559J3444k695j2827K538
$$ 238751 233310 263380 293477 291474 267400 250241 250185 261050 277609 291053 288358 275531 278069
7581B78069J9503m37l8206l4082J3865L5919o44l8066k2566J2614J2320q731m561
$$ 278069 297572 297135 258929 224847 238712 274631 273987 235921 213355 225969 238289 229558 224997
7568B24997J5353J0165j1248p057J6826J5440j3009k3361l502Q520l473p823J1750
$$ 224997 240350 250515 239267 232210 249036 264476 251467 228106 224604 233124 229651 221828 233578
7555B33578K4671R426r014n617L525l192j2265k989J1468M225k1271l5688k2925
$$ 233578 258249 267675 258661 253044 256569 253377 241112 238123 249591 253816 232545 196857 173932
7542A73932M564K2539J6401n308j5186J762K2730J4875j3808k2852j788J3809
$$ 173932 178496 201035 217436 212128 196942 198704 221434 236309 222501 199649 197861 211670
7530B11670J566j2503j902J3938M902j6370j5722N608J5558M192o475m388k878
$$ 211670 213236 200733 198831 212769 217671 201301 185579 191187 206745 210937 204462 200074 197196
7517A97196p897k932J8534L2063J5612j3088j8634n04N602j5292k9147m080L3233
$$ 197196 189299 186367 204901 236964 252576 239488 220854 220350 225952 210660 181513 177433 210666
7504B10666L0617q718k6310J305K4655K467k9144j7013J9269K1482q570j6951
$$ 210666 241283 232565 206255 207560 232215 234682 205538 188525 207794 229276 220706 203755
7492B03755N884J3387p444j2636J3539K5622L64j8112K043K1680J930k5330j5797
$$ 203755 209639 223026 215582 202946 216485 242107 242471 224359 226402 248082 250012 224682 208885
7479B08885J0641J3134L215R655J3346j1441k9548K371M6858L4709j8596l5278
$$ 208885 219526 232660 235875 245530 258876 247435 217887 220258 267116 301825 283229 247951
7467B47951k217J7679L59q577R498J2736j2692j8998J3014L1780N450k0804o123
$$ 247951 245734 263413 263772 255195 264693 277429 264737 245739 258753 290533 295983 275179 269056
7454B69056J6942P876j0890n930K905q814j2117J7712L6226j927n1805l8026K3147
$$ 269056 285998 293874 282984 277054 279959 271145 259028 276740 312966 311039 259234 221208 244355
7441B44355M7512J3165j8207q077J2446J3571J0727J6843J2779q893k0646n783
$$ 244355 291867 305032 286825 278748 291194 304765 315492 332335 345114 336221 315575 309792
7429C09792J2869J1551j441q140n303N133J9870K2687K055j7900l528K9542L0928
$$ 309792 322661 334212 332771 324631 319328 324461 344331 367018 369073 351173 347645 377187 408115
7416D08115m627k5135m157J9885J1996o111n001N47r239j1990J5757M5698L7802
$$ 408115 403488 378353 374196 394081 406077 399966 394965 395512 386273 374283 390040 435738 473540
7403D73540N812q884n343j0496j7459L061L7774L9212L301j9252j872K0855J4982
$$ 473540 479352 470468 465125 454629 437170 440231 478005 517217 520518 501266 499394 520249 535231
7390E35231k610l749K717l475j1818j891J5362J4208k049q746k609k241r214l543
$$ 535231 532621 528872 531589 528114 516296 514405 529767 543975 541926 533180 530571 528330 519116 515573
7376E15573J7246K6886J0859q670o376Q525R993l727j1002j906J1819K0255K5053
$$ 515573 532819 559705 570564 561894 555518 564043 574036 570309 559307 557401 569220 589475 614528
$$ [...]
##END NTUPLES=NMR SPECTRUM
##END=
